lucene-dev mailing list archives

Site index · List index
Message view « Date » · « Thread »
Top « Date » · « Thread »
From Policeman Jenkins Server <jenk...@thetaphi.de>
Subject [JENKINS] Lucene-Solr-trunk-Linux (64bit/jdk1.8.0_66) - Build # 14792 - Failure!
Date Thu, 05 Nov 2015 05:02:06 GMT
Build: http://jenkins.thetaphi.de/job/Lucene-Solr-trunk-Linux/14792/
Java: 64bit/jdk1.8.0_66 -XX:-UseCompressedOops -XX:+UseSerialGC

1 tests failed.
FAILED:  org.apache.solr.cloud.CdcrReplicationHandlerTest.doTest

Error Message:
There are still nodes recoverying - waited for 330 seconds

Stack Trace:
java.lang.AssertionError: There are still nodes recoverying - waited for 330 seconds
	at __randomizedtesting.SeedInfo.seed([72E7104EE9F8F3BA:D5A3A8EA8443E003]:0)
	at org.junit.Assert.fail(Assert.java:93)
	at org.apache.solr.cloud.AbstractDistribZkTestBase.waitForRecoveriesToFinish(AbstractDistribZkTestBase.java:172)
	at org.apache.solr.cloud.AbstractDistribZkTestBase.waitForRecoveriesToFinish(AbstractDistribZkTestBase.java:133)
	at org.apache.solr.cloud.AbstractDistribZkTestBase.waitForRecoveriesToFinish(AbstractDistribZkTestBase.java:128)
	at org.apache.solr.cloud.BaseCdcrDistributedZkTest.waitForRecoveriesToFinish(BaseCdcrDistributedZkTest.java:465)
	at org.apache.solr.cloud.BaseCdcrDistributedZkTest.clearSourceCollection(BaseCdcrDistributedZkTest.java:319)
	at org.apache.solr.cloud.CdcrReplicationHandlerTest.doTestPartialReplicationAfterPeerSync(CdcrReplicationHandlerTest.java:158)
	at org.apache.solr.cloud.CdcrReplicationHandlerTest.doTest(CdcrReplicationHandlerTest.java:53)
	at sun.reflect.NativeMethodAccessorImpl.invoke0(Native Method)
	at sun.reflect.NativeMethodAccessorImpl.invoke(NativeMethodAccessorImpl.java:62)
	at sun.reflect.DelegatingMethodAccessorImpl.invoke(DelegatingMethodAccessorImpl.java:43)
	at java.lang.reflect.Method.invoke(Method.java:497)
	at com.carrotsearch.randomizedtesting.RandomizedRunner.invoke(RandomizedRunner.java:1660)
	at com.carrotsearch.randomizedtesting.RandomizedRunner$8.evaluate(RandomizedRunner.java:866)
	at com.carrotsearch.randomizedtesting.RandomizedRunner$9.evaluate(RandomizedRunner.java:902)
	at com.carrotsearch.randomizedtesting.RandomizedRunner$10.evaluate(RandomizedRunner.java:916)
	at org.apache.solr.BaseDistributedSearchTestCase$ShardsRepeatRule$ShardsFixedStatement.callStatement(BaseDistributedSearchTestCase.java:963)
	at org.apache.solr.BaseDistributedSearchTestCase$ShardsRepeatRule$ShardsStatement.evaluate(BaseDistributedSearchTestCase.java:938)
	at com.carrotsearch.randomizedtesting.rules.SystemPropertiesRestoreRule$1.evaluate(SystemPropertiesRestoreRule.java:57)
	at org.apache.lucene.util.TestRuleSetupTeardownChained$1.evaluate(TestRuleSetupTeardownChained.java:50)
	at org.apache.lucene.util.AbstractBeforeAfterRule$1.evaluate(AbstractBeforeAfterRule.java:46)
	at org.apache.lucene.util.TestRuleThreadAndTestName$1.evaluate(TestRuleThreadAndTestName.java:49)
	at org.apache.lucene.util.TestRuleIgnoreAfterMaxFailures$1.evaluate(TestRuleIgnoreAfterMaxFailures.java:65)
	at org.apache.lucene.util.TestRuleMarkFailure$1.evaluate(TestRuleMarkFailure.java:48)
	at com.carrotsearch.randomizedtesting.rules.StatementAdapter.evaluate(StatementAdapter.java:36)
	at com.carrotsearch.randomizedtesting.ThreadLeakControl$StatementRunner.run(ThreadLeakControl.java:367)
	at com.carrotsearch.randomizedtesting.ThreadLeakControl.forkTimeoutingTask(ThreadLeakControl.java:809)
	at com.carrotsearch.randomizedtesting.ThreadLeakControl$3.evaluate(ThreadLeakControl.java:460)
	at com.carrotsearch.randomizedtesting.RandomizedRunner.runSingleTest(RandomizedRunner.java:875)
	at com.carrotsearch.randomizedtesting.RandomizedRunner$5.evaluate(RandomizedRunner.java:777)
	at com.carrotsearch.randomizedtesting.RandomizedRunner$6.evaluate(RandomizedRunner.java:811)
	at com.carrotsearch.randomizedtesting.RandomizedRunner$7.evaluate(RandomizedRunner.java:822)
	at com.carrotsearch.randomizedtesting.rules.StatementAdapter.evaluate(StatementAdapter.java:36)
	at com.carrotsearch.randomizedtesting.rules.SystemPropertiesRestoreRule$1.evaluate(SystemPropertiesRestoreRule.java:57)
	at org.apache.lucene.util.AbstractBeforeAfterRule$1.evaluate(AbstractBeforeAfterRule.java:46)
	at com.carrotsearch.randomizedtesting.rules.StatementAdapter.evaluate(StatementAdapter.java:36)
	at org.apache.lucene.util.TestRuleStoreClassName$1.evaluate(TestRuleStoreClassName.java:42)
	at com.carrotsearch.randomizedtesting.rules.NoShadowingOrOverridesOnMethodsRule$1.evaluate(NoShadowingOrOverridesOnMethodsRule.java:40)
	at com.carrotsearch.randomizedtesting.rules.NoShadowingOrOverridesOnMethodsRule$1.evaluate(NoShadowingOrOverridesOnMethodsRule.java:40)
	at com.carrotsearch.randomizedtesting.rules.StatementAdapter.evaluate(StatementAdapter.java:36)
	at com.carrotsearch.randomizedtesting.rules.StatementAdapter.evaluate(StatementAdapter.java:36)
	at com.carrotsearch.randomizedtesting.rules.StatementAdapter.evaluate(StatementAdapter.java:36)
	at org.apache.lucene.util.TestRuleAssertionsRequired$1.evaluate(TestRuleAssertionsRequired.java:54)
	at org.apache.lucene.util.TestRuleMarkFailure$1.evaluate(TestRuleMarkFailure.java:48)
	at org.apache.lucene.util.TestRuleIgnoreAfterMaxFailures$1.evaluate(TestRuleIgnoreAfterMaxFailures.java:65)
	at org.apache.lucene.util.TestRuleIgnoreTestSuites$1.evaluate(TestRuleIgnoreTestSuites.java:55)
	at com.carrotsearch.randomizedtesting.rules.StatementAdapter.evaluate(StatementAdapter.java:36)
	at com.carrotsearch.randomizedtesting.ThreadLeakControl$StatementRunner.run(ThreadLeakControl.java:367)
	at java.lang.Thread.run(Thread.java:745)




Build Log:
[...truncated 10825 lines...]
   [junit4] Suite: org.apache.solr.cloud.CdcrReplicationHandlerTest
   [junit4]   2> Creating dataDir: /home/jenkins/workspace/Lucene-Solr-trunk-Linux/solr/build/solr-core/test/J1/temp/solr.cloud.CdcrReplicationHandlerTest_72E7104EE9F8F3BA-001/init-core-data-001
   [junit4]   2> 1044217 INFO  (SUITE-CdcrReplicationHandlerTest-seed#[72E7104EE9F8F3BA]-worker) [    ] o.a.s.SolrTestCaseJ4 Randomized ssl (true) and clientAuth (false)
   [junit4]   2> 1044217 INFO  (SUITE-CdcrReplicationHandlerTest-seed#[72E7104EE9F8F3BA]-worker) [    ] o.a.s.BaseDistributedSearchTestCase Setting hostContext system property: /
   [junit4]   2> 1044218 INFO  (TEST-CdcrReplicationHandlerTest.doTest-seed#[72E7104EE9F8F3BA]) [    ] o.a.s.c.ZkTestServer STARTING ZK TEST SERVER
   [junit4]   2> 1044218 INFO  (Thread-3047) [    ] o.a.s.c.ZkTestServer client port:0.0.0.0/0.0.0.0:0
   [junit4]   2> 1044218 INFO  (Thread-3047) [    ] o.a.s.c.ZkTestServer Starting server
   [junit4]   2> 1044318 INFO  (TEST-CdcrReplicationHandlerTest.doTest-seed#[72E7104EE9F8F3BA]) [    ] o.a.s.c.ZkTestServer start zk server on port:49045
   [junit4]   2> 1044319 INFO  (TEST-CdcrReplicationHandlerTest.doTest-seed#[72E7104EE9F8F3BA]) [    ] o.a.s.c.c.SolrZkClient Using default ZkCredentialsProvider
   [junit4]   2> 1044319 INFO  (TEST-CdcrReplicationHandlerTest.doTest-seed#[72E7104EE9F8F3BA]) [    ] o.a.s.c.c.ConnectionManager Waiting for client to connect to ZooKeeper
   [junit4]   2> 1044321 INFO  (zkCallback-832-thread-1) [    ] o.a.s.c.c.ConnectionManager Watcher org.apache.solr.common.cloud.ConnectionManager@5b60034f name:ZooKeeperConnection Watcher:127.0.0.1:49045 got event WatchedEvent state:SyncConnected type:None path:null path:null type:None
   [junit4]   2> 1044321 INFO  (TEST-CdcrReplicationHandlerTest.doTest-seed#[72E7104EE9F8F3BA]) [    ] o.a.s.c.c.ConnectionManager Client is connected to ZooKeeper
   [junit4]   2> 1044321 INFO  (TEST-CdcrReplicationHandlerTest.doTest-seed#[72E7104EE9F8F3BA]) [    ] o.a.s.c.c.SolrZkClient Using default ZkACLProvider
   [junit4]   2> 1044321 INFO  (TEST-CdcrReplicationHandlerTest.doTest-seed#[72E7104EE9F8F3BA]) [    ] o.a.s.c.c.SolrZkClient makePath: /solr
   [junit4]   2> 1044323 INFO  (TEST-CdcrReplicationHandlerTest.doTest-seed#[72E7104EE9F8F3BA]) [    ] o.a.s.c.c.SolrZkClient Using default ZkCredentialsProvider
   [junit4]   2> 1044323 INFO  (TEST-CdcrReplicationHandlerTest.doTest-seed#[72E7104EE9F8F3BA]) [    ] o.a.s.c.c.ConnectionManager Waiting for client to connect to ZooKeeper
   [junit4]   2> 1044323 INFO  (zkCallback-833-thread-1) [    ] o.a.s.c.c.ConnectionManager Watcher org.apache.solr.common.cloud.ConnectionManager@2556f54f name:ZooKeeperConnection Watcher:127.0.0.1:49045/solr got event WatchedEvent state:SyncConnected type:None path:null path:null type:None
   [junit4]   2> 1044323 INFO  (TEST-CdcrReplicationHandlerTest.doTest-seed#[72E7104EE9F8F3BA]) [    ] o.a.s.c.c.ConnectionManager Client is connected to ZooKeeper
   [junit4]   2> 1044324 INFO  (TEST-CdcrReplicationHandlerTest.doTest-seed#[72E7104EE9F8F3BA]) [    ] o.a.s.c.c.SolrZkClient Using default ZkACLProvider
   [junit4]   2> 1044324 INFO  (TEST-CdcrReplicationHandlerTest.doTest-seed#[72E7104EE9F8F3BA]) [    ] o.a.s.c.c.SolrZkClient makePath: /collections/collection1
   [junit4]   2> 1044325 INFO  (TEST-CdcrReplicationHandlerTest.doTest-seed#[72E7104EE9F8F3BA]) [    ] o.a.s.c.c.SolrZkClient makePath: /collections/collection1/shards
   [junit4]   2> 1044325 INFO  (TEST-CdcrReplicationHandlerTest.doTest-seed#[72E7104EE9F8F3BA]) [    ] o.a.s.c.c.SolrZkClient makePath: /collections/control_collection
   [junit4]   2> 1044325 INFO  (TEST-CdcrReplicationHandlerTest.doTest-seed#[72E7104EE9F8F3BA]) [    ] o.a.s.c.c.SolrZkClient makePath: /collections/control_collection/shards
   [junit4]   2> 1044326 INFO  (TEST-CdcrReplicationHandlerTest.doTest-seed#[72E7104EE9F8F3BA]) [    ] o.a.s.c.AbstractZkTestCase put /home/jenkins/workspace/Lucene-Solr-trunk-Linux/solr/core/src/test-files/solr/collection1/conf/solrconfig-cdcr.xml to /configs/conf1/solrconfig.xml
   [junit4]   2> 1044326 INFO  (TEST-CdcrReplicationHandlerTest.doTest-seed#[72E7104EE9F8F3BA]) [    ] o.a.s.c.c.SolrZkClient makePath: /configs/conf1/solrconfig.xml
   [junit4]   2> 1044326 INFO  (TEST-CdcrReplicationHandlerTest.doTest-seed#[72E7104EE9F8F3BA]) [    ] o.a.s.c.AbstractZkTestCase put /home/jenkins/workspace/Lucene-Solr-trunk-Linux/solr/core/src/test-files/solr/collection1/conf/schema15.xml to /configs/conf1/schema.xml
   [junit4]   2> 1044327 INFO  (TEST-CdcrReplicationHandlerTest.doTest-seed#[72E7104EE9F8F3BA]) [    ] o.a.s.c.c.SolrZkClient makePath: /configs/conf1/schema.xml
   [junit4]   2> 1044327 INFO  (TEST-CdcrReplicationHandlerTest.doTest-seed#[72E7104EE9F8F3BA]) [    ] o.a.s.c.AbstractZkTestCase put /home/jenkins/workspace/Lucene-Solr-trunk-Linux/solr/core/src/test-files/solr/collection1/conf/solrconfig.snippet.randomindexconfig.xml to /configs/conf1/solrconfig.snippet.randomindexconfig.xml
   [junit4]   2> 1044327 INFO  (TEST-CdcrReplicationHandlerTest.doTest-seed#[72E7104EE9F8F3BA]) [    ] o.a.s.c.c.SolrZkClient makePath: /configs/conf1/solrconfig.snippet.randomindexconfig.xml
   [junit4]   2> 1044328 INFO  (TEST-CdcrReplicationHandlerTest.doTest-seed#[72E7104EE9F8F3BA]) [    ] o.a.s.c.AbstractZkTestCase put /home/jenkins/workspace/Lucene-Solr-trunk-Linux/solr/core/src/test-files/solr/collection1/conf/stopwords.txt to /configs/conf1/stopwords.txt
   [junit4]   2> 1044328 INFO  (TEST-CdcrReplicationHandlerTest.doTest-seed#[72E7104EE9F8F3BA]) [    ] o.a.s.c.c.SolrZkClient makePath: /configs/conf1/stopwords.txt
   [junit4]   2> 1044328 INFO  (TEST-CdcrReplicationHandlerTest.doTest-seed#[72E7104EE9F8F3BA]) [    ] o.a.s.c.AbstractZkTestCase put /home/jenkins/workspace/Lucene-Solr-trunk-Linux/solr/core/src/test-files/solr/collection1/conf/protwords.txt to /configs/conf1/protwords.txt
   [junit4]   2> 1044329 INFO  (TEST-CdcrReplicationHandlerTest.doTest-seed#[72E7104EE9F8F3BA]) [    ] o.a.s.c.c.SolrZkClient makePath: /configs/conf1/protwords.txt
   [junit4]   2> 1044329 INFO  (TEST-CdcrReplicationHandlerTest.doTest-seed#[72E7104EE9F8F3BA]) [    ] o.a.s.c.AbstractZkTestCase put /home/jenkins/workspace/Lucene-Solr-trunk-Linux/solr/core/src/test-files/solr/collection1/conf/currency.xml to /configs/conf1/currency.xml
   [junit4]   2> 1044329 INFO  (TEST-CdcrReplicationHandlerTest.doTest-seed#[72E7104EE9F8F3BA]) [    ] o.a.s.c.c.SolrZkClient makePath: /configs/conf1/currency.xml
   [junit4]   2> 1044330 INFO  (TEST-CdcrReplicationHandlerTest.doTest-seed#[72E7104EE9F8F3BA]) [    ] o.a.s.c.AbstractZkTestCase put /home/jenkins/workspace/Lucene-Solr-trunk-Linux/solr/core/src/test-files/solr/collection1/conf/enumsConfig.xml to /configs/conf1/enumsConfig.xml
   [junit4]   2> 1044330 INFO  (TEST-CdcrReplicationHandlerTest.doTest-seed#[72E7104EE9F8F3BA]) [    ] o.a.s.c.c.SolrZkClient makePath: /configs/conf1/enumsConfig.xml
   [junit4]   2> 1044330 INFO  (TEST-CdcrReplicationHandlerTest.doTest-seed#[72E7104EE9F8F3BA]) [    ] o.a.s.c.AbstractZkTestCase put /home/jenkins/workspace/Lucene-Solr-trunk-Linux/solr/core/src/test-files/solr/collection1/conf/open-exchange-rates.json to /configs/conf1/open-exchange-rates.json
   [junit4]   2> 1044330 INFO  (TEST-CdcrReplicationHandlerTest.doTest-seed#[72E7104EE9F8F3BA]) [    ] o.a.s.c.c.SolrZkClient makePath: /configs/conf1/open-exchange-rates.json
   [junit4]   2> 1044331 INFO  (TEST-CdcrReplicationHandlerTest.doTest-seed#[72E7104EE9F8F3BA]) [    ] o.a.s.c.AbstractZkTestCase put /home/jenkins/workspace/Lucene-Solr-trunk-Linux/solr/core/src/test-files/solr/collection1/conf/mapping-ISOLatin1Accent.txt to /configs/conf1/mapping-ISOLatin1Accent.txt
   [junit4]   2> 1044331 INFO  (TEST-CdcrReplicationHandlerTest.doTest-seed#[72E7104EE9F8F3BA]) [    ] o.a.s.c.c.SolrZkClient makePath: /configs/conf1/mapping-ISOLatin1Accent.txt
   [junit4]   2> 1044331 INFO  (TEST-CdcrReplicationHandlerTest.doTest-seed#[72E7104EE9F8F3BA]) [    ] o.a.s.c.AbstractZkTestCase put /home/jenkins/workspace/Lucene-Solr-trunk-Linux/solr/core/src/test-files/solr/collection1/conf/old_synonyms.txt to /configs/conf1/old_synonyms.txt
   [junit4]   2> 1044331 INFO  (TEST-CdcrReplicationHandlerTest.doTest-seed#[72E7104EE9F8F3BA]) [    ] o.a.s.c.c.SolrZkClient makePath: /configs/conf1/old_synonyms.txt
   [junit4]   2> 1044332 INFO  (TEST-CdcrReplicationHandlerTest.doTest-seed#[72E7104EE9F8F3BA]) [    ] o.a.s.c.AbstractZkTestCase put /home/jenkins/workspace/Lucene-Solr-trunk-Linux/solr/core/src/test-files/solr/collection1/conf/synonyms.txt to /configs/conf1/synonyms.txt
   [junit4]   2> 1044332 INFO  (TEST-CdcrReplicationHandlerTest.doTest-seed#[72E7104EE9F8F3BA]) [    ] o.a.s.c.c.SolrZkClient makePath: /configs/conf1/synonyms.txt
   [junit4]   2> 1044333 INFO  (TEST-CdcrReplicationHandlerTest.doTest-seed#[72E7104EE9F8F3BA]) [    ] o.a.s.c.c.SolrZkClient Using default ZkCredentialsProvider
   [junit4]   2> 1044333 INFO  (TEST-CdcrReplicationHandlerTest.doTest-seed#[72E7104EE9F8F3BA]) [    ] o.a.s.c.c.ConnectionManager Waiting for client to connect to ZooKeeper
   [junit4]   2> 1044334 INFO  (zkCallback-834-thread-1) [    ] o.a.s.c.c.ConnectionManager Watcher org.apache.solr.common.cloud.ConnectionManager@2d1a90ed name:ZooKeeperConnection Watcher:127.0.0.1:49045/solr got event WatchedEvent state:SyncConnected type:None path:null path:null type:None
   [junit4]   2> 1044334 INFO  (TEST-CdcrReplicationHandlerTest.doTest-seed#[72E7104EE9F8F3BA]) [    ] o.a.s.c.c.ConnectionManager Client is connected to ZooKeeper
   [junit4]   2> 1044334 INFO  (TEST-CdcrReplicationHandlerTest.doTest-seed#[72E7104EE9F8F3BA]) [    ] o.a.s.c.c.SolrZkClient Using default ZkACLProvider
   [junit4]   2> 1044334 INFO  (TEST-CdcrReplicationHandlerTest.doTest-seed#[72E7104EE9F8F3BA]) [    ] o.a.s.SolrTestCaseJ4 ###Starting doTest
   [junit4]   2> 1044386 INFO  (TEST-CdcrReplicationHandlerTest.doTest-seed#[72E7104EE9F8F3BA]) [    ] o.a.s.SolrTestCaseJ4 Writing core.properties file to /home/jenkins/workspace/Lucene-Solr-trunk-Linux/solr/build/solr-core/test/J1/temp/solr.cloud.CdcrReplicationHandlerTest_72E7104EE9F8F3BA-001/jetty-001/cores/collection1
   [junit4]   2> 1044388 INFO  (TEST-CdcrReplicationHandlerTest.doTest-seed#[72E7104EE9F8F3BA]) [    ] o.e.j.s.Server jetty-9.2.13.v20150730
   [junit4]   2> 1044388 INFO  (TEST-CdcrReplicationHandlerTest.doTest-seed#[72E7104EE9F8F3BA]) [    ] o.e.j.s.h.ContextHandler Started o.e.j.s.ServletContextHandler@d443fe3{/,null,AVAILABLE}
   [junit4]   2> 1044394 INFO  (TEST-CdcrReplicationHandlerTest.doTest-seed#[72E7104EE9F8F3BA]) [    ] o.e.j.s.ServerConnector Started ServerConnector@7ee1202c{SSL-http/1.1}{127.0.0.1:40332}
   [junit4]   2> 1044394 INFO  (TEST-CdcrReplicationHandlerTest.doTest-seed#[72E7104EE9F8F3BA]) [    ] o.e.j.s.Server Started @1046054ms
   [junit4]   2> 1044394 INFO  (TEST-CdcrReplicationHandlerTest.doTest-seed#[72E7104EE9F8F3BA]) [    ] o.a.s.c.s.e.JettySolrRunner Jetty properties: {shards=shard1, hostContext=/, hostPort=40332, coreRootDirectory=/home/jenkins/workspace/Lucene-Solr-trunk-Linux/solr/build/solr-core/test/J1/temp/solr.cloud.CdcrReplicationHandlerTest_72E7104EE9F8F3BA-001/jetty-001/cores}
   [junit4]   2> 1044394 INFO  (TEST-CdcrReplicationHandlerTest.doTest-seed#[72E7104EE9F8F3BA]) [    ] o.a.s.s.SolrDispatchFilter SolrDispatchFilter.init(): sun.misc.Launcher$AppClassLoader@4e0e2f2a
   [junit4]   2> 1044394 INFO  (TEST-CdcrReplicationHandlerTest.doTest-seed#[72E7104EE9F8F3BA]) [    ] o.a.s.c.SolrResourceLoader new SolrResourceLoader for directory: '/home/jenkins/workspace/Lucene-Solr-trunk-Linux/solr/build/solr-core/test/J1/temp/solr.cloud.CdcrReplicationHandlerTest_72E7104EE9F8F3BA-001/jetty-001/'
   [junit4]   2> 1044394 INFO  (TEST-CdcrReplicationHandlerTest.doTest-seed#[72E7104EE9F8F3BA]) [    ] o.a.s.c.SolrResourceLoader JNDI not configured for solr (NoInitialContextEx)
   [junit4]   2> 1044394 INFO  (TEST-CdcrReplicationHandlerTest.doTest-seed#[72E7104EE9F8F3BA]) [    ] o.a.s.c.SolrResourceLoader solr home defaulted to 'solr/' (could not find system property or JNDI)
   [junit4]   2> 1044404 INFO  (TEST-CdcrReplicationHandlerTest.doTest-seed#[72E7104EE9F8F3BA]) [    ] o.a.s.c.c.SolrZkClient Using default ZkCredentialsProvider
   [junit4]   2> 1044404 INFO  (TEST-CdcrReplicationHandlerTest.doTest-seed#[72E7104EE9F8F3BA]) [    ] o.a.s.c.c.ConnectionManager Waiting for client to connect to ZooKeeper
   [junit4]   2> 1044405 INFO  (zkCallback-835-thread-1) [    ] o.a.s.c.c.ConnectionManager Watcher org.apache.solr.common.cloud.ConnectionManager@6961df4b name:ZooKeeperConnection Watcher:127.0.0.1:49045/solr got event WatchedEvent state:SyncConnected type:None path:null path:null type:None
   [junit4]   2> 1044405 INFO  (TEST-CdcrReplicationHandlerTest.doTest-seed#[72E7104EE9F8F3BA]) [    ] o.a.s.c.c.ConnectionManager Client is connected to ZooKeeper
   [junit4]   2> 1044405 INFO  (TEST-CdcrReplicationHandlerTest.doTest-seed#[72E7104EE9F8F3BA]) [    ] o.a.s.c.c.SolrZkClient Using default ZkACLProvider
   [junit4]   2> 1044405 INFO  (TEST-CdcrReplicationHandlerTest.doTest-seed#[72E7104EE9F8F3BA]) [    ] o.a.s.s.SolrDispatchFilter Loading solr.xml from SolrHome (not found in ZooKeeper)
   [junit4]   2> 1044405 INFO  (TEST-CdcrReplicationHandlerTest.doTest-seed#[72E7104EE9F8F3BA]) [    ] o.a.s.c.SolrXmlConfig Loading container configuration from /home/jenkins/workspace/Lucene-Solr-trunk-Linux/solr/build/solr-core/test/J1/temp/solr.cloud.CdcrReplicationHandlerTest_72E7104EE9F8F3BA-001/jetty-001/solr.xml
   [junit4]   2> 1044409 INFO  (TEST-CdcrReplicationHandlerTest.doTest-seed#[72E7104EE9F8F3BA]) [    ] o.a.s.c.CoresLocator Config-defined core root directory: /home/jenkins/workspace/Lucene-Solr-trunk-Linux/solr/build/solr-core/test/J1/temp/solr.cloud.CdcrReplicationHandlerTest_72E7104EE9F8F3BA-001/jetty-001/cores
   [junit4]   2> 1044409 INFO  (TEST-CdcrReplicationHandlerTest.doTest-seed#[72E7104EE9F8F3BA]) [    ] o.a.s.c.CoreContainer New CoreContainer 1079451768
   [junit4]   2> 1044409 INFO  (TEST-CdcrReplicationHandlerTest.doTest-seed#[72E7104EE9F8F3BA]) [    ] o.a.s.c.CoreContainer Loading cores into CoreContainer [instanceDir=/home/jenkins/workspace/Lucene-Solr-trunk-Linux/solr/build/solr-core/test/J1/temp/solr.cloud.CdcrReplicationHandlerTest_72E7104EE9F8F3BA-001/jetty-001/]
   [junit4]   2> 1044409 INFO  (TEST-CdcrReplicationHandlerTest.doTest-seed#[72E7104EE9F8F3BA]) [    ] o.a.s.c.CoreContainer loading shared library: /home/jenkins/workspace/Lucene-Solr-trunk-Linux/solr/build/solr-core/test/J1/temp/solr.cloud.CdcrReplicationHandlerTest_72E7104EE9F8F3BA-001/jetty-001/lib
   [junit4]   2> 1044409 WARN  (TEST-CdcrReplicationHandlerTest.doTest-seed#[72E7104EE9F8F3BA]) [    ] o.a.s.c.SolrResourceLoader Can't find (or read) directory to add to classloader: lib (resolved as: /home/jenkins/workspace/Lucene-Solr-trunk-Linux/solr/build/solr-core/test/J1/temp/solr.cloud.CdcrReplicationHandlerTest_72E7104EE9F8F3BA-001/jetty-001/lib).
   [junit4]   2> 1044413 INFO  (TEST-CdcrReplicationHandlerTest.doTest-seed#[72E7104EE9F8F3BA]) [    ] o.a.s.h.c.HttpShardHandlerFactory created with socketTimeout : 90000,urlScheme : ,connTimeout : 15000,maxConnectionsPerHost : 20,maxConnections : 10000,corePoolSize : 0,maximumPoolSize : 2147483647,maxThreadIdleTime : 5,sizeOfQueue : -1,fairnessPolicy : false,useRetries : false,
   [junit4]   2> 1044415 INFO  (TEST-CdcrReplicationHandlerTest.doTest-seed#[72E7104EE9F8F3BA]) [    ] o.a.s.u.UpdateShardHandler Creating UpdateShardHandler HTTP client with params: socketTimeout=340000&connTimeout=45000&retry=true
   [junit4]   2> 1044415 INFO  (TEST-CdcrReplicationHandlerTest.doTest-seed#[72E7104EE9F8F3BA]) [    ] o.a.s.l.LogWatcher SLF4J impl is org.slf4j.impl.Log4jLoggerFactory
   [junit4]   2> 1044415 INFO  (TEST-CdcrReplicationHandlerTest.doTest-seed#[72E7104EE9F8F3BA]) [    ] o.a.s.l.LogWatcher Registering Log Listener [Log4j (org.slf4j.impl.Log4jLoggerFactory)]
   [junit4]   2> 1044415 INFO  (TEST-CdcrReplicationHandlerTest.doTest-seed#[72E7104EE9F8F3BA]) [    ] o.a.s.c.ZkContainer Zookeeper client=127.0.0.1:49045/solr
   [junit4]   2> 1044416 INFO  (TEST-CdcrReplicationHandlerTest.doTest-seed#[72E7104EE9F8F3BA]) [    ] o.a.s.c.ZkController zkHost includes chroot
   [junit4]   2> 1044416 INFO  (TEST-CdcrReplicationHandlerTest.doTest-seed#[72E7104EE9F8F3BA]) [    ] o.a.s.c.c.SolrZkClient Using default ZkCredentialsProvider
   [junit4]   2> 1044416 INFO  (TEST-CdcrReplicationHandlerTest.doTest-seed#[72E7104EE9F8F3BA]) [    ] o.a.s.c.c.ConnectionManager Waiting for client to connect to ZooKeeper
   [junit4]   2> 1044417 INFO  (zkCallback-837-thread-1) [    ] o.a.s.c.c.ConnectionManager Watcher org.apache.solr.common.cloud.ConnectionManager@665a0c5b name:ZooKeeperConnection Watcher:127.0.0.1:49045 got event WatchedEvent state:SyncConnected type:None path:null path:null type:None
   [junit4]   2> 1044417 INFO  (TEST-CdcrReplicationHandlerTest.doTest-seed#[72E7104EE9F8F3BA]) [    ] o.a.s.c.c.ConnectionManager Client is connected to ZooKeeper
   [junit4]   2> 1044417 INFO  (TEST-CdcrReplicationHandlerTest.doTest-seed#[72E7104EE9F8F3BA]) [    ] o.a.s.c.c.SolrZkClient Using default ZkACLProvider
   [junit4]   2> 1044418 INFO  (TEST-CdcrReplicationHandlerTest.doTest-seed#[72E7104EE9F8F3BA]) [n:127.0.0.1:40332_    ] o.a.s.c.c.ConnectionManager Waiting for client to connect to ZooKeeper
   [junit4]   2> 1044418 INFO  (zkCallback-838-thread-1-processing-n:127.0.0.1:40332_) [n:127.0.0.1:40332_    ] o.a.s.c.c.ConnectionManager Watcher org.apache.solr.common.cloud.ConnectionManager@17e9fe6b name:ZooKeeperConnection Watcher:127.0.0.1:49045/solr got event WatchedEvent state:SyncConnected type:None path:null path:null type:None
   [junit4]   2> 1044419 INFO  (TEST-CdcrReplicationHandlerTest.doTest-seed#[72E7104EE9F8F3BA]) [n:127.0.0.1:40332_    ] o.a.s.c.c.ConnectionManager Client is connected to ZooKeeper
   [junit4]   2> 1044419 INFO  (TEST-CdcrReplicationHandlerTest.doTest-seed#[72E7104EE9F8F3BA]) [n:127.0.0.1:40332_    ] o.a.s.c.c.SolrZkClient makePath: /overseer/queue
   [junit4]   2> 1044420 INFO  (TEST-CdcrReplicationHandlerTest.doTest-seed#[72E7104EE9F8F3BA]) [n:127.0.0.1:40332_    ] o.a.s.c.c.SolrZkClient makePath: /overseer/collection-queue-work
   [junit4]   2> 1044421 INFO  (TEST-CdcrReplicationHandlerTest.doTest-seed#[72E7104EE9F8F3BA]) [n:127.0.0.1:40332_    ] o.a.s.c.c.SolrZkClient makePath: /overseer/collection-map-running
   [junit4]   2> 1044422 INFO  (TEST-CdcrReplicationHandlerTest.doTest-seed#[72E7104EE9F8F3BA]) [n:127.0.0.1:40332_    ] o.a.s.c.c.SolrZkClient makePath: /overseer/collection-map-completed
   [junit4]   2> 1044422 INFO  (TEST-CdcrReplicationHandlerTest.doTest-seed#[72E7104EE9F8F3BA]) [n:127.0.0.1:40332_    ] o.a.s.c.c.SolrZkClient makePath: /overseer/collection-map-failure
   [junit4]   2> 1044423 INFO  (TEST-CdcrReplicationHandlerTest.doTest-seed#[72E7104EE9F8F3BA]) [n:127.0.0.1:40332_    ] o.a.s.c.c.SolrZkClient makePath: /live_nodes
   [junit4]   2> 1044423 INFO  (TEST-CdcrReplicationHandlerTest.doTest-seed#[72E7104EE9F8F3BA]) [n:127.0.0.1:40332_    ] o.a.s.c.c.SolrZkClient makePath: /aliases.json
   [junit4]   2> 1044424 INFO  (TEST-CdcrReplicationHandlerTest.doTest-seed#[72E7104EE9F8F3BA]) [n:127.0.0.1:40332_    ] o.a.s.c.c.SolrZkClient makePath: /clusterstate.json
   [junit4]   2> 1044424 INFO  (TEST-CdcrReplicationHandlerTest.doTest-seed#[72E7104EE9F8F3BA]) [n:127.0.0.1:40332_    ] o.a.s.c.c.SolrZkClient makePath: /security.json
   [junit4]   2> 1044425 INFO  (TEST-CdcrReplicationHandlerTest.doTest-seed#[72E7104EE9F8F3BA]) [n:127.0.0.1:40332_    ] o.a.s.c.ZkController Register node as live in ZooKeeper:/live_nodes/127.0.0.1:40332_
   [junit4]   2> 1044425 INFO  (TEST-CdcrReplicationHandlerTest.doTest-seed#[72E7104EE9F8F3BA]) [n:127.0.0.1:40332_    ] o.a.s.c.c.SolrZkClient makePath: /live_nodes/127.0.0.1:40332_
   [junit4]   2> 1044425 INFO  (TEST-CdcrReplicationHandlerTest.doTest-seed#[72E7104EE9F8F3BA]) [n:127.0.0.1:40332_    ] o.a.s.c.c.SolrZkClient makePath: /overseer_elect
   [junit4]   2> 1044426 INFO  (TEST-CdcrReplicationHandlerTest.doTest-seed#[72E7104EE9F8F3BA]) [n:127.0.0.1:40332_    ] o.a.s.c.c.SolrZkClient makePath: /overseer_elect/election
   [junit4]   2> 1044426 INFO  (TEST-CdcrReplicationHandlerTest.doTest-seed#[72E7104EE9F8F3BA]) [n:127.0.0.1:40332_    ] o.a.s.c.Overseer Overseer (id=null) closing
   [junit4]   2> 1044426 INFO  (TEST-CdcrReplicationHandlerTest.doTest-seed#[72E7104EE9F8F3BA]) [n:127.0.0.1:40332_    ] o.a.s.c.LeaderElector Joined leadership election with path: /overseer_elect/election/94810866738397189-127.0.0.1:40332_-n_0000000000
   [junit4]   2> 1044426 INFO  (TEST-CdcrReplicationHandlerTest.doTest-seed#[72E7104EE9F8F3BA]) [n:127.0.0.1:40332_    ] o.a.s.c.OverseerElectionContext I am going to be the leader 127.0.0.1:40332_
   [junit4]   2> 1044426 INFO  (TEST-CdcrReplicationHandlerTest.doTest-seed#[72E7104EE9F8F3BA]) [n:127.0.0.1:40332_    ] o.a.s.c.c.SolrZkClient makePath: /overseer_elect/leader
   [junit4]   2> 1044427 INFO  (TEST-CdcrReplicationHandlerTest.doTest-seed#[72E7104EE9F8F3BA]) [n:127.0.0.1:40332_    ] o.a.s.c.Overseer Overseer (id=94810866738397189-127.0.0.1:40332_-n_0000000000) starting
   [junit4]   2> 1044427 INFO  (TEST-CdcrReplicationHandlerTest.doTest-seed#[72E7104EE9F8F3BA]) [n:127.0.0.1:40332_    ] o.a.s.c.c.SolrZkClient makePath: /overseer/queue-work
   [junit4]   2> 1044429 INFO  (TEST-CdcrReplicationHandlerTest.doTest-seed#[72E7104EE9F8F3BA]) [n:127.0.0.1:40332_    ] o.a.s.c.OverseerAutoReplicaFailoverThread Starting OverseerAutoReplicaFailoverThread autoReplicaFailoverWorkLoopDelay=10000 autoReplicaFailoverWaitAfterExpiration=30000 autoReplicaFailoverBadNodeExpiration=60000
   [junit4]   2> 1044430 INFO  (OverseerCollectionConfigSetProcessor-94810866738397189-127.0.0.1:40332_-n_0000000000) [n:127.0.0.1:40332_    ] o.a.s.c.OverseerTaskProcessor Process current queue of overseer operations
   [junit4]   2> 1044430 INFO  (TEST-CdcrReplicationHandlerTest.doTest-seed#[72E7104EE9F8F3BA]) [n:127.0.0.1:40332_    ] o.a.s.c.c.ZkStateReader Updating cluster state from ZooKeeper... 
   [junit4]   2> 1044430 INFO  (OverseerStateUpdate-94810866738397189-127.0.0.1:40332_-n_0000000000) [n:127.0.0.1:40332_    ] o.a.s.c.Overseer Starting to work on the main queue
   [junit4]   2> 1044444 INFO  (TEST-CdcrReplicationHandlerTest.doTest-seed#[72E7104EE9F8F3BA]) [n:127.0.0.1:40332_    ] o.a.s.c.CoreContainer Security conf doesn't exist. Skipping setup for authorization module.
   [junit4]   2> 1044444 INFO  (TEST-CdcrReplicationHandlerTest.doTest-seed#[72E7104EE9F8F3BA]) [n:127.0.0.1:40332_    ] o.a.s.c.CoreContainer No authentication plugin used.
   [junit4]   2> 1044445 INFO  (TEST-CdcrReplicationHandlerTest.doTest-seed#[72E7104EE9F8F3BA]) [n:127.0.0.1:40332_    ] o.a.s.c.CoresLocator Looking for core definitions underneath /home/jenkins/workspace/Lucene-Solr-trunk-Linux/solr/build/solr-core/test/J1/temp/solr.cloud.CdcrReplicationHandlerTest_72E7104EE9F8F3BA-001/jetty-001/cores
   [junit4]   2> 1044445 INFO  (TEST-CdcrReplicationHandlerTest.doTest-seed#[72E7104EE9F8F3BA]) [n:127.0.0.1:40332_    ] o.a.s.c.SolrCore Created CoreDescriptor: {name=collection1, config=solrconfig.xml, transient=false, schema=schema.xml, loadOnStartup=true, configSetProperties=configsetprops.json, instanceDir=/home/jenkins/workspace/Lucene-Solr-trunk-Linux/solr/build/solr-core/test/J1/temp/solr.cloud.CdcrReplicationHandlerTest_72E7104EE9F8F3BA-001/jetty-001/cores/collection1, collection=tmp_collection, absoluteInstDir=/home/jenkins/workspace/Lucene-Solr-trunk-Linux/solr/build/solr-core/test/J1/temp/solr.cloud.CdcrReplicationHandlerTest_72E7104EE9F8F3BA-001/jetty-001/cores/collection1/, coreNodeName=, dataDir=data/, shard=}
   [junit4]   2> 1044445 INFO  (TEST-CdcrReplicationHandlerTest.doTest-seed#[72E7104EE9F8F3BA]) [n:127.0.0.1:40332_    ] o.a.s.c.CoresLocator Found core collection1 in /home/jenkins/workspace/Lucene-Solr-trunk-Linux/solr/build/solr-core/test/J1/temp/solr.cloud.CdcrReplicationHandlerTest_72E7104EE9F8F3BA-001/jetty-001/cores/collection1/
   [junit4]   2> 1044445 INFO  (TEST-CdcrReplicationHandlerTest.doTest-seed#[72E7104EE9F8F3BA]) [n:127.0.0.1:40332_    ] o.a.s.c.CoresLocator Found 1 core definitions
   [junit4]   2> 1044446 INFO  (TEST-CdcrReplicationHandlerTest.doTest-seed#[72E7104EE9F8F3BA]) [n:127.0.0.1:40332_    ] o.a.s.s.SolrDispatchFilter user.dir=/home/jenkins/workspace/Lucene-Solr-trunk-Linux/solr/build/solr-core/test/J1
   [junit4]   2> 1044446 INFO  (TEST-CdcrReplicationHandlerTest.doTest-seed#[72E7104EE9F8F3BA]) [n:127.0.0.1:40332_    ] o.a.s.s.SolrDispatchFilter SolrDispatchFilter.init() done
   [junit4]   2> 1044446 INFO  (coreLoadExecutor-3414-thread-1-processing-n:127.0.0.1:40332_) [n:127.0.0.1:40332_ c:tmp_collection   x:collection1] o.a.s.c.ZkController publishing state=down
   [junit4]   2> 1044446 INFO  (coreLoadExecutor-3414-thread-1-processing-n:127.0.0.1:40332_) [n:127.0.0.1:40332_ c:tmp_collection   x:collection1] o.a.s.c.ZkController numShards not found on descriptor - reading it from system property
   [junit4]   2> 1044446 INFO  (coreLoadExecutor-3414-thread-1-processing-n:127.0.0.1:40332_) [n:127.0.0.1:40332_ c:tmp_collection   x:collection1] o.a.s.c.ZkController look for our core node name
   [junit4]   2> 1044446 INFO  (OverseerStateUpdate-94810866738397189-127.0.0.1:40332_-n_0000000000) [n:127.0.0.1:40332_    ] o.a.s.c.Overseer processMessage: queueSize: 1, message = {
   [junit4]   2>   "core":"collection1",
   [junit4]   2>   "roles":null,
   [junit4]   2>   "base_url":"https://127.0.0.1:40332",
   [junit4]   2>   "node_name":"127.0.0.1:40332_",
   [junit4]   2>   "numShards":"1",
   [junit4]   2>   "state":"down",
   [junit4]   2>   "shard":null,
   [junit4]   2>   "collection":"tmp_collection",
   [junit4]   2>   "operation":"state"} current state version: 0
   [junit4]   2> 1044447 INFO  (OverseerStateUpdate-94810866738397189-127.0.0.1:40332_-n_0000000000) [n:127.0.0.1:40332_    ] o.a.s.c.o.ReplicaMutator Update state numShards=1 message={
   [junit4]   2>   "core":"collection1",
   [junit4]   2>   "roles":null,
   [junit4]   2>   "base_url":"https://127.0.0.1:40332",
   [junit4]   2>   "node_name":"127.0.0.1:40332_",
   [junit4]   2>   "numShards":"1",
   [junit4]   2>   "state":"down",
   [junit4]   2>   "shard":null,
   [junit4]   2>   "collection":"tmp_collection",
   [junit4]   2>   "operation":"state"}
   [junit4]   2> 1044447 INFO  (OverseerStateUpdate-94810866738397189-127.0.0.1:40332_-n_0000000000) [n:127.0.0.1:40332_    ] o.a.s.c.o.ClusterStateMutator building a new cName: tmp_collection
   [junit4]   2> 1044447 INFO  (OverseerStateUpdate-94810866738397189-127.0.0.1:40332_-n_0000000000) [n:127.0.0.1:40332_    ] o.a.s.c.o.ReplicaMutator Assigning new node to shard shard=shard1
   [junit4]   2> 1044447 INFO  (zkCallback-838-thread-1-processing-n:127.0.0.1:40332_) [n:127.0.0.1:40332_    ] o.a.s.c.c.ZkStateReader A cluster state change: WatchedEvent state:SyncConnected type:NodeDataChanged path:/clusterstate.json, has occurred - updating... (live nodes size: 1)
   [junit4]   2> 1045447 INFO  (coreLoadExecutor-3414-thread-1-processing-n:127.0.0.1:40332_) [n:127.0.0.1:40332_ c:tmp_collection   x:collection1] o.a.s.c.ZkController waiting to find shard id in clusterstate for collection1
   [junit4]   2> 1045447 INFO  (coreLoadExecutor-3414-thread-1-processing-n:127.0.0.1:40332_) [n:127.0.0.1:40332_ c:tmp_collection   x:collection1] o.a.s.c.ZkController Check for collection zkNode:tmp_collection
   [junit4]   2> 1045447 INFO  (coreLoadExecutor-3414-thread-1-processing-n:127.0.0.1:40332_) [n:127.0.0.1:40332_ c:tmp_collection   x:collection1] o.a.s.c.ZkController Creating collection in ZooKeeper:tmp_collection
   [junit4]   2> 1045447 INFO  (coreLoadExecutor-3414-thread-1-processing-n:127.0.0.1:40332_) [n:127.0.0.1:40332_ c:tmp_collection   x:collection1] o.a.s.c.ZkController Looking for collection configName
   [junit4]   2> 1045447 INFO  (coreLoadExecutor-3414-thread-1-processing-n:127.0.0.1:40332_) [n:127.0.0.1:40332_ c:tmp_collection   x:collection1] o.a.s.c.ZkController Only one config set found in zk - using it:conf1
   [junit4]   2> 1045447 INFO  (coreLoadExecutor-3414-thread-1-processing-n:127.0.0.1:40332_) [n:127.0.0.1:40332_ c:tmp_collection   x:collection1] o.a.s.c.c.SolrZkClient makePath: /collections/tmp_collection
   [junit4]   2> 1045448 INFO  (zkCallback-838-thread-1-processing-n:127.0.0.1:40332_) [n:127.0.0.1:40332_    ] o.a.s.c.c.ZkStateReader A collections change: WatchedEvent state:SyncConnected type:NodeChildrenChanged path:/collections, has occurred - updating...
   [junit4]   2> 1045448 INFO  (coreLoadExecutor-3414-thread-1-processing-n:127.0.0.1:40332_) [n:127.0.0.1:40332_ c:tmp_collection   x:collection1] o.a.s.c.c.ZkStateReader Load collection config from:/collections/tmp_collection
   [junit4]   2> 1045448 INFO  (coreLoadExecutor-3414-thread-1-processing-n:127.0.0.1:40332_) [n:127.0.0.1:40332_ c:tmp_collection   x:collection1] o.a.s.c.c.ZkStateReader path=/collections/tmp_collection configName=conf1 specified config exists in ZooKeeper
   [junit4]   2> 1045448 INFO  (coreLoadExecutor-3414-thread-1-processing-n:127.0.0.1:40332_) [n:127.0.0.1:40332_ c:tmp_collection   x:collection1] o.a.s.c.SolrResourceLoader new SolrResourceLoader for directory: '/home/jenkins/workspace/Lucene-Solr-trunk-Linux/solr/build/solr-core/test/J1/temp/solr.cloud.CdcrReplicationHandlerTest_72E7104EE9F8F3BA-001/jetty-001/cores/collection1/'
   [junit4]   2> 1045448 INFO  (coreLoadExecutor-3414-thread-1-processing-n:127.0.0.1:40332_) [n:127.0.0.1:40332_ c:tmp_collection   x:collection1] o.a.s.c.SolrResourceLoader JNDI not configured for solr (NoInitialContextEx)
   [junit4]   2> 1045449 INFO  (coreLoadExecutor-3414-thread-1-processing-n:127.0.0.1:40332_) [n:127.0.0.1:40332_ c:tmp_collection   x:collection1] o.a.s.c.SolrResourceLoader solr home defaulted to 'solr/' (could not find system property or JNDI)
   [junit4]   2> 1045456 INFO  (coreLoadExecutor-3414-thread-1-processing-n:127.0.0.1:40332_) [n:127.0.0.1:40332_ c:tmp_collection   x:collection1] o.a.s.c.Config loaded config solrconfig.xml with version 0 
   [junit4]   2> 1045459 INFO  (coreLoadExecutor-3414-thread-1-processing-n:127.0.0.1:40332_) [n:127.0.0.1:40332_ c:tmp_collection   x:collection1] o.a.s.c.SolrConfig current version of requestparams : -1
   [junit4]   2> 1045476 INFO  (coreLoadExecutor-3414-thread-1-processing-n:127.0.0.1:40332_) [n:127.0.0.1:40332_ c:tmp_collection   x:collection1] o.a.s.c.SolrConfig Using Lucene MatchVersion: 6.0.0
   [junit4]   2> 1045482 INFO  (coreLoadExecutor-3414-thread-1-processing-n:127.0.0.1:40332_) [n:127.0.0.1:40332_ c:tmp_collection   x:collection1] o.a.s.c.Config Loaded SolrConfig: solrconfig.xml
   [junit4]   2> 1045482 INFO  (coreLoadExecutor-3414-thread-1-processing-n:127.0.0.1:40332_) [n:127.0.0.1:40332_ c:tmp_collection   x:collection1] o.a.s.s.IndexSchema Reading Solr Schema from /configs/conf1/schema.xml
   [junit4]   2> 1045485 INFO  (coreLoadExecutor-3414-thread-1-processing-n:127.0.0.1:40332_) [n:127.0.0.1:40332_ c:tmp_collection   x:collection1] o.a.s.s.IndexSchema [collection1] Schema name=test
   [junit4]   2> 1045557 INFO  (coreLoadExecutor-3414-thread-1-processing-n:127.0.0.1:40332_) [n:127.0.0.1:40332_ c:tmp_collection   x:collection1] o.a.s.s.IndexSchema default search field in schema is text
   [junit4]   2> 1045558 INFO  (coreLoadExecutor-3414-thread-1-processing-n:127.0.0.1:40332_) [n:127.0.0.1:40332_ c:tmp_collection   x:collection1] o.a.s.s.IndexSchema unique key field: id
   [junit4]   2> 1045558 INFO  (coreLoadExecutor-3414-thread-1-processing-n:127.0.0.1:40332_) [n:127.0.0.1:40332_ c:tmp_collection   x:collection1] o.a.s.s.FileExchangeRateProvider Reloading exchange rates from file currency.xml
   [junit4]   2> 1045560 INFO  (coreLoadExecutor-3414-thread-1-processing-n:127.0.0.1:40332_) [n:127.0.0.1:40332_ c:tmp_collection   x:collection1] o.a.s.s.FileExchangeRateProvider Reloading exchange rates from file currency.xml
   [junit4]   2> 1045566 INFO  (coreLoadExecutor-3414-thread-1-processing-n:127.0.0.1:40332_) [n:127.0.0.1:40332_ c:tmp_collection   x:collection1] o.a.s.c.ConfigSetProperties Did not find ConfigSet properties, assuming default properties: Can't find resource 'configsetprops.json' in classpath or '/configs/conf1', cwd=/home/jenkins/workspace/Lucene-Solr-trunk-Linux/solr/build/solr-core/test/J1
   [junit4]   2> 1045566 INFO  (coreLoadExecutor-3414-thread-1-processing-n:127.0.0.1:40332_) [n:127.0.0.1:40332_ c:tmp_collection   x:collection1] o.a.s.c.CoreContainer Creating SolrCore 'collection1' using configuration from collection tmp_collection
   [junit4]   2> 1045566 INFO  (coreLoadExecutor-3414-thread-1-processing-n:127.0.0.1:40332_) [n:127.0.0.1:40332_ c:tmp_collection s:shard1 r:core_node1 x:collection1] o.a.s.c.SolrCore solr.StandardDirectoryFactory
   [junit4]   2> 1045566 INFO  (coreLoadExecutor-3414-thread-1-processing-n:127.0.0.1:40332_) [n:127.0.0.1:40332_ c:tmp_collection s:shard1 r:core_node1 x:collection1] o.a.s.c.SolrCore [[collection1] ] Opening new SolrCore at [/home/jenkins/workspace/Lucene-Solr-trunk-Linux/solr/build/solr-core/test/J1/temp/solr.cloud.CdcrReplicationHandlerTest_72E7104EE9F8F3BA-001/jetty-001/cores/collection1/], dataDir=[null]
   [junit4]   2> 1045566 INFO  (coreLoadExecutor-3414-thread-1-processing-n:127.0.0.1:40332_) [n:127.0.0.1:40332_ c:tmp_collection s:shard1 r:core_node1 x:collection1] o.a.s.c.JmxMonitoredMap JMX monitoring is enabled. Adding Solr mbeans to JMX Server: com.sun.jmx.mbeanserver.JmxMBeanServer@3353328c
   [junit4]   2> 1045566 INFO  (coreLoadExecutor-3414-thread-1-processing-n:127.0.0.1:40332_) [n:127.0.0.1:40332_ c:tmp_collection s:shard1 r:core_node1 x:collection1] o.a.s.c.CachingDirectoryFactory return new directory for /home/jenkins/workspace/Lucene-Solr-trunk-Linux/solr/build/solr-core/test/J1/temp/solr.cloud.CdcrReplicationHandlerTest_72E7104EE9F8F3BA-001/jetty-001/cores/collection1/data
   [junit4]   2> 1045566 INFO  (coreLoadExecutor-3414-thread-1-processing-n:127.0.0.1:40332_) [n:127.0.0.1:40332_ c:tmp_collection s:shard1 r:core_node1 x:collection1] o.a.s.c.SolrCore New index directory detected: old=null new=/home/jenkins/workspace/Lucene-Solr-trunk-Linux/solr/build/solr-core/test/J1/temp/solr.cloud.CdcrReplicationHandlerTest_72E7104EE9F8F3BA-001/jetty-001/cores/collection1/data/index/
   [junit4]   2> 1045567 WARN  (coreLoadExecutor-3414-thread-1-processing-n:127.0.0.1:40332_) [n:127.0.0.1:40332_ c:tmp_collection s:shard1 r:core_node1 x:collection1] o.a.s.c.SolrCore [collection1] Solr index directory '/home/jenkins/workspace/Lucene-Solr-trunk-Linux/solr/build/solr-core/test/J1/temp/solr.cloud.CdcrReplicationHandlerTest_72E7104EE9F8F3BA-001/jetty-001/cores/collection1/data/index' doesn't exist. Creating new index...
   [junit4]   2> 1045567 INFO  (coreLoadExecutor-3414-thread-1-processing-n:127.0.0.1:40332_) [n:127.0.0.1:40332_ c:tmp_collection s:shard1 r:core_node1 x:collection1] o.a.s.c.CachingDirectoryFactory return new directory for /home/jenkins/workspace/Lucene-Solr-trunk-Linux/solr/build/solr-core/test/J1/temp/solr.cloud.CdcrReplicationHandlerTest_72E7104EE9F8F3BA-001/jetty-001/cores/collection1/data/index
   [junit4]   2> 1045567 INFO  (coreLoadExecutor-3414-thread-1-processing-n:127.0.0.1:40332_) [n:127.0.0.1:40332_ c:tmp_collection s:shard1 r:core_node1 x:collection1] o.a.s.u.RandomMergePolicy RandomMergePolicy wrapping class org.apache.lucene.index.AlcoholicMergePolicy: [AlcoholicMergePolicy: minMergeSize=0, mergeFactor=10, maxMergeSize=2105308297, maxMergeSizeForForcedMerge=9223372036854775807, calibrateSizeByDeletes=true, maxMergeDocs=2147483647, maxCFSSegmentSizeMB=8.796093022207999E12, noCFSRatio=0.1]
   [junit4]   2> 1045682 INFO  (coreLoadExecutor-3414-thread-1-processing-n:127.0.0.1:40332_) [n:127.0.0.1:40332_ c:tmp_collection s:shard1 r:core_node1 x:collection1] o.a.s.c.SolrCore SolrDeletionPolicy.onCommit: commits: num=1
   [junit4]   2> 	commit{dir=/home/jenkins/workspace/Lucene-Solr-trunk-Linux/solr/build/solr-core/test/J1/temp/solr.cloud.CdcrReplicationHandlerTest_72E7104EE9F8F3BA-001/jetty-001/cores/collection1/data/index,segFN=segments_1,generation=1}
   [junit4]   2> 1045682 INFO  (coreLoadExecutor-3414-thread-1-processing-n:127.0.0.1:40332_) [n:127.0.0.1:40332_ c:tmp_collection s:shard1 r:core_node1 x:collection1] o.a.s.c.SolrCore newest commit generation = 1
   [junit4]   2> 1045683 INFO  (OldIndexDirectoryCleanupThreadForCore-collection1) [n:127.0.0.1:40332_ c:tmp_collection s:shard1 r:core_node1 x:collection1] o.a.s.c.SolrCore Looking for old index directories to cleanup for core collection1 in /home/jenkins/workspace/Lucene-Solr-trunk-Linux/solr/build/solr-core/test/J1/temp/solr.cloud.CdcrReplicationHandlerTest_72E7104EE9F8F3BA-001/jetty-001/cores/collection1/data/
   [junit4]   2> 1045685 INFO  (coreLoadExecutor-3414-thread-1-processing-n:127.0.0.1:40332_) [n:127.0.0.1:40332_ c:tmp_collection s:shard1 r:core_node1 x:collection1] o.a.s.u.p.UpdateRequestProcessorChain creating updateRequestProcessorChain "cdcr-processor-chain"
   [junit4]   2> 1045694 INFO  (coreLoadExecutor-3414-thread-1-processing-n:127.0.0.1:40332_) [n:127.0.0.1:40332_ c:tmp_collection s:shard1 r:core_node1 x:collection1] o.a.s.c.SolrCore no updateRequestProcessorChain defined as default, creating implicit default
   [junit4]   2> 1045696 INFO  (coreLoadExecutor-3414-thread-1-processing-n:127.0.0.1:40332_) [n:127.0.0.1:40332_ c:tmp_collection s:shard1 r:core_node1 x:collection1] o.a.s.h.l.XMLLoader xsltCacheLifetimeSeconds=60
   [junit4]   2> 1045696 INFO  (coreLoadExecutor-3414-thread-1-processing-n:127.0.0.1:40332_) [n:127.0.0.1:40332_ c:tmp_collection s:shard1 r:core_node1 x:collection1] o.a.s.h.l.XMLLoader xsltCacheLifetimeSeconds=60
   [junit4]   2> 1045697 INFO  (coreLoadExecutor-3414-thread-1-processing-n:127.0.0.1:40332_) [n:127.0.0.1:40332_ c:tmp_collection s:shard1 r:core_node1 x:collection1] o.a.s.h.l.XMLLoader xsltCacheLifetimeSeconds=60
   [junit4]   2> 1045697 INFO  (coreLoadExecutor-3414-thread-1-processing-n:127.0.0.1:40332_) [n:127.0.0.1:40332_ c:tmp_collection s:shard1 r:core_node1 x:collection1] o.a.s.h.l.XMLLoader xsltCacheLifetimeSeconds=60
   [junit4]   2> 1045703 INFO  (coreLoadExecutor-3414-thread-1-processing-n:127.0.0.1:40332_) [n:127.0.0.1:40332_ c:tmp_collection s:shard1 r:core_node1 x:collection1] o.a.s.c.RequestHandlers Registered paths: /admin/mbeans,standard,/update/csv,/update/json/docs,/admin/luke,/admin/segments,/get,/admin/system,/replication,/admin/properties,/config,/schema,/admin/plugins,/admin/logging,/update/json,/admin/threads,/admin/ping,/cdcr,/update,/admin/file
   [junit4]   2> 1045704 INFO  (coreLoadExecutor-3414-thread-1-processing-n:127.0.0.1:40332_) [n:127.0.0.1:40332_ c:tmp_collection s:shard1 r:core_node1 x:collection1] o.a.s.c.SolrCore Using default statsCache cache: org.apache.solr.search.stats.LocalStatsCache
   [junit4]   2> 1045711 INFO  (coreLoadExecutor-3414-thread-1-processing-n:127.0.0.1:40332_) [n:127.0.0.1:40332_ c:tmp_collection s:shard1 r:core_node1 x:collection1] o.a.s.u.UpdateHandler Using UpdateLog implementation: org.apache.solr.update.CdcrUpdateLog
   [junit4]   2> 1045711 INFO  (coreLoadExecutor-3414-thread-1-processing-n:127.0.0.1:40332_) [n:127.0.0.1:40332_ c:tmp_collection s:shard1 r:core_node1 x:collection1] o.a.s.u.UpdateLog Initializing UpdateLog: dataDir= defaultSyncLevel=FLUSH numRecordsToKeep=100 maxNumLogsToKeep=10 numVersionBuckets=65536
   [junit4]   2> 1045712 INFO  (coreLoadExecutor-3414-thread-1-processing-n:127.0.0.1:40332_) [n:127.0.0.1:40332_ c:tmp_collection s:shard1 r:core_node1 x:collection1] o.a.s.c.SolrCore Hard AutoCommit: disabled
   [junit4]   2> 1045712 INFO  (coreLoadExecutor-3414-thread-1-processing-n:127.0.0.1:40332_) [n:127.0.0.1:40332_ c:tmp_collection s:shard1 r:core_node1 x:collection1] o.a.s.c.SolrCore Soft AutoCommit: disabled
   [junit4]   2> 1045712 INFO  (coreLoadExecutor-3414-thread-1-processing-n:127.0.0.1:40332_) [n:127.0.0.1:40332_ c:tmp_collection s:shard1 r:core_node1 x:collection1] o.a.s.u.RandomMergePolicy RandomMergePolicy wrapping class org.apache.lucene.index.TieredMergePolicy: [TieredMergePolicy: maxMergeAtOnce=34, maxMergeAtOnceExplicit=16, maxMergedSegmentMB=6.599609375, floorSegmentMB=2.1435546875, forceMergeDeletesPctAllowed=6.804017152491953, segmentsPerTier=28.0, maxCFSSegmentSizeMB=8.796093022207999E12, noCFSRatio=0.6325937505797732
   [junit4]   2> 1045713 INFO  (coreLoadExecutor-3414-thread-1-processing-n:127.0.0.1:40332_) [n:127.0.0.1:40332_ c:tmp_collection s:shard1 r:core_node1 x:collection1] o.a.s.c.SolrCore SolrDeletionPolicy.onInit: commits: num=1
   [junit4]   2> 	commit{dir=/home/jenkins/workspace/Lucene-Solr-trunk-Linux/solr/build/solr-core/test/J1/temp/solr.cloud.CdcrReplicationHandlerTest_72E7104EE9F8F3BA-001/jetty-001/cores/collection1/data/index,segFN=segments_1,generation=1}
   [junit4]   2> 1045713 INFO  (coreLoadExecutor-3414-thread-1-processing-n:127.0.0.1:40332_) [n:127.0.0.1:40332_ c:tmp_collection s:shard1 r:core_node1 x:collection1] o.a.s.c.SolrCore newest commit generation = 1
   [junit4]   2> 1045713 INFO  (coreLoadExecutor-3414-thread-1-processing-n:127.0.0.1:40332_) [n:127.0.0.1:40332_ c:tmp_collection s:shard1 r:core_node1 x:collection1] o.a.s.s.SolrIndexSearcher Opening Searcher@2775f688[collection1] main
   [junit4]   2> 1045713 INFO  (coreLoadExecutor-3414-thread-1-processing-n:127.0.0.1:40332_) [n:127.0.0.1:40332_ c:tmp_collection s:shard1 r:core_node1 x:collection1] o.a.s.c.c.ZkStateReader Load collection config from:/collections/tmp_collection
   [junit4]   2> 1045713 INFO  (coreLoadExecutor-3414-thread-1-processing-n:127.0.0.1:40332_) [n:127.0.0.1:40332_ c:tmp_collection s:shard1 r:core_node1 x:collection1] o.a.s.c.c.ZkStateReader path=/collections/tmp_collection configName=conf1 specified config exists in ZooKeeper
   [junit4]   2> 1045713 INFO  (coreLoadExecutor-3414-thread-1-processing-n:127.0.0.1:40332_) [n:127.0.0.1:40332_ c:tmp_collection s:shard1 r:core_node1 x:collection1] o.a.s.r.ManagedResourceStorage Setting up ZooKeeper-based storage for the RestManager with znodeBase: /configs/conf1
   [junit4]   2> 1045714 INFO  (coreLoadExecutor-3414-thread-1-processing-n:127.0.0.1:40332_) [n:127.0.0.1:40332_ c:tmp_collection s:shard1 r:core_node1 x:collection1] o.a.s.r.ManagedResourceStorage Configured ZooKeeperStorageIO with znodeBase: /configs/conf1
   [junit4]   2> 1045714 INFO  (coreLoadExecutor-3414-thread-1-processing-n:127.0.0.1:40332_) [n:127.0.0.1:40332_ c:tmp_collection s:shard1 r:core_node1 x:collection1] o.a.s.r.RestManager Initializing RestManager with initArgs: {}
   [junit4]   2> 1045714 INFO  (coreLoadExecutor-3414-thread-1-processing-n:127.0.0.1:40332_) [n:127.0.0.1:40332_ c:tmp_collection s:shard1 r:core_node1 x:collection1] o.a.s.r.ManagedResourceStorage Reading _rest_managed.json using ZooKeeperStorageIO:path=/configs/conf1
   [junit4]   2> 1045714 INFO  (coreLoadExecutor-3414-thread-1-processing-n:127.0.0.1:40332_) [n:127.0.0.1:40332_ c:tmp_collection s:shard1 r:core_node1 x:collection1] o.a.s.r.ManagedResourceStorage No data found for znode /configs/conf1/_rest_managed.json
   [junit4]   2> 1045714 INFO  (coreLoadExecutor-3414-thread-1-processing-n:127.0.0.1:40332_) [n:127.0.0.1:40332_ c:tmp_collection s:shard1 r:core_node1 x:collection1] o.a.s.r.ManagedResourceStorage Loaded null at path _rest_managed.json using ZooKeeperStorageIO:path=/configs/conf1
   [junit4]   2> 1045714 INFO  (coreLoadExecutor-3414-thread-1-processing-n:127.0.0.1:40332_) [n:127.0.0.1:40332_ c:tmp_collection s:shard1 r:core_node1 x:collection1] o.a.s.r.RestManager Initializing 0 registered ManagedResources
   [junit4]   2> 1045714 INFO  (coreLoadExecutor-3414-thread-1-processing-n:127.0.0.1:40332_) [n:127.0.0.1:40332_ c:tmp_collection s:shard1 r:core_node1 x:collection1] o.a.s.h.ReplicationHandler Commits will be reserved for  10000
   [junit4]   2> 1045717 INFO  (coreLoadExecutor-3414-thread-1-processing-n:127.0.0.1:40332_) [n:127.0.0.1:40332_ c:tmp_collection s:shard1 r:core_node1 x:collection1] o.a.s.c.c.SolrZkClient makePath: /collections/tmp_collection/cdcr/state
   [junit4]   2> 1045718 INFO  (coreLoadExecutor-3414-thread-1-processing-n:127.0.0.1:40332_) [n:127.0.0.1:40332_ c:tmp_collection s:shard1 r:core_node1 x:collection1] o.a.s.h.CdcrBufferStateManager Created znode /collections/tmp_collection/cdcr/state/buffer
   [junit4]   2> 1045720 INFO  (coreLoadExecutor-3414-thread-1-processing-n:127.0.0.1:40332_) [n:127.0.0.1:40332_ c:tmp_collection s:shard1 r:core_node1 x:collection1] o.a.s.h.CdcrProcessStateManager Created znode /collections/tmp_collection/cdcr/state/process
   [junit4]   2> 1045730 INFO  (searcherExecutor-3415-thread-1-processing-n:127.0.0.1:40332_ x:collection1 s:shard1 c:tmp_collection r:core_node1) [n:127.0.0.1:40332_ c:tmp_collection s:shard1 r:core_node1 x:collection1] o.a.s.c.SolrCore [collection1] Registered new searcher Searcher@2775f688[collection1] main{ExitableDirectoryReader(UninvertingDirectoryReader())}
   [junit4]   2> 1045730 INFO  (coreLoadExecutor-3414-thread-1-processing-n:127.0.0.1:40332_) [n:127.0.0.1:40332_ c:tmp_collection s:shard1 r:core_node1 x:collection1] o.a.s.u.UpdateLog Looking up max value of version field to seed version buckets
   [junit4]   2> 1045730 INFO  (coreLoadExecutor-3414-thread-1-processing-n:127.0.0.1:40332_) [n:127.0.0.1:40332_ c:tmp_collection s:shard1 r:core_node1 x:collection1] o.a.s.u.VersionInfo Refreshing highest value of _version_ for 65536 version buckets from index
   [junit4]   2> 1045730 INFO  (coreLoadExecutor-3414-thread-1-processing-n:127.0.0.1:40332_) [n:127.0.0.1:40332_ c:tmp_collection s:shard1 r:core_node1 x:collection1] o.a.s.u.VersionInfo No terms found for _version_, cannot seed version bucket highest value from index
   [junit4]   2> 1045730 INFO  (coreLoadExecutor-3414-thread-1-processing-n:127.0.0.1:40332_) [n:127.0.0.1:40332_ c:tmp_collection s:shard1 r:core_node1 x:collection1] o.a.s.u.UpdateLog Could not find max version in index or recent updates, using new clock 1516973869398753280
   [junit4]   2> 1045732 INFO  (coreLoadExecutor-3414-thread-1-processing-n:127.0.0.1:40332_) [n:127.0.0.1:40332_ c:tmp_collection s:shard1 r:core_node1 x:collection1] o.a.s.u.UpdateLog Took 1.0ms to seed version buckets with highest version 1516973869398753280
   [junit4]   2> 1045732 INFO  (coreLoadExecutor-3414-thread-1-processing-n:127.0.0.1:40332_) [n:127.0.0.1:40332_ c:tmp_collection s:shard1 r:core_node1 x:collection1] o.a.s.c.ZkController watch zkdir /configs/conf1
   [junit4]   2> 1045732 INFO  (coreLoadExecutor-3414-thread-1-processing-n:127.0.0.1:40332_) [n:127.0.0.1:40332_ c:tmp_collection s:shard1 r:core_node1 x:collection1] o.a.s.c.CoreContainer registering core: collection1
   [junit4]   2> 1045732 INFO  (coreZkRegister-3408-thread-1-processing-n:127.0.0.1:40332_ x:collection1 s:shard1 c:tmp_collection r:core_node1) [n:127.0.0.1:40332_ c:tmp_collection s:shard1 r:core_node1 x:collection1] o.a.s.c.ZkController Register replica - core:collection1 address:https://127.0.0.1:40332 collection:tmp_collection shard:shard1
   [junit4]   2> 1045733 INFO  (coreZkRegister-3408-thread-1-processing-n:127.0.0.1:40332_ x:collection1 s:shard1 c:tmp_collection r:core_node1) [n:127.0.0.1:40332_ c:tmp_collection s:shard1 r:core_node1 x:collection1] o.a.s.c.c.SolrZkClient makePath: /collections/tmp_collection/leader_elect/shard1/election
   [junit4]   2> 1045734 INFO  (coreZkRegister-3408-thread-1-processing-n:127.0.0.1:40332_ x:collection1 s:shard1 c:tmp_collection r:core_node1) [n:127.0.0.1:40332_ c:tmp_collection s:shard1 r:core_node1 x:collection1] o.a.s.c.LeaderElector Joined leadership election with path: /collections/tmp_collection/leader_elect/shard1/election/94810866738397189-core_node1-n_0000000000
   [junit4]   2> 1045734 INFO  (coreZkRegister-3408-thread-1-processing-n:127.0.0.1:40332_ x:collection1 s:shard1 c:tmp_collection r:core_node1) [n:127.0.0.1:40332_ c:tmp_collection s:shard1 r:core_node1 x:collection1] o.a.s.c.ShardLeaderElectionContext Running the leader process for shard shard1
   [junit4]   2> 1045734 INFO  (coreZkRegister-3408-thread-1-processing-n:127.0.0.1:40332_ x:collection1 s:shard1 c:tmp_collection r:core_node1) [n:127.0.0.1:40332_ c:tmp_collection s:shard1 r:core_node1 x:collection1] o.a.s.c.ShardLeaderElectionContext Enough replicas found to continue.
   [junit4]   2> 1045734 INFO  (coreZkRegister-3408-thread-1-processing-n:127.0.0.1:40332_ x:collection1 s:shard1 c:tmp_collection r:core_node1) [n:127.0.0.1:40332_ c:tmp_collection s:shard1 r:core_node1 x:collection1] o.a.s.c.ShardLeaderElectionContext I may be the new leader - try and sync
   [junit4]   2> 1045734 INFO  (coreZkRegister-3408-thread-1-processing-n:127.0.0.1:40332_ x:collection1 s:shard1 c:tmp_collection r:core_node1) [n:127.0.0.1:40332_ c:tmp_collection s:shard1 r:core_node1 x:collection1] o.a.s.c.SyncStrategy Sync replicas to https://127.0.0.1:40332/collection1/
   [junit4]   2> 1045735 INFO  (coreZkRegister-3408-thread-1-processing-n:127.0.0.1:40332_ x:collection1 s:shard1 c:tmp_collection r:core_node1) [n:127.0.0.1:40332_ c:tmp_collection s:shard1 r:core_node1 x:collection1] o.a.s.c.SyncStrategy Sync Success - now sync replicas to me
   [junit4]   2> 1045735 INFO  (OverseerStateUpdate-94810866738397189-127.0.0.1:40332_-n_0000000000) [n:127.0.0.1:40332_    ] o.a.s.c.Overseer processMessage: queueSize: 1, message = {
   [junit4]   2>   "operation":"leader",
   [junit4]   2>   "shard":"shard1",
   [junit4]   2>   "collection":"tmp_collection"} current state version: 1
   [junit4]   2> 1045735 INFO  (coreZkRegister-3408-thread-1-processing-n:127.0.0.1:40332_ x:collection1 s:shard1 c:tmp_collection r:core_node1) [n:127.0.0.1:40332_ c:tmp_collection s:shard1 r:core_node1 x:collection1] o.a.s.c.SyncStrategy https://127.0.0.1:40332/collection1/ has no replicas
   [junit4]   2> 1045735 INFO  (coreZkRegister-3408-thread-1-processing-n:127.0.0.1:40332_ x:collection1 s:shard1 c:tmp_collection r:core_node1) [n:127.0.0.1:40332_ c:tmp_collection s:shard1 r:core_node1 x:collection1] o.a.s.c.ShardLeaderElectionContext I am the new leader: https://127.0.0.1:40332/collection1/ shard1
   [junit4]   2> 1045735 INFO  (coreZkRegister-3408-thread-1-processing-n:127.0.0.1:40332_ x:collection1 s:shard1 c:tmp_collection r:core_node1) [n:127.0.0.1:40332_ c:tmp_collection s:shard1 r:core_node1 x:collection1] o.a.s.c.c.SolrZkClient makePath: /collections/tmp_collection/leaders/shard1
   [junit4]   2> 1045736 INFO  (coreZkRegister-3408-thread-1-processing-n:127.0.0.1:40332_ x:collection1 s:shard1 c:tmp_collection r:core_node1) [n:127.0.0.1:40332_ c:tmp_collection s:shard1 r:core_node1 x:collection1] o.a.s.c.ShardLeaderElectionContextBase Creating leader registration node
   [junit4]   2> 1045736 INFO  (zkCallback-838-thread-1-processing-n:127.0.0.1:40332_) [n:127.0.0.1:40332_    ] o.a.s.h.CdcrProcessStateManager Received new leader state @ tmp_collection:shard1
   [junit4]   2> 1045739 INFO  (OverseerStateUpdate-94810866738397189-127.0.0.1:40332_-n_0000000000) [n:127.0.0.1:40332_    ] o.a.s.c.Overseer processMessage: queueSize: 1, message = {
   [junit4]   2>   "operation":"leader",
   [junit4]   2>   "shard":"shard1",
   [junit4]   2>   "collection":"tmp_collection",
   [junit4]   2>   "base_url":"https://127.0.0.1:40332",
   [junit4]   2>   "core":"collection1",
   [junit4]   2>   "state":"active"} current state version: 1
   [junit4]   2> 1045841 INFO  (zkCallback-838-thread-1-processing-n:127.0.0.1:40332_) [n:127.0.0.1:40332_    ] o.a.s.c.c.ZkStateReader A cluster state change: WatchedEvent state:SyncConnected type:NodeDataChanged path:/clusterstate.json, has occurred - updating... (live nodes size: 1)
   [junit4]   2> 1045890 INFO  (coreZkRegister-3408-thread-1-processing-n:127.0.0.1:40332_ x:collection1 s:shard1 c:tmp_collection r:core_node1) [n:127.0.0.1:40332_ c:tmp_collection s:shard1 r:core_node1 x:collection1] o.a.s.c.ZkController We are https://127.0.0.1:40332/collection1/ and leader is https://127.0.0.1:40332/collection1/
   [junit4]   2> 1045890 INFO  (coreZkRegister-3408-thread-1-processing-n:127.0.0.1:40332_ x:collection1 s:shard1 c:tmp_collection r:core_node1) [n:127.0.0.1:40332_ c:tmp_collection s:shard1 r:core_node1 x:collection1] o.a.s.c.ZkController No LogReplay needed for core=collection1 baseURL=https://127.0.0.1:40332
   [junit4]   2> 1045890 INFO  (coreZkRegister-3408-thread-1-processing-n:127.0.0.1:40332_ x:collection1 s:shard1 c:tmp_collection r:core_node1) [n:127.0.0.1:40332_ c:tmp_collection s:shard1 r:core_node1 x:collection1] o.a.s.c.ZkController I am the leader, no recovery necessary
   [junit4]   2> 1045890 INFO  (coreZkRegister-3408-thread-1-processing-n:127.0.0.1:40332_ x:collection1 s:shard1 c:tmp_collection r:core_node1) [n:127.0.0.1:40332_ c:tmp_collection s:shard1 r:core_node1 x:collection1] o.a.s.c.ZkController publishing state=active
   [junit4]   2> 1045890 INFO  (coreZkRegister-3408-thread-1-processing-n:127.0.0.1:40332_ x:collection1 s:shard1 c:tmp_collection r:core_node1) [n:127.0.0.1:40332_ c:tmp_collection s:shard1 r:core_node1 x:collection1] o.a.s.c.ZkController numShards not found on descriptor - reading it from system property
   [junit4]   2> 1045891 INFO  (OverseerStateUpdate-94810866738397189-127.0.0.1:40332_-n_0000000000) [n:127.0.0.1:40332_    ] o.a.s.c.Overseer processMessage: queueSize: 1, message = {
   [junit4]   2>   "core":"collection1",
   [junit4]   2>   "core_node_name":"core_node1",
   [junit4]   2>   "roles":null,
   [junit4]   2>   "base_url":"https://127.0.0.1:40332",
   [junit4]   2>   "node_name":"127.0.0.1:40332_",
   [junit4]   2>   "numShards":"1",
   [junit4]   2>   "state":"active",
   [junit4]   2>   "shard":"shard1",
   [junit4]   2>   "collection":"tmp_collection",
   [junit4]   2>   "operation":"state"} current state version: 2
   [junit4]   2> 1045891 INFO  (OverseerStateUpdate-94810866738397189-127.0.0.1:40332_-n_0000000000) [n:127.0.0.1:40332_    ] o.a.s.c.o.ReplicaMutator Update state numShards=1 message={
   [junit4]   2>   "core":"collection1",
   [junit4]   2>   "core_node_name":"core_node1",
   [junit4]   2>   "roles":null,
   [junit4]   2>   "base_url":"https://127.0.0.1:40332",
   [junit4]   2>   "node_name":"127.0.0.1:40332_",
   [junit4]   2>   "numShards":"1",
   [junit4]   2>   "state":"active",
   [junit4]   2>   "shard":"shard1",
   [junit4]   2>   "collection":"tmp_collection",
   [junit4]   2>   "operation":"state"}
   [junit4]   2> 1045992 INFO  (zkCallback-838-thread-1-processing-n:127.0.0.1:40332_) [n:127.0.0.1:40332_    ] o.a.s.c.c.ZkStateReader A cluster state change: WatchedEvent state:SyncConnected type:NodeDataChanged path:/clusterstate.json, has occurred - updating... (live nodes size: 1)
   [junit4]   2> 1045993 INFO  (TEST-CdcrReplicationHandlerTest.doTest-seed#[72E7104EE9F8F3BA]) [    ] o.a.s.SolrTestCaseJ4 Writing core.properties file to /home/jenkins/workspace/Lucene-Solr-trunk-Linux/solr/build/solr-core/test/J1/temp/solr.cloud.CdcrReplicationHandlerTest_72E7104EE9F8F3BA-001/jetty-002/cores/collection1
   [junit4]   2> 1045994 INFO  (TEST-CdcrReplicationHandlerTest.doTest-seed#[72E7104EE9F8F3BA]) [    ] o.e.j.s.Server jetty-9.2.13.v20150730
   [junit4]   2> 1045995 INFO  (TEST-CdcrReplicationHandlerTest.doTest-seed#[72E7104EE9F8F3BA]) [    ] o.e.j.s.h.ContextHandler Started o.e.j.s.ServletContextHandler@422db307{/,null,AVAILABLE}
   [junit4]   2> 1045997 INFO  (TEST-CdcrReplicationHandlerTest.doTest-seed#[72E7104EE9F8F3BA]) [    ] o.e.j.s.ServerConnector Started ServerConnector@37518264{SSL-http/1.1}{127.0.0.1:57096}
   [junit4]   2> 1045997 INFO  (TEST-CdcrReplicationHandlerTest.doTest-seed#[72E7104EE9F8F3BA]) [    ] o.e.j.s.Server Started @1047657ms
   [junit4]   2> 1045997 INFO  (TEST-CdcrReplicationHandlerTest.doTest-seed#[72E7104EE9F8F3BA]) [    ] o.a.s.c.s.e.JettySolrRunner Jetty properties: {shards=shard2, hostContext=/, hostPort=57096, coreRootDirectory=/home/jenkins/workspace/Lucene-Solr-trunk-Linux/solr/build/solr-core/test/J1/temp/solr.cloud.CdcrReplicationHandlerTest_72E7104EE9F8F3BA-001/jetty-002/cores}
   [junit4]   2> 1045997 INFO  (TEST-CdcrReplicationHandlerTest.doTest-seed#[72E7104EE9F8F3BA]) [    ] o.a.s.s.SolrDispatchFilter SolrDispatchFilter.init(): sun.misc.Launcher$AppClassLoader@4e0e2f2a
   [junit4]   2> 1045997 INFO  (TEST-CdcrReplicationHandlerTest.doTest-seed#[72E7104EE9F8F3BA]) [    ] o.a.s.c.SolrResourceLoader new SolrResourceLoader for directory: '/home/jenkins/workspace/Lucene-Solr-trunk-Linux/solr/build/solr-core/test/J1/temp/solr.cloud.CdcrReplicationHandlerTest_72E7104EE9F8F3BA-001/jetty-002/'
   [junit4]   2> 1045997 INFO  (TEST-CdcrReplicationHandlerTest.doTest-seed#[72E7104EE9F8F3BA]) [    ] o.a.s.c.SolrResourceLoader JNDI not configured for solr (NoInitialContextEx)
   [junit4]   2> 1045997 INFO  (TEST-CdcrReplicationHandlerTest.doTest-seed#[72E7104EE9F8F3BA]) [    ] o.a.s.c.SolrResourceLoader solr home defaulted to 'solr/' (could not find system property or JNDI)
   [junit4]   2> 1046006 INFO  (TEST-CdcrReplicationHandlerTest.doTest-seed#[72E7104EE9F8F3BA]) [    ] o.a.s.c.c.SolrZkClient Using default ZkCredentialsProvider
   [junit4]   2> 1046007 INFO  (TEST-CdcrReplicationHandlerTest.doTest-seed#[72E7104EE9F8F3BA]) [    ] o.a.s.c.c.ConnectionManager Waiting for client to connect to ZooKeeper
   [junit4]   2> 1046007 INFO  (zkCallback-839-thread-1) [    ] o.a.s.c.c.ConnectionManager Watcher org.apache.solr.common.cloud.ConnectionManager@62eb462 name:ZooKeeperConnection Watcher:127.0.0.1:49045/solr got event WatchedEvent state:SyncConnected type:None path:null path:null type:None
   [junit4]   2> 1046007 INFO  (TEST-CdcrReplicationHandlerTest.doTest-seed#[72E7104EE9F8F3BA]) [    ] o.a.s.c.c.ConnectionManager Client is connected to ZooKeeper
   [junit4]   2> 1046008 INFO  (TEST-CdcrReplicationHandlerTest.doTest-seed#[72E7104EE9F8F3BA]) [    ] o.a.s.c.c.SolrZkClient Using default ZkACLProvider
   [junit4]   2> 1046008 INFO  (TEST-CdcrReplicationHandlerTest.doTest-seed#[72E7104EE9F8F3BA]) [    ] o.a.s.s.SolrDispatchFilter Loading solr.xml from SolrHome (not found in ZooKeeper)
   [junit4]   2> 1046008 INFO  (TEST-CdcrReplicationHandlerTest.doTest-seed#[72E7104EE9F8F3BA]) [    ] o.a.s.c.SolrXmlConfig Loading container configuration from /home/jenkins/workspace/Lucene-Solr-trunk-Linux/solr/build/solr-core/test/J1/temp/solr.cloud.CdcrReplicationHandlerTest_72E7104EE9F8F3BA-001/jetty-002/solr.xml
   [junit4]   2> 1046011 INFO  (TEST-CdcrReplicationHandlerTest.doTest-seed#[72E7104EE9F8F3BA]) [    ] o.a.s.c.CoresLocator Config-defined core root directory: /home/jenkins/workspace/Lucene-Solr-trunk-Linux/solr/build/solr-core/test/J1/temp/solr.cloud.CdcrReplicationHandlerTest_72E7104EE9F8F3BA-001/jetty-002/cores
   [junit4]   2> 1046011 INFO  (TEST-CdcrReplicationHandlerTest.doTest-seed#[72E7104EE9F8F3BA]) [    ] o.a.s.c.CoreContainer New CoreContainer 1165890798
   [junit4]   2> 1046011 INFO  (TEST-CdcrReplicationHandlerTest.doTest-seed#[72E7104EE9F8F3BA]) [    ] o.a.s.c.CoreContainer Loading cores into CoreContainer [instanceDir=/home/jenkins/workspace/Lucene-Solr-trunk-Linux/solr/build/solr-core/test/J1/temp/solr.cloud.CdcrReplicationHandlerTest_72E7104EE9F8F3BA-001/jetty-002/]
   [junit4]   2> 1046011 INFO  (TEST-CdcrReplicationHandlerTest.doTest-seed#[72E7104EE9F8F3BA]) [    ] o.a.s.c.CoreContainer loading shared library: /home/jenkins/workspace/Lucene-Solr-trunk-Linux/solr/build/solr-core/test/J1/temp/solr.cloud.CdcrReplicationHandlerTest_72E7104EE9F8F3BA-001/jetty-002/lib
   [junit4]   2> 1046011 WARN  (TEST-CdcrReplicationHandlerTest.doTest-seed#[72E7104EE9F8F3BA]) [    ] o.a.s.c.SolrResourceLoader Can't find (or read) directory to add to classloader: lib (resolved as: /home/jenkins/workspace/Lucene-Solr-trunk-Linux/solr/build/solr-core/test/J1/temp/solr.cloud.CdcrReplicationHandlerTest_72E7104EE9F8F3BA-001/jetty-002/lib).
   [junit4]   2> 1046015 INFO  (TEST-CdcrReplicationHandlerTest.doTest-seed#[72E7104EE9F8F3BA]) [    ] o.a.s.h.c.HttpShardHandlerFactory created with socketTimeout : 90000,urlScheme : ,connTimeout : 15000,maxConnectionsPerHost : 20,maxConnections : 10000,corePoolSize : 0,maximumPoolSize : 2147483647,maxThreadIdleTime : 5,sizeOfQueue : -1,fairnessPolicy : false,useRetries : false,
   [junit4]   2> 1046017 INFO  (TEST-CdcrReplicationHandlerTest.doTest-seed#[72E7104EE9F8F3BA]) [    ] o.a.s.u.UpdateShardHandler Creating UpdateShardHandler HTTP client with params: socketTimeout=340000&connTimeout=45000&retry=true
   [junit4]   2> 1046018 INFO  (TEST-CdcrReplicationHandlerTest.doTest-seed#[72E7104EE9F8F3BA]) [    ] o.a.s.l.LogWatcher SLF4J impl is org.slf4j.impl.Log4jLoggerFactory
   [junit4]   2> 1046018 INFO  (TEST-CdcrReplicationHandlerTest.doTest-seed#[72E7104EE9F8F3BA]) [    ] o.a.s.l.LogWatcher Registering Log Listener [Log4j (org.slf4j.impl.Log4jLoggerFactory)]
   [junit4]   2> 1046018 INFO  (TEST-CdcrReplicationHandlerTest.doTest-seed#[72E7104EE9F8F3BA]) [    ] o.a.s.c.ZkContainer Zookeeper client=127.0.0.1:49045/solr
   [junit4]   2> 1046018 INFO  (TEST-CdcrReplicationHandlerTest.doTest-seed#[72E7104EE9F8F3BA]) [    ] o.a.s.c.ZkController zkHost includes chroot
   [junit4]   2> 1046018 INFO  (TEST-CdcrReplicationHandlerTest.doTest-seed#[72E7104EE9F8F3BA]) [    ] o.a.s.c.c.SolrZkClient Using default ZkCredentialsProvider
   [junit4]   2> 1046018 INFO  (TEST-CdcrReplicationHandlerTest.doTest-seed#[72E7104EE9F8F3BA]) [    ] o.a.s.c.c.ConnectionManager Waiting for client to connect to ZooKeeper
   [junit4]   2> 1046019 INFO  (zkCallback-841-thread-1) [    ] o.a.s.c.c.ConnectionManager Watcher org.apache.solr.common.cloud.ConnectionManager@7dc2a302 name:ZooKeeperConnection Watcher:127.0.0.1:49045 got event WatchedEvent state:SyncConnected type:None path:null path:null type:None
   [junit4]   2> 1046019 INFO  (TEST-CdcrReplicationHandlerTest.doTest-seed#[72E7104EE9F8F3BA]) [    ] o.a.s.c.c.ConnectionManager Client is connected to ZooKeeper
   [junit4]   2> 1046020 INFO  (TEST-CdcrReplicationHandlerTest.doTest-seed#[72E7104EE9F8F3BA]) [    ] o.a.s.c.c.SolrZkClient Using default ZkACLProvider
   [junit4]   2> 1046020 INFO  (TEST-CdcrReplicationHandlerTest.doTest-seed#[72E7104EE9F8F3BA]) [n:127.0.0.1:57096_    ] o.a.s.c.c.ConnectionManager Waiting for client to connect to ZooKeeper
   [junit4]   2> 1046021 INFO  (zkCallback-842-thread-1-processing-n:127.0.0.1:57096_) [n:127.0.0.1:57096_    ] o.a.s.c.c.ConnectionManager Watcher org.apache.solr.common.cloud.ConnectionManager@5ec28153 name:ZooKeeperConnection Watcher:127.0.0.1:49045/solr got event WatchedEvent state:SyncConnected type:None path:null path:null type:None
   [junit4]   2> 1046021 INFO  (TEST-CdcrReplicationHandlerTest.doTest-seed#[72E7104EE9F8F3BA]) [n:127.0.0.1:57096_    ] o.a.s.c.c.ConnectionManager Client is connected to ZooKeeper
   [junit4]   2> 1046023 INFO  (TEST-CdcrReplicationHandlerTest.doTest-seed#[72E7104EE9F8F3BA]) [n:127.0.0.1:57096_    ] o.a.s.c.c.ZkStateReader Updating cluster state from ZooKeeper... 
   [junit4]   2> 1047024 INFO  (TEST-CdcrReplicationHandlerTest.doTest-seed#[72E7104EE9F8F3BA]) [n:127.0.0.1:57096_    ] o.a.s.c.ZkController Register node as live in ZooKeeper:/live_nodes/127.0.0.1:57096_
   [junit4]   2> 1047025 INFO  (TEST-CdcrReplicationHandlerTest.doTest-seed#[72E7104EE9F8F3BA]) [n:127.0.0.1:57096_    ] o.a.s.c.c.SolrZkClient makePath: /live_nodes/127.0.0.1:57096_
   [junit4]   2> 1047025 INFO  (zkCallback-838-thread-1-processing-n:127.0.0.1:40332_) [n:127.0.0.1:40332_    ] o.a.s.c.c.ZkStateReader A live node change: WatchedEvent state:SyncConnected type:NodeChildrenChanged path:/live_nodes, has occurred - updating... (live nodes size: 1)
   [junit4]   2> 1047025 INFO  (zkCallback-842-thread-1-processing-n:127.0.0.1:57096_) [n:127.0.0.1:57096_    ] o.a.s.c.c.ZkStateReader A live node change: WatchedEvent state:SyncConnected type:NodeChildrenChanged path:/live_nodes, has occurred - updating... (live nodes size: 1)
   [junit4]   2> 1047026 INFO  (TEST-CdcrReplicationHandlerTest.doTest-seed#[72E7104EE9F8F3BA]) [n:127.0.0.1:57096_    ] o.a.s.c.Overseer Overseer (id=null) closing
   [junit4]   2> 1047026 INFO  (TEST-CdcrReplicationHandlerTest.doTest-seed#[72E7104EE9F8F3BA]) [n:127.0.0.1:57096_    ] o.a.s.c.LeaderElector Joined leadership election with path: /overseer_elect/election/94810866738397192-127.0.0.1:57096_-n_0000000001
   [junit4]   2> 1047026 INFO  (TEST-CdcrReplicationHandlerTest.doTest-seed#[72E7104EE9F8F3BA]) [n:127.0.0.1:57096_    ] o.a.s.c.LeaderElector Watching path /overseer_elect/election/94810866738397189-127.0.0.1:40332_-n_0000000000 to know if I could be the leader
   [junit4]   2> 1047034 INFO  (TEST-CdcrReplicationHandlerTest.doTest-seed#[72E7104EE9F8F3BA]) [n:127.0.0.1:57096_    ] o.a.s.c.CoreContainer Security conf doesn't exist. Skipping setup for authorization module.
   [junit4]   2> 1047034 INFO  (TEST-CdcrReplicationHandlerTest.doTest-seed#[72E7104EE9F8F3BA]) [n:127.0.0.1:57096_    ] o.a.s.c.CoreContainer No authentication plugin used.
   [junit4]   2> 1047035 INFO  (TEST-CdcrReplicationHandlerTest.doTest-seed#[72E7104EE9F8F3BA]) [n:127.0.0.1:57096_    ] o.a.s.c.CoresLocator Looking for core definitions underneath /home/jenkins/workspace/Lucene-Solr-trunk-Linux/solr/build/solr-core/test/J1/temp/solr.cloud.CdcrReplicationHandlerTest_72E7104EE9F8F3BA-001/jetty-002/cores
   [junit4]   2> 1047035 INFO  (TEST-CdcrReplicationHandlerTest.doTest-seed#[72E7104EE9F8F3BA]) [n:127.0.0.1:57096_    ] o.a.s.c.SolrCore Created CoreDescriptor: {name=collection1, config=solrconfig.xml, transient=false, schema=schema.xml, loadOnStartup=true, configSetProperties=configsetprops.json, instanceDir=/home/jenkins/workspace/Lucene-Solr-trunk-Linux/solr/build/solr-core/test/J1/temp/solr.cloud.CdcrReplicationHandlerTest_72E7104EE9F8F3BA-001/jetty-002/cores/collection1, collection=tmp_collection, absoluteInstDir=/home/jenkins/workspace/Lucene-Solr-trunk-Linux/solr/build/solr-core/test/J1/temp/solr.cloud.CdcrReplicationHandlerTest_72E7104EE9F8F3BA-001/jetty-002/cores/collection1/, coreNodeName=, dataDir=data/, shard=}
   [junit4]   2> 1047035 INFO  (TEST-CdcrReplicationHandlerTest.doTest-seed#[72E7104EE9F8F3BA]) [n:127.0.0.1:57096_    ] o.a.s.c.CoresLocator Found core collection1 in /home/jenkins/workspace/Lucene-Solr-trunk-Linux/solr/build/solr-core/test/J1/temp/solr.cloud.CdcrReplicationHandlerTest_72E7104EE9F8F3BA-001/jetty-002/cores/collection1/
   [junit4]   2> 1047035 INFO  (TEST-CdcrReplicationHandlerTest.doTest-seed#[72E7104EE9F8F3BA]) [n:127.0.0.1:57096_    ] o.a.s.c.CoresLocator Found 1 core definitions
   [junit4]   2> 1047036 INFO  (TEST-CdcrReplicationHandlerTest.doTest-seed#[72E7104EE9F8F3BA]) [n:127.0.0.1:57096_    ] o.a.s.s.SolrDispatchFilter user.dir=/home/jenkins/workspace/Lucene-Solr-trunk-Linux/solr/build/solr-core/test/J1
   [junit4]   2> 1047036 INFO  (TEST-CdcrReplicationHandlerTest.doTest-seed#[72E7104EE9F8F3BA]) [n:127.0.0.1:57096_    ] o.a.s.s.SolrDispatchFilter SolrDispatchFilter.init() done
   [junit4]   2> 1047036 INFO  (coreLoadExecutor-3426-thread-1-processing-n:127.0.0.1:57096_) [n:127.0.0.1:57096_ c:tmp_collection   x:collection1] o.a.s.c.ZkController publishing state=down
   [junit4]   2> 1047036 INFO  (coreLoadExecutor-3426-thread-1-processing-n:127.0.0.1:57096_) [n:127.0.0.1:57096_ c:tmp_collection   x:collection1] o.a.s.c.ZkController numShards not found on descriptor - reading it from system property
   [junit4]   2> 1047036 INFO  (coreLoadExecutor-3426-thread-1-processing-n:127.0.0.1:57096_) [n:127.0.0.1:57096_ c:tmp_collection   x:collection1] o.a.s.c.ZkController Registering watch for collection tmp_collection
   [junit4]   2> 1047036 INFO  (coreLoadExecutor-3426-thread-1-processing-n:127.0.0.1:57096_) [n:127.0.0.1:57096_ c:tmp_collection   x:collection1] o.a.s.c.c.ZkStateReader addZkWatch tmp_collection
   [junit4]   2> 1047037 INFO  (coreLoadExecutor-3426-thread-1-processing-n:127.0.0.1:57096_) [n:127.0.0.1:57096_ c:tmp_collection   x:collection1] o.a.s.c.c.ZkStateReader Deleting data for tmp_collection
   [junit4]   2> 1047037 INFO  (OverseerStateUpdate-94810866738397189-127.0.0.1:40332_-n_0000000000) [n:127.0.0.1:40332_    ] o.a.s.c.Overseer processMessage: queueSize: 1, message = {
   [junit4]   2>   "core":"collection1",
   [junit4]   2>   "roles":null,
   [junit4]   2>   "base_url":"https://127.0.0.1:57096",
   [junit4]   2>   "node_name":"127.0.0.1:57096_",
   [junit4]   2>   "numShards":"1",
   [junit4]   2>   "state":"down",
   [junit4]   2>   "shard":null,
   [junit4]   2>   "collection":"tmp_collection",
   [junit4]   2>   "operation":"state"} current state version: 3
   [junit4]   2> 1047037 INFO  (coreLoadExecutor-3426-thread-1-processing-n:127.0.0.1:57096_) [n:127.0.0.1:57096_ c:tmp_collection   x:collection1] o.a.s.c.ZkController look for our core node name
   [junit4]   2> 1047037 INFO  (OverseerStateUpdate-94810866738397189-127.0.0.1:40332_-n_0000000000) [n:127.0.0.1:40332_    ] o.a.s.c.o.ReplicaMutator Update state numShards=1 message={
   [junit4]   2>   "core":"collection1",
   [junit4]   2>   "roles":null,
   [junit4]   2>   "base_url":"https://127.0.0.1:57096",
   [junit4]   2>   "node_name":"127.0.0.1:57096_",
   [junit4]   2>   "numShards":"1",
   [junit4]   2>   "state":"down",
   [junit4]   2>   "shard":null,
   [junit4]   2>   "collection":"tmp_collection",
   [junit4]   2>   "operation":"state"}
   [junit4]   2> 1047037 INFO  (OverseerStateUpdate-94810866738397189-127.0.0.1:40332_-n_0000000000) [n:127.0.0.1:40332_    ] o.a.s.c.o.ReplicaMutator Collection already exists with numShards=1
   [junit4]   2> 1047037 INFO  (OverseerStateUpdate-94810866738397189-127.0.0.1:40332_-n_0000000000) [n:127.0.0.1:40332_    ] o.a.s.c.o.ReplicaMutator Assigning new node to shard shard=shard1
   [junit4]   2> 1047138 INFO  (zkCallback-842-thread-1-processing-n:127.0.0.1:57096_) [n:127.0.0.1:57096_    ] o.a.s.c.c.ZkStateReader A cluster state change: WatchedEvent state:SyncConnected type:NodeDataChanged path:/clusterstate.json, has occurred - updating... (live nodes size: 2)
   [junit4]   2> 1047138 INFO  (zkCallback-838-thread-1-processing-n:127.0.0.1:40332_) [n:127.0.0.1:40332_    ] o.a.s.c.c.ZkStateReader A cluster state change: WatchedEvent state:SyncConnected type:NodeDataChanged path:/clusterstate.json, has occurred - updating... (live nodes size: 2)
   [junit4]   2> 1048037 INFO  (coreLoadExecutor-3426-thread-1-processing-n:127.0.0.1:57096_) [n:127.0.0.1:57096_ c:tmp_collection   x:collection1] o.a.s.c.ZkController waiting to find shard id in clusterstate for collection1
   [junit4]   2> 1048037 INFO  (coreLoadExecutor-3426-thread-1-processing-n:127.0.0.1:57096_) [n:127.0.0.1:57096_ c:tmp_collection   x:collection1] o.a.s.c.ZkController Check for collection zkNode:tmp_collection
   [junit4]   2> 1048037 INFO  (coreLoadExecutor-3426-thread-1-processing-n:127.0.0.1:57096_) [n:127.0.0.1:57096_ c:tmp_collection   x:collection1] o.a.s.c.ZkController Collection zkNode exists
   [junit4]   2> 1048037 INFO  (coreLoadExecutor-3426-thread-1-processing-n:127.0.0.1:57096_) [n:127.0.0.1:57096_ c:tmp_collection   x:collection1] o.a.s.c.c.ZkStateReader Load collection config from:/collections/tmp_collection
   [junit4]   2> 1048038 INFO  (coreLoadExecutor-3426-thread-1-processing-n:127.0.0.1:57096_) [n:127.0.0.1:57096_ c:tmp_collection   x:collection1] o.a.s.c.c.ZkStateReader path=/collections/tmp_collection configName=conf1 specified config exists in ZooKeeper
   [junit4]   2> 1048038 INFO  (coreLoadExecutor-3426-thread-1-processing-n:127.0.0.1:57096_) [n:127.0.0.1:57096_ c:tmp_collection   x:collection1] o.a.s.c.SolrResourceLoader new SolrResourceLoader for directory: '/home/jenkins/workspace/Lucene-Solr-trunk-Linux/solr/build/solr-core/test/J1/temp/solr.cloud.CdcrReplicationHandlerTest_72E7104EE9F8F3BA-001/jetty-002/cores/collection1/'
   [junit4]   2> 1048038 INFO  (coreLoadExecutor-3426-thread-1-processing-n:127.0.0.1:57096_) [n:127.0.0.1:57096_ c:tmp_collection   x:collection1] o.a.s.c.SolrResourceLoader JNDI not configured for solr (NoInitialContextEx)
   [junit4]   2> 1048038 INFO  (coreLoadExecutor-3426-thread-1-processing-n:127.0.0.1:57096_) [n:127.0.0.1:57096_ c:tmp_collection   x:collection1] o.a.s.c.SolrResourceLoader solr home defaulted to 'solr/' (could not find system property or JNDI)
   [junit4]   2> 1048046 INFO  (coreLoadExecutor-3426-thread-1-processing-n:127.0.0.1:57096_) [n:127.0.0.1:57096_ c:tmp_collection   x:collection1] o.a.s.c.Config loaded config solrconfig.xml with version 0 
   [junit4]   2> 1048049 INFO  (coreLoadExecutor-3426-thread-1-processing-n:127.0.0.1:57096_) [n:127.0.0.1:57096_ c:tmp_collection   x:collection1] o.a.s.c.SolrConfig current version of requestparams : -1
   [junit4]   2> 1048051 INFO  (coreLoadExecutor-3426-thread-1-processing-n:127.0.0.1:57096_) [n:127.0.0.1:57096_ c:tmp_collection   x:collection1] o.a.s.c.SolrConfig Using Lucene MatchVersion: 6.0.0
   [junit4]   2> 1048074 INFO  (coreLoadExecutor-3426-thread-1-processing-n:127.0.0.1:57096_) [n:127.0.0.1:57096_ c:tmp_collection   x:collection1] o.a.s.c.Config Loaded SolrConfig: solrconfig.xml
   [junit4]   2> 1048075 INFO  (coreLoadExecutor-3426-thread-1-processing-n:127.0.0.1:57096_) [n:127.0.0.1:57096_ c:tmp_collection   x:collection1] o.a.s.s.IndexSchema Reading Solr Schema from /configs/conf1/schema.xml
   [junit4]   2> 1048077 INFO  (coreLoadExecutor-3426-thread-1-processing-n:127.0.0.1:57096_) [n:127.0.0.1:57096_ c:tmp_collection   x:collection1] o.a.s.s.IndexSchema [collection1] Schema name=test
   [junit4]   2> 1048148 INFO  (coreLoadExecutor-3426-thread-1-processing-n:127.0.0.1:57096_) [n:127.0.0.1:57096_ c:tmp_collection   x:collection1] o.a.s.s.IndexSchema default search field in schema is text
   [junit4]   2> 1048149 INFO  (coreLoadExecutor-3426-thread-1-processing-n:127.0.0.1:57096_) [n:127.0.0.1:57096_ c:tmp_collection   x:collection1] o.a.s.s.IndexSchema unique key field: id
   [junit4]   2> 1048150 INFO  (coreLoadExecutor-3426-thread-1-processing-n:127.0.0.1:57096_) [n:127.0.0.1:57096_ c:tmp_collection   x:collection1] o.a.s.s.FileExchangeRateProvider Reloading exchange rates from file currency.xml
   [junit4]   2> 1048151 INFO  (coreLoadExecutor-3426-thread-1-processing-n:127.0.0.1:57096_) [n:127.0.0.1:57096_ c:tmp_collection   x:collection1] o.a.s.s.FileExchangeRateProvider Reloading exchange rates from file currency.xml
   [junit4]   2> 1048157 INFO  (coreLoadExecutor-3426-thread-1-processing-n:127.0.0.1:57096_) [n:127.0.0.1:57096_ c:tmp_collection   x:collection1] o.a.s.c.ConfigSetProperties Did not find ConfigSet properties, assuming default properties: Can't find resource 'configsetprops.json' in classpath or '/configs/conf1', cwd=/home/jenkins/workspace/Lucene-Solr-trunk-Linux/solr/build/solr-core/test/J1
   [junit4]   2> 1048157 INFO  (coreLoadExecutor-3426-thread-1-processing-n:127.0.0.1:57096_) [n:127.0.0.1:57096_ c:tmp_collection   x:collection1] o.a.s.c.CoreContainer Creating SolrCore 'collection1' using configuration from collection tmp_collection
   [junit4]   2> 1048157 INFO  (coreLoadExecutor-3426-thread-1-processing-n:127.0.0.1:57096_) [n:127.0.0.1:57096_ c:tmp_collection s:shard1 r:core_node2 x:collection1] o.a.s.c.SolrCore solr.StandardDirectoryFactory
   [junit4]   2> 1048157 INFO  (coreLoadExecutor-3426-thread-1-processing-n:127.0.0.1:57096_) [n:127.0.0.1:57096_ c:tmp_collection s:shard1 r:core_node2 x:collection1] o.a.s.c.SolrCore [[collection1] ] Opening new SolrCore at [/home/jenkins/workspace/Lucene-Solr-trunk-Linux/solr/build/solr-core/test/J1/temp/solr.cloud.CdcrReplicationHandlerTest_72E7104EE9F8F3BA-001/jetty-002/cores/collection1/], dataDir=[null]
   [junit4]   2> 1048157 INFO  (coreLoadExecutor-3426-thread-1-processing-n:127.0.0.1:57096_) [n:127.0.0.1:57096_ c:tmp_collection s:shard1 r:core_node2 x:collection1] o.a.s.c.JmxMonitoredMap JMX monitoring is enabled. Adding Solr mbeans to JMX Server: com.sun.jmx.mbeanserver.JmxMBeanServer@3353328c
   [junit4]   2> 1048158 INFO  (coreLoadExecutor-3426-thread-1-processing-n:127.0.0.1:57096_) [n:127.0.0.1:57096_ c:tmp_collection s:shard1 r:core_node2 x:collection1] o.a.s.c.CachingDirectoryFactory return new directory for /home/jenkins/workspace/Lucene-Solr-trunk-Linux/solr/build/solr-core/test/J1/temp/solr.cloud.CdcrReplicationHandlerTest_72E7104EE9F8F3BA-001/jetty-002/cores/collection1/data
   [junit4]   2> 1048158 INFO  (coreLoadExecutor-3426-thread-1-processing-n:127.0.0.1:57096_) [n:127.0.0.1:57096_ c:tmp_collection s:shard1 r:core_node2 x:collection1] o.a.s.c.SolrCore New index directory detected: old=null new=/home/jenkins/workspace/Lucene-Solr-trunk-Linux/solr/build/solr-core/test/J1/temp/solr.cloud.CdcrReplicationHandlerTest_72E7104EE9F8F3BA-001/jetty-002/cores/collection1/data/index/
   [junit4]   2> 1048158 WARN  (coreLoadExecutor-3426-thread-1-processing-n:127.0.0.1:57096_) [n:127.0.0.1:57096_ c:tmp_collection s:shard1 r:core_node2 x:collection1] o.a.s.c.SolrCore [collection1] Solr index directory '/home/jenkins/workspace/Lucene-Solr-trunk-Linux/solr/build/solr-core/test/J1/temp/solr.cloud.CdcrReplicationHandlerTest_72E7104EE9F8F3BA-001/jetty-002/cores/collection1/data/index' doesn't exist. Creating new index...
   [junit4]   2> 1048158 INFO  (coreLoadExecutor-3426-thread-1-processing-n:127.0.0.1:57096_) [n:127.0.0.1:57096_ c:tmp_collection s:shard1 r:core_node2 x:collection1] o.a.s.c.CachingDirectoryFactory return new directory for /home/jenkins/workspace/Lucene-Solr-trunk-Linux/solr/build/solr-core/test/J1/temp/solr.cloud.CdcrReplicationHandlerTest_72E7104EE9F8F3BA-001/jetty-002/cores/collection1/data/index
   [junit4]   2> 1048159 INFO  (coreLoadExecutor-3426-thread-1-processing-n:127.0.0.1:57096_) [n:127.0.0.1:57096_ c:tmp_collection s:shard1 r:core_node2 x:collection1] o.a.s.u.RandomMergePolicy RandomMergePolicy wrapping class org.apache.lucene.index.AlcoholicMergePolicy: [AlcoholicMergePolicy: minMergeSize=0, mergeFactor=10, maxMergeSize=2105308297, maxMergeSizeForForcedMerge=9223372036854775807, calibrateSizeByDeletes=true, maxMergeDocs=2147483647, maxCFSSegmentSizeMB=8.796093022207999E12, noCFSRatio=0.1]
   [junit4]   2> 1048270 INFO  (coreLoadExecutor-3426-thread-1-processing-n:127.0.0.1:57096_) [n:127.0.0.1:57096_ c:tmp_collection s:shard1 r:core_node2 x:collection1] o.a.s.c.SolrCore SolrDeletionPolicy.onCommit: commits: num=1
   [junit4]   2> 	commit{dir=/home/jenkins/workspace/Lucene-Solr-trunk-Linux/solr/build/solr-core/test/J1/temp/solr.cloud.CdcrReplicationHandlerTest_72E7104EE9F8F3BA-001/jetty-002/cores/collection1/data/index,segFN=segments_1,generation=1}
   [junit4]   2> 1048270 INFO  (coreLoadExecutor-3426-thread-1-processing-n:127.0.0.1:57096_) [n:127.0.0.1:57096_ c:tmp_collection s:shard1 r:core_node2 x:collection1] o.a.s.c.SolrCore newest commit generation = 1
   [junit4]   2> 1048271 INFO  (OldIndexDirectoryCleanupThreadForCore-collection1) [n:127.0.0.1:57096_ c:tmp_collection s:shard1 r:core_node2 x:collection1] o.a.s.c.SolrCore Looking for old index directories to cleanup for core collection1 in /home/jenkins/workspace/Lucene-Solr-trunk-Linux/solr/build/solr-core/test/J1/temp/solr.cloud.CdcrReplicationHandlerTest_72E7104EE9F8F3BA-001/jetty-002/cores/collection1/data/
   [junit4]   2> 1048273 INFO  (coreLoadExecutor-3426-thread-1-processing-n:127.0.0.1:57096_) [n:127.0.0.1:57096_ c:tmp_collection s:shard1 r:core_node2 x:collection1] o.a.s.u.p.UpdateRequestProcessorChain creating updateRequestProcessorChain "cdcr-processor-chain"
   [junit4]   2> 1048273 INFO  (coreLoadExecutor-3426-thread-1-processing-n:127.0.0.1:57096_) [n:127.0.0.1:57096_ c:tmp_collection s:shard1 r:core_node2 x:collection1] o.a.s.c.SolrCore no updateRequestProcessorChain defined as default, creating implicit default
   [junit4]   2> 1048274 INFO  (coreLoadExecutor-3426-thread-1-processing-n:127.0.0.1:57096_) [n:127.0.0.1:57096_ c:tmp_collection s:shard1 r:core_node2 x:collection1] o.a.s.h.l.XMLLoader xsltCacheLifetimeSeconds=60
   [junit4]   2> 1048275 INFO  (coreLoadExecutor-3426-thread-1-processing-n:127.0.0.1:57096_) [n:127.0.0.1:57096_ c:tmp_collection s:shard1 r:core_node2 x:collection1] o.a.s.h.l.XMLLoader xsltCacheLifetimeSeconds=60
   [junit4]   2> 1048276 INFO  (coreLoadExecutor-3426-thread-1-processing-n:127.0.0.1:57096_) [n:127.0.0.1:57096_ c:tmp_collection s:shard1 r:core_node2 x:collection1] o.a.s.h.l.XMLLoader xsltCacheLifetimeSeconds=60
   [junit4]   2> 1048276 INFO  (coreLoadExecutor-3426-thread-1-processing-n:127.0.0.1:57096_) [n:127.0.0.1:57096_ c:tmp_collection s:shard1 r:core_node2 x:collection1] o.a.s.h.l.XMLLoader xsltCacheLifetimeSeconds=60
   [junit4]   2> 1048280 INFO  (coreLoadExecutor-3426-thread-1-processing-n:127.0.0.1:57096_) [n:127.0.0.1:57096_ c:tmp_collection s:shard1 r:core_node2 x:collection1] o.a.s.c.RequestHandlers Registered paths: /admin/mbeans,standard,/update/csv,/update/json/docs,/admin/luke,/admin/segments,/get,/admin/system,/replication,/admin/properties,/config,/schema,/admin/plugins,/admin/logging,/update/json,/admin/threads,/admin/ping,/cdcr,/update,/admin/file
   [junit4]   2> 1048280 INFO  (coreLoadExecutor-3426-thread-1-processing-n:127.0.0.1:57096_) [n:127.0.0.1:57096_ c:tmp_collection s:shard1 r:core_node2 x:collection1] o.a.s.c.SolrCore Using default statsCache cache: org.apache.solr.search.stats.LocalStatsCache
   [junit4]   2> 1048280 INFO  (coreLoadExecutor-3426-thread-1-processing-n:127.0.0.1:57096_) [n:127.0.0.1:57096_ c:tmp_collection s:shard1 r:core_node2 x:collection1] o.a.s.u.UpdateHandler Using UpdateLog implementation: org.apache.solr.update.CdcrUpdateLog
   [junit4]   2> 1048280 INFO  (coreLoadExecutor-3426-thread-1-processing-n:127.0.0.1:57096_) [n:127.0.0.1:57096_ c:tmp_collection s:shard1 r:core_node2 x:collection1] o.a.s.u.UpdateLog Initializing UpdateLog: dataDir= defaultSyncLevel=FLUSH numRecordsToKeep=100 maxNumLogsToKeep=10 numVersionBuckets=65536
   [junit4]   2> 1048281 INFO  (coreLoadExecutor-3426-thread-1-processing-n:127.0.0.1:57096_) [n:127.0.0.1:57096_ c:tmp_collection s:shard1 r:core_node2 x:collection1] o.a.s.c.SolrCore Hard AutoCommit: disabled
   [junit4]   2> 1048281 INFO  (coreLoadExecutor-3426-thread-1-processing-n:127.0.0.1:57096_) [n:127.0.0.1:57096_ c:tmp_collection s:shard1 r:core_node2 x:collection1] o.a.s.c.SolrCore Soft AutoCommit: disabled
   [junit4]   2> 1048282 INFO  (coreLoadExecutor-3426-thread-1-processing-n:127.0.0.1:57096_) [n:127.0.0.1:57096_ c:tmp_collection s:shard1 r:core_node2 x:collection1] o.a.s.u.RandomMergePolicy RandomMergePolicy wrapping class org.apache.lucene.index.TieredMergePolicy: [TieredMergePolicy: maxMergeAtOnce=34, maxMergeAtOnceExplicit=16, maxMergedSegmentMB=6.599609375, floorSegmentMB=2.1435546875, forceMergeDeletesPctAllowed=6.804017152491953, segmentsPerTier=28.0, maxCFSSegmentSizeMB=8.796093022207999E12, noCFSRatio=0.6325937505797732
   [junit4]   2> 1048282 INFO  (coreLoadExecutor-3426-thread-1-processing-n:127.0.0.1:57096_) [n:127.0.0.1:57096_ c:tmp_collection s:shard1 r:core_node2 x:collection1] o.a.s.c.SolrCore SolrDeletionPolicy.onInit: commits: num=1
   [junit4]   2> 	commit{dir=/home/jenkins/workspace/Lucene-Solr-trunk-Linux/solr/build/solr-core/test/J1/temp/solr.cloud.CdcrReplicationHandlerTest_72E7104EE9F8F3BA-001/jetty-002/cores/collection1/data/index,segFN=segments_1,generation=1}
   [junit4]   2> 1048282 INFO  (coreLoadExecutor-3426-thread-1-processing-n:127.0.0.1:57096_) [n:127.0.0.1:57096_ c:tmp_collection s:shard1 r:core_node2 x:collection1] o.a.s.c.SolrCore newest commit generation = 1
   [junit4]   2> 1048283 INFO  (coreLoadExecutor-3426-thread-1-processing-n:127.0.0.1:57096_) [n:127.0.0.1:57096_ c:tmp_collection s:shard1 r:core_node2 x:collection1] o.a.s.s.SolrIndexSearcher Opening Searcher@78b41714[collection1] main
   [junit4]   2> 1048283 INFO  (coreLoadExecutor-3426-thread-1-processing-n:127.0.0.1:57096_) [n:127.0.0.1:57096_ c:tmp_collection s:shard1 r:core_node2 x:collection1] o.a.s.c.c.ZkStateReader Load collection config from:/collections/tmp_collection
   [junit4]   2> 1048283 INFO  (coreLoadExecutor-3426-thread-1-processing-n:127.0.0.1:57096_) [n:127.0.0.1:57096_ c

[...truncated too long message...]

eed#[72E7104EE9F8F3BA]) [    ] o.e.j.s.ServerConnector Stopped ServerConnector@170ba907{SSL-http/1.1}{127.0.0.1:57096}
   [junit4]   2> 1561604 INFO  (TEST-CdcrReplicationHandlerTest.doTest-seed#[72E7104EE9F8F3BA]) [    ] o.e.j.s.h.ContextHandler Stopped o.e.j.s.ServletContextHandler@1deb0919{/,null,UNAVAILABLE}
   [junit4]   2> 1561604 INFO  (TEST-CdcrReplicationHandlerTest.doTest-seed#[72E7104EE9F8F3BA]) [n:127.0.0.1:57096_ c:source_collection s:shard1 r:core_node2 x:source_collection_shard1_replica1] o.a.s.SolrTestCaseJ4 ###Ending doTest
   [junit4]   2> 1561605 INFO  (TEST-CdcrReplicationHandlerTest.doTest-seed#[72E7104EE9F8F3BA]) [n:127.0.0.1:57096_ c:source_collection s:shard1 r:core_node2 x:source_collection_shard1_replica1] o.a.s.c.ZkTestServer connecting to 127.0.0.1:49045 49045
   [junit4]   2> 1561709 INFO  (Thread-3047) [    ] o.a.s.c.ZkTestServer connecting to 127.0.0.1:49045 49045
   [junit4]   2> 1561709 WARN  (Thread-3047) [    ] o.a.s.c.ZkTestServer Watch limit violations: 
   [junit4]   2> Maximum concurrent create/delete watches above limit:
   [junit4]   2> 
   [junit4]   2> 	68	/solr/aliases.json
   [junit4]   2> 	14	/solr/configs/conf1
   [junit4]   2> 	6	/solr/collections/source_collection/leaders/shard1/leader
   [junit4]   2> 	5	/solr/security.json
   [junit4]   2> 	2	/solr/collections/tmp_collection/leaders/shard1/leader
   [junit4]   2> 
   [junit4]   2> Maximum concurrent data watches above limit:
   [junit4]   2> 
   [junit4]   2> 	68	/solr/clusterstate.json
   [junit4]   2> 	13	/solr/collections/source_collection/cdcr/state/buffer
   [junit4]   2> 	13	/solr/collections/source_collection/cdcr/state/process
   [junit4]   2> 	13	/solr/collections/source_collection/state.json
   [junit4]   2> 	2	/solr/collections/source_collection/leader_elect/shard1/election/94810866738397192-core_node2-n_0000000000
   [junit4]   2> 	2	/solr/collections/source_collection/leader_elect/shard1/election/94810866738397216-core_node1-n_0000000000
   [junit4]   2> 	2	/solr/collections/source_collection/leader_elect/shard1/election/94810866738397216-core_node2-n_0000000000
   [junit4]   2> 	2	/solr/collections/tmp_collection/cdcr/state/buffer
   [junit4]   2> 	2	/solr/overseer_elect/election/94810866738397216-127.0.0.1:40332_-n_0000000002
   [junit4]   2> 	2	/solr/collections/source_collection/leader_elect/shard1/election/94810866738397259-core_node2-n_0000000000
   [junit4]   2> 	2	/solr/collections/tmp_collection/cdcr/state/process
   [junit4]   2> 
   [junit4]   2> Maximum concurrent children watches above limit:
   [junit4]   2> 
   [junit4]   2> 	68	/solr/collections
   [junit4]   2> 	65	/solr/live_nodes
   [junit4]   2> 	4	/solr/overseer/queue
   [junit4]   2> 	4	/solr/overseer/collection-queue-work
   [junit4]   2> 
   [junit4]   2> NOTE: reproduce with: ant test  -Dtestcase=CdcrReplicationHandlerTest -Dtests.method=doTest -Dtests.seed=72E7104EE9F8F3BA -Dtests.multiplier=3 -Dtests.slow=true -Dtests.locale=ko_KR -Dtests.timezone=GB-Eire -Dtests.asserts=true -Dtests.file.encoding=UTF-8
   [junit4] FAILURE  517s J1 | CdcrReplicationHandlerTest.doTest <<<
   [junit4]    > Throwable #1: java.lang.AssertionError: There are still nodes recoverying - waited for 330 seconds
   [junit4]    > 	at __randomizedtesting.SeedInfo.seed([72E7104EE9F8F3BA:D5A3A8EA8443E003]:0)
   [junit4]    > 	at org.apache.solr.cloud.AbstractDistribZkTestBase.waitForRecoveriesToFinish(AbstractDistribZkTestBase.java:172)
   [junit4]    > 	at org.apache.solr.cloud.AbstractDistribZkTestBase.waitForRecoveriesToFinish(AbstractDistribZkTestBase.java:133)
   [junit4]    > 	at org.apache.solr.cloud.AbstractDistribZkTestBase.waitForRecoveriesToFinish(AbstractDistribZkTestBase.java:128)
   [junit4]    > 	at org.apache.solr.cloud.BaseCdcrDistributedZkTest.waitForRecoveriesToFinish(BaseCdcrDistributedZkTest.java:465)
   [junit4]    > 	at org.apache.solr.cloud.BaseCdcrDistributedZkTest.clearSourceCollection(BaseCdcrDistributedZkTest.java:319)
   [junit4]    > 	at org.apache.solr.cloud.CdcrReplicationHandlerTest.doTestPartialReplicationAfterPeerSync(CdcrReplicationHandlerTest.java:158)
   [junit4]    > 	at org.apache.solr.cloud.CdcrReplicationHandlerTest.doTest(CdcrReplicationHandlerTest.java:53)
   [junit4]    > 	at org.apache.solr.BaseDistributedSearchTestCase$ShardsRepeatRule$ShardsFixedStatement.callStatement(BaseDistributedSearchTestCase.java:963)
   [junit4]    > 	at org.apache.solr.BaseDistributedSearchTestCase$ShardsRepeatRule$ShardsStatement.evaluate(BaseDistributedSearchTestCase.java:938)
   [junit4]    > 	at java.lang.Thread.run(Thread.java:745)
   [junit4]   2> 1561711 INFO  (SUITE-CdcrReplicationHandlerTest-seed#[72E7104EE9F8F3BA]-worker) [n:127.0.0.1:57096_ c:source_collection s:shard1 r:core_node2 x:source_collection_shard1_replica1] o.a.s.SolrTestCaseJ4 ###deleteCore
   [junit4]   2> NOTE: leaving temporary files on disk at: /home/jenkins/workspace/Lucene-Solr-trunk-Linux/solr/build/solr-core/test/J1/temp/solr.cloud.CdcrReplicationHandlerTest_72E7104EE9F8F3BA-001
   [junit4]   2> Nov 05, 2015 4:58:53 AM com.carrotsearch.randomizedtesting.ThreadLeakControl checkThreadLeaks
   [junit4]   2> WARNING: Will linger awaiting termination of 1 leaked thread(s).
   [junit4]   2> NOTE: test params are: codec=Asserting(Lucene60): {_version_=PostingsFormat(name=MockRandom), id=BlockTreeOrds(blocksize=128)}, docValues:{}, sim=ClassicSimilarity, locale=ko_KR, timezone=GB-Eire
   [junit4]   2> NOTE: Linux 3.19.0-31-generic amd64/Oracle Corporation 1.8.0_66 (64-bit)/cpus=12,threads=1,free=64894720,total=518979584
   [junit4]   2> NOTE: All tests run in this JVM: [TestCoreContainer, MultiTermTest, TestLMJelinekMercerSimilarityFactory, ZkCLITest, DistanceUnitsTest, UniqFieldsUpdateProcessorFactoryTest, TestTolerantSearch, ChaosMonkeyNothingIsSafeTest, DistributedFacetPivotWhiteBoxTest, TestUpdate, ActionThrottleTest, TestSchemaManager, ExplicitHLLTest, TestRuleBasedAuthorizationPlugin, TestDefaultSearchFieldResource, SolrPluginUtilsTest, RuleEngineTest, TestRTGBase, TestCloudPivotFacet, TestBinaryResponseWriter, TestSortByMinMaxFunction, SuggestComponentTest, CoreAdminRequestStatusTest, TestRemoveLastDynamicCopyField, TestExclusionRuleCollectionAccess, TestFileDictionaryLookup, TestCodecSupport, SortByFunctionTest, HdfsChaosMonkeySafeLeaderTest, TestSchemaSimilarityResource, TestSchemaVersionResource, TestBlendedInfixSuggestions, TestObjectReleaseTracker, TestWordDelimiterFilterFactory, TestManagedSchemaFieldTypeResource, TestConfigOverlay, TestFastOutputStream, SolrCloudExampleTest, TestBM25SimilarityFactory, TestCloudInspectUtil, LoggingHandlerTest, ZkSolrClientTest, TestImplicitCoreProperties, AtomicUpdatesTest, TermVectorComponentTest, TestRebalanceLeaders, TestNRTOpen, BitVectorTest, CoreAdminCreateDiscoverTest, TestJsonRequest, SpellCheckCollatorTest, ShardRoutingTest, RollingRestartTest, TestQueryUtils, ConvertedLegacyTest, SSLMigrationTest, AnalysisErrorHandlingTest, ShardSplitTest, TestSQLHandler, DistributedExpandComponentTest, TestClassNameShortening, TestStressUserVersions, BasicFunctionalityTest, MoreLikeThisHandlerTest, TestConfigSetImmutable, TestQueryTypes, TestTrie, DirectSolrSpellCheckerTest, PreAnalyzedUpdateProcessorTest, TestCloudManagedSchema, TestSolrCloudWithKerberosAlt, CSVRequestHandlerTest, SpatialFilterTest, TestSolrDeletionPolicy2, SimplePostToolTest, CollectionReloadTest, RequestLoggingTest, DistributedFacetPivotLongTailTest, TestDistribIDF, DocExpirationUpdateProcessorFactoryTest, CircularListTest, TestSerializedLuceneMatchVersion, WordBreakSolrSpellCheckerTest, SuggesterFSTTest, VMParamsZkACLAndCredentialsProvidersTest, TestJmxMonitoredMap, SyncSliceTest, TestReplicationHandler, ZkControllerTest, TestRealTimeGet, TestReload, DistributedTermsComponentTest, TestSolr4Spatial, SpellCheckComponentTest, SolrCmdDistributorTest, TestFiltering, PrimitiveFieldTypeTest, XmlUpdateRequestHandlerTest, RequiredFieldsTest, TestJmxIntegration, MBeansHandlerTest, BinaryUpdateRequestHandlerTest, HighlighterConfigTest, UpdateParamsTest, TestSolrIndexConfig, CopyFieldTest, BadComponentTest, SampleTest, NumericFieldsTest, TestElisionMultitermQuery, OutputWriterTest, TestPostingsSolrHighlighter, DirectSolrConnectionTest, SynonymTokenizerTest, TestSweetSpotSimilarityFactory, TimeZoneUtilsTest, OpenExchangeRatesOrgProviderTest, TestFastLRUCache, TestSystemIdResolver, SpellingQueryConverterTest, RAMDirectoryFactoryTest, TestSolrJ, TestLRUCache, TestDocumentBuilder, SolrTestCaseJ4Test, TestCrossCoreJoin, TestCursorMarkWithoutUniqueKey, TestDistributedMissingSort, TestJettySolrRunner, AliasIntegrationTest, CdcrReplicationHandlerTest]
   [junit4] Completed [451/554] on J1 in 517.76s, 1 test, 1 failure <<< FAILURES!

[...truncated 338 lines...]
BUILD FAILED
/home/jenkins/workspace/Lucene-Solr-trunk-Linux/build.xml:775: The following error occurred while executing this line:
/home/jenkins/workspace/Lucene-Solr-trunk-Linux/build.xml:719: The following error occurred while executing this line:
/home/jenkins/workspace/Lucene-Solr-trunk-Linux/build.xml:59: The following error occurred while executing this line:
/home/jenkins/workspace/Lucene-Solr-trunk-Linux/solr/build.xml:233: The following error occurred while executing this line:
/home/jenkins/workspace/Lucene-Solr-trunk-Linux/solr/common-build.xml:516: The following error occurred while executing this line:
/home/jenkins/workspace/Lucene-Solr-trunk-Linux/lucene/common-build.xml:1432: The following error occurred while executing this line:
/home/jenkins/workspace/Lucene-Solr-trunk-Linux/lucene/common-build.xml:987: There were test failures: 554 suites (8 ignored), 2182 tests, 1 failure, 75 ignored (38 assumptions) [seed: 72E7104EE9F8F3BA]

Total time: 47 minutes 57 seconds
Build step 'Invoke Ant' marked build as failure
Archiving artifacts
[WARNINGS] Skipping publisher since build result is FAILURE
Recording test results
Email was triggered for: Failure - Any
Sending email for trigger: Failure - Any



Mime
View raw message