lucene-dev mailing list archives

Site index · List index
Message view « Date » · « Thread »
Top « Date » · « Thread »
From Policeman Jenkins Server <jenk...@thetaphi.de>
Subject [JENKINS] Lucene-Solr-trunk-Windows (32bit/jdk1.8.0_66) - Build # 5414 - Failure!
Date Mon, 23 Nov 2015 00:32:06 GMT
Build: http://jenkins.thetaphi.de/job/Lucene-Solr-trunk-Windows/5414/
Java: 32bit/jdk1.8.0_66 -server -XX:+UseParallelGC

3 tests failed.
FAILED:  junit.framework.TestSuite.org.apache.solr.core.TestCoreDiscovery

Error Message:
ERROR: SolrIndexSearcher opens=23 closes=22

Stack Trace:
java.lang.AssertionError: ERROR: SolrIndexSearcher opens=23 closes=22
	at __randomizedtesting.SeedInfo.seed([78274312F6039B99]:0)
	at org.junit.Assert.fail(Assert.java:93)
	at org.apache.solr.SolrTestCaseJ4.endTrackingSearchers(SolrTestCaseJ4.java:452)
	at org.apache.solr.SolrTestCaseJ4.afterClass(SolrTestCaseJ4.java:222)
	at sun.reflect.GeneratedMethodAccessor13.invoke(Unknown Source)
	at sun.reflect.DelegatingMethodAccessorImpl.invoke(DelegatingMethodAccessorImpl.java:43)
	at java.lang.reflect.Method.invoke(Method.java:497)
	at com.carrotsearch.randomizedtesting.RandomizedRunner.invoke(RandomizedRunner.java:1764)
	at com.carrotsearch.randomizedtesting.RandomizedRunner$7.evaluate(RandomizedRunner.java:834)
	at com.carrotsearch.randomizedtesting.rules.StatementAdapter.evaluate(StatementAdapter.java:36)
	at com.carrotsearch.randomizedtesting.rules.SystemPropertiesRestoreRule$1.evaluate(SystemPropertiesRestoreRule.java:57)
	at org.apache.lucene.util.AbstractBeforeAfterRule$1.evaluate(AbstractBeforeAfterRule.java:46)
	at com.carrotsearch.randomizedtesting.rules.StatementAdapter.evaluate(StatementAdapter.java:36)
	at org.apache.lucene.util.TestRuleStoreClassName$1.evaluate(TestRuleStoreClassName.java:42)
	at com.carrotsearch.randomizedtesting.rules.NoShadowingOrOverridesOnMethodsRule$1.evaluate(NoShadowingOrOverridesOnMethodsRule.java:40)
	at com.carrotsearch.randomizedtesting.rules.NoShadowingOrOverridesOnMethodsRule$1.evaluate(NoShadowingOrOverridesOnMethodsRule.java:40)
	at com.carrotsearch.randomizedtesting.rules.StatementAdapter.evaluate(StatementAdapter.java:36)
	at com.carrotsearch.randomizedtesting.rules.StatementAdapter.evaluate(StatementAdapter.java:36)
	at com.carrotsearch.randomizedtesting.rules.StatementAdapter.evaluate(StatementAdapter.java:36)
	at org.apache.lucene.util.TestRuleAssertionsRequired$1.evaluate(TestRuleAssertionsRequired.java:54)
	at org.apache.lucene.util.TestRuleMarkFailure$1.evaluate(TestRuleMarkFailure.java:48)
	at org.apache.lucene.util.TestRuleIgnoreAfterMaxFailures$1.evaluate(TestRuleIgnoreAfterMaxFailures.java:65)
	at org.apache.lucene.util.TestRuleIgnoreTestSuites$1.evaluate(TestRuleIgnoreTestSuites.java:55)
	at com.carrotsearch.randomizedtesting.rules.StatementAdapter.evaluate(StatementAdapter.java:36)
	at com.carrotsearch.randomizedtesting.ThreadLeakControl$StatementRunner.run(ThreadLeakControl.java:367)
	at java.lang.Thread.run(Thread.java:745)


FAILED:  junit.framework.TestSuite.org.apache.solr.core.TestCoreDiscovery

Error Message:
1 thread leaked from SUITE scope at org.apache.solr.core.TestCoreDiscovery:     1) Thread[id=10024, name=searcherExecutor-4657-thread-1, state=WAITING, group=TGRP-TestCoreDiscovery]         at sun.misc.Unsafe.park(Native Method)         at java.util.concurrent.locks.LockSupport.park(LockSupport.java:175)         at java.util.concurrent.locks.AbstractQueuedSynchronizer$ConditionObject.await(AbstractQueuedSynchronizer.java:2039)         at java.util.concurrent.LinkedBlockingQueue.take(LinkedBlockingQueue.java:442)         at java.util.concurrent.ThreadPoolExecutor.getTask(ThreadPoolExecutor.java:1067)         at java.util.concurrent.ThreadPoolExecutor.runWorker(ThreadPoolExecutor.java:1127)         at java.util.concurrent.ThreadPoolExecutor$Worker.run(ThreadPoolExecutor.java:617)         at java.lang.Thread.run(Thread.java:745)

Stack Trace:
com.carrotsearch.randomizedtesting.ThreadLeakError: 1 thread leaked from SUITE scope at org.apache.solr.core.TestCoreDiscovery: 
   1) Thread[id=10024, name=searcherExecutor-4657-thread-1, state=WAITING, group=TGRP-TestCoreDiscovery]
        at sun.misc.Unsafe.park(Native Method)
        at java.util.concurrent.locks.LockSupport.park(LockSupport.java:175)
        at java.util.concurrent.locks.AbstractQueuedSynchronizer$ConditionObject.await(AbstractQueuedSynchronizer.java:2039)
        at java.util.concurrent.LinkedBlockingQueue.take(LinkedBlockingQueue.java:442)
        at java.util.concurrent.ThreadPoolExecutor.getTask(ThreadPoolExecutor.java:1067)
        at java.util.concurrent.ThreadPoolExecutor.runWorker(ThreadPoolExecutor.java:1127)
        at java.util.concurrent.ThreadPoolExecutor$Worker.run(ThreadPoolExecutor.java:617)
        at java.lang.Thread.run(Thread.java:745)
	at __randomizedtesting.SeedInfo.seed([78274312F6039B99]:0)


FAILED:  junit.framework.TestSuite.org.apache.solr.core.TestCoreDiscovery

Error Message:
There are still zombie threads that couldn't be terminated:    1) Thread[id=10024, name=searcherExecutor-4657-thread-1, state=WAITING, group=TGRP-TestCoreDiscovery]         at sun.misc.Unsafe.park(Native Method)         at java.util.concurrent.locks.LockSupport.park(LockSupport.java:175)         at java.util.concurrent.locks.AbstractQueuedSynchronizer$ConditionObject.await(AbstractQueuedSynchronizer.java:2039)         at java.util.concurrent.LinkedBlockingQueue.take(LinkedBlockingQueue.java:442)         at java.util.concurrent.ThreadPoolExecutor.getTask(ThreadPoolExecutor.java:1067)         at java.util.concurrent.ThreadPoolExecutor.runWorker(ThreadPoolExecutor.java:1127)         at java.util.concurrent.ThreadPoolExecutor$Worker.run(ThreadPoolExecutor.java:617)         at java.lang.Thread.run(Thread.java:745)

Stack Trace:
com.carrotsearch.randomizedtesting.ThreadLeakError: There are still zombie threads that couldn't be terminated:
   1) Thread[id=10024, name=searcherExecutor-4657-thread-1, state=WAITING, group=TGRP-TestCoreDiscovery]
        at sun.misc.Unsafe.park(Native Method)
        at java.util.concurrent.locks.LockSupport.park(LockSupport.java:175)
        at java.util.concurrent.locks.AbstractQueuedSynchronizer$ConditionObject.await(AbstractQueuedSynchronizer.java:2039)
        at java.util.concurrent.LinkedBlockingQueue.take(LinkedBlockingQueue.java:442)
        at java.util.concurrent.ThreadPoolExecutor.getTask(ThreadPoolExecutor.java:1067)
        at java.util.concurrent.ThreadPoolExecutor.runWorker(ThreadPoolExecutor.java:1127)
        at java.util.concurrent.ThreadPoolExecutor$Worker.run(ThreadPoolExecutor.java:617)
        at java.lang.Thread.run(Thread.java:745)
	at __randomizedtesting.SeedInfo.seed([78274312F6039B99]:0)




Build Log:
[...truncated 10711 lines...]
   [junit4] Suite: org.apache.solr.core.TestCoreDiscovery
   [junit4]   2> Creating dataDir: C:\Users\JenkinsSlave\workspace\Lucene-Solr-trunk-Windows\solr\build\solr-core\test\J1\temp\solr.core.TestCoreDiscovery_78274312F6039B99-001\init-core-data-001
   [junit4]   2> 1638807 INFO  (SUITE-TestCoreDiscovery-seed#[78274312F6039B99]-worker) [    ] o.a.s.SolrTestCaseJ4 Randomized ssl (false) and clientAuth (false)
   [junit4]   2> 1638807 INFO  (SUITE-TestCoreDiscovery-seed#[78274312F6039B99]-worker) [    ] o.a.s.SolrTestCaseJ4 ####initCore
   [junit4]   2> 1638807 INFO  (SUITE-TestCoreDiscovery-seed#[78274312F6039B99]-worker) [    ] o.a.s.SolrTestCaseJ4 ####initCore end
   [junit4]   2> 1638829 INFO  (TEST-TestCoreDiscovery.testTooManyTransientCores-seed#[78274312F6039B99]) [    ] o.a.s.SolrTestCaseJ4 ###Starting testTooManyTransientCores
   [junit4]   2> 1639243 INFO  (TEST-TestCoreDiscovery.testTooManyTransientCores-seed#[78274312F6039B99]) [    ] o.a.s.c.SolrResourceLoader new SolrResourceLoader for directory: 'C:\Users\JenkinsSlave\workspace\Lucene-Solr-trunk-Windows\solr\build\solr-core\test\J1\temp\solr.core.TestCoreDiscovery_78274312F6039B99-001\tempDir-001'
   [junit4]   2> 1639243 INFO  (TEST-TestCoreDiscovery.testTooManyTransientCores-seed#[78274312F6039B99]) [    ] o.a.s.c.SolrResourceLoader JNDI not configured for solr (NoInitialContextEx)
   [junit4]   2> 1639243 INFO  (TEST-TestCoreDiscovery.testTooManyTransientCores-seed#[78274312F6039B99]) [    ] o.a.s.c.SolrResourceLoader using system property solr.solr.home: C:\Users\JenkinsSlave\workspace\Lucene-Solr-trunk-Windows\solr\build\solr-core\test\J1\temp\solr.core.TestCoreDiscovery_78274312F6039B99-001\tempDir-001
   [junit4]   2> 1639243 INFO  (TEST-TestCoreDiscovery.testTooManyTransientCores-seed#[78274312F6039B99]) [    ] o.a.s.c.SolrXmlConfig Loading container configuration from C:\Users\JenkinsSlave\workspace\Lucene-Solr-trunk-Windows\solr\build\solr-core\test\J1\temp\solr.core.TestCoreDiscovery_78274312F6039B99-001\tempDir-001\solr.xml
   [junit4]   2> 1639249 INFO  (TEST-TestCoreDiscovery.testTooManyTransientCores-seed#[78274312F6039B99]) [    ] o.a.s.c.CoresLocator Config-defined core root directory: C:\Users\JenkinsSlave\workspace\Lucene-Solr-trunk-Windows\solr\build\solr-core\test\J1\temp\solr.core.TestCoreDiscovery_78274312F6039B99-001\tempDir-001
   [junit4]   2> 1639249 INFO  (TEST-TestCoreDiscovery.testTooManyTransientCores-seed#[78274312F6039B99]) [    ] o.a.s.c.CoreContainer New CoreContainer 31896985
   [junit4]   2> 1639249 INFO  (TEST-TestCoreDiscovery.testTooManyTransientCores-seed#[78274312F6039B99]) [    ] o.a.s.c.CoreContainer Loading cores into CoreContainer [instanceDir=C:\Users\JenkinsSlave\workspace\Lucene-Solr-trunk-Windows\solr\build\solr-core\test\J1\temp\solr.core.TestCoreDiscovery_78274312F6039B99-001\tempDir-001]
   [junit4]   2> 1639250 WARN  (TEST-TestCoreDiscovery.testTooManyTransientCores-seed#[78274312F6039B99]) [    ] o.a.s.c.CoreContainer Couldn't add files from C:\Users\JenkinsSlave\workspace\Lucene-Solr-trunk-Windows\solr\build\solr-core\test\J1\temp\solr.core.TestCoreDiscovery_78274312F6039B99-001\tempDir-001\lib to classpath: C:\Users\JenkinsSlave\workspace\Lucene-Solr-trunk-Windows\solr\build\solr-core\test\J1\temp\solr.core.TestCoreDiscovery_78274312F6039B99-001\tempDir-001\lib
   [junit4]   2> 1639250 INFO  (TEST-TestCoreDiscovery.testTooManyTransientCores-seed#[78274312F6039B99]) [    ] o.a.s.h.c.HttpShardHandlerFactory created with socketTimeout : 600000,connTimeout : 60000,maxConnectionsPerHost : 20,maxConnections : 10000,corePoolSize : 0,maximumPoolSize : 2147483647,maxThreadIdleTime : 5,sizeOfQueue : -1,fairnessPolicy : false,useRetries : false,
   [junit4]   2> 1639252 INFO  (TEST-TestCoreDiscovery.testTooManyTransientCores-seed#[78274312F6039B99]) [    ] o.a.s.u.UpdateShardHandler Creating UpdateShardHandler HTTP client with params: socketTimeout=600000&connTimeout=60000&retry=true
   [junit4]   2> 1639253 INFO  (TEST-TestCoreDiscovery.testTooManyTransientCores-seed#[78274312F6039B99]) [    ] o.a.s.c.CoreContainer Allocating transient cache for 2 transient cores
   [junit4]   2> 1639255 INFO  (TEST-TestCoreDiscovery.testTooManyTransientCores-seed#[78274312F6039B99]) [    ] o.a.s.l.LogWatcher SLF4J impl is org.slf4j.impl.Log4jLoggerFactory
   [junit4]   2> 1639255 INFO  (TEST-TestCoreDiscovery.testTooManyTransientCores-seed#[78274312F6039B99]) [    ] o.a.s.l.LogWatcher Registering Log Listener [Log4j (org.slf4j.impl.Log4jLoggerFactory)]
   [junit4]   2> 1639255 INFO  (TEST-TestCoreDiscovery.testTooManyTransientCores-seed#[78274312F6039B99]) [    ] o.a.s.c.CoreContainer Security conf doesn't exist. Skipping setup for authorization module.
   [junit4]   2> 1639255 INFO  (TEST-TestCoreDiscovery.testTooManyTransientCores-seed#[78274312F6039B99]) [    ] o.a.s.c.CoreContainer No authentication plugin used.
   [junit4]   2> 1639255 INFO  (TEST-TestCoreDiscovery.testTooManyTransientCores-seed#[78274312F6039B99]) [    ] o.a.s.c.CoresLocator Looking for core definitions underneath C:\Users\JenkinsSlave\workspace\Lucene-Solr-trunk-Windows\solr\build\solr-core\test\J1\temp\solr.core.TestCoreDiscovery_78274312F6039B99-001\tempDir-001
   [junit4]   2> 1639256 INFO  (TEST-TestCoreDiscovery.testTooManyTransientCores-seed#[78274312F6039B99]) [    ] o.a.s.c.SolrCore Created CoreDescriptor: {name=coreLOS, config=solrconfig-minimal.xml, transient=false, schema=schema-tiny.xml, loadOnStartup=true, configSetProperties=configsetprops.json, instanceDir=C:\Users\JenkinsSlave\workspace\Lucene-Solr-trunk-Windows\solr\build\solr-core\test\J1\temp\solr.core.TestCoreDiscovery_78274312F6039B99-001\tempDir-001\coreLOS, absoluteInstDir=C:\Users\JenkinsSlave\workspace\Lucene-Solr-trunk-Windows\solr\build\solr-core\test\J1\temp\solr.core.TestCoreDiscovery_78274312F6039B99-001\tempDir-001\coreLOS\, dataDir=coreLOS}
   [junit4]   2> 1639256 INFO  (TEST-TestCoreDiscovery.testTooManyTransientCores-seed#[78274312F6039B99]) [    ] o.a.s.c.CoresLocator Found core coreLOS in C:\Users\JenkinsSlave\workspace\Lucene-Solr-trunk-Windows\solr\build\solr-core\test\J1\temp\solr.core.TestCoreDiscovery_78274312F6039B99-001\tempDir-001\coreLOS\
   [junit4]   2> 1639257 INFO  (TEST-TestCoreDiscovery.testTooManyTransientCores-seed#[78274312F6039B99]) [    ] o.a.s.c.SolrCore Created CoreDescriptor: {name=coreT1, config=solrconfig-minimal.xml, transient=true, schema=schema-tiny.xml, loadOnStartup=true, configSetProperties=configsetprops.json, instanceDir=C:\Users\JenkinsSlave\workspace\Lucene-Solr-trunk-Windows\solr\build\solr-core\test\J1\temp\solr.core.TestCoreDiscovery_78274312F6039B99-001\tempDir-001\coreT1, absoluteInstDir=C:\Users\JenkinsSlave\workspace\Lucene-Solr-trunk-Windows\solr\build\solr-core\test\J1\temp\solr.core.TestCoreDiscovery_78274312F6039B99-001\tempDir-001\coreT1\, dataDir=coreT1}
   [junit4]   2> 1639257 INFO  (TEST-TestCoreDiscovery.testTooManyTransientCores-seed#[78274312F6039B99]) [    ] o.a.s.c.CoresLocator Found core coreT1 in C:\Users\JenkinsSlave\workspace\Lucene-Solr-trunk-Windows\solr\build\solr-core\test\J1\temp\solr.core.TestCoreDiscovery_78274312F6039B99-001\tempDir-001\coreT1\
   [junit4]   2> 1639258 INFO  (TEST-TestCoreDiscovery.testTooManyTransientCores-seed#[78274312F6039B99]) [    ] o.a.s.c.SolrCore Created CoreDescriptor: {name=coreT2, config=solrconfig-minimal.xml, transient=true, schema=schema-tiny.xml, loadOnStartup=true, configSetProperties=configsetprops.json, instanceDir=C:\Users\JenkinsSlave\workspace\Lucene-Solr-trunk-Windows\solr\build\solr-core\test\J1\temp\solr.core.TestCoreDiscovery_78274312F6039B99-001\tempDir-001\coreT2, absoluteInstDir=C:\Users\JenkinsSlave\workspace\Lucene-Solr-trunk-Windows\solr\build\solr-core\test\J1\temp\solr.core.TestCoreDiscovery_78274312F6039B99-001\tempDir-001\coreT2\, dataDir=coreT2}
   [junit4]   2> 1639258 INFO  (TEST-TestCoreDiscovery.testTooManyTransientCores-seed#[78274312F6039B99]) [    ] o.a.s.c.CoresLocator Found core coreT2 in C:\Users\JenkinsSlave\workspace\Lucene-Solr-trunk-Windows\solr\build\solr-core\test\J1\temp\solr.core.TestCoreDiscovery_78274312F6039B99-001\tempDir-001\coreT2\
   [junit4]   2> 1639259 INFO  (TEST-TestCoreDiscovery.testTooManyTransientCores-seed#[78274312F6039B99]) [    ] o.a.s.c.SolrCore Created CoreDescriptor: {name=coreT3, config=solrconfig-minimal.xml, transient=true, schema=schema-tiny.xml, loadOnStartup=true, configSetProperties=configsetprops.json, instanceDir=C:\Users\JenkinsSlave\workspace\Lucene-Solr-trunk-Windows\solr\build\solr-core\test\J1\temp\solr.core.TestCoreDiscovery_78274312F6039B99-001\tempDir-001\coreT3, absoluteInstDir=C:\Users\JenkinsSlave\workspace\Lucene-Solr-trunk-Windows\solr\build\solr-core\test\J1\temp\solr.core.TestCoreDiscovery_78274312F6039B99-001\tempDir-001\coreT3\, dataDir=coreT3}
   [junit4]   2> 1639259 INFO  (TEST-TestCoreDiscovery.testTooManyTransientCores-seed#[78274312F6039B99]) [    ] o.a.s.c.CoresLocator Found core coreT3 in C:\Users\JenkinsSlave\workspace\Lucene-Solr-trunk-Windows\solr\build\solr-core\test\J1\temp\solr.core.TestCoreDiscovery_78274312F6039B99-001\tempDir-001\coreT3\
   [junit4]   2> 1639260 INFO  (TEST-TestCoreDiscovery.testTooManyTransientCores-seed#[78274312F6039B99]) [    ] o.a.s.c.SolrCore Created CoreDescriptor: {name=coreT4, config=solrconfig-minimal.xml, transient=true, schema=schema-tiny.xml, loadOnStartup=true, configSetProperties=configsetprops.json, instanceDir=C:\Users\JenkinsSlave\workspace\Lucene-Solr-trunk-Windows\solr\build\solr-core\test\J1\temp\solr.core.TestCoreDiscovery_78274312F6039B99-001\tempDir-001\coreT4, absoluteInstDir=C:\Users\JenkinsSlave\workspace\Lucene-Solr-trunk-Windows\solr\build\solr-core\test\J1\temp\solr.core.TestCoreDiscovery_78274312F6039B99-001\tempDir-001\coreT4\, dataDir=coreT4}
   [junit4]   2> 1639260 INFO  (TEST-TestCoreDiscovery.testTooManyTransientCores-seed#[78274312F6039B99]) [    ] o.a.s.c.CoresLocator Found core coreT4 in C:\Users\JenkinsSlave\workspace\Lucene-Solr-trunk-Windows\solr\build\solr-core\test\J1\temp\solr.core.TestCoreDiscovery_78274312F6039B99-001\tempDir-001\coreT4\
   [junit4]   2> 1639261 INFO  (TEST-TestCoreDiscovery.testTooManyTransientCores-seed#[78274312F6039B99]) [    ] o.a.s.c.SolrCore Created CoreDescriptor: {name=coreT5, config=solrconfig-minimal.xml, transient=true, schema=schema-tiny.xml, loadOnStartup=true, configSetProperties=configsetprops.json, instanceDir=C:\Users\JenkinsSlave\workspace\Lucene-Solr-trunk-Windows\solr\build\solr-core\test\J1\temp\solr.core.TestCoreDiscovery_78274312F6039B99-001\tempDir-001\coreT5, absoluteInstDir=C:\Users\JenkinsSlave\workspace\Lucene-Solr-trunk-Windows\solr\build\solr-core\test\J1\temp\solr.core.TestCoreDiscovery_78274312F6039B99-001\tempDir-001\coreT5\, dataDir=coreT5}
   [junit4]   2> 1639261 INFO  (TEST-TestCoreDiscovery.testTooManyTransientCores-seed#[78274312F6039B99]) [    ] o.a.s.c.CoresLocator Found core coreT5 in C:\Users\JenkinsSlave\workspace\Lucene-Solr-trunk-Windows\solr\build\solr-core\test\J1\temp\solr.core.TestCoreDiscovery_78274312F6039B99-001\tempDir-001\coreT5\
   [junit4]   2> 1639262 INFO  (TEST-TestCoreDiscovery.testTooManyTransientCores-seed#[78274312F6039B99]) [    ] o.a.s.c.SolrCore Created CoreDescriptor: {name=coreT6, config=solrconfig-minimal.xml, transient=true, schema=schema-tiny.xml, loadOnStartup=true, configSetProperties=configsetprops.json, instanceDir=C:\Users\JenkinsSlave\workspace\Lucene-Solr-trunk-Windows\solr\build\solr-core\test\J1\temp\solr.core.TestCoreDiscovery_78274312F6039B99-001\tempDir-001\coreT6, absoluteInstDir=C:\Users\JenkinsSlave\workspace\Lucene-Solr-trunk-Windows\solr\build\solr-core\test\J1\temp\solr.core.TestCoreDiscovery_78274312F6039B99-001\tempDir-001\coreT6\, dataDir=coreT6}
   [junit4]   2> 1639262 INFO  (TEST-TestCoreDiscovery.testTooManyTransientCores-seed#[78274312F6039B99]) [    ] o.a.s.c.CoresLocator Found core coreT6 in C:\Users\JenkinsSlave\workspace\Lucene-Solr-trunk-Windows\solr\build\solr-core\test\J1\temp\solr.core.TestCoreDiscovery_78274312F6039B99-001\tempDir-001\coreT6\
   [junit4]   2> 1639262 INFO  (TEST-TestCoreDiscovery.testTooManyTransientCores-seed#[78274312F6039B99]) [    ] o.a.s.c.CoresLocator Found 7 core definitions
   [junit4]   2> 1639262 INFO  (coreLoadExecutor-4620-thread-1) [    ] o.a.s.c.SolrResourceLoader new SolrResourceLoader for directory: 'C:\Users\JenkinsSlave\workspace\Lucene-Solr-trunk-Windows\solr\build\solr-core\test\J1\temp\solr.core.TestCoreDiscovery_78274312F6039B99-001\tempDir-001\coreLOS'
   [junit4]   2> 1639262 INFO  (coreLoadExecutor-4620-thread-1) [    ] o.a.s.c.SolrResourceLoader JNDI not configured for solr (NoInitialContextEx)
   [junit4]   2> 1639262 INFO  (coreLoadExecutor-4620-thread-1) [    ] o.a.s.c.SolrResourceLoader using system property solr.solr.home: C:\Users\JenkinsSlave\workspace\Lucene-Solr-trunk-Windows\solr\build\solr-core\test\J1\temp\solr.core.TestCoreDiscovery_78274312F6039B99-001\tempDir-001
   [junit4]   2> 1639274 INFO  (coreLoadExecutor-4620-thread-1) [    ] o.a.s.c.SolrConfig current version of requestparams : -1
   [junit4]   2> 1639276 INFO  (coreLoadExecutor-4620-thread-1) [    ] o.a.s.c.SolrConfig Using Lucene MatchVersion: 6.0.0
   [junit4]   2> 1639278 INFO  (coreLoadExecutor-4620-thread-1) [    ] o.a.s.c.Config Loaded SolrConfig: solrconfig-minimal.xml
   [junit4]   2> 1639281 INFO  (coreLoadExecutor-4620-thread-1) [    ] o.a.s.s.IndexSchema [coreLOS] Schema name=tiny
   [junit4]   2> 1639284 INFO  (coreLoadExecutor-4620-thread-1) [    ] o.a.s.s.IndexSchema unique key field: id
   [junit4]   2> 1639289 INFO  (coreLoadExecutor-4620-thread-1) [    ] o.a.s.c.ConfigSetProperties Did not find ConfigSet properties, assuming default properties: Can't find resource 'configsetprops.json' in classpath or 'C:\Users\JenkinsSlave\workspace\Lucene-Solr-trunk-Windows\solr\build\solr-core\test\J1\temp\solr.core.TestCoreDiscovery_78274312F6039B99-001\tempDir-001\coreLOS'
   [junit4]   2> 1639289 INFO  (coreLoadExecutor-4620-thread-1) [    ] o.a.s.c.CoreContainer Creating SolrCore 'coreLOS' using configuration from instancedir C:\Users\JenkinsSlave\workspace\Lucene-Solr-trunk-Windows\solr\build\solr-core\test\J1\temp\solr.core.TestCoreDiscovery_78274312F6039B99-001\tempDir-001\coreLOS
   [junit4]   2> 1639289 INFO  (coreLoadExecutor-4620-thread-1) [    x:coreLOS] o.a.s.c.SolrCore org.apache.solr.core.MockDirectoryFactory
   [junit4]   2> 1639289 INFO  (coreLoadExecutor-4620-thread-1) [    x:coreLOS] o.a.s.c.SolrCore [[coreLOS] ] Opening new SolrCore at [C:\Users\JenkinsSlave\workspace\Lucene-Solr-trunk-Windows\solr\build\solr-core\test\J1\temp\solr.core.TestCoreDiscovery_78274312F6039B99-001\tempDir-001\coreLOS], dataDir=[null]
   [junit4]   2> 1639289 INFO  (coreLoadExecutor-4620-thread-1) [    x:coreLOS] o.a.s.c.SolrCore JMX monitoring not detected for core: coreLOS
   [junit4]   2> 1639289 INFO  (coreLoadExecutor-4620-thread-1) [    x:coreLOS] o.a.s.c.CachingDirectoryFactory return new directory for C:\Users\JenkinsSlave\workspace\Lucene-Solr-trunk-Windows\solr\build\solr-core\test\J1\temp\solr.core.TestCoreDiscovery_78274312F6039B99-001\tempDir-001\coreLOS\coreLOS\
   [junit4]   2> 1639289 INFO  (coreLoadExecutor-4620-thread-1) [    x:coreLOS] o.a.s.c.SolrCore New index directory detected: old=null new=C:\Users\JenkinsSlave\workspace\Lucene-Solr-trunk-Windows\solr\build\solr-core\test\J1\temp\solr.core.TestCoreDiscovery_78274312F6039B99-001\tempDir-001\coreLOS\coreLOS\index/
   [junit4]   2> 1639289 WARN  (coreLoadExecutor-4620-thread-1) [    x:coreLOS] o.a.s.c.SolrCore [coreLOS] Solr index directory 'C:\Users\JenkinsSlave\workspace\Lucene-Solr-trunk-Windows\solr\build\solr-core\test\J1\temp\solr.core.TestCoreDiscovery_78274312F6039B99-001\tempDir-001\coreLOS\coreLOS\index' doesn't exist. Creating new index...
   [junit4]   2> 1639289 INFO  (coreLoadExecutor-4620-thread-1) [    x:coreLOS] o.a.s.c.CachingDirectoryFactory return new directory for C:\Users\JenkinsSlave\workspace\Lucene-Solr-trunk-Windows\solr\build\solr-core\test\J1\temp\solr.core.TestCoreDiscovery_78274312F6039B99-001\tempDir-001\coreLOS\coreLOS\index
   [junit4]   2> 1639289 INFO  (coreLoadExecutor-4620-thread-1) [    x:coreLOS] o.a.s.u.RandomMergePolicy RandomMergePolicy wrapping class org.apache.lucene.index.LogDocMergePolicy: [LogDocMergePolicy: minMergeSize=1000, mergeFactor=34, maxMergeSize=9223372036854775807, maxMergeSizeForForcedMerge=9223372036854775807, calibrateSizeByDeletes=true, maxMergeDocs=2147483647, maxCFSSegmentSizeMB=8.796093022207999E12, noCFSRatio=0.46688546544368204]
   [junit4]   2> 1639289 INFO  (coreLoadExecutor-4620-thread-1) [    x:coreLOS] o.a.s.c.SolrCore SolrDeletionPolicy.onCommit: commits: num=1
   [junit4]   2> 	commit{dir=MockDirectoryWrapper(RAMDirectory@1ae5963 lockFactory=org.apache.lucene.store.SingleInstanceLockFactory@18478b6),segFN=segments_1,generation=1}
   [junit4]   2> 1639289 INFO  (coreLoadExecutor-4620-thread-1) [    x:coreLOS] o.a.s.c.SolrCore newest commit generation = 1
   [junit4]   2> 1639290 INFO  (coreLoadExecutor-4620-thread-3) [    ] o.a.s.c.SolrResourceLoader new SolrResourceLoader for directory: 'C:\Users\JenkinsSlave\workspace\Lucene-Solr-trunk-Windows\solr\build\solr-core\test\J1\temp\solr.core.TestCoreDiscovery_78274312F6039B99-001\tempDir-001\coreT2'
   [junit4]   2> 1639290 INFO  (coreLoadExecutor-4620-thread-3) [    ] o.a.s.c.SolrResourceLoader JNDI not configured for solr (NoInitialContextEx)
   [junit4]   2> 1639290 INFO  (coreLoadExecutor-4620-thread-3) [    ] o.a.s.c.SolrResourceLoader using system property solr.solr.home: C:\Users\JenkinsSlave\workspace\Lucene-Solr-trunk-Windows\solr\build\solr-core\test\J1\temp\solr.core.TestCoreDiscovery_78274312F6039B99-001\tempDir-001
   [junit4]   2> 1639296 INFO  (coreLoadExecutor-4620-thread-3) [    ] o.a.s.c.SolrConfig current version of requestparams : -1
   [junit4]   2> 1639297 INFO  (coreLoadExecutor-4620-thread-3) [    ] o.a.s.c.SolrConfig Using Lucene MatchVersion: 6.0.0
   [junit4]   2> 1639300 INFO  (coreLoadExecutor-4620-thread-3) [    ] o.a.s.c.Config Loaded SolrConfig: solrconfig-minimal.xml
   [junit4]   2> 1639302 INFO  (coreLoadExecutor-4620-thread-3) [    ] o.a.s.s.IndexSchema [coreT2] Schema name=tiny
   [junit4]   2> 1639304 INFO  (coreLoadExecutor-4620-thread-3) [    ] o.a.s.s.IndexSchema unique key field: id
   [junit4]   2> 1639305 INFO  (coreLoadExecutor-4620-thread-3) [    ] o.a.s.c.ConfigSetProperties Did not find ConfigSet properties, assuming default properties: Can't find resource 'configsetprops.json' in classpath or 'C:\Users\JenkinsSlave\workspace\Lucene-Solr-trunk-Windows\solr\build\solr-core\test\J1\temp\solr.core.TestCoreDiscovery_78274312F6039B99-001\tempDir-001\coreT2'
   [junit4]   2> 1639305 INFO  (coreLoadExecutor-4620-thread-3) [    ] o.a.s.c.CoreContainer Creating SolrCore 'coreT2' using configuration from instancedir C:\Users\JenkinsSlave\workspace\Lucene-Solr-trunk-Windows\solr\build\solr-core\test\J1\temp\solr.core.TestCoreDiscovery_78274312F6039B99-001\tempDir-001\coreT2
   [junit4]   2> 1639306 INFO  (coreLoadExecutor-4620-thread-3) [    x:coreT2] o.a.s.c.SolrCore org.apache.solr.core.MockDirectoryFactory
   [junit4]   2> 1639306 INFO  (coreLoadExecutor-4620-thread-3) [    x:coreT2] o.a.s.c.SolrCore [[coreT2] ] Opening new SolrCore at [C:\Users\JenkinsSlave\workspace\Lucene-Solr-trunk-Windows\solr\build\solr-core\test\J1\temp\solr.core.TestCoreDiscovery_78274312F6039B99-001\tempDir-001\coreT2], dataDir=[null]
   [junit4]   2> 1639306 INFO  (coreLoadExecutor-4620-thread-3) [    x:coreT2] o.a.s.c.SolrCore JMX monitoring not detected for core: coreT2
   [junit4]   2> 1639306 INFO  (coreLoadExecutor-4620-thread-3) [    x:coreT2] o.a.s.c.CachingDirectoryFactory return new directory for C:\Users\JenkinsSlave\workspace\Lucene-Solr-trunk-Windows\solr\build\solr-core\test\J1\temp\solr.core.TestCoreDiscovery_78274312F6039B99-001\tempDir-001\coreT2\coreT2\
   [junit4]   2> 1639306 INFO  (coreLoadExecutor-4620-thread-3) [    x:coreT2] o.a.s.c.SolrCore New index directory detected: old=null new=C:\Users\JenkinsSlave\workspace\Lucene-Solr-trunk-Windows\solr\build\solr-core\test\J1\temp\solr.core.TestCoreDiscovery_78274312F6039B99-001\tempDir-001\coreT2\coreT2\index/
   [junit4]   2> 1639306 WARN  (coreLoadExecutor-4620-thread-3) [    x:coreT2] o.a.s.c.SolrCore [coreT2] Solr index directory 'C:\Users\JenkinsSlave\workspace\Lucene-Solr-trunk-Windows\solr\build\solr-core\test\J1\temp\solr.core.TestCoreDiscovery_78274312F6039B99-001\tempDir-001\coreT2\coreT2\index' doesn't exist. Creating new index...
   [junit4]   2> 1639306 INFO  (coreLoadExecutor-4620-thread-3) [    x:coreT2] o.a.s.c.CachingDirectoryFactory return new directory for C:\Users\JenkinsSlave\workspace\Lucene-Solr-trunk-Windows\solr\build\solr-core\test\J1\temp\solr.core.TestCoreDiscovery_78274312F6039B99-001\tempDir-001\coreT2\coreT2\index
   [junit4]   2> 1639306 INFO  (coreLoadExecutor-4620-thread-3) [    x:coreT2] o.a.s.u.RandomMergePolicy RandomMergePolicy wrapping class org.apache.lucene.index.LogDocMergePolicy: [LogDocMergePolicy: minMergeSize=1000, mergeFactor=34, maxMergeSize=9223372036854775807, maxMergeSizeForForcedMerge=9223372036854775807, calibrateSizeByDeletes=true, maxMergeDocs=2147483647, maxCFSSegmentSizeMB=8.796093022207999E12, noCFSRatio=0.46688546544368204]
   [junit4]   2> 1639307 INFO  (coreLoadExecutor-4620-thread-3) [    x:coreT2] o.a.s.c.SolrCore SolrDeletionPolicy.onCommit: commits: num=1
   [junit4]   2> 	commit{dir=MockDirectoryWrapper(RAMDirectory@1bc4435 lockFactory=org.apache.lucene.store.SingleInstanceLockFactory@ce23da),segFN=segments_1,generation=1}
   [junit4]   2> 1639307 INFO  (coreLoadExecutor-4620-thread-3) [    x:coreT2] o.a.s.c.SolrCore newest commit generation = 1
   [junit4]   2> 1639307 INFO  (coreLoadExecutor-4620-thread-2) [    ] o.a.s.c.SolrResourceLoader new SolrResourceLoader for directory: 'C:\Users\JenkinsSlave\workspace\Lucene-Solr-trunk-Windows\solr\build\solr-core\test\J1\temp\solr.core.TestCoreDiscovery_78274312F6039B99-001\tempDir-001\coreT1'
   [junit4]   2> 1639307 INFO  (coreLoadExecutor-4620-thread-2) [    ] o.a.s.c.SolrResourceLoader JNDI not configured for solr (NoInitialContextEx)
   [junit4]   2> 1639307 INFO  (coreLoadExecutor-4620-thread-2) [    ] o.a.s.c.SolrResourceLoader using system property solr.solr.home: C:\Users\JenkinsSlave\workspace\Lucene-Solr-trunk-Windows\solr\build\solr-core\test\J1\temp\solr.core.TestCoreDiscovery_78274312F6039B99-001\tempDir-001
   [junit4]   2> 1639312 INFO  (coreLoadExecutor-4620-thread-2) [    ] o.a.s.c.SolrConfig current version of requestparams : -1
   [junit4]   2> 1639313 INFO  (coreLoadExecutor-4620-thread-2) [    ] o.a.s.c.SolrConfig Using Lucene MatchVersion: 6.0.0
   [junit4]   2> 1639317 INFO  (coreLoadExecutor-4620-thread-2) [    ] o.a.s.c.Config Loaded SolrConfig: solrconfig-minimal.xml
   [junit4]   2> 1639319 INFO  (coreLoadExecutor-4620-thread-2) [    ] o.a.s.s.IndexSchema [coreT1] Schema name=tiny
   [junit4]   2> 1639320 INFO  (coreLoadExecutor-4620-thread-2) [    ] o.a.s.s.IndexSchema unique key field: id
   [junit4]   2> 1639322 INFO  (coreLoadExecutor-4620-thread-2) [    ] o.a.s.c.ConfigSetProperties Did not find ConfigSet properties, assuming default properties: Can't find resource 'configsetprops.json' in classpath or 'C:\Users\JenkinsSlave\workspace\Lucene-Solr-trunk-Windows\solr\build\solr-core\test\J1\temp\solr.core.TestCoreDiscovery_78274312F6039B99-001\tempDir-001\coreT1'
   [junit4]   2> 1639322 INFO  (coreLoadExecutor-4620-thread-2) [    ] o.a.s.c.CoreContainer Creating SolrCore 'coreT1' using configuration from instancedir C:\Users\JenkinsSlave\workspace\Lucene-Solr-trunk-Windows\solr\build\solr-core\test\J1\temp\solr.core.TestCoreDiscovery_78274312F6039B99-001\tempDir-001\coreT1
   [junit4]   2> 1639322 INFO  (coreLoadExecutor-4620-thread-2) [    x:coreT1] o.a.s.c.SolrCore org.apache.solr.core.MockDirectoryFactory
   [junit4]   2> 1639322 INFO  (coreLoadExecutor-4620-thread-2) [    x:coreT1] o.a.s.c.SolrCore [[coreT1] ] Opening new SolrCore at [C:\Users\JenkinsSlave\workspace\Lucene-Solr-trunk-Windows\solr\build\solr-core\test\J1\temp\solr.core.TestCoreDiscovery_78274312F6039B99-001\tempDir-001\coreT1], dataDir=[null]
   [junit4]   2> 1639322 INFO  (coreLoadExecutor-4620-thread-2) [    x:coreT1] o.a.s.c.SolrCore JMX monitoring not detected for core: coreT1
   [junit4]   2> 1639322 INFO  (coreLoadExecutor-4620-thread-2) [    x:coreT1] o.a.s.c.CachingDirectoryFactory return new directory for C:\Users\JenkinsSlave\workspace\Lucene-Solr-trunk-Windows\solr\build\solr-core\test\J1\temp\solr.core.TestCoreDiscovery_78274312F6039B99-001\tempDir-001\coreT1\coreT1\
   [junit4]   2> 1639322 INFO  (coreLoadExecutor-4620-thread-2) [    x:coreT1] o.a.s.c.SolrCore New index directory detected: old=null new=C:\Users\JenkinsSlave\workspace\Lucene-Solr-trunk-Windows\solr\build\solr-core\test\J1\temp\solr.core.TestCoreDiscovery_78274312F6039B99-001\tempDir-001\coreT1\coreT1\index/
   [junit4]   2> 1639322 WARN  (coreLoadExecutor-4620-thread-2) [    x:coreT1] o.a.s.c.SolrCore [coreT1] Solr index directory 'C:\Users\JenkinsSlave\workspace\Lucene-Solr-trunk-Windows\solr\build\solr-core\test\J1\temp\solr.core.TestCoreDiscovery_78274312F6039B99-001\tempDir-001\coreT1\coreT1\index' doesn't exist. Creating new index...
   [junit4]   2> 1639323 INFO  (coreLoadExecutor-4620-thread-2) [    x:coreT1] o.a.s.c.CachingDirectoryFactory return new directory for C:\Users\JenkinsSlave\workspace\Lucene-Solr-trunk-Windows\solr\build\solr-core\test\J1\temp\solr.core.TestCoreDiscovery_78274312F6039B99-001\tempDir-001\coreT1\coreT1\index
   [junit4]   2> 1639323 INFO  (coreLoadExecutor-4620-thread-2) [    x:coreT1] o.a.s.u.RandomMergePolicy RandomMergePolicy wrapping class org.apache.lucene.index.LogDocMergePolicy: [LogDocMergePolicy: minMergeSize=1000, mergeFactor=34, maxMergeSize=9223372036854775807, maxMergeSizeForForcedMerge=9223372036854775807, calibrateSizeByDeletes=true, maxMergeDocs=2147483647, maxCFSSegmentSizeMB=8.796093022207999E12, noCFSRatio=0.46688546544368204]
   [junit4]   2> 1639323 INFO  (coreLoadExecutor-4620-thread-2) [    x:coreT1] o.a.s.c.SolrCore SolrDeletionPolicy.onCommit: commits: num=1
   [junit4]   2> 	commit{dir=MockDirectoryWrapper(RAMDirectory@186950c lockFactory=org.apache.lucene.store.SingleInstanceLockFactory@d90811),segFN=segments_1,generation=1}
   [junit4]   2> 1639323 INFO  (coreLoadExecutor-4620-thread-2) [    x:coreT1] o.a.s.c.SolrCore newest commit generation = 1
   [junit4]   2> 1639323 INFO  (coreLoadExecutor-4620-thread-1) [    x:coreLOS] o.a.s.c.SolrCore no updateRequestProcessorChain defined as default, creating implicit default
   [junit4]   2> 1639326 INFO  (coreLoadExecutor-4620-thread-1) [    x:coreLOS] o.a.s.h.l.XMLLoader xsltCacheLifetimeSeconds=60
   [junit4]   2> 1639327 INFO  (coreLoadExecutor-4620-thread-1) [    x:coreLOS] o.a.s.h.l.XMLLoader xsltCacheLifetimeSeconds=60
   [junit4]   2> 1639328 INFO  (coreLoadExecutor-4620-thread-1) [    x:coreLOS] o.a.s.h.l.XMLLoader xsltCacheLifetimeSeconds=60
   [junit4]   2> 1639328 INFO  (coreLoadExecutor-4620-thread-1) [    x:coreLOS] o.a.s.h.l.XMLLoader xsltCacheLifetimeSeconds=60
   [junit4]   2> 1639334 INFO  (OldIndexDirectoryCleanupThreadForCore-coreLOS) [    x:coreLOS] o.a.s.c.SolrCore Looking for old index directories to cleanup for core coreLOS in C:\Users\JenkinsSlave\workspace\Lucene-Solr-trunk-Windows\solr\build\solr-core\test\J1\temp\solr.core.TestCoreDiscovery_78274312F6039B99-001\tempDir-001\coreLOS\coreLOS\
   [junit4]   2> 1639335 INFO  (coreLoadExecutor-4620-thread-2) [    x:coreT1] o.a.s.c.SolrCore no updateRequestProcessorChain defined as default, creating implicit default
   [junit4]   2> 1639336 INFO  (coreLoadExecutor-4620-thread-2) [    x:coreT1] o.a.s.h.l.XMLLoader xsltCacheLifetimeSeconds=60
   [junit4]   2> 1639611 INFO  (coreLoadExecutor-4620-thread-2) [    x:coreT1] o.a.s.h.l.XMLLoader xsltCacheLifetimeSeconds=60
   [junit4]   2> 1639612 INFO  (coreLoadExecutor-4620-thread-2) [    x:coreT1] o.a.s.h.l.XMLLoader xsltCacheLifetimeSeconds=60
   [junit4]   2> 1639613 INFO  (coreLoadExecutor-4620-thread-2) [    x:coreT1] o.a.s.h.l.XMLLoader xsltCacheLifetimeSeconds=60
   [junit4]   2> 1639614 INFO  (coreLoadExecutor-4620-thread-3) [    x:coreT2] o.a.s.c.SolrCore no updateRequestProcessorChain defined as default, creating implicit default
   [junit4]   2> 1639614 INFO  (coreLoadExecutor-4620-thread-3) [    x:coreT2] o.a.s.h.l.XMLLoader xsltCacheLifetimeSeconds=60
   [junit4]   2> 1639615 INFO  (coreLoadExecutor-4620-thread-3) [    x:coreT2] o.a.s.h.l.XMLLoader xsltCacheLifetimeSeconds=60
   [junit4]   2> 1639615 INFO  (coreLoadExecutor-4620-thread-3) [    x:coreT2] o.a.s.h.l.XMLLoader xsltCacheLifetimeSeconds=60
   [junit4]   2> 1639616 INFO  (coreLoadExecutor-4620-thread-3) [    x:coreT2] o.a.s.h.l.XMLLoader xsltCacheLifetimeSeconds=60
   [junit4]   2> 1639616 INFO  (OldIndexDirectoryCleanupThreadForCore-coreT2) [    x:coreT2] o.a.s.c.SolrCore Looking for old index directories to cleanup for core coreT2 in C:\Users\JenkinsSlave\workspace\Lucene-Solr-trunk-Windows\solr\build\solr-core\test\J1\temp\solr.core.TestCoreDiscovery_78274312F6039B99-001\tempDir-001\coreT2\coreT2\
   [junit4]   2> 1639618 INFO  (OldIndexDirectoryCleanupThreadForCore-coreT1) [    x:coreT1] o.a.s.c.SolrCore Looking for old index directories to cleanup for core coreT1 in C:\Users\JenkinsSlave\workspace\Lucene-Solr-trunk-Windows\solr\build\solr-core\test\J1\temp\solr.core.TestCoreDiscovery_78274312F6039B99-001\tempDir-001\coreT1\coreT1\
   [junit4]   2> 1639618 INFO  (coreLoadExecutor-4620-thread-1) [    x:coreLOS] o.a.s.c.RequestHandlers Registered paths: /admin/mbeans,/update/csv,/update/json/docs,/admin/luke,/select,/admin/segments,/get,/admin/system,/replication,/admin/properties,/config,/schema,/admin/plugins,/admin/logging,/update/json,/admin/threads,/admin/ping,/update,/admin/file
   [junit4]   2> 1639618 INFO  (coreLoadExecutor-4620-thread-1) [    x:coreLOS] o.a.s.c.SolrCore Using default statsCache cache: org.apache.solr.search.stats.LocalStatsCache
   [junit4]   2> 1639619 WARN  (OldIndexDirectoryCleanupThreadForCore-coreT1) [    x:coreT1] o.a.s.c.DirectoryFactory C:\Users\JenkinsSlave\workspace\Lucene-Solr-trunk-Windows\solr\build\solr-core\test\J1\temp\solr.core.TestCoreDiscovery_78274312F6039B99-001\tempDir-001\coreT1\coreT1\ does not point to a valid data directory; skipping clean-up of old index directories.
   [junit4]   2> 1639619 WARN  (OldIndexDirectoryCleanupThreadForCore-coreT2) [    x:coreT2] o.a.s.c.DirectoryFactory C:\Users\JenkinsSlave\workspace\Lucene-Solr-trunk-Windows\solr\build\solr-core\test\J1\temp\solr.core.TestCoreDiscovery_78274312F6039B99-001\tempDir-001\coreT2\coreT2\ does not point to a valid data directory; skipping clean-up of old index directories.
   [junit4]   2> 1639619 INFO  (coreLoadExecutor-4620-thread-3) [    x:coreT2] o.a.s.c.RequestHandlers Registered paths: /admin/mbeans,/update/csv,/update/json/docs,/admin/luke,/select,/admin/segments,/get,/admin/system,/replication,/admin/properties,/config,/schema,/admin/plugins,/admin/logging,/update/json,/admin/threads,/admin/ping,/update,/admin/file
   [junit4]   2> 1639619 INFO  (coreLoadExecutor-4620-thread-3) [    x:coreT2] o.a.s.c.SolrCore Using default statsCache cache: org.apache.solr.search.stats.LocalStatsCache
   [junit4]   2> 1639620 INFO  (coreLoadExecutor-4620-thread-2) [    x:coreT1] o.a.s.c.RequestHandlers Registered paths: /admin/mbeans,/update/csv,/update/json/docs,/admin/luke,/select,/admin/segments,/get,/admin/system,/replication,/admin/properties,/config,/schema,/admin/plugins,/admin/logging,/update/json,/admin/threads,/admin/ping,/update,/admin/file
   [junit4]   2> 1639620 INFO  (coreLoadExecutor-4620-thread-2) [    x:coreT1] o.a.s.c.SolrCore Using default statsCache cache: org.apache.solr.search.stats.LocalStatsCache
   [junit4]   2> 1639620 WARN  (OldIndexDirectoryCleanupThreadForCore-coreLOS) [    x:coreLOS] o.a.s.c.DirectoryFactory C:\Users\JenkinsSlave\workspace\Lucene-Solr-trunk-Windows\solr\build\solr-core\test\J1\temp\solr.core.TestCoreDiscovery_78274312F6039B99-001\tempDir-001\coreLOS\coreLOS\ does not point to a valid data directory; skipping clean-up of old index directories.
   [junit4]   2> 1639620 INFO  (coreLoadExecutor-4620-thread-1) [    x:coreLOS] o.a.s.c.SolrCore Hard AutoCommit: disabled
   [junit4]   2> 1639620 INFO  (coreLoadExecutor-4620-thread-1) [    x:coreLOS] o.a.s.c.SolrCore Soft AutoCommit: disabled
   [junit4]   2> 1639620 INFO  (coreLoadExecutor-4620-thread-1) [    x:coreLOS] o.a.s.u.RandomMergePolicy RandomMergePolicy wrapping class org.apache.lucene.index.LogByteSizeMergePolicy: [LogByteSizeMergePolicy: minMergeSize=1677721, mergeFactor=15, maxMergeSize=2147483648, maxMergeSizeForForcedMerge=9223372036854775807, calibrateSizeByDeletes=true, maxMergeDocs=2147483647, maxCFSSegmentSizeMB=8.796093022207999E12, noCFSRatio=0.0]
   [junit4]   2> 1639621 INFO  (coreLoadExecutor-4620-thread-2) [    x:coreT1] o.a.s.c.SolrCore Hard AutoCommit: disabled
   [junit4]   2> 1639621 INFO  (coreLoadExecutor-4620-thread-2) [    x:coreT1] o.a.s.c.SolrCore Soft AutoCommit: disabled
   [junit4]   2> 1639621 INFO  (coreLoadExecutor-4620-thread-2) [    x:coreT1] o.a.s.u.RandomMergePolicy RandomMergePolicy wrapping class org.apache.lucene.index.LogByteSizeMergePolicy: [LogByteSizeMergePolicy: minMergeSize=1677721, mergeFactor=15, maxMergeSize=2147483648, maxMergeSizeForForcedMerge=9223372036854775807, calibrateSizeByDeletes=true, maxMergeDocs=2147483647, maxCFSSegmentSizeMB=8.796093022207999E12, noCFSRatio=0.0]
   [junit4]   2> 1639622 INFO  (coreLoadExecutor-4620-thread-1) [    x:coreLOS] o.a.s.c.SolrCore SolrDeletionPolicy.onInit: commits: num=1
   [junit4]   2> 	commit{dir=MockDirectoryWrapper(RAMDirectory@1ae5963 lockFactory=org.apache.lucene.store.SingleInstanceLockFactory@18478b6),segFN=segments_1,generation=1}
   [junit4]   2> 1639622 INFO  (coreLoadExecutor-4620-thread-1) [    x:coreLOS] o.a.s.c.SolrCore newest commit generation = 1
   [junit4]   2> 1639622 INFO  (coreLoadExecutor-4620-thread-1) [    x:coreLOS] o.a.s.s.SolrIndexSearcher Opening Searcher@9dc9fe[coreLOS] main
   [junit4]   2> 1639622 INFO  (coreLoadExecutor-4620-thread-1) [    x:coreLOS] o.a.s.r.ManagedResourceStorage File-based storage initialized to use dir: C:\Users\JenkinsSlave\workspace\Lucene-Solr-trunk-Windows\solr\build\solr-core\test\J1\temp\solr.core.TestCoreDiscovery_78274312F6039B99-001\tempDir-001\coreLOS\conf
   [junit4]   2> 1639622 INFO  (coreLoadExecutor-4620-thread-1) [    x:coreLOS] o.a.s.r.RestManager Initializing RestManager with initArgs: {storageDir=C:\Users\JenkinsSlave\workspace\Lucene-Solr-trunk-Windows\solr\build\solr-core\test\J1\temp\solr.core.TestCoreDiscovery_78274312F6039B99-001\tempDir-001\coreLOS\conf}
   [junit4]   2> 1639622 INFO  (coreLoadExecutor-4620-thread-1) [    x:coreLOS] o.a.s.r.ManagedResourceStorage Reading _rest_managed.json using file:dir=C:\Users\JenkinsSlave\workspace\Lucene-Solr-trunk-Windows\solr\build\solr-core\test\J1\temp\solr.core.TestCoreDiscovery_78274312F6039B99-001\tempDir-001\coreLOS\conf
   [junit4]   2> 1639623 INFO  (coreLoadExecutor-4620-thread-1) [    x:coreLOS] o.a.s.r.RestManager Initializing 0 registered ManagedResources
   [junit4]   2> 1639623 INFO  (coreLoadExecutor-4620-thread-1) [    x:coreLOS] o.a.s.h.ReplicationHandler Commits will be reserved for  10000
   [junit4]   2> 1639623 INFO  (searcherExecutor-4621-thread-1-processing-x:coreLOS) [    x:coreLOS] o.a.s.c.SolrCore [coreLOS] Registered new searcher Searcher@9dc9fe[coreLOS] main{ExitableDirectoryReader(UninvertingDirectoryReader())}
   [junit4]   2> 1639623 INFO  (coreLoadExecutor-4620-thread-1) [    x:coreLOS] o.a.s.c.CoreContainer registering core: coreLOS
   [junit4]   2> 1639623 INFO  (coreLoadExecutor-4620-thread-1) [    ] o.a.s.c.SolrResourceLoader new SolrResourceLoader for directory: 'C:\Users\JenkinsSlave\workspace\Lucene-Solr-trunk-Windows\solr\build\solr-core\test\J1\temp\solr.core.TestCoreDiscovery_78274312F6039B99-001\tempDir-001\coreT3'
   [junit4]   2> 1639623 INFO  (coreLoadExecutor-4620-thread-1) [    ] o.a.s.c.SolrResourceLoader JNDI not configured for solr (NoInitialContextEx)
   [junit4]   2> 1639623 INFO  (coreLoadExecutor-4620-thread-1) [    ] o.a.s.c.SolrResourceLoader using system property solr.solr.home: C:\Users\JenkinsSlave\workspace\Lucene-Solr-trunk-Windows\solr\build\solr-core\test\J1\temp\solr.core.TestCoreDiscovery_78274312F6039B99-001\tempDir-001
   [junit4]   2> 1639629 INFO  (coreLoadExecutor-4620-thread-1) [    ] o.a.s.c.SolrConfig current version of requestparams : -1
   [junit4]   2> 1639630 INFO  (coreLoadExecutor-4620-thread-1) [    ] o.a.s.c.SolrConfig Using Lucene MatchVersion: 6.0.0
   [junit4]   2> 1639632 INFO  (coreLoadExecutor-4620-thread-1) [    ] o.a.s.c.Config Loaded SolrConfig: solrconfig-minimal.xml
   [junit4]   2> 1639634 INFO  (coreLoadExecutor-4620-thread-1) [    ] o.a.s.s.IndexSchema [coreT3] Schema name=tiny
   [junit4]   2> 1639636 INFO  (coreLoadExecutor-4620-thread-1) [    ] o.a.s.s.IndexSchema unique key field: id
   [junit4]   2> 1639637 INFO  (coreLoadExecutor-4620-thread-1) [    ] o.a.s.c.ConfigSetProperties Did not find ConfigSet properties, assuming default properties: Can't find resource 'configsetprops.json' in classpath or 'C:\Users\JenkinsSlave\workspace\Lucene-Solr-trunk-Windows\solr\build\solr-core\test\J1\temp\solr.core.TestCoreDiscovery_78274312F6039B99-001\tempDir-001\coreT3'
   [junit4]   2> 1639638 INFO  (coreLoadExecutor-4620-thread-1) [    ] o.a.s.c.CoreContainer Creating SolrCore 'coreT3' using configuration from instancedir C:\Users\JenkinsSlave\workspace\Lucene-Solr-trunk-Windows\solr\build\solr-core\test\J1\temp\solr.core.TestCoreDiscovery_78274312F6039B99-001\tempDir-001\coreT3
   [junit4]   2> 1639638 INFO  (coreLoadExecutor-4620-thread-1) [    x:coreT3] o.a.s.c.SolrCore org.apache.solr.core.MockDirectoryFactory
   [junit4]   2> 1639638 INFO  (coreLoadExecutor-4620-thread-1) [    x:coreT3] o.a.s.c.SolrCore [[coreT3] ] Opening new SolrCore at [C:\Users\JenkinsSlave\workspace\Lucene-Solr-trunk-Windows\solr\build\solr-core\test\J1\temp\solr.core.TestCoreDiscovery_78274312F6039B99-001\tempDir-001\coreT3], dataDir=[null]
   [junit4]   2> 1639638 INFO  (coreLoadExecutor-4620-thread-1) [    x:coreT3] o.a.s.c.SolrCore JMX monitoring not detected for core: coreT3
   [junit4]   2> 1639638 INFO  (coreLoadExecutor-4620-thread-1) [    x:coreT3] o.a.s.c.CachingDirectoryFactory return new directory for C:\Users\JenkinsSlave\workspace\Lucene-Solr-trunk-Windows\solr\build\solr-core\test\J1\temp\solr.core.TestCoreDiscovery_78274312F6039B99-001\tempDir-001\coreT3\coreT3\
   [junit4]   2> 1639638 INFO  (coreLoadExecutor-4620-thread-1) [    x:coreT3] o.a.s.c.SolrCore New index directory detected: old=null new=C:\Users\JenkinsSlave\workspace\Lucene-Solr-trunk-Windows\solr\build\solr-core\test\J1\temp\solr.core.TestCoreDiscovery_78274312F6039B99-001\tempDir-001\coreT3\coreT3\index/
   [junit4]   2> 1639638 WARN  (coreLoadExecutor-4620-thread-1) [    x:coreT3] o.a.s.c.SolrCore [coreT3] Solr index directory 'C:\Users\JenkinsSlave\workspace\Lucene-Solr-trunk-Windows\solr\build\solr-core\test\J1\temp\solr.core.TestCoreDiscovery_78274312F6039B99-001\tempDir-001\coreT3\coreT3\index' doesn't exist. Creating new index...
   [junit4]   2> 1639638 INFO  (coreLoadExecutor-4620-thread-1) [    x:coreT3] o.a.s.c.CachingDirectoryFactory return new directory for C:\Users\JenkinsSlave\workspace\Lucene-Solr-trunk-Windows\solr\build\solr-core\test\J1\temp\solr.core.TestCoreDiscovery_78274312F6039B99-001\tempDir-001\coreT3\coreT3\index
   [junit4]   2> 1639638 INFO  (coreLoadExecutor-4620-thread-1) [    x:coreT3] o.a.s.u.RandomMergePolicy RandomMergePolicy wrapping class org.apache.lucene.index.TieredMergePolicy: [TieredMergePolicy: maxMergeAtOnce=32, maxMergeAtOnceExplicit=13, maxMergedSegmentMB=62.9912109375, floorSegmentMB=0.9853515625, forceMergeDeletesPctAllowed=29.36240756005536, segmentsPerTier=46.0, maxCFSSegmentSizeMB=8.796093022207999E12, noCFSRatio=1.0
   [junit4]   2> 1639639 INFO  (coreLoadExecutor-4620-thread-2) [    x:coreT1] o.a.s.c.SolrCore SolrDeletionPolicy.onInit: commits: num=1
   [junit4]   2> 	commit{dir=MockDirectoryWrapper(RAMDirectory@186950c lockFactory=org.apache.lucene.store.SingleInstanceLockFactory@d90811),segFN=segments_1,generation=1}
   [junit4]   2> 1639639 INFO  (coreLoadExecutor-4620-thread-2) [    x:coreT1] o.a.s.c.SolrCore newest commit generation = 1
   [junit4]   2> 1639639 INFO  (coreLoadExecutor-4620-thread-2) [    x:coreT1] o.a.s.s.SolrIndexSearcher Opening Searcher@148d90e[coreT1] main
   [junit4]   2> 1639639 INFO  (coreLoadExecutor-4620-thread-2) [    x:coreT1] o.a.s.r.ManagedResourceStorage File-based storage initialized to use dir: C:\Users\JenkinsSlave\workspace\Lucene-Solr-trunk-Windows\solr\build\solr-core\test\J1\temp\solr.core.TestCoreDiscovery_78274312F6039B99-001\tempDir-001\coreT1\conf
   [junit4]   2> 1639639 INFO  (coreLoadExecutor-4620-thread-2) [    x:coreT1] o.a.s.r.RestManager Initializing RestManager with initArgs: {storageDir=C:\Users\JenkinsSlave\workspace\Lucene-Solr-trunk-Windows\solr\build\solr-core\test\J1\temp\solr.core.TestCoreDiscovery_78274312F6039B99-001\tempDir-001\coreT1\conf}
   [junit4]   2> 1639639 INFO  (coreLoadExecutor-4620-thread-2) [    x:coreT1] o.a.s.r.ManagedResourceStorage Reading _rest_managed.json using file:dir=C:\Users\JenkinsSlave\workspace\Lucene-Solr-trunk-Windows\solr\build\solr-core\test\J1\temp\solr.core.TestCoreDiscovery_78274312F6039B99-001\tempDir-001\coreT1\conf
   [junit4]   2> 1639639 INFO  (coreLoadExecutor-4620-thread-2) [    x:coreT1] o.a.s.r.RestManager Initializing 0 registered ManagedResources
   [junit4]   2> 1639639 INFO  (coreLoadExecutor-4620-thread-2) [    x:coreT1] o.a.s.h.ReplicationHandler Commits will be reserved for  10000
   [junit4]   2> 1639640 INFO  (coreLoadExecutor-4620-thread-2) [    x:coreT1] o.a.s.c.CoreContainer Opening transient core coreT1
   [junit4]   2> 1639640 INFO  (coreLoadExecutor-4620-thread-2) [    x:coreT1] o.a.s.c.CoreContainer registering core: coreT1
   [junit4]   2> 1639640 INFO  (coreLoadExecutor-4620-thread-2) [    ] o.a.s.c.SolrResourceLoader new SolrResourceLoader for directory: 'C:\Users\JenkinsSlave\workspace\Lucene-Solr-trunk-Windows\solr\build\solr-core\test\J1\temp\solr.core.TestCoreDiscovery_78274312F6039B99-001\tempDir-001\coreT4'
   [junit4]   2> 1639640 INFO  (coreLoadExecutor-4620-thread-2) [    ] o.a.s.c.SolrResourceLoader JNDI not configured for solr (NoInitialContextEx)
   [junit4]   2> 1639640 INFO  (coreLoadExecutor-4620-thread-2) [    ] o.a.s.c.SolrResourceLoader using system property solr.solr.home: C:\Users\JenkinsSlave\workspace\Lucene-Solr-trunk-Windows\solr\build\solr-core\test\J1\temp\solr.core.TestCoreDiscovery_78274312F6039B99-001\tempDir-001
   [junit4]   2> 1639646 INFO  (coreLoadExecutor-4620-thread-2) [    ] o.a.s.c.SolrConfig current version of requestparams : -1
   [junit4]   2> 1639648 INFO  (coreLoadExecutor-4620-thread-2) [    ] o.a.s.c.SolrConfig Using Lucene MatchVersion: 6.0.0
   [junit4]   2> 1639650 INFO  (coreLoadExecutor-4620-thread-2) [    ] o.a.s.c.Config Loaded SolrConfig: solrconfig-minimal.xml
   [junit4]   2> 1639652 INFO  (coreLoadExecutor-4620-thread-2) [    ] o.a.s.s.IndexSchema [coreT4] Schema name=tiny
   [junit4]   2> 1639654 INFO  (coreLoadExecutor-4620-thread-2) [    ] o.a.s.s.IndexSchema unique key field: id
   [junit4]   2> 1639655 INFO  (coreLoadExecutor-4620-thread-2) [    ] o.a.s.c.ConfigSetProperties Did not find ConfigSet properties, assuming default properties: Can't find resource 'configsetprops.json' in classpath or 'C:\Users\JenkinsSlave\workspace\Lucene-Solr-trunk-Windows\solr\build\solr-core\test\J1\temp\solr.core.TestCoreDiscovery_78274312F6039B99-001\tempDir-001\coreT4'
   [junit4]   2> 1639655 INFO  (coreLoadExecutor-4620-thread-2) [    ] o.a.s.c.CoreContainer Creating SolrCore 'coreT4' using configuration from instancedir C:\Users\JenkinsSlave\workspace\Lucene-Solr-trunk-Windows\solr\build\solr-core\test\J1\temp\solr.core.TestCoreDiscovery_78274312F6039B99-001\tempDir-001\coreT4
   [junit4]   2> 1639655 INFO  (coreLoadExecutor-4620-thread-2) [    x:coreT4] o.a.s.c.SolrCore org.apache.solr.core.MockDirectoryFactory
   [junit4]   2> 1639655 INFO  (coreLoadExecutor-4620-thread-2) [    x:coreT4] o.a.s.c.SolrCore [[coreT4] ] Opening new SolrCore at [C:\Users\JenkinsSlave\workspace\Lucene-Solr-trunk-Windows\solr\build\solr-core\test\J1\temp\solr.core.TestCoreDiscovery_78274312F6039B99-001\tempDir-001\coreT4], dataDir=[null]
   [junit4]   2> 1639656 INFO  (coreLoadExecutor-4620-thread-2) [    x:coreT4] o.a.s.c.SolrCore JMX monitoring not detected for core: coreT4
   [junit4]   2> 1639656 INFO  (coreLoadExecutor-4620-thread-2) [    x:coreT4] o.a.s.c.CachingDirectoryFactory return new directory for C:\Users\JenkinsSlave\workspace\Lucene-Solr-trunk-Windows\solr\build\solr-core\test\J1\temp\solr.core.TestCoreDiscovery_78274312F6039B99-001\tempDir-001\coreT4\coreT4\
   [junit4]   2> 1639656 INFO  (coreLoadExecutor-4620-thread-2) [    x:coreT4] o.a.s.c.SolrCore New index directory detected: old=null new=C:\Users\JenkinsSlave\workspace\Lucene-Solr-trunk-Windows\solr\build\solr-core\test\J1\temp\solr.core.TestCoreDiscovery_78274312F6039B99-001\tempDir-001\coreT4\coreT4\index/
   [junit4]   2> 1639656 WARN  (coreLoadExecutor-4620-thread-2) [    x:coreT4] o.a.s.c.SolrCore [coreT4] Solr index directory 'C:\Users\JenkinsSlave\workspace\Lucene-Solr-trunk-Windows\solr\build\solr-core\test\J1\temp\solr.core.TestCoreDiscovery_78274312F6039B99-001\tempDir-001\coreT4\coreT4\index' doesn't exist. Creating new index...
   [junit4]   2> 1639656 INFO  (coreLoadExecutor-4620-thread-2) [    x:coreT4] o.a.s.c.CachingDirectoryFactory return new directory for C:\Users\JenkinsSlave\workspace\Lucene-Solr-trunk-Windows\solr\build\solr-core\test\J1\temp\solr.core.TestCoreDiscovery_78274312F6039B99-001\tempDir-001\coreT4\coreT4\index
   [junit4]   2> 1639656 INFO  (coreLoadExecutor-4620-thread-2) [    x:coreT4] o.a.s.u.RandomMergePolicy RandomMergePolicy wrapping class org.apache.lucene.index.TieredMergePolicy: [TieredMergePolicy: maxMergeAtOnce=32, maxMergeAtOnceExplicit=13, maxMergedSegmentMB=62.9912109375, floorSegmentMB=0.9853515625, forceMergeDeletesPctAllowed=29.36240756005536, segmentsPerTier=46.0, maxCFSSegmentSizeMB=8.796093022207999E12, noCFSRatio=1.0
   [junit4]   2> 1639657 INFO  (coreLoadExecutor-4620-thread-1) [    x:coreT3] o.a.s.c.SolrCore SolrDeletionPolicy.onCommit: commits: num=1
   [junit4]   2> 	commit{dir=MockDirectoryWrapper(RAMDirectory@17d1ea4 lockFactory=org.apache.lucene.store.SingleInstanceLockFactory@1da5d21),segFN=segments_1,generation=1}
   [junit4]   2> 1639657 INFO  (coreLoadExecutor-4620-thread-1) [    x:coreT3] o.a.s.c.SolrCore newest commit generation = 1
   [junit4]   2> 1639657 INFO  (coreLoadExecutor-4620-thread-2) [    x:coreT4] o.a.s.c.SolrCore SolrDeletionPolicy.onCommit: commits: num=1
   [junit4]   2> 	commit{dir=MockDirectoryWrapper(RAMDirectory@1b1c19c lockFactory=org.apache.lucene.store.SingleInstanceLockFactory@11b9d2a),segFN=segments_1,generation=1}
   [junit4]   2> 1639657 INFO  (coreLoadExecutor-4620-thread-2) [    x:coreT4] o.a.s.c.SolrCore newest commit generation = 1
   [junit4]   2> 1639658 INFO  (coreLoadExecutor-4620-thread-1) [    x:coreT3] o.a.s.c.SolrCore no updateRequestProcessorChain defined as default, creating implicit default
   [junit4]   2> 1639659 INFO  (coreLoadExecutor-4620-thread-1) [    x:coreT3] o.a.s.h.l.XMLLoader xsltCacheLifetimeSeconds=60
   [junit4]   2> 1639659 INFO  (coreLoadExecutor-4620-thread-1) [    x:coreT3] o.a.s.h.l.XMLLoader xsltCacheLifetimeSeconds=60
   [junit4]   2> 1639660 INFO  (coreLoadExecutor-4620-thread-1) [    x:coreT3] o.a.s.h.l.XMLLoader xsltCacheLifetimeSeconds=60
   [junit4]   2> 1639661 INFO  (coreLoadExecutor-4620-thread-1) [    x:coreT3] o.a.s.h.l.XMLLoader xsltCacheLifetimeSeconds=60
   [junit4]   2> 1639662 INFO  (coreLoadExecutor-4620-thread-1) [    x:coreT3] o.a.s.c.RequestHandlers Registered paths: /admin/mbeans,/update/csv,/update/json/docs,/admin/luke,/select,/admin/segments,/get,/admin/system,/replication,/admin/properties,/config,/schema,/admin/plugins,/admin/logging,/update/json,/admin/threads,/admin/ping,/update,/admin/file
   [junit4]   2> 1639662 INFO  (coreLoadExecutor-4620-thread-1) [    x:coreT3] o.a.s.c.SolrCore Using default statsCache cache: org.apache.solr.search.stats.LocalStatsCache
   [junit4]   2> 1639663 INFO  (OldIndexDirectoryCleanupThreadForCore-coreT3) [    x:coreT3] o.a.s.c.SolrCore Looking for old index directories to cleanup for core coreT3 in C:\Users\JenkinsSlave\workspace\Lucene-Solr-trunk-Windows\solr\build\solr-core\test\J1\temp\solr.core.TestCoreDiscovery_78274312F6039B99-001\tempDir-001\coreT3\coreT3\
   [junit4]   2> 1639663 WARN  (OldIndexDirectoryCleanupThreadForCore-coreT3) [    x:coreT3] o.a.s.c.DirectoryFactory C:\Users\JenkinsSlave\workspace\Lucene-Solr-trunk-Windows\solr\build\solr-core\test\J1\temp\solr.core.TestCoreDiscovery_78274312F6039B99-001\tempDir-001\coreT3\coreT3\ does not point to a valid data directory; skipping clean-up of old index directories.
   [junit4]   2> 1639665 INFO  (searcherExecutor-4623-thread-1-processing-x:coreT1) [    x:coreT1] o.a.s.c.SolrCore [coreT1] Registered new searcher Searcher@148d90e[coreT1] main{ExitableDirectoryReader(UninvertingDirectoryReader())}
   [junit4]   2> 1639665 INFO  (coreLoadExecutor-4620-thread-1) [    x:coreT3] o.a.s.c.SolrCore Hard AutoCommit: disabled
   [junit4]   2> 1639665 INFO  (coreLoadExecutor-4620-thread-1) [    x:coreT3] o.a.s.c.SolrCore Soft AutoCommit: disabled
   [junit4]   2> 1639665 INFO  (coreLoadExecutor-4620-thread-1) [    x:coreT3] o.a.s.u.RandomMergePolicy RandomMergePolicy wrapping class org.apache.lucene.index.TieredMergePolicy: [TieredMergePolicy: maxMergeAtOnce=46, maxMergeAtOnceExplicit=10, maxMergedSegmentMB=73.9091796875, floorSegmentMB=2.1494140625, forceMergeDeletesPctAllowed=16.32818241110269, segmentsPerTier=20.0, maxCFSSegmentSizeMB=8.796093022207999E12, noCFSRatio=1.0
   [junit4]   2> 1639666 INFO  (coreLoadExecutor-4620-thread-1) [    x:coreT3] o.a.s.c.SolrCore SolrDeletionPolicy.onInit: commits: num=1
   [junit4]   2> 	commit{dir=MockDirectoryWrapper(RAMDirectory@17d1ea4 lockFactory=org.apache.lucene.store.SingleInstanceLockFactory@1da5d21),segFN=segments_1,generation=1}
   [junit4]   2> 1639666 INFO  (coreLoadExecutor-4620-thread-1) [    x:coreT3] o.a.s.c.SolrCore newest commit generation = 1
   [junit4]   2> 1639666 INFO  (coreLoadExecutor-4620-thread-1) [    x:coreT3] o.a.s.s.SolrIndexSearcher Opening Searcher@4b7667[coreT3] main
   [junit4]   2> 1639666 INFO  (coreLoadExecutor-4620-thread-1) [    x:coreT3] o.a.s.r.ManagedResourceStorage File-based storage initialized to use dir: C:\Users\JenkinsSlave\workspace\Lucene-Solr-trunk-Windows\solr\build\solr-core\test\J1\temp\solr.core.TestCoreDiscovery_78274312F6039B99-001\tempDir-001\coreT3\conf
   [junit4]   2> 1639666 INFO  (coreLoadExecutor-4620-thread-1) [    x:coreT3] o.a.s.r.RestManager Initializing RestManager with initArgs: {storageDir=C:\Users\JenkinsSlave\workspace\Lucene-Solr-trunk-Windows\solr\build\solr-core\test\J1\temp\solr.core.TestCoreDiscovery_78274312F6039B99-001\tempDir-001\coreT3\conf}
   [junit4]   2> 1639666 INFO  (coreLoadExecutor-4620-thread-1) [    x:coreT3] o.a.s.r.ManagedResourceStorage Reading _rest_managed.json using file:dir=C:\Users\JenkinsSlave\workspace\Lucene-Solr-trunk-Windows\solr\build\solr-core\test\J1\temp\solr.core.TestCoreDiscovery_78274312F6039B99-001\tempDir-001\coreT3\conf
   [junit4]   2> 1639667 INFO  (coreLoadExecutor-4620-thread-3) [    x:coreT2] o.a.s.c.SolrCore Hard AutoCommit: disabled
   [junit4]   2> 1639667 INFO  (coreLoadExecutor-4620-thread-3) [    x:coreT2] o.a.s.c.SolrCore Soft AutoCommit: disabled
   [junit4]   2> 1639667 INFO  (coreLoadExecutor-4620-thread-3) [    x:coreT2] o.a.s.u.RandomMergePolicy RandomMergePolicy wrapping class org.apache.lucene.index.LogByteSizeMergePolicy: [LogByteSizeMergePolicy: minMergeSize=1677721, mergeFactor=15, maxMergeSize=2147483648, maxMergeSizeForForcedMerge=9223372036854775807, calibrateSizeByDeletes=true, maxMergeDocs=2147483647, maxCFSSegmentSizeMB=8.796093022207999E12, noCFSRatio=0.0]
   [junit4]   2> 1639667 INFO  (coreLoadExecutor-4620-thread-1) [    x:coreT3] o.a.s.r.RestManager Initializing 0 registered ManagedResources
   [junit4]   2> 1639667 INFO  (coreLoadExecutor-4620-thread-1) [    x:coreT3] o.a.s.h.ReplicationHandler Commits will be reserved for  10000
   [junit4]   2> 1639667 INFO  (coreLoadExecutor-4620-thread-1) [    x:coreT3] o.a.s.c.CoreContainer Opening transient core coreT3
   [junit4]   2> 1639667 INFO  (coreLoadExecutor-4620-thread-1) [    x:coreT3] o.a.s.c.CoreContainer registering core: coreT3
   [junit4]   2> 1639667 INFO  (coreLoadExecutor-4620-thread-1) [    ] o.a.s.c.SolrResourceLoader new SolrResourceLoader for directory: 'C:\Users\JenkinsSlave\workspace\Lucene-Solr-trunk-Windows\solr\build\solr-core\test\J1\temp\solr.core.TestCoreDiscovery_78274312F6039B99-001\tempDir-001\coreT5'
   [junit4]   2> 1639667 INFO  (coreLoadExecutor-4620-thread-1) [    ] o.a.s.c.SolrResourceLoader JNDI not configured for solr (NoInitialContextEx)
   [junit4]   2> 1639667 INFO  (coreLoadExecutor-4620-thread-1) [    ] o.a.s.c.SolrResourceLoader using system property solr.solr.home: C:\Users\JenkinsSlave\workspace\Lucene-Solr-trunk-Windows\solr\build\solr-core\test\J1\temp\solr.core.TestCoreDiscovery_78274312F6039B99-001\tempDir-001
   [junit4]   2> 1639672 INFO  (coreLoadExecutor-4620-thread-1) [    ] o.a.s.c.SolrConfig current version of requestparams : -1
   [junit4]   2> 1639674 INFO  (coreLoadExecutor-4620-thread-1) [    ] o.a.s.c.SolrConfig Using Lucene MatchVersion: 6.0.0
   [junit4]   2> 1639677 INFO  (coreLoadExecutor-4620-thread-1) [    ] o.a.s.c.Config Loaded SolrConfig: solrconfig-minimal.xml
   [junit4]   2> 1639679 INFO  (coreLoadExecutor-4620-thread-1) [    ] o.a.s.s.IndexSchema [coreT5] Schema name=tiny
   [junit4]   2> 1639681 INFO  (coreLoadExecutor-4620-thread-1) [    ] o.a.s.s.IndexSchema unique key field: id
   [junit4]   2> 1639682 INFO  (coreLoadExecutor-4620-thread-1) [    ] o.a.s.c.ConfigSetProperties Did not find ConfigSet properties, assuming default properties: Can't find resource 'configsetprops.json' in classpath or 'C:\Users\JenkinsSlave\workspace\Lucene-Solr-trunk-Windows\solr\build\solr-core\test\J1\temp\solr.core.TestCoreDiscovery_78274312F6039B99-001\tempDir-001\coreT5'
   [junit4]   2> 1639682 INFO  (coreLoadExecutor-4620-thread-1) [    ] o.a.s.c.CoreContainer Creating SolrCore 'coreT5' using configuration from instancedir C:\Users\JenkinsSlave\workspace\Lucene-Solr-trunk-Windows\solr\build\solr-core\test\J1\temp\solr.core.TestCoreDiscovery_78274312F6039B99-001\tempDir-001\coreT5
   [junit4]   2> 1639682 INFO  (coreLoadExecutor-4620-thread-1) [    x:coreT5] o.a.s.c.SolrCore org.apache.solr.core.MockDirectoryFactory
   [junit4]   2> 1639682 INFO  (coreLoadExecutor-4620-thread-1) [    x:coreT5] o.a.s.c.SolrCore [[coreT5] ] Opening new SolrCore at [C:\Users\JenkinsSlave\workspace\Lucene-Solr-trunk-Windows\solr\build\solr-core\test\J1\temp\solr.core.TestCoreDiscovery_78274312F6039B99-001\tempDir-001\coreT5], dataDir=[null]
   [junit4]   2> 1639682 INFO  (coreLoadExecutor-4620-thread-1) [    x:coreT5] o.a.s.c.SolrCore JMX monitoring not detected for core: coreT5
   [junit4]   2> 1639683 INFO  (coreLoadExecutor-4620-thread-1) [    x:coreT5] o.a.s.c.CachingDirectoryFactory return new directory for C:\Users\JenkinsSlave\workspace\Lucene-Solr-trunk-Windows\solr\build\solr-core\test\J1\temp\solr.core.TestCoreDiscovery_78274312F6039B99-001\tempDir-001\coreT5\coreT5\
   [junit4]   2> 1639683 INFO  (coreLoadExecutor-4620-thread-1) [    x:coreT5] o.a.s.c.SolrCore New index directory detected: old=null new=C:\Users\JenkinsSlave\workspace\Lucene-Solr-trunk-Windows\solr\build\solr-core\test\J1\temp\solr.core.TestCoreDiscovery_78274312F6039B99-001\tempDir-001\coreT5\coreT5\index/
   [junit4]   2> 1639683 WARN  (coreLoadExecutor-4620-thread-1) [    x:coreT5] o.a.s.c.SolrCore [coreT5] Solr index directory 'C:\Users\JenkinsSlave\workspace\Lucene-Solr-trunk-Windows\solr\build\solr-core\test\J1\temp\solr.core.TestCoreDiscovery_78274312F6039B99-001\tempDir-001\coreT5\coreT5\index' doesn't exist. Creating new index...
   [junit4]   2> 1639683 INFO  (coreLoadExecutor-4620-thread-1) [    x:coreT5] o.a.s.c.CachingDirectoryFactory return new directory for C:\Users\JenkinsSlave\workspace\Lucene-Solr-trunk-Windows\solr\build\solr-core\test\J1\temp\solr.core.TestCoreDiscovery_78274312F6039B99-001\tempDir-001\coreT5\coreT5\index
   [junit4]   2> 1639683 INFO  (coreLoadExecutor-4620-thread-1) [    x:coreT5] o.a.s.u.RandomMergePolicy RandomMergePolicy wrapping class org.apache.lucene.index.TieredMergePolicy: [TieredMergePolicy: maxMergeAtOnce=4, maxMergeAtOnceExplicit=6, maxMergedSegmentMB=69.365234375, floorSegmentMB=1.33203125, forceMergeDeletesPctAllowed=21.267521259215194, segmentsPerTier=25.0, maxCFSSegmentSizeMB=8.796093022207999E12, noCFSRatio=0.0
   [junit4]   2> 1639683 INFO  (coreLoadExecutor-4620-thread-3) [    x:coreT2] o.a.s.c.SolrCore SolrDeletionPolicy.onInit: commits: num=1
   [junit4]   2> 	commit{dir=MockDirectoryWrapper(RAMDirectory@1bc4435 lockFactory=org.apache.lucene.store.SingleInstanceLockFactory@ce23da),segFN=segments_1,generation=1}
   [junit4]   2> 1639683 INFO  (coreLoadExecutor-4620-thread-3) [    x:coreT2] o.a.s.c.SolrCore newest commit generation = 1
   [junit4]   2> 1639683 INFO  (coreLoadExecutor-4620-thread-3) [    x:coreT2] o.a.s.s.SolrIndexSearcher Opening Searcher@f048f5[coreT2] main
   [junit4]   2> 1639684 INFO  (coreLoadExecutor-4620-thread-3) [    x:coreT2] o.a.s.r.ManagedResourceStorage File-based storage initialized to use dir: C:\Users\JenkinsSlave\workspace\Lucene-Solr-trunk-Windows\solr\build\solr-core\test\J1\temp\solr.core.TestCoreDiscovery_78274312F6039B99-001\tempDir-001\coreT2\conf
   [junit4]   2> 1639684 INFO  (coreLoadExecutor-4620-thread-3) [    x:coreT2] o.a.s.r.RestManager Initializing RestManager with initArgs: {storageDir=C:\Users\JenkinsSlave\workspace\Lucene-Solr-trunk-Windows\solr\build\solr-core\test\J1\temp\solr.core.TestCoreDiscovery_78274312F6039B99-001\tempDir-001\coreT2\conf}
   [junit4]   2> 1639684 INFO  (coreLoadExecutor-4620-thread-3) [    x:coreT2] o.a.s.r.ManagedResourceStorage Reading _rest_managed.json using file:dir=C:\Users\JenkinsSlave\workspace\Lucene-Solr-trunk-Windows\solr\build\solr-core\test\J1\temp\solr.core.TestCoreDiscovery_78274312F6039B99-001\tempDir-001\coreT2\conf
   [junit4]   2> 1639685 INFO  (coreLoadExecutor-4620-thread-3) [    x:coreT2] o.a.s.r.RestManager Initializing 0 registered ManagedResources
   [junit4]   2> 1639685 INFO  (coreLoadExecutor-4620-thread-3) [    x:coreT2] o.a.s.h.ReplicationHandler Commits will be reserved for  10000
   [junit4]   2> 1639685 INFO  (coreLoadExecutor-4620-thread-3) [    x:coreT2] o.a.s.c.CoreContainer Opening transient core coreT2
   [junit4]   2> 1639685 INFO  (coreLoadExecutor-4620-thread-3) [    x:coreT2] o.a.s.c.SolrCores Closing transient core [coreT1]
   [junit4]   2> 1639685 INFO  (coreLoadExecutor-4620-thread-3) [    x:coreT2] o.a.s.c.CoreContainer registering core: coreT2
   [junit4]   2> 1639685 INFO  (coreLoadExecutor-4620-thread-3) [    ] o.a.s.c.SolrResourceLoader new SolrResourceLoader for directory: 'C:\Users\JenkinsSlave\workspace\Lucene-Solr-trunk-Windows\solr\build\solr-core\test\J1\temp\solr.core.TestCoreDiscovery_78274312F6039B99-001\tempDir-001\coreT6'
   [junit4]   2> 1639685 INFO  (coreLoadExecutor-4620-thread-3) [    ] o.a.s.c.SolrResourceLoader JNDI not configured for solr (NoInitialContextEx)
   [junit4]   2> 1639685 INFO  (coreLoadExecutor-4620-thread-3) [    ] o.a.s.c.SolrResourceLoader using system property solr.solr.home: C:\Users\JenkinsSlave\workspace\Lucene-Solr-trunk-Windows\solr\build\solr-core\test\J1\temp\solr.core.TestCoreDiscovery_78274312F6039B99-001\tempDir-001
   [junit4]   2> 1639690 INFO  (coreLoadExecutor-4620-thread-3) [    ] o.a.s.c.SolrConfig current version of requestparams : -1
   [junit4]   2> 1639691 INFO  (coreLoadExecutor-4620-thread-3) [    ] o.a.s.c.SolrConfig Using Lucene MatchVersion: 6.0.0
   [junit4]   2> 1639694 INFO  (coreLoadExecutor-4620-thread-3) [    ] o.a.s.c.Config Loaded SolrConfig: solrconfig-minimal.xml
   [junit4]   2> 1639696 INFO  (coreLoadExecutor-4620-thread-3) [    ] o.a.s.s.IndexSchema [coreT6] Schema name=tiny
   [junit4]   2> 1639698 INFO  (coreLoadExecutor-4620-thread-3) [    ] o.a.s.s.IndexSchema unique key field: id
   [junit4]   2> 1639700 INFO  (coreLoadExecutor-4620-thread-3) [    ] o.a.s.c.ConfigSetProperties Did not find ConfigSet properties, assuming default properties: Can't find resource 'configsetprops.json' in classpath or 'C:\Users\JenkinsSlave\workspace\Lucene-Solr-trunk-Windows\solr\build\solr-core\test\J1\temp\solr.core.TestCoreDiscovery_78274312F6039B99-001\tempDir-001\coreT6'
   [junit4]   2> 1639700 INFO  (coreLoadExecutor-4620-thread-3) [    ] o.a.s.c.CoreContainer Creating SolrCore 'coreT6' using configuration from instancedir C:\Users\JenkinsSlave\workspace\Lucene-Solr-trunk-Windows\solr\build\solr-core\test\J1\temp\solr.core.TestCoreDiscovery_78274312F6039B99-001\tempDir-001\coreT6
   [junit4]   2> 1639700 INFO  (coreLoadExecutor-4620-thread-3) [    x:coreT6] o.a.s.c.SolrCore org.apache.solr.core.MockDirectoryFactory
   [junit4]   2> 1639700 INFO  (coreLoadExecutor-4620-thread-3) [    x:coreT6] o.a.s.c.SolrCore [[coreT6] ] Opening new SolrCore at [C:\Users\JenkinsSlave\workspace\Lucene-Solr-trunk-Windows\solr\build\solr-core\test\J1\temp\solr.core.TestCoreDiscovery_78274312F6039B99-001\tempDir-001\coreT6], dataDir=[null]
   [junit4]   2> 1639700 INFO  (coreLoadExecutor-4620-thread-3) [    x:coreT6] o.a.s.c.SolrCore JMX monitoring not detected for core: coreT6
   [junit4]   2> 1639700 INFO  (coreLoadExecutor-4620-thread-3) [    x:coreT6] o.a.s.c.CachingDirectoryFactory return new directory for C:\Users\JenkinsSlave\workspace\Lucene-Solr-trunk-Windows\solr\build\solr-core\test\J1\temp\solr.core.TestCoreDiscovery_78274312F6039B99-001\tempDir-001\coreT6\coreT6\
   [junit4]   2> 1639700 INFO  (coreLoadExecutor-4620-thread-3) [    x:coreT6] o.a.s.c.SolrCore New index directory detected: old=null new=C:\Users\JenkinsSlave\workspace\Lucene-Solr-trunk-Windows\solr\build\solr-core\test\J1\temp\solr.core.TestCoreDiscovery_78274312F6039B99-001\tempDir-001\coreT6\coreT6\index/
   [junit4]   2> 1639700 WARN  (coreLoadExecutor-4620-thread-3) [    x:coreT6] o.a.s.c.SolrCore [coreT6] Solr index directory 'C:\Users\JenkinsSlave\workspace\Lucene-Solr-trunk-Windows\solr\build\solr-core\test\J1\temp\solr.core.TestCoreDiscovery_78274312F6039B99-001\tempDir-001\coreT6\coreT6\index' doesn't exist. Creating new index...
   [junit4]   2> 1639701 INFO  (coreLoadExecutor-4620-thread-3) [    x:coreT6] o.a.s.c.CachingDirectoryFactory return new directory for C:\Users\JenkinsSlave\workspace\Lucene-Solr-trunk-Windows\solr\build\solr-core\test\J1\temp\solr.core.TestCoreDiscovery_78274312F6039B99-001\tempDir-001\coreT6\coreT6\index
   [junit4]   2> 1639701 INFO  (coreLoadExecutor-4620-thread-3) [    x:coreT6] o.a.s.u.RandomMergePolicy RandomMergePolicy wrapping class org.apache.lucene.index.TieredMergePolicy: [TieredMergePolicy: maxMergeAtOnce=32, maxMergeAtOnceExplicit=13, maxMergedSegmentMB=62.9912109375, floorSegmentMB=0.9853515625, forceMergeDeletesPctAllowed=29.36240756005536, segmentsPerTier=46.0, maxCFSSegmentSizeMB=8.796093022207999E12, noCFSRatio=1.0
   [junit4]   2> 1639701 INFO  (coreLoadExecutor-4620-thread-1) [    x:coreT5] o.a.s.c.SolrCore SolrDeletionPolicy.onCommit: commits: num=1
   [junit4]   2> 	commit{dir=MockDirectoryWrapper(RAMDirectory@1cb35b6 lockFactory=org.apache.lucene.store.SingleInstanceLockFactory@641bb1),segFN=segments_1,generation=1}
   [junit4]   2> 1639701 INFO  (coreLoadExecutor-4620-thread-1) [    x:coreT5] o.a.s.c.SolrCore newest commit generation = 1
   [junit4]   2> 1639701 INFO  (coreLoadExecutor-4620-thread-3) [    x:coreT6] o.a.s.c.SolrCore SolrDeletionPolicy.onCommit: commits: num=1
   [junit4]   2> 	commit{dir=MockDirectoryWrapper(RAMDirectory@6e6c0a lockFactory=org.apache.lucene.store.SingleInstanceLockFactory@1f7777),segFN=segments_1,generation=1}
   [junit4]   2> 1639701 INFO  (coreLoadExecutor-4620-thread-3) [    x:coreT6] o.a.s.c.SolrCore newest commit generation = 1
   [junit4]   2> 1639701 INFO  (Thread-3682) [    ] o.a.s.c.SolrCore [coreT1]  CLOSING SolrCore org.apache.solr.core.SolrCore@10a290
   [junit4]   2> 1639702 INFO  (Thread-3682) [    ] o.a.s.u.UpdateHandler closing DirectUpdateHandler2{commits=0,autocommits=0,soft autocommits=0,optimizes=0,rollbacks=0,expungeDeletes=0,docsPending=0,adds=0,deletesById=0,deletesByQuery=0,errors=0,cumulative_adds=0,cumulative_deletesById=0,cumulative_deletesByQuery=0,cumulative_errors=0}
   [junit4]   2> 1639702 INFO  (Thread-3682) [    ] o.a.s.u.SolrCoreState Closing SolrCoreState
   [junit4]   2> 1639702 INFO  (Thread-3682) [    ] o.a.s.u.DefaultSolrCoreState SolrCoreState ref count has reached 0 - closing IndexWriter
   [junit4]   2> 1639702 INFO  (Thread-3682) [    ] o.a.s.u.DefaultSolrCoreState closing IndexWriter with IndexWriterCloser
   [junit4]   2> 1639716 INFO  (searcherExecutor-4622-thread-1-processing-x:coreT2) [    x:coreT2] o.a.s.c.SolrCore [coreT2] Registered new searcher Searcher@f048f5[coreT2] main{ExitableDirectoryReader(UninvertingDirectoryReader())}
   [junit4]   2> 1639717 INFO  (coreLoadExecutor-4620-thread-1) [    x:coreT5] o.a.s.c.SolrCore no updateRequestProcessorChain defined as default, creating implicit default
   [junit4]   2> 1639718 INFO  (coreLoadExecutor-4620-thread-1) [    x:coreT5] o.a.s.h.l.XMLLoader xsltCacheLifetimeSeconds=60
   [junit4]   2> 1639718 INFO  (coreLoadExecutor-4620-thread-1) [    x:coreT5] o.a.s.h.l.XMLLoader xsltCacheLifetimeSeconds=60
   [junit4]   2> 1639719 INFO  (coreLoadExecutor-4620-thread-1) [    x:coreT5] o.a.s.h.l.XMLLoader xsltCacheLifetimeSeconds=60
   [junit4]   2> 1639720 INFO  (coreLoadExecutor-4620-thread-1) [    x:coreT5] o.a.s.h.l.XMLLoader xsltCacheLifetimeSeconds=60
   [junit4]   2> 1639745 INFO  (coreLoadExecutor-4620-thread-3) [    x:coreT6] o.a.s.c.SolrCore no updateRequestProcessorChain defined as default, creating implicit default
   [junit4]   2> 1639746 INFO  (coreLoadExecutor-4620-thread-3) [    x:coreT6] o.a.s.h.l.XMLLoader xsltCacheLifetimeSeconds=60
   [junit4]   2> 1639747 INFO  (coreLoadExecutor-4620-thread-3) [    x:coreT6] o.a.s.h.l.XMLLoader xsltCacheLifetimeSeconds=60
   [junit4]   2> 1639748 INFO  (coreLoadExecutor-4620-thread-3) [    x:coreT6] o.a.s.h.l.XMLLoader xsltCacheLifetimeSeconds=60
   [junit4]   2> 1639749 INFO  (coreLoadExecutor-4620-thread-3) [    x:coreT6] o.a.s.h.l.XMLLoader xsltCacheLifetimeSeconds=60
   [junit4]   2> 1639749 INFO  (OldIndexDirectoryCleanupThreadForCore-coreT6) [    x:coreT6] o.a.s.c.SolrCore Looking for old index directories to cleanup for core coreT6 in C:\Users\JenkinsSlave\workspace\Lucene-Solr-trunk-Windows\solr\build\solr-core\test\J1\temp\solr.core.TestCoreDiscovery_78274312F6039B99-001\tempDir-001\coreT6\coreT6\
   [junit4]   2> 1639751 INFO  (coreLoadExecutor-4620-thread-2) [    x:coreT4] o.a.s.c.SolrCore no updateRequestProcessorChain defined as default, creating implicit default
   [junit4]   2> 1639752 INFO  (coreLoadExecutor-4620-thread-2) [    x:coreT4] o.a.s.h.l.XMLLoader xsltCacheLifetimeSeconds=60
   [junit4]   2> 1639753 INFO  (coreLoadExecutor-4620-thread-2) [    x:coreT4] o.a.s.h.l.XMLLoader xsltCacheLifetimeSeconds=60
   [junit4]   2> 1639753 INFO  (coreLoadExecutor-4620-thread-2) [    x:coreT4] o.a.s.h.l.XMLLoader xsltCacheLifetimeSeconds=60
   [junit4]   2> 1639754 INFO  (coreLoadExecutor-4620-thread-2) [    x:coreT4] o.a.s.h.l.XMLLoader xsltCacheLifetimeSeconds=60
   [junit4]   2> 1639755 INFO  (coreLoadExecutor-4620-thread-1) [    x:coreT5] o.a.s.c.RequestHandlers Registered paths: /admin/mbeans,/update/csv,/update/json/docs,/admin/luke,/select,/admin/segments,/get,/admin/system,/replication,/admin/properties,/config,/schema,/admin/plugins,/admin/logging,/update/json,/admin/threads,/admin/ping,/update,/admin/file
   [junit4]   2> 1639755 INFO  (coreLoadExecutor-4620-thread-1) [    x:coreT5] o.a.s.c.SolrCore Using default statsCache cache: org.apache.solr.search.stats.LocalStatsCache
   [junit4]   2> 1639755 INFO  (coreLoadExecutor-4620-thread-1) [    x:coreT5] o.a.s.c.SolrCore Hard AutoCommit: disabled
   [junit4]   2> 1639755 INFO  (coreLoadExecutor-4620-thread-1) [    x:coreT5] o.a.s.c.SolrCore Soft AutoCommit: disabled
   [junit4]   2> 1639755 INFO  (coreLoadExecutor-4620-thread-1) [    x:coreT5] o.a.s.u.RandomMergePolicy RandomMergePolicy wrapping class org.apache.lucene.index.TieredMergePolicy: [TieredMergePolicy: maxMergeAtOnce=47, maxMergeAtOnceExplicit=33, maxMergedSegmentMB=33.4990234375, floorSegmentMB=1.7333984375, forceMergeDeletesPctAllowed=9.064609185614211, segmentsPerTier=44.0, maxCFSSegmentSizeMB=8.796093022207999E12, noCFSRatio=0.40962906904651
   [junit4]   2> 1639755 INFO  (searcherExecutor-4631-thread-1-processing-x:coreT3) [    x:coreT3] o.a.s.c.SolrCore [coreT3] Registered new searcher Searcher@4b7667[coreT3] main{ExitableDirectoryReader(UninvertingDirectoryReader())}
   [junit4]   2> 1639756 INFO  (coreLoadExecutor-4620-thread-1) [    x:coreT5] o.a.s.c.SolrCore SolrDeletionPolicy.onInit: commits: num=1
   [junit4]   2> 	commit{dir=MockDirectoryWrapper(RAMDirectory@1cb35b6 lockFactory=org.apache.lucene.store.SingleInstanceLockFactory@641bb1),segFN=segments_1,generation=1}
   [junit4]   2> 1639756 INFO  (coreLoadExecutor-4620-thread-1) [    x:coreT5] o.a.s.c.SolrCore newest commit generation = 1
   [junit4]   2> 1639756 INFO  (coreLoadExecutor-4620-thread-1) [    x:coreT5] o.a.s.s.SolrIndexSearcher Opening Searcher@727371[coreT5] main
   [junit4]   2> 1639756 INFO  (OldIndexDirectoryCleanupThreadForCore-coreT5) [    x:coreT5] o.a.s.c.SolrCore Looking for old index directories to cleanup for core coreT5 in C:\Users\JenkinsSlave\workspace\Lucene-Solr-trunk-Windows\solr\build\solr-core\test\J1\temp\solr.core.TestCoreDiscovery_78274312F6039B99-001\tempDir-001\coreT5\coreT5\
   [junit4]   2> 1639757 INFO  (OldIndexDirectoryCleanupThreadForCore-coreT4) [    x:coreT4] o.a.s.c.SolrCore Looking for old index directories to cleanup for core coreT4 in C:\Users\JenkinsSlave\workspace\Lucene-Solr-trunk-Windows\solr\build\solr-core\test\J1\temp\solr.core.TestCoreDiscovery_78274312F6039B99-001\tempDir-001\coreT4\coreT4\
   [junit4]   2> 1639758 INFO  (coreLoadExecutor-4620-thread-2) [    x:coreT4] o.a.s.c.RequestHandlers Registered paths: /admin/mbeans,/update/csv,/update/json/docs,/admin/luke,/select,/admin/segments,/get,/admin/system,/replication,/admin/properties,/config,/schema,/admin/plugins,/admin/logging,/update/json,/admin/threads,/admin/ping,/update,/admin/file
   [junit4]   2> 1639758 INFO  (coreLoadExecutor-4620-thread-2) [    x:coreT4] o.a.s.c.SolrCore Using default statsCache cache: org.apache.solr.search.stats.LocalStatsCache
   [junit4]   2> 1639758 WARN  (OldIndexDirectoryCleanupThreadForCore-coreT6) [    x:coreT6] o.a.s.c.DirectoryFactory C:\Users\JenkinsSlave\workspace\Lucene-Solr-trunk-Windows\solr\build\solr-core\test\J1\temp\solr.core.TestCoreDiscovery_78274312F6039B99-001\tempDir-001\coreT6\coreT6\ does not point to a valid data directory; skipping clean-up of old index directories.
   [junit4]   2> 1639758 INFO  (coreLoadExecutor-4620-thread-3) [    x:coreT6] o.a.s.c.RequestHandlers Registered paths: /admin/mbeans,/update/csv,/update/json/docs,/admin/luke,/select,/admin/segments,/get,/admin/system,/replication,/admin/properties,/config,/schema,/admin/plugins,/admin/logging,/update/json,/admin/threads,/admin/ping,/update,/admin/file
   [junit4]   2> 1639759 INFO  (coreLoadExecutor-4620-thread-3) [    x:coreT6] o.a.s.c.SolrCore Using default statsCache cache: org.apache.solr.search.stats.LocalStatsCache
   [junit4]   2> 1639759 INFO  (coreLoadExecutor-4620-thread-2) [    x:coreT4] o.a.s.c.SolrCore Hard AutoCommit: disabled
   [junit4]   2> 1639759 INFO  (coreLoadExecutor-4620-thread-2) [    x:coreT4] o.a.s.c.SolrCore Soft AutoCommit: disabled
   [junit4]   2> 1639759 INFO  (coreLoadExecutor-4620-thread-2) [    x:coreT4] o.a.s.u.RandomMergePolicy RandomMergePolicy wrapping class org.apache.lucene.index.TieredMergePolicy: [TieredMergePolicy: maxMergeAtOnce=46, maxMergeAtOnceExplicit=10, maxMergedSegmentMB=73.9091796875, floorSegmentMB=2.1494140625, forceMergeDeletesPctAllowed=16.32818241110269, segmentsPerTier=20.0, maxCFSSegmentSizeMB=8.796093022207999E12, noCFSRatio=1.0
   [junit4]   2> 1639759 INFO  (coreLoadExecutor-4620-thread-2) [    x:coreT4] o.a.s.c.SolrCore SolrDeletionPolicy.onInit: commits: num=1
   [junit4]   2> 	commit{dir=MockDirectoryWrapper(RAMDirectory@1b1c19c lockFactory=org.apache.lucene.store.SingleInstanceLockFactory@11b9d2a),segFN=segments_1,generation=1}
   [junit4]   2> 1639759 INFO  (coreLoadExecutor-4620-thread-2) [    x:coreT4] o.a.s.c.SolrCore newest commit generation = 1
   [junit4]   2> 1639759 INFO  (coreLoadExecutor-4620-thread-2) [    x:coreT4] o.a.s.s.SolrIndexSearcher Opening Searcher@1bbe3e9[coreT4] main
   [junit4]   2> 1639759 INFO  (coreLoadExecutor-4620-thread-2) [    x:coreT4] o.a.s.r.ManagedResourceStorage File-based storage initialized to use dir: C:\Users\JenkinsSlave\workspace\Lucene-Solr-trunk-Windows\solr\build\solr-core\test\J1\temp\solr.core.TestCoreDiscovery_78274312F6039B99-001\tempDir-001\coreT4\conf
   [junit4]   2> 1639759 INFO  (coreLoadExecutor-4620-thread-2) [    x:coreT4] o.a.s.r.RestManager Initializing RestManager with initArgs: {storageDir=C:\Users\JenkinsSlave\workspace\Lucene-Solr-trunk-Windows\solr\build\solr-core\test\J1\temp\solr.core.TestCoreDiscovery_78274312F6039B99-001\tempDir-001\coreT4\conf}
   [junit4]   2> 1639759 INFO  (coreLoadExecutor-4620-thread-2) [    x:coreT4] o.a.s.r.ManagedResourceStorage Reading _rest_managed.json using file:dir=C:\Users\JenkinsSlave\workspace\Lucene-Solr-trunk-Windows\solr\build\solr-core\test\J1\temp\solr.core.TestCoreDiscovery_78274312F6039B99-001\tempDir-001\coreT4\conf
   [junit4]   2> 1639759 INFO  (coreLoadExecutor-4620-thread-2) [    x:coreT4] o.a.s.r.RestManager Initializing 0 registered ManagedResources
   [junit4]   2> 1639759 INFO  (coreLoadExecutor-4620-thread-2) [    x:coreT4] o.a.s.h.ReplicationHandler Commits will be reserved for  10000
   [junit4]   2> 1639759 INFO  (searcherExecutor-4632-thread-1-processing-x:coreT4) [    x:coreT4] o.a.s.c.SolrCore [coreT4] Registered new searcher Searcher@1bbe3e9[coreT4] main{ExitableDirectoryReader(UninvertingDirectoryReader())}
   [junit4]   2> 1639759 INFO  (coreLoadExecutor-4620-thread-2) [    x:coreT4] o.a.s.c.CoreContainer Opening transient core coreT4
   [junit4]   2> 1639759 INFO  (coreLoadExecutor-4620-thread-2) [    x:coreT4] o.a.s.c.SolrCores Closing transient core [coreT3]
   [junit4]   2> 1639759 INFO  (coreLoadExecutor-4620-thread-2) [    x:coreT4] o.a.s.c.CoreContainer registering core: coreT4
   [junit4]   2> 1639760 WARN  (OldIndexDirectoryCleanupThreadForCore-coreT4) [    x:coreT4] o.a.s.c.DirectoryFactory C:\Users\JenkinsSlave\workspace\Lucene-Solr-trunk-Windows\solr\build\solr-core\test\J1\temp\solr.core.TestCoreDiscovery_78274312F6039B99-001\tempDir-001\coreT4\coreT4\ does not point to a valid data directory; skipping clean-up of old index directories.
   [junit4]   2> 1639760 WARN  (OldIndexDirectoryCleanupThreadForCore-coreT5) [    x:coreT5] o.a.s.c.DirectoryFactory C:\Users\JenkinsSlave\workspace\Lucene-Solr-trunk-Windows\solr\build\solr-core\test\J1\temp\solr.core.TestCoreDiscovery_78274312F6039B99-001\tempDir-001\coreT5\coreT5\ does not point to a valid data directory; skipping clean-up of old index directories.
   [junit4]   2> 1639760 INFO  (coreLoadExecutor-4620-thread-1) [    x:coreT5] o.a.s.r.ManagedResourceStorage File-based storage initialized to use dir: C:\Users\JenkinsSlave\workspace\Lucene-Solr-trunk-Windows\solr\build\solr-core\test\J1\temp\solr.core.TestCoreDiscovery_78274312F6039B99-001\tempDir-001\coreT5\conf
   [junit4]   2> 1639760 INFO  (coreLoadExecutor-4620-thread-1) [    x:coreT5] o.a.s.r.RestManager Initializing RestManager with initArgs: {storageDir=C:\Users\JenkinsSlave\workspace\Lucene-Solr-trunk-Windows\solr\build\solr-core\test\J1\temp\solr.core.TestCoreDiscovery_78274312F6039B99-001\tempDir-001\coreT5\conf}
   [junit4]   2> 1639760 INFO  (coreLoadExecutor-4620-thread-1) [    x:coreT5] o.a.s.r.ManagedResourceStorage Reading _rest_managed.json using file:dir=C:\Users\JenkinsSlave\workspace\Lucene-Solr-trunk-Windows\solr\build\solr-core\test\J1\temp\solr.core.TestCoreDiscovery_78274312F6039B99-001\tempDir-001\coreT5\conf
   [junit4]   2> 1639761 INFO  (coreLoadExecutor-4620-thread-1) [    x:coreT5] o.a.s.r.RestManager Initializing 0 registered ManagedResources
   [junit4]   2> 1639761 INFO  (coreLoadExecutor-4620-thread-1) [    x:coreT5] o.a.s.h.ReplicationHandler Commits will be reserved for  10000
   [junit4]   2> 1639761 INFO  (coreLoadExecutor-4620-thread-3) [    x:coreT6] o.a.s.c.SolrCore Hard AutoCommit: disabled
   [junit4]   2> 1639761 INFO  (coreLoadExecutor-4620-thread-3) [    x:coreT6] o.a.s.c.SolrCore Soft AutoCommit: disabled
   [junit4]   2> 1639761 INFO  (coreLoadExecutor-4620-thread-3) [    x:coreT6] o.a.s.u.RandomMergePolicy RandomMergePolicy wrapping class org.apache.lucene.index.TieredMergePolicy: [TieredMergePolicy: maxMergeAtOnce=46, maxMergeAtOnceExplicit=10, maxMergedSegmentMB=73.9091796875, floorSegmentMB=2.1494140625, forceMergeDeletesPctAllowed=16.32818241110269, segmentsPerTier=20.0, maxCFSSegmentSizeMB=8.796093022207999E12, noCFSRatio=1.0
   [junit4]   2> 1639763 INFO  (coreLoadExecutor-4620-thread-3) [    x:coreT6] o.a.s.c.SolrCore SolrDeletionPolicy.onInit: commits: num=1
   [junit4]   2> 	commit{dir=MockDirectoryWrapper(RAMDirectory@6e6c0a lockFactory=org.apache.lucene.store.SingleInstanceLockFactory@1f7777),segFN=segments_1,generation=1}
   [junit4]   2> 1639763 INFO  (coreLoadExecutor-4620-thread-3) [    x:coreT6] o.a.s.c.SolrCore newest commit generation = 1
   [junit4]   2> 1639763 INFO  (coreLoadExecutor-4620-thread-3) [    x:coreT6] o.a.s.s.SolrIndexSearcher Opening Searcher@148533c[coreT6] main
   [junit4]   2> 1639763 INFO  (coreLoadExecutor-4620-thread-3) [    x:coreT6] o.a.s.r.ManagedResourceStorage File-based storage initialized to use dir: C:\Users\JenkinsSlave\workspace\Lucene-Solr-trunk-Windows\solr\build\solr-core\test\J1\temp\solr.core.TestCoreDiscovery_78274312F6039B99-001\tempDir-001\coreT6\conf
   [junit4]   2> 1639763 INFO  (coreLoadExecutor-4620-thread-3) [    x:coreT6] o.a.s.r.RestManager Initializing RestManager with initArgs: {storageDir=C:\Users\JenkinsSlave\workspace\Lucene-Solr-trunk-Windows\solr\build\solr-core\test\J1\temp\solr.core.TestCoreDiscovery_78274312F6039B99-001\tempDir-001\coreT6\conf}
   [junit4]   2> 1639763 INFO  (coreLoadExecutor-4620-thread-3) [    x:coreT6] o.a.s.r.ManagedResourceStorage Reading _rest_managed.json using file:dir=C:\Users\JenkinsSlave\workspace\Lucene-Solr-trunk-Windows\solr\build\solr-core\test\J1\temp\solr.core.TestCoreDiscovery_78274312F6039B99-001\tempDir-001\coreT6\conf
   [junit4]   2> 1639764 INFO  (coreLoadExecutor-4620-thread-3) [    x:coreT6] o.a.s.r.RestManager Initializing 0 registered ManagedResources
   [junit4]   2> 1639764 INFO  (coreLoadExecutor-4620-thread-3) [    x:coreT6] o.a.s.h.ReplicationHandler Commits will be reserved for  10000
   [junit4]   2> 1639764 INFO  (coreLoadExecutor-4620-thread-3) [    x:coreT6] o.a.s.c.CoreContainer Opening transient core coreT6
   [junit4]   2> 1639764 INFO  (coreLoadExecutor-4620-thread-3) [    x:coreT6] o.a.s.c.SolrCores Closing transient core [coreT2]
   [junit4]   2> 1639764 INFO  (coreLoadExecutor-4620-thread-3) [    x:coreT6] o.a.s.c.CoreContainer registering core: coreT6
   [junit4]   2> 1639766 INFO  (coreLoadExecutor-4620-thread-1) [    x:coreT5] o.a.s.c.CoreContainer Opening transient core coreT5
   [junit4]   2> 1639766 INFO  (coreLoadExecutor-4620-thread-1) [    x:coreT5] o.a.s.c.SolrCores Closing transient core [coreT4]
   [junit4]   2> 1639766 INFO  (coreLoadExecutor-4620-thread-1) [    x:coreT5] o.a.s.c.CoreContainer registering core: coreT5
   [junit4]   2> 1639767 INFO  (Thread-3682) [    ] o.a.s.c.SolrCore [coreT1] Closing main searcher on request.
   [junit4]   2> 1639767 INFO  (Thread-3682) [    ] o.a.s.c.CachingDirectoryFactory Closing MockDirectoryFactory - 2 directories currently being tracked
   [junit4]   2> 1639767 INFO  (Thread-3682) [    ] o.a.s.c.CachingDirectoryFactory looking to close C:\Users\JenkinsSlave\workspace\Lucene-Solr-trunk-Windows\solr\build\solr-core\test\J1\temp\solr.core.TestCoreDiscovery_78274312F6039B99-001\tempDir-001\coreT1\coreT1\ [CachedDir<<refCount=0;path=C:\Users\JenkinsSlave\workspace\Lucene-Solr-trunk-Windows\solr\build\solr-core\test\J1\temp\solr.core.TestCoreDiscovery_78274312F6039B99-001\tempDir-001\coreT1\coreT1\;done=false>>]
   [junit4]   2> 1639767 INFO  (Thread-3682) [    ] o.a.s.c.CachingDirectoryFactory Closing directory: C:\Users\JenkinsSlave\workspace\Lucene-Solr-trunk-Windows\solr\build\solr-core\test\J1\temp\solr.core.TestCoreDiscovery_78274312F6039B99-001\tempDir-001\coreT1\coreT1\
   [junit4]   2> 1639767 INFO  (Thread-3682) [    ] o.a.s.c.CachingDirectoryFactory looking to close C:\Users\JenkinsSlave\workspace\Lucene-Solr-trunk-Windows\solr\build\solr-core\test\J1\temp\solr.core.TestCoreDiscovery_78274312F6039B99-001\tempDir-001\coreT1\coreT1\index [CachedDir<<refCount=0;path=C:\Users\JenkinsSlave\workspace\Lucene-Solr-trunk-Windows\solr\build\solr-core\test\J1\temp\solr.core.TestCoreDiscovery_78274312F6039B99-001\tempDir-001\coreT1\coreT1\index;done=false>>]
   [junit4]   2> 1639767 INFO  (Thread-3682) [    ] o.a.s.c.CachingDirectoryFactory Closing directory: C:\Users\JenkinsSlave\workspace\Lucene-Solr-trunk-Windows\solr\build\solr-core\test\J1\temp\solr.core.TestCoreDiscovery_78274312F6039B99-001\tempDir-001\coreT1\coreT1\index
   [junit4]   2> 1639767 INFO  (Thread-3682) [    ] o.a.s.c.SolrCore [coreT3]  CLOSING SolrCore org.apache.solr.core.SolrCore@d744e2
   [junit4]   2> 1639767 INFO  (Thread-3682) [    ] o.a.s.u.UpdateHandler closing DirectUpdateHandler2{commits=0,autocommits=0,soft autocommits=0,optimizes=0,rollbacks=0,expungeDeletes=0,docsPending=0,adds=0,deletesById=0,deletesByQuery=0,errors=0,cumulative_adds=0,cumulative_deletesById=0,cumulative_deletesByQuery=0,cumulative_er

[...truncated too long message...]

7)
   [junit4]   2>         at java.lang.Thread.run(Thread.java:745)
   [junit4]   2> Nov 23, 2015 12:30:54 AM com.carrotsearch.randomizedtesting.ThreadLeakControl tryToInterruptAll
   [junit4]   2> INFO: Starting to interrupt leaked threads:
   [junit4]   2>    1) Thread[id=10024, name=searcherExecutor-4657-thread-1, state=WAITING, group=TGRP-TestCoreDiscovery]
   [junit4]   2> Nov 23, 2015 12:30:57 AM com.carrotsearch.randomizedtesting.ThreadLeakControl tryToInterruptAll
   [junit4]   2> SEVERE: There are still zombie threads that couldn't be terminated:
   [junit4]   2>    1) Thread[id=10024, name=searcherExecutor-4657-thread-1, state=WAITING, group=TGRP-TestCoreDiscovery]
   [junit4]   2>         at sun.misc.Unsafe.park(Native Method)
   [junit4]   2>         at java.util.concurrent.locks.LockSupport.park(LockSupport.java:175)
   [junit4]   2>         at java.util.concurrent.locks.AbstractQueuedSynchronizer$ConditionObject.await(AbstractQueuedSynchronizer.java:2039)
   [junit4]   2>         at java.util.concurrent.LinkedBlockingQueue.take(LinkedBlockingQueue.java:442)
   [junit4]   2>         at java.util.concurrent.ThreadPoolExecutor.getTask(ThreadPoolExecutor.java:1067)
   [junit4]   2>         at java.util.concurrent.ThreadPoolExecutor.runWorker(ThreadPoolExecutor.java:1127)
   [junit4]   2>         at java.util.concurrent.ThreadPoolExecutor$Worker.run(ThreadPoolExecutor.java:617)
   [junit4]   2>         at java.lang.Thread.run(Thread.java:745)
   [junit4]   2> NOTE: test params are: codec=Asserting(Lucene60): {}, docValues:{}, sim=ClassicSimilarity, locale=es_NI, timezone=US/Aleutian
   [junit4]   2> NOTE: Windows 7 6.1 x86/Oracle Corporation 1.8.0_66 (32-bit)/cpus=3,threads=2,free=153227040,total=427294720
   [junit4]   2> NOTE: All tests run in this JVM: [TestManagedResourceStorage, UpdateRequestProcessorFactoryTest, PreAnalyzedUpdateProcessorTest, BaseCdcrDistributedZkTest, TestClassNameShortening, HdfsBasicDistributedZk2Test, SpellCheckCollatorTest, SolrTestCaseJ4Test, TestTrackingShardHandlerFactory, TestPHPSerializedResponseWriter, MultiTermTest, TestCursorMarkWithoutUniqueKey, TestNRTOpen, TestDefaultSearchFieldResource, OverseerTaskQueueTest, BasicZkTest, TestDownShardTolerantSearch, TestCollationField, RemoteQueryErrorTest, TestFastOutputStream, TestFuzzyAnalyzedSuggestions, DistributedFacetPivotLongTailTest, TestRTimerTree, RAMDirectoryFactoryTest, AutoCommitTest, TestTrie, TestCharFilters, TestConfigSetsAPIZkFailure, OverseerCollectionConfigSetProcessorTest, TestBlobHandler, OpenExchangeRatesOrgProviderTest, TestBM25SimilarityFactory, FieldAnalysisRequestHandlerTest, DistributedTermsComponentTest, TestJettySolrRunner, DistribJoinFromCollectionTest, HdfsBasicDistributedZkTest, SortByFunctionTest, HdfsDirectoryFactoryTest, CSVRequestHandlerTest, TestFiltering, TestRequestForwarding, TestBulkSchemaConcurrent, CollectionsAPIDistributedZkTest, TestReqParamsAPI, OverseerRolesTest, TestSolrCLIRunExample, SolrXmlInZkTest, TestDynamicFieldResource, OutputWriterTest, TermVectorComponentDistributedTest, SynonymTokenizerTest, TestExceedMaxTermLength, TestClassicSimilarityFactory, PluginInfoTest, TestSchemaSimilarityResource, DistanceFunctionTest, TestSolrJ, SignatureUpdateProcessorFactoryTest, CloudExitableDirectoryReaderTest, TestReplicaProperties, CursorPagingTest, DistributedExpandComponentTest, FieldMutatingUpdateProcessorTest, LeaderElectionIntegrationTest, HdfsRecoveryZkTest, FullSolrCloudDistribCmdsTest, TestChildDocTransformer, CoreAdminHandlerTest, TestSolrIndexConfig, TestSolrQueryParser, DebugComponentTest, TestRTGBase, TestValueSourceCache, CopyFieldTest, UUIDUpdateProcessorFallbackTest, HttpPartitionTest, TestRecovery, DirectUpdateHandlerOptimizeTest, TestDynamicFieldCollectionResource, BinaryUpdateRequestHandlerTest, FileUtilsTest, TestJoin, TestConfigSetsAPIExclusivity, TestTrieFacet, TestCloudSchemaless, RequestHandlersTest, TestReversedWildcardFilterFactory, RequestLoggingTest, DistributedQueueTest, TestCollapseQParserPlugin, TestFieldTypeResource, CachingDirectoryFactoryTest, TestManagedSchema, ParsingFieldUpdateProcessorsTest, SuggesterWFSTTest, SolrCmdDistributorTest, TestSearcherReuse, SpellingQueryConverterTest, TestSQLHandler, TestBlendedInfixSuggestions, TestSolrQueryParserResource, TestReRankQParserPlugin, ChaosMonkeySafeLeaderTest, DeleteReplicaTest, SecurityConfHandlerTest, ResponseLogComponentTest, TestPerFieldSimilarityClassic, OverriddenZkACLAndCredentialsProvidersTest, TestSolrCloudWithKerberosAlt, SuggestComponentContextFilterQueryTest, DataDrivenBlockJoinTest, TestOmitPositions, HdfsDirectoryTest, TestDistributedGrouping, SharedFSAutoReplicaFailoverTest, TestAtomicUpdateErrorCases, ExitableDirectoryReaderTest, TestFieldCollectionResource, HLLSerializationTest, TestBinaryResponseWriter, TestIndexSearcher, TestFoldingMultitermQuery, DefaultValueUpdateProcessorTest, RecoveryAfterSoftCommitTest, LeaderInitiatedRecoveryOnShardRestartTest, TestFileDictionaryLookup, BasicDistributedZk2Test, CloneFieldUpdateProcessorFactoryTest, CleanupOldIndexTest, HdfsChaosMonkeyNothingIsSafeTest, AsyncCallRequestStatusResponseTest, TestConfigSetImmutable, TestManagedSchemaFieldTypeResource, CacheHeaderTest, TestFieldTypeCollectionResource, TestRandomMergePolicy, MinimalSchemaTest, UnloadDistributedZkTest, TestRandomFaceting, LeaderElectionTest, TestZkChroot, ZkCLITest, TestSolr4Spatial, StatsComponentTest, TestGroupingSearch, TestFunctionQuery, DirectUpdateHandlerTest, ShowFileRequestHandlerTest, TestCoreDiscovery]
   [junit4]   2> NOTE: reproduce with: ant test  -Dtestcase=TestCoreDiscovery -Dtests.seed=78274312F6039B99 -Dtests.slow=true -Dtests.locale=es_NI -Dtests.timezone=US/Aleutian -Dtests.asserts=true -Dtests.file.encoding=US-ASCII
   [junit4] ERROR   0.00s J1 | TestCoreDiscovery (suite) <<<
   [junit4]    > Throwable #1: java.lang.AssertionError: ERROR: SolrIndexSearcher opens=23 closes=22
   [junit4]    > 	at __randomizedtesting.SeedInfo.seed([78274312F6039B99]:0)
   [junit4]    > 	at org.apache.solr.SolrTestCaseJ4.endTrackingSearchers(SolrTestCaseJ4.java:452)
   [junit4]    > 	at org.apache.solr.SolrTestCaseJ4.afterClass(SolrTestCaseJ4.java:222)
   [junit4]    > 	at java.lang.Thread.run(Thread.java:745)Throwable #2: com.carrotsearch.randomizedtesting.ThreadLeakError: 1 thread leaked from SUITE scope at org.apache.solr.core.TestCoreDiscovery: 
   [junit4]    >    1) Thread[id=10024, name=searcherExecutor-4657-thread-1, state=WAITING, group=TGRP-TestCoreDiscovery]
   [junit4]    >         at sun.misc.Unsafe.park(Native Method)
   [junit4]    >         at java.util.concurrent.locks.LockSupport.park(LockSupport.java:175)
   [junit4]    >         at java.util.concurrent.locks.AbstractQueuedSynchronizer$ConditionObject.await(AbstractQueuedSynchronizer.java:2039)
   [junit4]    >         at java.util.concurrent.LinkedBlockingQueue.take(LinkedBlockingQueue.java:442)
   [junit4]    >         at java.util.concurrent.ThreadPoolExecutor.getTask(ThreadPoolExecutor.java:1067)
   [junit4]    >         at java.util.concurrent.ThreadPoolExecutor.runWorker(ThreadPoolExecutor.java:1127)
   [junit4]    >         at java.util.concurrent.ThreadPoolExecutor$Worker.run(ThreadPoolExecutor.java:617)
   [junit4]    >         at java.lang.Thread.run(Thread.java:745)
   [junit4]    > 	at __randomizedtesting.SeedInfo.seed([78274312F6039B99]:0)Throwable #3: com.carrotsearch.randomizedtesting.ThreadLeakError: There are still zombie threads that couldn't be terminated:
   [junit4]    >    1) Thread[id=10024, name=searcherExecutor-4657-thread-1, state=WAITING, group=TGRP-TestCoreDiscovery]
   [junit4]    >         at sun.misc.Unsafe.park(Native Method)
   [junit4]    >         at java.util.concurrent.locks.LockSupport.park(LockSupport.java:175)
   [junit4]    >         at java.util.concurrent.locks.AbstractQueuedSynchronizer$ConditionObject.await(AbstractQueuedSynchronizer.java:2039)
   [junit4]    >         at java.util.concurrent.LinkedBlockingQueue.take(LinkedBlockingQueue.java:442)
   [junit4]    >         at java.util.concurrent.ThreadPoolExecutor.getTask(ThreadPoolExecutor.java:1067)
   [junit4]    >         at java.util.concurrent.ThreadPoolExecutor.runWorker(ThreadPoolExecutor.java:1127)
   [junit4]    >         at java.util.concurrent.ThreadPoolExecutor$Worker.run(ThreadPoolExecutor.java:617)
   [junit4]    >         at java.lang.Thread.run(Thread.java:745)
   [junit4]    > 	at __randomizedtesting.SeedInfo.seed([78274312F6039B99]:0)
   [junit4] Completed [407/560] on J1 in 146.84s, 12 tests, 1 failure, 2 errors, 4 skipped <<< FAILURES!

[...truncated 500 lines...]
BUILD FAILED
C:\Users\JenkinsSlave\workspace\Lucene-Solr-trunk-Windows\build.xml:775: The following error occurred while executing this line:
C:\Users\JenkinsSlave\workspace\Lucene-Solr-trunk-Windows\build.xml:719: The following error occurred while executing this line:
C:\Users\JenkinsSlave\workspace\Lucene-Solr-trunk-Windows\build.xml:59: The following error occurred while executing this line:
C:\Users\JenkinsSlave\workspace\Lucene-Solr-trunk-Windows\solr\build.xml:233: The following error occurred while executing this line:
C:\Users\JenkinsSlave\workspace\Lucene-Solr-trunk-Windows\solr\common-build.xml:516: The following error occurred while executing this line:
C:\Users\JenkinsSlave\workspace\Lucene-Solr-trunk-Windows\lucene\common-build.xml:1432: The following error occurred while executing this line:
C:\Users\JenkinsSlave\workspace\Lucene-Solr-trunk-Windows\lucene\common-build.xml:987: There were test failures: 560 suites (8 ignored), 2217 tests, 3 suite-level errors, 562 ignored (77 assumptions) [seed: 78274312F6039B99]

Total time: 51 minutes 16 seconds
Build step 'Invoke Ant' marked build as failure
Archiving artifacts
[WARNINGS] Skipping publisher since build result is FAILURE
Recording test results
Email was triggered for: Failure - Any
Sending email for trigger: Failure - Any



Mime
View raw message