lucene-dev mailing list archives

Site index · List index
Message view « Date » · « Thread »
Top « Date » · « Thread »
From Policeman Jenkins Server <jenk...@thetaphi.de>
Subject [JENKINS] Lucene-Solr-5.x-MacOSX (64bit/jdk1.7.0) - Build # 2804 - Failure!
Date Mon, 09 Nov 2015 21:16:49 GMT
Build: http://jenkins.thetaphi.de/job/Lucene-Solr-5.x-MacOSX/2804/
Java: 64bit/jdk1.7.0 -XX:-UseCompressedOops -XX:+UseG1GC

1 tests failed.
FAILED:  org.apache.lucene.TestMergeSchedulerExternal.testSubclassConcurrentMergeScheduler

Error Message:


Stack Trace:
java.lang.AssertionError
	at __randomizedtesting.SeedInfo.seed([E63050CDCB505F80:61B1ED60CF702584]:0)
	at org.junit.Assert.fail(Assert.java:92)
	at org.junit.Assert.assertTrue(Assert.java:43)
	at org.junit.Assert.assertTrue(Assert.java:54)
	at org.apache.lucene.TestMergeSchedulerExternal.testSubclassConcurrentMergeScheduler(TestMergeSchedulerExternal.java:116)
	at sun.reflect.NativeMethodAccessorImpl.invoke0(Native Method)
	at sun.reflect.NativeMethodAccessorImpl.invoke(NativeMethodAccessorImpl.java:57)
	at sun.reflect.DelegatingMethodAccessorImpl.invoke(DelegatingMethodAccessorImpl.java:43)
	at java.lang.reflect.Method.invoke(Method.java:606)
	at com.carrotsearch.randomizedtesting.RandomizedRunner.invoke(RandomizedRunner.java:1660)
	at com.carrotsearch.randomizedtesting.RandomizedRunner$8.evaluate(RandomizedRunner.java:866)
	at com.carrotsearch.randomizedtesting.RandomizedRunner$9.evaluate(RandomizedRunner.java:902)
	at com.carrotsearch.randomizedtesting.RandomizedRunner$10.evaluate(RandomizedRunner.java:916)
	at org.apache.lucene.util.TestRuleSetupTeardownChained$1.evaluate(TestRuleSetupTeardownChained.java:50)
	at org.apache.lucene.util.AbstractBeforeAfterRule$1.evaluate(AbstractBeforeAfterRule.java:46)
	at org.apache.lucene.util.TestRuleThreadAndTestName$1.evaluate(TestRuleThreadAndTestName.java:49)
	at org.apache.lucene.util.TestRuleIgnoreAfterMaxFailures$1.evaluate(TestRuleIgnoreAfterMaxFailures.java:65)
	at org.apache.lucene.util.TestRuleMarkFailure$1.evaluate(TestRuleMarkFailure.java:48)
	at com.carrotsearch.randomizedtesting.rules.StatementAdapter.evaluate(StatementAdapter.java:36)
	at com.carrotsearch.randomizedtesting.ThreadLeakControl$StatementRunner.run(ThreadLeakControl.java:367)
	at com.carrotsearch.randomizedtesting.ThreadLeakControl.forkTimeoutingTask(ThreadLeakControl.java:809)
	at com.carrotsearch.randomizedtesting.ThreadLeakControl$3.evaluate(ThreadLeakControl.java:460)
	at com.carrotsearch.randomizedtesting.RandomizedRunner.runSingleTest(RandomizedRunner.java:875)
	at com.carrotsearch.randomizedtesting.RandomizedRunner$5.evaluate(RandomizedRunner.java:777)
	at com.carrotsearch.randomizedtesting.RandomizedRunner$6.evaluate(RandomizedRunner.java:811)
	at com.carrotsearch.randomizedtesting.RandomizedRunner$7.evaluate(RandomizedRunner.java:822)
	at org.apache.lucene.util.AbstractBeforeAfterRule$1.evaluate(AbstractBeforeAfterRule.java:46)
	at com.carrotsearch.randomizedtesting.rules.StatementAdapter.evaluate(StatementAdapter.java:36)
	at org.apache.lucene.util.TestRuleStoreClassName$1.evaluate(TestRuleStoreClassName.java:42)
	at com.carrotsearch.randomizedtesting.rules.NoShadowingOrOverridesOnMethodsRule$1.evaluate(NoShadowingOrOverridesOnMethodsRule.java:40)
	at com.carrotsearch.randomizedtesting.rules.NoShadowingOrOverridesOnMethodsRule$1.evaluate(NoShadowingOrOverridesOnMethodsRule.java:40)
	at com.carrotsearch.randomizedtesting.rules.StatementAdapter.evaluate(StatementAdapter.java:36)
	at com.carrotsearch.randomizedtesting.rules.StatementAdapter.evaluate(StatementAdapter.java:36)
	at com.carrotsearch.randomizedtesting.rules.StatementAdapter.evaluate(StatementAdapter.java:36)
	at org.apache.lucene.util.TestRuleAssertionsRequired$1.evaluate(TestRuleAssertionsRequired.java:54)
	at org.apache.lucene.util.TestRuleMarkFailure$1.evaluate(TestRuleMarkFailure.java:48)
	at org.apache.lucene.util.TestRuleIgnoreAfterMaxFailures$1.evaluate(TestRuleIgnoreAfterMaxFailures.java:65)
	at org.apache.lucene.util.TestRuleIgnoreTestSuites$1.evaluate(TestRuleIgnoreTestSuites.java:55)
	at com.carrotsearch.randomizedtesting.rules.StatementAdapter.evaluate(StatementAdapter.java:36)
	at com.carrotsearch.randomizedtesting.ThreadLeakControl$StatementRunner.run(ThreadLeakControl.java:367)
	at java.lang.Thread.run(Thread.java:745)




Build Log:
[...truncated 1155 lines...]
   [junit4] Suite: org.apache.lucene.TestMergeSchedulerExternal
   [junit4]   2> NOTE: reproduce with: ant test  -Dtestcase=TestMergeSchedulerExternal
-Dtests.method=testSubclassConcurrentMergeScheduler -Dtests.seed=E63050CDCB505F80 -Dtests.slow=true
-Dtests.locale=fi -Dtests.timezone=Asia/Sakhalin -Dtests.asserts=true -Dtests.file.encoding=ISO-8859-1
   [junit4] FAILURE 0.50s J1 | TestMergeSchedulerExternal.testSubclassConcurrentMergeScheduler
<<<
   [junit4]    > Throwable #1: java.lang.AssertionError
   [junit4]    > 	at __randomizedtesting.SeedInfo.seed([E63050CDCB505F80:61B1ED60CF702584]:0)
   [junit4]    > 	at org.apache.lucene.TestMergeSchedulerExternal.testSubclassConcurrentMergeScheduler(TestMergeSchedulerExternal.java:116)
   [junit4]    > 	at java.lang.Thread.run(Thread.java:745)
   [junit4]   2> NOTE: test params are: codec=Asserting(Lucene54): {id=PostingsFormat(name=MockRandom)},
docValues:{}, sim=RandomSimilarityProvider(queryNorm=false,coord=crazy): {}, locale=fi, timezone=Asia/Sakhalin
   [junit4]   2> NOTE: Mac OS X 10.8.5 x86_64/Oracle Corporation 1.7.0_80 (64-bit)/cpus=3,threads=1,free=230576536,total=509607936
   [junit4]   2> NOTE: All tests run in this JVM: [TestLevenshteinAutomata, TestSparseFixedBitDocIdSet,
TestCachingTokenFilter, TestDateFilter, TestTimeLimitingCollector, TestOfflineSorter, TestFlex,
TestRegexpRandom2, TestSpanNotQuery, TestPerFieldDocValuesFormat, TestDocValuesScoring, TestTopDocsCollector,
Test2BTerms, TestDocumentsWriterStallControl, TestPayloads, TestSimpleExplanations, TestNoMergePolicy,
TestPhrasePrefixQuery, TestIndexSearcher, TestBlendedTermQuery, TestUnicodeUtil, TestTieredMergePolicy,
TestAddIndexes, TestFastDecompressionMode, TestDocInverterPerFieldErrorInfo, TestMultiDocValues,
TestFieldCacheRewriteMethod, TestBinaryDocValuesUpdates, LimitedFiniteStringsIteratorTest,
TestSimilarityProvider, TestNamedSPILoader, TestTwoPhaseCommitTool, TestTermVectorsReader,
TestTopFieldCollector, TestExternalCodecs, TestBooleanScorer, TestSingleInstanceLockFactory,
TestFixedBitSet, TestSleepingLockWrapper, TestSimilarity2, TestNRTReaderCleanup, TestCrashCausesCorruptIndex,
TestMultiTermsEnum, Test2BSortedDocValuesOrds, TestSpanExplanationsOfNonMatches, TestDocIdSet,
TestHighCompressionMode, TestRegExp, TestGrowableByteArrayDataOutput, TestForUtil, TestPositiveScoresOnlyCollector,
TestToken, TestFilteredQuery, TestBytesRefHash, TestAssertions, TestStressIndexing, TestMinShouldMatch2,
TestSearchAfter, TestLockFactory, TestQueryCachingPolicy, TestNRTCachingDirectory, TestIndexWriterThreadsToSegments,
TestPostingsOffsets, TestFilteredSearch, TestSearcherManager, TestIntsRef, TestQueryBuilder,
TestBagOfPositions, TestLRUQueryCache, TestQueryRescorer, TestSpanExplanations, TestDisjunctionMaxQuery,
TestBooleanQueryVisitSubscorers, TestIndexWriterOutOfFileDescriptors, TestPackedInts, TestAllFilesHaveCodecHeader,
TestMultiValuedNumericRangeQuery, TestNumericRangeQuery32, TestCustomSearcherSort, TestField,
TestDocValues, Test2BPostingsBytes, TestNumericUtils, TestTimSorter, Test2BNumericDocValues,
TestSnapshotDeletionPolicy, TestFileSwitchDirectory, TestSpanOrQuery, TestRegexpRandom, TestAutomaton,
TestWildcardRandom, TestBagOfPostings, TestSpans, TestSentinelIntSet, TestQueryWrapperFilter,
TestSegmentInfos, TestAutomatonQueryUnicode, TestParallelLeafReader, TestLucene50StoredFieldsFormat,
TestMergeSchedulerExternal]
   [junit4] Completed [206/412] on J1 in 0.52s, 2 tests, 1 failure <<< FAILURES!

[...truncated 671 lines...]
BUILD FAILED
/Users/jenkins/workspace/Lucene-Solr-5.x-MacOSX/build.xml:785: The following error occurred
while executing this line:
/Users/jenkins/workspace/Lucene-Solr-5.x-MacOSX/build.xml:729: The following error occurred
while executing this line:
/Users/jenkins/workspace/Lucene-Solr-5.x-MacOSX/build.xml:59: The following error occurred
while executing this line:
/Users/jenkins/workspace/Lucene-Solr-5.x-MacOSX/lucene/build.xml:50: The following error occurred
while executing this line:
/Users/jenkins/workspace/Lucene-Solr-5.x-MacOSX/lucene/common-build.xml:1452: The following
error occurred while executing this line:
/Users/jenkins/workspace/Lucene-Solr-5.x-MacOSX/lucene/common-build.xml:1006: There were test
failures: 412 suites (1 ignored), 3322 tests, 1 failure, 50 ignored (46 assumptions) [seed:
E63050CDCB505F80]

Total time: 7 minutes 20 seconds
Build step 'Invoke Ant' marked build as failure
Archiving artifacts
[WARNINGS] Skipping publisher since build result is FAILURE
Recording test results
Email was triggered for: Failure - Any
Sending email for trigger: Failure - Any



Mime
View raw message