lucene-dev mailing list archives

Site index · List index
Message view « Date » · « Thread »
Top « Date » · « Thread »
From Policeman Jenkins Server <jenk...@thetaphi.de>
Subject [JENKINS] Lucene-Solr-5.x-Solaris (multiarch/jdk1.7.0) - Build # 217 - Failure!
Date Sat, 28 Nov 2015 15:34:39 GMT
Build: http://jenkins.thetaphi.de/job/Lucene-Solr-5.x-Solaris/217/
Java: multiarch/jdk1.7.0 -d32 -client -XX:+UseConcMarkSweepGC

1 tests failed.
FAILED:  org.apache.solr.cloud.CustomCollectionTest.test

Error Message:
KeeperErrorCode = Session expired for /clusterstate.json

Stack Trace:
org.apache.zookeeper.KeeperException$SessionExpiredException: KeeperErrorCode = Session expired for /clusterstate.json
	at __randomizedtesting.SeedInfo.seed([8AF90EA9E7290C05:2AD317349D561FD]:0)
	at org.apache.zookeeper.KeeperException.create(KeeperException.java:127)
	at org.apache.zookeeper.KeeperException.create(KeeperException.java:51)
	at org.apache.zookeeper.ZooKeeper.getData(ZooKeeper.java:1155)
	at org.apache.solr.common.cloud.SolrZkClient$7.execute(SolrZkClient.java:345)
	at org.apache.solr.common.cloud.SolrZkClient$7.execute(SolrZkClient.java:342)
	at org.apache.solr.common.cloud.ZkCmdExecutor.retryOperation(ZkCmdExecutor.java:61)
	at org.apache.solr.common.cloud.SolrZkClient.getData(SolrZkClient.java:342)
	at org.apache.solr.common.cloud.ZkStateReader.refreshLegacyClusterState(ZkStateReader.java:477)
	at org.apache.solr.common.cloud.ZkStateReader.updateClusterState(ZkStateReader.java:257)
	at org.apache.solr.cloud.AbstractDistribZkTestBase.waitForRecoveriesToFinish(AbstractDistribZkTestBase.java:144)
	at org.apache.solr.cloud.AbstractDistribZkTestBase.waitForRecoveriesToFinish(AbstractDistribZkTestBase.java:131)
	at org.apache.solr.cloud.AbstractDistribZkTestBase.waitForRecoveriesToFinish(AbstractDistribZkTestBase.java:126)
	at org.apache.solr.cloud.CustomCollectionTest.testCreateShardRepFactor(CustomCollectionTest.java:389)
	at org.apache.solr.cloud.CustomCollectionTest.test(CustomCollectionTest.java:97)
	at sun.reflect.NativeMethodAccessorImpl.invoke0(Native Method)
	at sun.reflect.NativeMethodAccessorImpl.invoke(NativeMethodAccessorImpl.java:57)
	at sun.reflect.DelegatingMethodAccessorImpl.invoke(DelegatingMethodAccessorImpl.java:43)
	at java.lang.reflect.Method.invoke(Method.java:606)
	at com.carrotsearch.randomizedtesting.RandomizedRunner.invoke(RandomizedRunner.java:1764)
	at com.carrotsearch.randomizedtesting.RandomizedRunner$8.evaluate(RandomizedRunner.java:871)
	at com.carrotsearch.randomizedtesting.RandomizedRunner$9.evaluate(RandomizedRunner.java:907)
	at com.carrotsearch.randomizedtesting.RandomizedRunner$10.evaluate(RandomizedRunner.java:921)
	at org.apache.solr.BaseDistributedSearchTestCase$ShardsRepeatRule$ShardsFixedStatement.callStatement(BaseDistributedSearchTestCase.java:964)
	at org.apache.solr.BaseDistributedSearchTestCase$ShardsRepeatRule$ShardsStatement.evaluate(BaseDistributedSearchTestCase.java:939)
	at com.carrotsearch.randomizedtesting.rules.SystemPropertiesRestoreRule$1.evaluate(SystemPropertiesRestoreRule.java:57)
	at org.apache.lucene.util.TestRuleSetupTeardownChained$1.evaluate(TestRuleSetupTeardownChained.java:50)
	at org.apache.lucene.util.AbstractBeforeAfterRule$1.evaluate(AbstractBeforeAfterRule.java:46)
	at org.apache.lucene.util.TestRuleThreadAndTestName$1.evaluate(TestRuleThreadAndTestName.java:49)
	at org.apache.lucene.util.TestRuleIgnoreAfterMaxFailures$1.evaluate(TestRuleIgnoreAfterMaxFailures.java:65)
	at org.apache.lucene.util.TestRuleMarkFailure$1.evaluate(TestRuleMarkFailure.java:48)
	at com.carrotsearch.randomizedtesting.rules.StatementAdapter.evaluate(StatementAdapter.java:36)
	at com.carrotsearch.randomizedtesting.ThreadLeakControl$StatementRunner.run(ThreadLeakControl.java:367)
	at com.carrotsearch.randomizedtesting.ThreadLeakControl.forkTimeoutingTask(ThreadLeakControl.java:809)
	at com.carrotsearch.randomizedtesting.ThreadLeakControl$3.evaluate(ThreadLeakControl.java:460)
	at com.carrotsearch.randomizedtesting.RandomizedRunner.runSingleTest(RandomizedRunner.java:880)
	at com.carrotsearch.randomizedtesting.RandomizedRunner$5.evaluate(RandomizedRunner.java:781)
	at com.carrotsearch.randomizedtesting.RandomizedRunner$6.evaluate(RandomizedRunner.java:816)
	at com.carrotsearch.randomizedtesting.RandomizedRunner$7.evaluate(RandomizedRunner.java:827)
	at com.carrotsearch.randomizedtesting.rules.StatementAdapter.evaluate(StatementAdapter.java:36)
	at com.carrotsearch.randomizedtesting.rules.SystemPropertiesRestoreRule$1.evaluate(SystemPropertiesRestoreRule.java:57)
	at org.apache.lucene.util.AbstractBeforeAfterRule$1.evaluate(AbstractBeforeAfterRule.java:46)
	at com.carrotsearch.randomizedtesting.rules.StatementAdapter.evaluate(StatementAdapter.java:36)
	at org.apache.lucene.util.TestRuleStoreClassName$1.evaluate(TestRuleStoreClassName.java:42)
	at com.carrotsearch.randomizedtesting.rules.NoShadowingOrOverridesOnMethodsRule$1.evaluate(NoShadowingOrOverridesOnMethodsRule.java:40)
	at com.carrotsearch.randomizedtesting.rules.NoShadowingOrOverridesOnMethodsRule$1.evaluate(NoShadowingOrOverridesOnMethodsRule.java:40)
	at com.carrotsearch.randomizedtesting.rules.StatementAdapter.evaluate(StatementAdapter.java:36)
	at com.carrotsearch.randomizedtesting.rules.StatementAdapter.evaluate(StatementAdapter.java:36)
	at com.carrotsearch.randomizedtesting.rules.StatementAdapter.evaluate(StatementAdapter.java:36)
	at org.apache.lucene.util.TestRuleAssertionsRequired$1.evaluate(TestRuleAssertionsRequired.java:54)
	at org.apache.lucene.util.TestRuleMarkFailure$1.evaluate(TestRuleMarkFailure.java:48)
	at org.apache.lucene.util.TestRuleIgnoreAfterMaxFailures$1.evaluate(TestRuleIgnoreAfterMaxFailures.java:65)
	at org.apache.lucene.util.TestRuleIgnoreTestSuites$1.evaluate(TestRuleIgnoreTestSuites.java:55)
	at com.carrotsearch.randomizedtesting.rules.StatementAdapter.evaluate(StatementAdapter.java:36)
	at com.carrotsearch.randomizedtesting.ThreadLeakControl$StatementRunner.run(ThreadLeakControl.java:367)
	at java.lang.Thread.run(Thread.java:745)




Build Log:
[...truncated 9879 lines...]
   [junit4] Suite: org.apache.solr.cloud.CustomCollectionTest
   [junit4]   2> Creating dataDir: /export/home/jenkins/workspace/Lucene-Solr-5.x-Solaris/solr/build/solr-core/test/J1/temp/solr.cloud.CustomCollectionTest_8AF90EA9E7290C05-001/init-core-data-001
   [junit4]   2> 441873 INFO  (SUITE-CustomCollectionTest-seed#[8AF90EA9E7290C05]-worker) [    ] o.a.s.BaseDistributedSearchTestCase Setting hostContext system property: /
   [junit4]   2> 441876 INFO  (TEST-CustomCollectionTest.test-seed#[8AF90EA9E7290C05]) [    ] o.a.s.c.ZkTestServer STARTING ZK TEST SERVER
   [junit4]   2> 441876 INFO  (Thread-913) [    ] o.a.s.c.ZkTestServer client port:0.0.0.0/0.0.0.0:0
   [junit4]   2> 441877 INFO  (Thread-913) [    ] o.a.s.c.ZkTestServer Starting server
   [junit4]   2> 441977 INFO  (TEST-CustomCollectionTest.test-seed#[8AF90EA9E7290C05]) [    ] o.a.s.c.ZkTestServer start zk server on port:58432
   [junit4]   2> 441977 INFO  (TEST-CustomCollectionTest.test-seed#[8AF90EA9E7290C05]) [    ] o.a.s.c.c.SolrZkClient Using default ZkCredentialsProvider
   [junit4]   2> 441978 INFO  (TEST-CustomCollectionTest.test-seed#[8AF90EA9E7290C05]) [    ] o.a.s.c.c.ConnectionManager Waiting for client to connect to ZooKeeper
   [junit4]   2> 441988 INFO  (zkCallback-656-thread-1) [    ] o.a.s.c.c.ConnectionManager Watcher org.apache.solr.common.cloud.ConnectionManager@aa9f0 name:ZooKeeperConnection Watcher:127.0.0.1:58432 got event WatchedEvent state:SyncConnected type:None path:null path:null type:None
   [junit4]   2> 441988 INFO  (TEST-CustomCollectionTest.test-seed#[8AF90EA9E7290C05]) [    ] o.a.s.c.c.ConnectionManager Client is connected to ZooKeeper
   [junit4]   2> 441989 INFO  (TEST-CustomCollectionTest.test-seed#[8AF90EA9E7290C05]) [    ] o.a.s.c.c.SolrZkClient Using default ZkACLProvider
   [junit4]   2> 441989 INFO  (TEST-CustomCollectionTest.test-seed#[8AF90EA9E7290C05]) [    ] o.a.s.c.c.SolrZkClient makePath: /solr
   [junit4]   2> 441997 INFO  (TEST-CustomCollectionTest.test-seed#[8AF90EA9E7290C05]) [    ] o.a.s.c.c.SolrZkClient Using default ZkCredentialsProvider
   [junit4]   2> 442000 INFO  (TEST-CustomCollectionTest.test-seed#[8AF90EA9E7290C05]) [    ] o.a.s.c.c.ConnectionManager Waiting for client to connect to ZooKeeper
   [junit4]   2> 442003 INFO  (zkCallback-657-thread-1) [    ] o.a.s.c.c.ConnectionManager Watcher org.apache.solr.common.cloud.ConnectionManager@52dcc2 name:ZooKeeperConnection Watcher:127.0.0.1:58432/solr got event WatchedEvent state:SyncConnected type:None path:null path:null type:None
   [junit4]   2> 442004 INFO  (TEST-CustomCollectionTest.test-seed#[8AF90EA9E7290C05]) [    ] o.a.s.c.c.ConnectionManager Client is connected to ZooKeeper
   [junit4]   2> 442004 INFO  (TEST-CustomCollectionTest.test-seed#[8AF90EA9E7290C05]) [    ] o.a.s.c.c.SolrZkClient Using default ZkACLProvider
   [junit4]   2> 442005 INFO  (TEST-CustomCollectionTest.test-seed#[8AF90EA9E7290C05]) [    ] o.a.s.c.c.SolrZkClient makePath: /collections/collection1
   [junit4]   2> 442012 INFO  (TEST-CustomCollectionTest.test-seed#[8AF90EA9E7290C05]) [    ] o.a.s.c.c.SolrZkClient makePath: /collections/collection1/shards
   [junit4]   2> 442018 INFO  (TEST-CustomCollectionTest.test-seed#[8AF90EA9E7290C05]) [    ] o.a.s.c.c.SolrZkClient makePath: /collections/control_collection
   [junit4]   2> 442022 INFO  (TEST-CustomCollectionTest.test-seed#[8AF90EA9E7290C05]) [    ] o.a.s.c.c.SolrZkClient makePath: /collections/control_collection/shards
   [junit4]   2> 442026 INFO  (TEST-CustomCollectionTest.test-seed#[8AF90EA9E7290C05]) [    ] o.a.s.c.AbstractZkTestCase put /export/home/jenkins/workspace/Lucene-Solr-5.x-Solaris/solr/core/src/test-files/solr/collection1/conf/solrconfig-tlog.xml to /configs/conf1/solrconfig.xml
   [junit4]   2> 442026 INFO  (TEST-CustomCollectionTest.test-seed#[8AF90EA9E7290C05]) [    ] o.a.s.c.c.SolrZkClient makePath: /configs/conf1/solrconfig.xml
   [junit4]   2> 442074 INFO  (TEST-CustomCollectionTest.test-seed#[8AF90EA9E7290C05]) [    ] o.a.s.c.AbstractZkTestCase put /export/home/jenkins/workspace/Lucene-Solr-5.x-Solaris/solr/core/src/test-files/solr/collection1/conf/schema.xml to /configs/conf1/schema.xml
   [junit4]   2> 442074 INFO  (TEST-CustomCollectionTest.test-seed#[8AF90EA9E7290C05]) [    ] o.a.s.c.c.SolrZkClient makePath: /configs/conf1/schema.xml
   [junit4]   2> 442078 INFO  (TEST-CustomCollectionTest.test-seed#[8AF90EA9E7290C05]) [    ] o.a.s.c.AbstractZkTestCase put /export/home/jenkins/workspace/Lucene-Solr-5.x-Solaris/solr/core/src/test-files/solr/collection1/conf/solrconfig.snippet.randomindexconfig.xml to /configs/conf1/solrconfig.snippet.randomindexconfig.xml
   [junit4]   2> 442079 INFO  (TEST-CustomCollectionTest.test-seed#[8AF90EA9E7290C05]) [    ] o.a.s.c.c.SolrZkClient makePath: /configs/conf1/solrconfig.snippet.randomindexconfig.xml
   [junit4]   2> 442082 INFO  (TEST-CustomCollectionTest.test-seed#[8AF90EA9E7290C05]) [    ] o.a.s.c.AbstractZkTestCase put /export/home/jenkins/workspace/Lucene-Solr-5.x-Solaris/solr/core/src/test-files/solr/collection1/conf/stopwords.txt to /configs/conf1/stopwords.txt
   [junit4]   2> 442082 INFO  (TEST-CustomCollectionTest.test-seed#[8AF90EA9E7290C05]) [    ] o.a.s.c.c.SolrZkClient makePath: /configs/conf1/stopwords.txt
   [junit4]   2> 442086 INFO  (TEST-CustomCollectionTest.test-seed#[8AF90EA9E7290C05]) [    ] o.a.s.c.AbstractZkTestCase put /export/home/jenkins/workspace/Lucene-Solr-5.x-Solaris/solr/core/src/test-files/solr/collection1/conf/protwords.txt to /configs/conf1/protwords.txt
   [junit4]   2> 442086 INFO  (TEST-CustomCollectionTest.test-seed#[8AF90EA9E7290C05]) [    ] o.a.s.c.c.SolrZkClient makePath: /configs/conf1/protwords.txt
   [junit4]   2> 442090 INFO  (TEST-CustomCollectionTest.test-seed#[8AF90EA9E7290C05]) [    ] o.a.s.c.AbstractZkTestCase put /export/home/jenkins/workspace/Lucene-Solr-5.x-Solaris/solr/core/src/test-files/solr/collection1/conf/currency.xml to /configs/conf1/currency.xml
   [junit4]   2> 442090 INFO  (TEST-CustomCollectionTest.test-seed#[8AF90EA9E7290C05]) [    ] o.a.s.c.c.SolrZkClient makePath: /configs/conf1/currency.xml
   [junit4]   2> 442094 INFO  (TEST-CustomCollectionTest.test-seed#[8AF90EA9E7290C05]) [    ] o.a.s.c.AbstractZkTestCase put /export/home/jenkins/workspace/Lucene-Solr-5.x-Solaris/solr/core/src/test-files/solr/collection1/conf/enumsConfig.xml to /configs/conf1/enumsConfig.xml
   [junit4]   2> 442094 INFO  (TEST-CustomCollectionTest.test-seed#[8AF90EA9E7290C05]) [    ] o.a.s.c.c.SolrZkClient makePath: /configs/conf1/enumsConfig.xml
   [junit4]   2> 442098 INFO  (TEST-CustomCollectionTest.test-seed#[8AF90EA9E7290C05]) [    ] o.a.s.c.AbstractZkTestCase put /export/home/jenkins/workspace/Lucene-Solr-5.x-Solaris/solr/core/src/test-files/solr/collection1/conf/open-exchange-rates.json to /configs/conf1/open-exchange-rates.json
   [junit4]   2> 442098 INFO  (TEST-CustomCollectionTest.test-seed#[8AF90EA9E7290C05]) [    ] o.a.s.c.c.SolrZkClient makePath: /configs/conf1/open-exchange-rates.json
   [junit4]   2> 442103 INFO  (TEST-CustomCollectionTest.test-seed#[8AF90EA9E7290C05]) [    ] o.a.s.c.AbstractZkTestCase put /export/home/jenkins/workspace/Lucene-Solr-5.x-Solaris/solr/core/src/test-files/solr/collection1/conf/mapping-ISOLatin1Accent.txt to /configs/conf1/mapping-ISOLatin1Accent.txt
   [junit4]   2> 442103 INFO  (TEST-CustomCollectionTest.test-seed#[8AF90EA9E7290C05]) [    ] o.a.s.c.c.SolrZkClient makePath: /configs/conf1/mapping-ISOLatin1Accent.txt
   [junit4]   2> 442107 INFO  (TEST-CustomCollectionTest.test-seed#[8AF90EA9E7290C05]) [    ] o.a.s.c.AbstractZkTestCase put /export/home/jenkins/workspace/Lucene-Solr-5.x-Solaris/solr/core/src/test-files/solr/collection1/conf/old_synonyms.txt to /configs/conf1/old_synonyms.txt
   [junit4]   2> 442107 INFO  (TEST-CustomCollectionTest.test-seed#[8AF90EA9E7290C05]) [    ] o.a.s.c.c.SolrZkClient makePath: /configs/conf1/old_synonyms.txt
   [junit4]   2> 442111 INFO  (TEST-CustomCollectionTest.test-seed#[8AF90EA9E7290C05]) [    ] o.a.s.c.AbstractZkTestCase put /export/home/jenkins/workspace/Lucene-Solr-5.x-Solaris/solr/core/src/test-files/solr/collection1/conf/synonyms.txt to /configs/conf1/synonyms.txt
   [junit4]   2> 442111 INFO  (TEST-CustomCollectionTest.test-seed#[8AF90EA9E7290C05]) [    ] o.a.s.c.c.SolrZkClient makePath: /configs/conf1/synonyms.txt
   [junit4]   2> 442308 INFO  (TEST-CustomCollectionTest.test-seed#[8AF90EA9E7290C05]) [    ] o.a.s.SolrTestCaseJ4 Writing core.properties file to /export/home/jenkins/workspace/Lucene-Solr-5.x-Solaris/solr/build/solr-core/test/J1/temp/solr.cloud.CustomCollectionTest_8AF90EA9E7290C05-001/control-001/cores/collection1
   [junit4]   2> 442309 INFO  (TEST-CustomCollectionTest.test-seed#[8AF90EA9E7290C05]) [    ] o.e.j.s.Server jetty-9.2.13.v20150730
   [junit4]   2> 442316 INFO  (TEST-CustomCollectionTest.test-seed#[8AF90EA9E7290C05]) [    ] o.e.j.s.h.ContextHandler Started o.e.j.s.ServletContextHandler@da5d{/,null,AVAILABLE}
   [junit4]   2> 442317 INFO  (TEST-CustomCollectionTest.test-seed#[8AF90EA9E7290C05]) [    ] o.e.j.s.ServerConnector Started ServerConnector@3392{HTTP/1.1}{127.0.0.1:48143}
   [junit4]   2> 442317 INFO  (TEST-CustomCollectionTest.test-seed#[8AF90EA9E7290C05]) [    ] o.e.j.s.Server Started @444966ms
   [junit4]   2> 442317 INFO  (TEST-CustomCollectionTest.test-seed#[8AF90EA9E7290C05]) [    ] o.a.s.c.s.e.JettySolrRunner Jetty properties: {coreRootDirectory=/export/home/jenkins/workspace/Lucene-Solr-5.x-Solaris/solr/build/solr-core/test/J1/../../../../../../../../../../export/home/jenkins/workspace/Lucene-Solr-5.x-Solaris/solr/build/solr-core/test/J1/temp/solr.cloud.CustomCollectionTest_8AF90EA9E7290C05-001/control-001/cores, hostContext=/, hostPort=48143, solr.data.dir=/export/home/jenkins/workspace/Lucene-Solr-5.x-Solaris/solr/build/solr-core/test/J1/temp/solr.cloud.CustomCollectionTest_8AF90EA9E7290C05-001/tempDir-001/control/data}
   [junit4]   2> 442317 INFO  (TEST-CustomCollectionTest.test-seed#[8AF90EA9E7290C05]) [    ] o.a.s.s.SolrDispatchFilter SolrDispatchFilter.init(): sun.misc.Launcher$AppClassLoader@1e84195
   [junit4]   2> 442317 INFO  (TEST-CustomCollectionTest.test-seed#[8AF90EA9E7290C05]) [    ] o.a.s.c.SolrResourceLoader new SolrResourceLoader for directory: '/export/home/jenkins/workspace/Lucene-Solr-5.x-Solaris/solr/build/solr-core/test/J1/temp/solr.cloud.CustomCollectionTest_8AF90EA9E7290C05-001/control-001'
   [junit4]   2> 442317 INFO  (TEST-CustomCollectionTest.test-seed#[8AF90EA9E7290C05]) [    ] o.a.s.c.SolrResourceLoader JNDI not configured for solr (NoInitialContextEx)
   [junit4]   2> 442317 INFO  (TEST-CustomCollectionTest.test-seed#[8AF90EA9E7290C05]) [    ] o.a.s.c.SolrResourceLoader solr home defaulted to 'solr/' (could not find system property or JNDI)
   [junit4]   2> 442318 INFO  (TEST-CustomCollectionTest.test-seed#[8AF90EA9E7290C05]) [    ] o.a.s.c.c.SolrZkClient Using default ZkCredentialsProvider
   [junit4]   2> 442319 INFO  (TEST-CustomCollectionTest.test-seed#[8AF90EA9E7290C05]) [    ] o.a.s.c.c.ConnectionManager Waiting for client to connect to ZooKeeper
   [junit4]   2> 442321 INFO  (zkCallback-658-thread-1) [    ] o.a.s.c.c.ConnectionManager Watcher org.apache.solr.common.cloud.ConnectionManager@1b438b0 name:ZooKeeperConnection Watcher:127.0.0.1:58432/solr got event WatchedEvent state:SyncConnected type:None path:null path:null type:None
   [junit4]   2> 442321 INFO  (TEST-CustomCollectionTest.test-seed#[8AF90EA9E7290C05]) [    ] o.a.s.c.c.ConnectionManager Client is connected to ZooKeeper
   [junit4]   2> 442321 INFO  (TEST-CustomCollectionTest.test-seed#[8AF90EA9E7290C05]) [    ] o.a.s.c.c.SolrZkClient Using default ZkACLProvider
   [junit4]   2> 442323 INFO  (TEST-CustomCollectionTest.test-seed#[8AF90EA9E7290C05]) [    ] o.a.s.s.SolrDispatchFilter Loading solr.xml from SolrHome (not found in ZooKeeper)
   [junit4]   2> 442323 INFO  (TEST-CustomCollectionTest.test-seed#[8AF90EA9E7290C05]) [    ] o.a.s.c.SolrXmlConfig Loading container configuration from /export/home/jenkins/workspace/Lucene-Solr-5.x-Solaris/solr/build/solr-core/test/J1/temp/solr.cloud.CustomCollectionTest_8AF90EA9E7290C05-001/control-001/solr.xml
   [junit4]   2> 442356 INFO  (TEST-CustomCollectionTest.test-seed#[8AF90EA9E7290C05]) [    ] o.a.s.c.CoresLocator Config-defined core root directory: /export/home/jenkins/workspace/Lucene-Solr-5.x-Solaris/solr/build/solr-core/test/J1/../../../../../../../../../../export/home/jenkins/workspace/Lucene-Solr-5.x-Solaris/solr/build/solr-core/test/J1/temp/solr.cloud.CustomCollectionTest_8AF90EA9E7290C05-001/control-001/cores
   [junit4]   2> 442356 INFO  (TEST-CustomCollectionTest.test-seed#[8AF90EA9E7290C05]) [    ] o.a.s.c.CoreContainer New CoreContainer 27279058
   [junit4]   2> 442356 INFO  (TEST-CustomCollectionTest.test-seed#[8AF90EA9E7290C05]) [    ] o.a.s.c.CoreContainer Loading cores into CoreContainer [instanceDir=/export/home/jenkins/workspace/Lucene-Solr-5.x-Solaris/solr/build/solr-core/test/J1/temp/solr.cloud.CustomCollectionTest_8AF90EA9E7290C05-001/control-001]
   [junit4]   2> 442356 WARN  (TEST-CustomCollectionTest.test-seed#[8AF90EA9E7290C05]) [    ] o.a.s.c.CoreContainer Couldn't add files from /export/home/jenkins/workspace/Lucene-Solr-5.x-Solaris/solr/build/solr-core/test/J1/temp/solr.cloud.CustomCollectionTest_8AF90EA9E7290C05-001/control-001/lib to classpath: /export/home/jenkins/workspace/Lucene-Solr-5.x-Solaris/solr/build/solr-core/test/J1/temp/solr.cloud.CustomCollectionTest_8AF90EA9E7290C05-001/control-001/lib
   [junit4]   2> 442357 INFO  (TEST-CustomCollectionTest.test-seed#[8AF90EA9E7290C05]) [    ] o.a.s.h.c.HttpShardHandlerFactory created with socketTimeout : 90000,urlScheme : ,connTimeout : 15000,maxConnectionsPerHost : 20,maxConnections : 10000,corePoolSize : 0,maximumPoolSize : 2147483647,maxThreadIdleTime : 5,sizeOfQueue : -1,fairnessPolicy : false,useRetries : false,
   [junit4]   2> 442359 INFO  (TEST-CustomCollectionTest.test-seed#[8AF90EA9E7290C05]) [    ] o.a.s.u.UpdateShardHandler Creating UpdateShardHandler HTTP client with params: socketTimeout=340000&connTimeout=45000&retry=true
   [junit4]   2> 442359 INFO  (TEST-CustomCollectionTest.test-seed#[8AF90EA9E7290C05]) [    ] o.a.s.l.LogWatcher SLF4J impl is org.slf4j.impl.Log4jLoggerFactory
   [junit4]   2> 442360 INFO  (TEST-CustomCollectionTest.test-seed#[8AF90EA9E7290C05]) [    ] o.a.s.l.LogWatcher Registering Log Listener [Log4j (org.slf4j.impl.Log4jLoggerFactory)]
   [junit4]   2> 442360 INFO  (TEST-CustomCollectionTest.test-seed#[8AF90EA9E7290C05]) [    ] o.a.s.c.ZkContainer Zookeeper client=127.0.0.1:58432/solr
   [junit4]   2> 442360 INFO  (TEST-CustomCollectionTest.test-seed#[8AF90EA9E7290C05]) [    ] o.a.s.c.ZkController zkHost includes chroot
   [junit4]   2> 442360 INFO  (TEST-CustomCollectionTest.test-seed#[8AF90EA9E7290C05]) [    ] o.a.s.c.c.SolrZkClient Using default ZkCredentialsProvider
   [junit4]   2> 442361 INFO  (TEST-CustomCollectionTest.test-seed#[8AF90EA9E7290C05]) [    ] o.a.s.c.c.ConnectionManager Waiting for client to connect to ZooKeeper
   [junit4]   2> 442362 INFO  (zkCallback-660-thread-1) [    ] o.a.s.c.c.ConnectionManager Watcher org.apache.solr.common.cloud.ConnectionManager@59cbb4 name:ZooKeeperConnection Watcher:127.0.0.1:58432 got event WatchedEvent state:SyncConnected type:None path:null path:null type:None
   [junit4]   2> 442363 INFO  (TEST-CustomCollectionTest.test-seed#[8AF90EA9E7290C05]) [    ] o.a.s.c.c.ConnectionManager Client is connected to ZooKeeper
   [junit4]   2> 442364 INFO  (TEST-CustomCollectionTest.test-seed#[8AF90EA9E7290C05]) [    ] o.a.s.c.c.SolrZkClient Using default ZkACLProvider
   [junit4]   2> 442366 INFO  (TEST-CustomCollectionTest.test-seed#[8AF90EA9E7290C05]) [n:127.0.0.1:48143_    ] o.a.s.c.c.ConnectionManager Waiting for client to connect to ZooKeeper
   [junit4]   2> 442368 INFO  (zkCallback-661-thread-1-processing-n:127.0.0.1:48143_) [n:127.0.0.1:48143_    ] o.a.s.c.c.ConnectionManager Watcher org.apache.solr.common.cloud.ConnectionManager@7beba3 name:ZooKeeperConnection Watcher:127.0.0.1:58432/solr got event WatchedEvent state:SyncConnected type:None path:null path:null type:None
   [junit4]   2> 442368 INFO  (TEST-CustomCollectionTest.test-seed#[8AF90EA9E7290C05]) [n:127.0.0.1:48143_    ] o.a.s.c.c.ConnectionManager Client is connected to ZooKeeper
   [junit4]   2> 442370 INFO  (TEST-CustomCollectionTest.test-seed#[8AF90EA9E7290C05]) [n:127.0.0.1:48143_    ] o.a.s.c.c.SolrZkClient makePath: /overseer/queue
   [junit4]   2> 442374 INFO  (TEST-CustomCollectionTest.test-seed#[8AF90EA9E7290C05]) [n:127.0.0.1:48143_    ] o.a.s.c.c.SolrZkClient makePath: /overseer/collection-queue-work
   [junit4]   2> 442384 INFO  (TEST-CustomCollectionTest.test-seed#[8AF90EA9E7290C05]) [n:127.0.0.1:48143_    ] o.a.s.c.c.SolrZkClient makePath: /overseer/collection-map-running
   [junit4]   2> 442388 INFO  (TEST-CustomCollectionTest.test-seed#[8AF90EA9E7290C05]) [n:127.0.0.1:48143_    ] o.a.s.c.c.SolrZkClient makePath: /overseer/collection-map-completed
   [junit4]   2> 442393 INFO  (TEST-CustomCollectionTest.test-seed#[8AF90EA9E7290C05]) [n:127.0.0.1:48143_    ] o.a.s.c.c.SolrZkClient makePath: /overseer/collection-map-failure
   [junit4]   2> 442397 INFO  (TEST-CustomCollectionTest.test-seed#[8AF90EA9E7290C05]) [n:127.0.0.1:48143_    ] o.a.s.c.c.SolrZkClient makePath: /live_nodes
   [junit4]   2> 442400 INFO  (TEST-CustomCollectionTest.test-seed#[8AF90EA9E7290C05]) [n:127.0.0.1:48143_    ] o.a.s.c.c.SolrZkClient makePath: /aliases.json
   [junit4]   2> 442403 INFO  (TEST-CustomCollectionTest.test-seed#[8AF90EA9E7290C05]) [n:127.0.0.1:48143_    ] o.a.s.c.c.SolrZkClient makePath: /clusterstate.json
   [junit4]   2> 442405 INFO  (TEST-CustomCollectionTest.test-seed#[8AF90EA9E7290C05]) [n:127.0.0.1:48143_    ] o.a.s.c.c.SolrZkClient makePath: /security.json
   [junit4]   2> 442407 INFO  (TEST-CustomCollectionTest.test-seed#[8AF90EA9E7290C05]) [n:127.0.0.1:48143_    ] o.a.s.c.ZkController Register node as live in ZooKeeper:/live_nodes/127.0.0.1:48143_
   [junit4]   2> 442408 INFO  (TEST-CustomCollectionTest.test-seed#[8AF90EA9E7290C05]) [n:127.0.0.1:48143_    ] o.a.s.c.c.SolrZkClient makePath: /live_nodes/127.0.0.1:48143_
   [junit4]   2> 442411 INFO  (TEST-CustomCollectionTest.test-seed#[8AF90EA9E7290C05]) [n:127.0.0.1:48143_    ] o.a.s.c.c.SolrZkClient makePath: /overseer_elect
   [junit4]   2> 442413 INFO  (TEST-CustomCollectionTest.test-seed#[8AF90EA9E7290C05]) [n:127.0.0.1:48143_    ] o.a.s.c.c.SolrZkClient makePath: /overseer_elect/election
   [junit4]   2> 442415 INFO  (TEST-CustomCollectionTest.test-seed#[8AF90EA9E7290C05]) [n:127.0.0.1:48143_    ] o.a.s.c.Overseer Overseer (id=null) closing
   [junit4]   2> 442416 INFO  (TEST-CustomCollectionTest.test-seed#[8AF90EA9E7290C05]) [n:127.0.0.1:48143_    ] o.a.s.c.LeaderElector Joined leadership election with path: /overseer_elect/election/94943438721712132-127.0.0.1:48143_-n_0000000000
   [junit4]   2> 442417 INFO  (TEST-CustomCollectionTest.test-seed#[8AF90EA9E7290C05]) [n:127.0.0.1:48143_    ] o.a.s.c.OverseerElectionContext I am going to be the leader 127.0.0.1:48143_
   [junit4]   2> 442417 INFO  (TEST-CustomCollectionTest.test-seed#[8AF90EA9E7290C05]) [n:127.0.0.1:48143_    ] o.a.s.c.c.SolrZkClient makePath: /overseer_elect/leader
   [junit4]   2> 442419 INFO  (TEST-CustomCollectionTest.test-seed#[8AF90EA9E7290C05]) [n:127.0.0.1:48143_    ] o.a.s.c.Overseer Overseer (id=94943438721712132-127.0.0.1:48143_-n_0000000000) starting
   [junit4]   2> 442422 INFO  (TEST-CustomCollectionTest.test-seed#[8AF90EA9E7290C05]) [n:127.0.0.1:48143_    ] o.a.s.c.c.SolrZkClient makePath: /overseer/queue-work
   [junit4]   2> 442433 INFO  (TEST-CustomCollectionTest.test-seed#[8AF90EA9E7290C05]) [n:127.0.0.1:48143_    ] o.a.s.c.OverseerAutoReplicaFailoverThread Starting OverseerAutoReplicaFailoverThread autoReplicaFailoverWorkLoopDelay=10000 autoReplicaFailoverWaitAfterExpiration=10000 autoReplicaFailoverBadNodeExpiration=60000
   [junit4]   2> 442434 INFO  (TEST-CustomCollectionTest.test-seed#[8AF90EA9E7290C05]) [n:127.0.0.1:48143_    ] o.a.s.c.c.ZkStateReader Updating cluster state from ZooKeeper... 
   [junit4]   2> 442434 INFO  (OverseerCollectionConfigSetProcessor-94943438721712132-127.0.0.1:48143_-n_0000000000) [n:127.0.0.1:48143_    ] o.a.s.c.OverseerTaskProcessor Process current queue of overseer operations
   [junit4]   2> 442434 INFO  (OverseerStateUpdate-94943438721712132-127.0.0.1:48143_-n_0000000000) [n:127.0.0.1:48143_    ] o.a.s.c.Overseer Starting to work on the main queue
   [junit4]   2> 442522 INFO  (TEST-CustomCollectionTest.test-seed#[8AF90EA9E7290C05]) [n:127.0.0.1:48143_    ] o.a.s.c.CoreContainer Security conf doesn't exist. Skipping setup for authorization module.
   [junit4]   2> 442522 INFO  (TEST-CustomCollectionTest.test-seed#[8AF90EA9E7290C05]) [n:127.0.0.1:48143_    ] o.a.s.c.CoreContainer No authentication plugin used.
   [junit4]   2> 442523 INFO  (TEST-CustomCollectionTest.test-seed#[8AF90EA9E7290C05]) [n:127.0.0.1:48143_    ] o.a.s.c.CoresLocator Looking for core definitions underneath /export/home/jenkins/workspace/Lucene-Solr-5.x-Solaris/solr/build/solr-core/test/J1/../../../../../../../../../../export/home/jenkins/workspace/Lucene-Solr-5.x-Solaris/solr/build/solr-core/test/J1/temp/solr.cloud.CustomCollectionTest_8AF90EA9E7290C05-001/control-001/cores
   [junit4]   2> 442525 INFO  (TEST-CustomCollectionTest.test-seed#[8AF90EA9E7290C05]) [n:127.0.0.1:48143_    ] o.a.s.c.SolrCore Created CoreDescriptor: {coreNodeName=, collection=control_collection, name=collection1, transient=false, absoluteInstDir=/export/home/jenkins/workspace/Lucene-Solr-5.x-Solaris/solr/build/solr-core/test/J1/../../../../../../../../../../export/home/jenkins/workspace/Lucene-Solr-5.x-Solaris/solr/build/solr-core/test/J1/temp/solr.cloud.CustomCollectionTest_8AF90EA9E7290C05-001/control-001/cores/collection1/, configSetProperties=configsetprops.json, shard=, instanceDir=/export/home/jenkins/workspace/Lucene-Solr-5.x-Solaris/solr/build/solr-core/test/J1/../../../../../../../../../../export/home/jenkins/workspace/Lucene-Solr-5.x-Solaris/solr/build/solr-core/test/J1/temp/solr.cloud.CustomCollectionTest_8AF90EA9E7290C05-001/control-001/cores/collection1, dataDir=data/, loadOnStartup=true, config=solrconfig.xml, schema=schema.xml}
   [junit4]   2> 442526 INFO  (TEST-CustomCollectionTest.test-seed#[8AF90EA9E7290C05]) [n:127.0.0.1:48143_    ] o.a.s.c.CoresLocator Found core collection1 in /export/home/jenkins/workspace/Lucene-Solr-5.x-Solaris/solr/build/solr-core/test/J1/../../../../../../../../../../export/home/jenkins/workspace/Lucene-Solr-5.x-Solaris/solr/build/solr-core/test/J1/temp/solr.cloud.CustomCollectionTest_8AF90EA9E7290C05-001/control-001/cores/collection1/
   [junit4]   2> 442526 INFO  (TEST-CustomCollectionTest.test-seed#[8AF90EA9E7290C05]) [n:127.0.0.1:48143_    ] o.a.s.c.CoresLocator Found 1 core definitions
   [junit4]   2> 442528 INFO  (TEST-CustomCollectionTest.test-seed#[8AF90EA9E7290C05]) [n:127.0.0.1:48143_    ] o.a.s.s.SolrDispatchFilter user.dir=/export/home/jenkins/workspace/Lucene-Solr-5.x-Solaris/solr/build/solr-core/test/J1
   [junit4]   2> 442528 INFO  (TEST-CustomCollectionTest.test-seed#[8AF90EA9E7290C05]) [n:127.0.0.1:48143_    ] o.a.s.s.SolrDispatchFilter SolrDispatchFilter.init() done
   [junit4]   2> 442528 INFO  (coreLoadExecutor-927-thread-1-processing-n:127.0.0.1:48143_) [n:127.0.0.1:48143_ c:control_collection   x:collection1] o.a.s.c.ZkController publishing state=down
   [junit4]   2> 442528 INFO  (coreLoadExecutor-927-thread-1-processing-n:127.0.0.1:48143_) [n:127.0.0.1:48143_ c:control_collection   x:collection1] o.a.s.c.ZkController numShards not found on descriptor - reading it from system property
   [junit4]   2> 442531 INFO  (OverseerStateUpdate-94943438721712132-127.0.0.1:48143_-n_0000000000) [n:127.0.0.1:48143_    ] o.a.s.c.Overseer processMessage: queueSize: 1, message = {
   [junit4]   2>   "base_url":"http://127.0.0.1:48143",
   [junit4]   2>   "node_name":"127.0.0.1:48143_",
   [junit4]   2>   "collection":"control_collection",
   [junit4]   2>   "shard":null,
   [junit4]   2>   "core":"collection1",
   [junit4]   2>   "operation":"state",
   [junit4]   2>   "state":"down",
   [junit4]   2>   "numShards":"1",
   [junit4]   2>   "roles":null} current state version: 0
   [junit4]   2> 442532 INFO  (coreLoadExecutor-927-thread-1-processing-n:127.0.0.1:48143_) [n:127.0.0.1:48143_ c:control_collection   x:collection1] o.a.s.c.ZkController look for our core node name
   [junit4]   2> 442532 INFO  (OverseerStateUpdate-94943438721712132-127.0.0.1:48143_-n_0000000000) [n:127.0.0.1:48143_    ] o.a.s.c.o.ReplicaMutator Update state numShards=1 message={
   [junit4]   2>   "base_url":"http://127.0.0.1:48143",
   [junit4]   2>   "node_name":"127.0.0.1:48143_",
   [junit4]   2>   "collection":"control_collection",
   [junit4]   2>   "shard":null,
   [junit4]   2>   "core":"collection1",
   [junit4]   2>   "operation":"state",
   [junit4]   2>   "state":"down",
   [junit4]   2>   "numShards":"1",
   [junit4]   2>   "roles":null}
   [junit4]   2> 442533 INFO  (OverseerStateUpdate-94943438721712132-127.0.0.1:48143_-n_0000000000) [n:127.0.0.1:48143_    ] o.a.s.c.o.ClusterStateMutator building a new cName: control_collection
   [junit4]   2> 442534 INFO  (OverseerStateUpdate-94943438721712132-127.0.0.1:48143_-n_0000000000) [n:127.0.0.1:48143_    ] o.a.s.c.o.ReplicaMutator Assigning new node to shard shard=shard1
   [junit4]   2> 442536 INFO  (zkCallback-661-thread-1-processing-n:127.0.0.1:48143_) [n:127.0.0.1:48143_    ] o.a.s.c.c.ZkStateReader A cluster state change: WatchedEvent state:SyncConnected type:NodeDataChanged path:/clusterstate.json, has occurred - updating... (live nodes size: 1)
   [junit4]   2> 443537 INFO  (coreLoadExecutor-927-thread-1-processing-n:127.0.0.1:48143_) [n:127.0.0.1:48143_ c:control_collection   x:collection1] o.a.s.c.ZkController waiting to find shard id in clusterstate for collection1
   [junit4]   2> 443537 INFO  (coreLoadExecutor-927-thread-1-processing-n:127.0.0.1:48143_) [n:127.0.0.1:48143_ c:control_collection   x:collection1] o.a.s.c.ZkController Check for collection zkNode:control_collection
   [junit4]   2> 443538 INFO  (coreLoadExecutor-927-thread-1-processing-n:127.0.0.1:48143_) [n:127.0.0.1:48143_ c:control_collection   x:collection1] o.a.s.c.ZkController Collection zkNode exists
   [junit4]   2> 443538 INFO  (coreLoadExecutor-927-thread-1-processing-n:127.0.0.1:48143_) [n:127.0.0.1:48143_ c:control_collection   x:collection1] o.a.s.c.c.ZkStateReader Load collection config from:/collections/control_collection
   [junit4]   2> 443540 INFO  (coreLoadExecutor-927-thread-1-processing-n:127.0.0.1:48143_) [n:127.0.0.1:48143_ c:control_collection   x:collection1] o.a.s.c.c.ZkStateReader path=/collections/control_collection configName=conf1 specified config exists in ZooKeeper
   [junit4]   2> 443540 INFO  (coreLoadExecutor-927-thread-1-processing-n:127.0.0.1:48143_) [n:127.0.0.1:48143_ c:control_collection   x:collection1] o.a.s.c.SolrResourceLoader new SolrResourceLoader for directory: '/export/home/jenkins/workspace/Lucene-Solr-5.x-Solaris/solr/build/solr-core/test/J1/temp/solr.cloud.CustomCollectionTest_8AF90EA9E7290C05-001/control-001/cores/collection1'
   [junit4]   2> 443541 INFO  (coreLoadExecutor-927-thread-1-processing-n:127.0.0.1:48143_) [n:127.0.0.1:48143_ c:control_collection   x:collection1] o.a.s.c.SolrResourceLoader JNDI not configured for solr (NoInitialContextEx)
   [junit4]   2> 443541 INFO  (coreLoadExecutor-927-thread-1-processing-n:127.0.0.1:48143_) [n:127.0.0.1:48143_ c:control_collection   x:collection1] o.a.s.c.SolrResourceLoader solr home defaulted to 'solr/' (could not find system property or JNDI)
   [junit4]   2> 443544 INFO  (coreLoadExecutor-927-thread-1-processing-n:127.0.0.1:48143_) [n:127.0.0.1:48143_ c:control_collection   x:collection1] o.a.s.c.Config loaded config solrconfig.xml with version 0 
   [junit4]   2> 443570 INFO  (coreLoadExecutor-927-thread-1-processing-n:127.0.0.1:48143_) [n:127.0.0.1:48143_ c:control_collection   x:collection1] o.a.s.c.SolrConfig current version of requestparams : -1
   [junit4]   2> 443614 INFO  (coreLoadExecutor-927-thread-1-processing-n:127.0.0.1:48143_) [n:127.0.0.1:48143_ c:control_collection   x:collection1] o.a.s.c.SolrConfig Using Lucene MatchVersion: 5.5.0
   [junit4]   2> 443725 INFO  (coreLoadExecutor-927-thread-1-processing-n:127.0.0.1:48143_) [n:127.0.0.1:48143_ c:control_collection   x:collection1] o.a.s.c.Config Loaded SolrConfig: solrconfig.xml
   [junit4]   2> 443740 INFO  (coreLoadExecutor-927-thread-1-processing-n:127.0.0.1:48143_) [n:127.0.0.1:48143_ c:control_collection   x:collection1] o.a.s.s.IndexSchema [collection1] Schema name=test
   [junit4]   2> 444532 INFO  (coreLoadExecutor-927-thread-1-processing-n:127.0.0.1:48143_) [n:127.0.0.1:48143_ c:control_collection   x:collection1] o.a.s.s.OpenExchangeRatesOrgProvider Initialized with rates=open-exchange-rates.json, refreshInterval=1440.
   [junit4]   2> 444546 INFO  (coreLoadExecutor-927-thread-1-processing-n:127.0.0.1:48143_) [n:127.0.0.1:48143_ c:control_collection   x:collection1] o.a.s.s.IndexSchema default search field in schema is text
   [junit4]   2> 444561 INFO  (coreLoadExecutor-927-thread-1-processing-n:127.0.0.1:48143_) [n:127.0.0.1:48143_ c:control_collection   x:collection1] o.a.s.s.IndexSchema unique key field: id
   [junit4]   2> 444595 INFO  (coreLoadExecutor-927-thread-1-processing-n:127.0.0.1:48143_) [n:127.0.0.1:48143_ c:control_collection   x:collection1] o.a.s.s.FileExchangeRateProvider Reloading exchange rates from file currency.xml
   [junit4]   2> 444602 INFO  (coreLoadExecutor-927-thread-1-processing-n:127.0.0.1:48143_) [n:127.0.0.1:48143_ c:control_collection   x:collection1] o.a.s.s.FileExchangeRateProvider Reloading exchange rates from file currency.xml
   [junit4]   2> 444612 INFO  (coreLoadExecutor-927-thread-1-processing-n:127.0.0.1:48143_) [n:127.0.0.1:48143_ c:control_collection   x:collection1] o.a.s.s.OpenExchangeRatesOrgProvider Reloading exchange rates from open-exchange-rates.json
   [junit4]   2> 444618 WARN  (coreLoadExecutor-927-thread-1-processing-n:127.0.0.1:48143_) [n:127.0.0.1:48143_ c:control_collection   x:collection1] o.a.s.s.OpenExchangeRatesOrgProvider Unknown key IMPORTANT NOTE
   [junit4]   2> 444618 WARN  (coreLoadExecutor-927-thread-1-processing-n:127.0.0.1:48143_) [n:127.0.0.1:48143_ c:control_collection   x:collection1] o.a.s.s.OpenExchangeRatesOrgProvider Expected key, got STRING
   [junit4]   2> 444618 INFO  (coreLoadExecutor-927-thread-1-processing-n:127.0.0.1:48143_) [n:127.0.0.1:48143_ c:control_collection   x:collection1] o.a.s.s.OpenExchangeRatesOrgProvider Reloading exchange rates from open-exchange-rates.json
   [junit4]   2> 444645 WARN  (coreLoadExecutor-927-thread-1-processing-n:127.0.0.1:48143_) [n:127.0.0.1:48143_ c:control_collection   x:collection1] o.a.s.s.OpenExchangeRatesOrgProvider Unknown key IMPORTANT NOTE
   [junit4]   2> 444645 WARN  (coreLoadExecutor-927-thread-1-processing-n:127.0.0.1:48143_) [n:127.0.0.1:48143_ c:control_collection   x:collection1] o.a.s.s.OpenExchangeRatesOrgProvider Expected key, got STRING
   [junit4]   2> 444648 INFO  (coreLoadExecutor-927-thread-1-processing-n:127.0.0.1:48143_) [n:127.0.0.1:48143_ c:control_collection   x:collection1] o.a.s.c.ConfigSetProperties Did not find ConfigSet properties, assuming default properties: Can't find resource 'configsetprops.json' in classpath or '/configs/conf1', cwd=/export/home/jenkins/workspace/Lucene-Solr-5.x-Solaris/solr/build/solr-core/test/J1
   [junit4]   2> 444648 INFO  (coreLoadExecutor-927-thread-1-processing-n:127.0.0.1:48143_) [n:127.0.0.1:48143_ c:control_collection   x:collection1] o.a.s.c.CoreContainer Creating SolrCore 'collection1' using configuration from collection control_collection
   [junit4]   2> 444648 INFO  (coreLoadExecutor-927-thread-1-processing-n:127.0.0.1:48143_) [n:127.0.0.1:48143_ c:control_collection s:shard1 r:core_node1 x:collection1] o.a.s.c.SolrCore org.apache.solr.core.MockDirectoryFactory
   [junit4]   2> 444648 INFO  (coreLoadExecutor-927-thread-1-processing-n:127.0.0.1:48143_) [n:127.0.0.1:48143_ c:control_collection s:shard1 r:core_node1 x:collection1] o.a.s.c.SolrCore [[collection1] ] Opening new SolrCore at [/export/home/jenkins/workspace/Lucene-Solr-5.x-Solaris/solr/build/solr-core/test/J1/temp/solr.cloud.CustomCollectionTest_8AF90EA9E7290C05-001/control-001/cores/collection1], dataDir=[null]
   [junit4]   2> 444648 INFO  (coreLoadExecutor-927-thread-1-processing-n:127.0.0.1:48143_) [n:127.0.0.1:48143_ c:control_collection s:shard1 r:core_node1 x:collection1] o.a.s.c.JmxMonitoredMap JMX monitoring is enabled. Adding Solr mbeans to JMX Server: com.sun.jmx.mbeanserver.JmxMBeanServer@1349d88
   [junit4]   2> 444649 INFO  (coreLoadExecutor-927-thread-1-processing-n:127.0.0.1:48143_) [n:127.0.0.1:48143_ c:control_collection s:shard1 r:core_node1 x:collection1] o.a.s.c.CachingDirectoryFactory return new directory for /export/home/jenkins/workspace/Lucene-Solr-5.x-Solaris/solr/build/solr-core/test/J1/../../../../../../../../../../export/home/jenkins/workspace/Lucene-Solr-5.x-Solaris/solr/build/solr-core/test/J1/temp/solr.cloud.CustomCollectionTest_8AF90EA9E7290C05-001/control-001/cores/collection1/data
   [junit4]   2> 444649 INFO  (coreLoadExecutor-927-thread-1-processing-n:127.0.0.1:48143_) [n:127.0.0.1:48143_ c:control_collection s:shard1 r:core_node1 x:collection1] o.a.s.c.SolrCore New index directory detected: old=null new=/export/home/jenkins/workspace/Lucene-Solr-5.x-Solaris/solr/build/solr-core/test/J1/../../../../../../../../../../export/home/jenkins/workspace/Lucene-Solr-5.x-Solaris/solr/build/solr-core/test/J1/temp/solr.cloud.CustomCollectionTest_8AF90EA9E7290C05-001/control-001/cores/collection1/data/index/
   [junit4]   2> 444649 WARN  (coreLoadExecutor-927-thread-1-processing-n:127.0.0.1:48143_) [n:127.0.0.1:48143_ c:control_collection s:shard1 r:core_node1 x:collection1] o.a.s.c.SolrCore [collection1] Solr index directory '/export/home/jenkins/workspace/Lucene-Solr-5.x-Solaris/solr/build/solr-core/test/J1/../../../../../../../../../../export/home/jenkins/workspace/Lucene-Solr-5.x-Solaris/solr/build/solr-core/test/J1/temp/solr.cloud.CustomCollectionTest_8AF90EA9E7290C05-001/control-001/cores/collection1/data/index' doesn't exist. Creating new index...
   [junit4]   2> 444649 INFO  (coreLoadExecutor-927-thread-1-processing-n:127.0.0.1:48143_) [n:127.0.0.1:48143_ c:control_collection s:shard1 r:core_node1 x:collection1] o.a.s.c.CachingDirectoryFactory return new directory for /export/home/jenkins/workspace/Lucene-Solr-5.x-Solaris/solr/build/solr-core/test/J1/../../../../../../../../../../export/home/jenkins/workspace/Lucene-Solr-5.x-Solaris/solr/build/solr-core/test/J1/temp/solr.cloud.CustomCollectionTest_8AF90EA9E7290C05-001/control-001/cores/collection1/data/index
   [junit4]   2> 444649 INFO  (coreLoadExecutor-927-thread-1-processing-n:127.0.0.1:48143_) [n:127.0.0.1:48143_ c:control_collection s:shard1 r:core_node1 x:collection1] o.a.s.u.RandomMergePolicy RandomMergePolicy wrapping class org.apache.lucene.index.TieredMergePolicy: [TieredMergePolicy: maxMergeAtOnce=28, maxMergeAtOnceExplicit=17, maxMergedSegmentMB=29.6044921875, floorSegmentMB=0.271484375, forceMergeDeletesPctAllowed=26.246877079082598, segmentsPerTier=37.0, maxCFSSegmentSizeMB=8.796093022207999E12, noCFSRatio=0.0
   [junit4]   2> 444650 INFO  (coreLoadExecutor-927-thread-1-processing-n:127.0.0.1:48143_) [n:127.0.0.1:48143_ c:control_collection s:shard1 r:core_node1 x:collection1] o.a.s.c.SolrCore SolrDeletionPolicy.onCommit: commits: num=1
   [junit4]   2> 	commit{dir=MockDirectoryWrapper(RAMDirectory@1b83dbe lockFactory=org.apache.lucene.store.SingleInstanceLockFactory@dd9329),segFN=segments_1,generation=1}
   [junit4]   2> 444650 INFO  (coreLoadExecutor-927-thread-1-processing-n:127.0.0.1:48143_) [n:127.0.0.1:48143_ c:control_collection s:shard1 r:core_node1 x:collection1] o.a.s.c.SolrCore newest commit generation = 1
   [junit4]   2> 444653 INFO  (OldIndexDirectoryCleanupThreadForCore-collection1) [n:127.0.0.1:48143_ c:control_collection s:shard1 r:core_node1 x:collection1] o.a.s.c.SolrCore Looking for old index directories to cleanup for core collection1 in /export/home/jenkins/workspace/Lucene-Solr-5.x-Solaris/solr/build/solr-core/test/J1/../../../../../../../../../../export/home/jenkins/workspace/Lucene-Solr-5.x-Solaris/solr/build/solr-core/test/J1/temp/solr.cloud.CustomCollectionTest_8AF90EA9E7290C05-001/control-001/cores/collection1/data/
   [junit4]   2> 444653 WARN  (OldIndexDirectoryCleanupThreadForCore-collection1) [n:127.0.0.1:48143_ c:control_collection s:shard1 r:core_node1 x:collection1] o.a.s.c.DirectoryFactory /export/home/jenkins/workspace/Lucene-Solr-5.x-Solaris/solr/build/solr-core/test/J1/../../../../../../../../../../export/home/jenkins/workspace/Lucene-Solr-5.x-Solaris/solr/build/solr-core/test/J1/temp/solr.cloud.CustomCollectionTest_8AF90EA9E7290C05-001/control-001/cores/collection1/data/ does not point to a valid data directory; skipping clean-up of old index directories.
   [junit4]   2> 444656 INFO  (coreLoadExecutor-927-thread-1-processing-n:127.0.0.1:48143_) [n:127.0.0.1:48143_ c:control_collection s:shard1 r:core_node1 x:collection1] o.a.s.u.p.UpdateRequestProcessorChain creating updateRequestProcessorChain "nodistrib"
   [junit4]   2> 444656 INFO  (coreLoadExecutor-927-thread-1-processing-n:127.0.0.1:48143_) [n:127.0.0.1:48143_ c:control_collection s:shard1 r:core_node1 x:collection1] o.a.s.u.p.UpdateRequestProcessorChain creating updateRequestProcessorChain "dedupe"
   [junit4]   2> 444656 INFO  (coreLoadExecutor-927-thread-1-processing-n:127.0.0.1:48143_) [n:127.0.0.1:48143_ c:control_collection s:shard1 r:core_node1 x:collection1] o.a.s.u.p.UpdateRequestProcessorChain inserting DistributedUpdateProcessorFactory into updateRequestProcessorChain "dedupe"
   [junit4]   2> 444657 INFO  (coreLoadExecutor-927-thread-1-processing-n:127.0.0.1:48143_) [n:127.0.0.1:48143_ c:control_collection s:shard1 r:core_node1 x:collection1] o.a.s.u.p.UpdateRequestProcessorChain creating updateRequestProcessorChain "stored_sig"
   [junit4]   2> 444657 INFO  (coreLoadExecutor-927-thread-1-processing-n:127.0.0.1:48143_) [n:127.0.0.1:48143_ c:control_collection s:shard1 r:core_node1 x:collection1] o.a.s.u.p.UpdateRequestProcessorChain inserting DistributedUpdateProcessorFactory into updateRequestProcessorChain "stored_sig"
   [junit4]   2> 444657 INFO  (coreLoadExecutor-927-thread-1-processing-n:127.0.0.1:48143_) [n:127.0.0.1:48143_ c:control_collection s:shard1 r:core_node1 x:collection1] o.a.s.u.p.UpdateRequestProcessorChain creating updateRequestProcessorChain "distrib-dup-test-chain-explicit"
   [junit4]   2> 444657 INFO  (coreLoadExecutor-927-thread-1-processing-n:127.0.0.1:48143_) [n:127.0.0.1:48143_ c:control_collection s:shard1 r:core_node1 x:collection1] o.a.s.u.p.UpdateRequestProcessorChain creating updateRequestProcessorChain "distrib-dup-test-chain-implicit"
   [junit4]   2> 444657 INFO  (coreLoadExecutor-927-thread-1-processing-n:127.0.0.1:48143_) [n:127.0.0.1:48143_ c:control_collection s:shard1 r:core_node1 x:collection1] o.a.s.u.p.UpdateRequestProcessorChain inserting DistributedUpdateProcessorFactory into updateRequestProcessorChain "distrib-dup-test-chain-implicit"
   [junit4]   2> 444657 INFO  (coreLoadExecutor-927-thread-1-processing-n:127.0.0.1:48143_) [n:127.0.0.1:48143_ c:control_collection s:shard1 r:core_node1 x:collection1] o.a.s.c.SolrCore no updateRequestProcessorChain defined as default, creating implicit default
   [junit4]   2> 444658 WARN  (coreLoadExecutor-927-thread-1-processing-n:127.0.0.1:48143_) [n:127.0.0.1:48143_ c:control_collection s:shard1 r:core_node1 x:collection1] o.a.s.c.RequestHandlers INVALID paramSet a in requestHandler {type = requestHandler,name = /dump,class = DumpRequestHandler,args = {defaults={a=A,b=B}}}
   [junit4]   2> 444670 INFO  (coreLoadExecutor-927-thread-1-processing-n:127.0.0.1:48143_) [n:127.0.0.1:48143_ c:control_collection s:shard1 r:core_node1 x:collection1] o.a.s.h.l.XMLLoader xsltCacheLifetimeSeconds=60
   [junit4]   2> 444673 INFO  (coreLoadExecutor-927-thread-1-processing-n:127.0.0.1:48143_) [n:127.0.0.1:48143_ c:control_collection s:shard1 r:core_node1 x:collection1] o.a.s.h.l.XMLLoader xsltCacheLifetimeSeconds=60
   [junit4]   2> 444675 INFO  (coreLoadExecutor-927-thread-1-processing-n:127.0.0.1:48143_) [n:127.0.0.1:48143_ c:control_collection s:shard1 r:core_node1 x:collection1] o.a.s.h.l.XMLLoader xsltCacheLifetimeSeconds=60
   [junit4]   2> 444678 INFO  (coreLoadExecutor-927-thread-1-processing-n:127.0.0.1:48143_) [n:127.0.0.1:48143_ c:control_collection s:shard1 r:core_node1 x:collection1] o.a.s.h.l.XMLLoader xsltCacheLifetimeSeconds=60
   [junit4]   2> 444702 INFO  (coreLoadExecutor-927-thread-1-processing-n:127.0.0.1:48143_) [n:127.0.0.1:48143_ c:control_collection s:shard1 r:core_node1 x:collection1] o.a.s.c.RequestHandlers Registered paths: /admin/properties,/admin/ping,/admin/mbeans,/update,/admin/segments,/admin/logging,/get,/replication,/admin/threads,/schema,standard,/update/json,/update/csv,/config,/update/json/docs,/admin/plugins,/dump,/admin/system,/admin/luke,/admin/file
   [junit4]   2> 444705 INFO  (coreLoadExecutor-927-thread-1-processing-n:127.0.0.1:48143_) [n:127.0.0.1:48143_ c:control_collection s:shard1 r:core_node1 x:collection1] o.a.s.c.SolrCore Using default statsCache cache: org.apache.solr.search.stats.LocalStatsCache
   [junit4]   2> 444706 INFO  (coreLoadExecutor-927-thread-1-processing-n:127.0.0.1:48143_) [n:127.0.0.1:48143_ c:control_collection s:shard1 r:core_node1 x:collection1] o.a.s.u.UpdateHandler Using UpdateLog implementation: org.apache.solr.update.UpdateLog
   [junit4]   2> 444706 INFO  (coreLoadExecutor-927-thread-1-processing-n:127.0.0.1:48143_) [n:127.0.0.1:48143_ c:control_collection s:shard1 r:core_node1 x:collection1] o.a.s.u.UpdateLog Initializing UpdateLog: dataDir= defaultSyncLevel=FLUSH numRecordsToKeep=100 maxNumLogsToKeep=10 numVersionBuckets=65536
   [junit4]   2> 444708 INFO  (coreLoadExecutor-927-thread-1-processing-n:127.0.0.1:48143_) [n:127.0.0.1:48143_ c:control_collection s:shard1 r:core_node1 x:collection1] o.a.s.c.SolrCore Hard AutoCommit: disabled
   [junit4]   2> 444708 INFO  (coreLoadExecutor-927-thread-1-processing-n:127.0.0.1:48143_) [n:127.0.0.1:48143_ c:control_collection s:shard1 r:core_node1 x:collection1] o.a.s.c.SolrCore Soft AutoCommit: disabled
   [junit4]   2> 444708 INFO  (coreLoadExecutor-927-thread-1-processing-n:127.0.0.1:48143_) [n:127.0.0.1:48143_ c:control_collection s:shard1 r:core_node1 x:collection1] o.a.s.u.RandomMergePolicy RandomMergePolicy wrapping class org.apache.lucene.index.LogByteSizeMergePolicy: [LogByteSizeMergePolicy: minMergeSize=1677721, mergeFactor=34, maxMergeSize=2147483648, maxMergeSizeForForcedMerge=9223372036854775807, calibrateSizeByDeletes=true, maxMergeDocs=2147483647, maxCFSSegmentSizeMB=8.796093022207999E12, noCFSRatio=0.26904973513818187]
   [junit4]   2> 444708 INFO  (coreLoadExecutor-927-thread-1-processing-n:127.0.0.1:48143_) [n:127.0.0.1:48143_ c:control_collection s:shard1 r:core_node1 x:collection1] o.a.s.c.SolrCore SolrDeletionPolicy.onInit: commits: num=1
   [junit4]   2> 	commit{dir=MockDirectoryWrapper(RAMDirectory@1b83dbe lockFactory=org.apache.lucene.store.SingleInstanceLockFactory@dd9329),segFN=segments_1,generation=1}
   [junit4]   2> 444709 INFO  (coreLoadExecutor-927-thread-1-processing-n:127.0.0.1:48143_) [n:127.0.0.1:48143_ c:control_collection s:shard1 r:core_node1 x:collection1] o.a.s.c.SolrCore newest commit generation = 1
   [junit4]   2> 444709 INFO  (coreLoadExecutor-927-thread-1-processing-n:127.0.0.1:48143_) [n:127.0.0.1:48143_ c:control_collection s:shard1 r:core_node1 x:collection1] o.a.s.s.SolrIndexSearcher Opening Searcher@5db398[collection1] main
   [junit4]   2> 444709 INFO  (coreLoadExecutor-927-thread-1-processing-n:127.0.0.1:48143_) [n:127.0.0.1:48143_ c:control_collection s:shard1 r:core_node1 x:collection1] o.a.s.c.c.ZkStateReader Load collection config from:/collections/control_collection
   [junit4]   2> 444711 INFO  (coreLoadExecutor-927-thread-1-processing-n:127.0.0.1:48143_) [n:127.0.0.1:48143_ c:control_collection s:shard1 r:core_node1 x:collection1] o.a.s.c.c.ZkStateReader path=/collections/control_collection configName=conf1 specified config exists in ZooKeeper
   [junit4]   2> 444711 INFO  (coreLoadExecutor-927-thread-1-processing-n:127.0.0.1:48143_) [n:127.0.0.1:48143_ c:control_collection s:shard1 r:core_node1 x:collection1] o.a.s.r.ManagedResourceStorage Setting up ZooKeeper-based storage for the RestManager with znodeBase: /configs/conf1
   [junit4]   2> 444712 INFO  (coreLoadExecutor-927-thread-1-processing-n:127.0.0.1:48143_) [n:127.0.0.1:48143_ c:control_collection s:shard1 r:core_node1 x:collection1] o.a.s.r.ManagedResourceStorage Configured ZooKeeperStorageIO with znodeBase: /configs/conf1
   [junit4]   2> 444712 INFO  (coreLoadExecutor-927-thread-1-processing-n:127.0.0.1:48143_) [n:127.0.0.1:48143_ c:control_collection s:shard1 r:core_node1 x:collection1] o.a.s.r.RestManager Initializing RestManager with initArgs: {}
   [junit4]   2> 444712 INFO  (coreLoadExecutor-927-thread-1-processing-n:127.0.0.1:48143_) [n:127.0.0.1:48143_ c:control_collection s:shard1 r:core_node1 x:collection1] o.a.s.r.ManagedResourceStorage Reading _rest_managed.json using ZooKeeperStorageIO:path=/configs/conf1
   [junit4]   2> 444713 INFO  (coreLoadExecutor-927-thread-1-processing-n:127.0.0.1:48143_) [n:127.0.0.1:48143_ c:control_collection s:shard1 r:core_node1 x:collection1] o.a.s.r.ManagedResourceStorage No data found for znode /configs/conf1/_rest_managed.json
   [junit4]   2> 444713 INFO  (coreLoadExecutor-927-thread-1-processing-n:127.0.0.1:48143_) [n:127.0.0.1:48143_ c:control_collection s:shard1 r:core_node1 x:collection1] o.a.s.r.ManagedResourceStorage Loaded null at path _rest_managed.json using ZooKeeperStorageIO:path=/configs/conf1
   [junit4]   2> 444713 INFO  (coreLoadExecutor-927-thread-1-processing-n:127.0.0.1:48143_) [n:127.0.0.1:48143_ c:control_collection s:shard1 r:core_node1 x:collection1] o.a.s.r.RestManager Initializing 0 registered ManagedResources
   [junit4]   2> 444713 INFO  (coreLoadExecutor-927-thread-1-processing-n:127.0.0.1:48143_) [n:127.0.0.1:48143_ c:control_collection s:shard1 r:core_node1 x:collection1] o.a.s.h.ReplicationHandler Commits will be reserved for  10000
   [junit4]   2> 444714 INFO  (searcherExecutor-928-thread-1-processing-r:core_node1 n:127.0.0.1:48143_ c:control_collection s:shard1 x:collection1) [n:127.0.0.1:48143_ c:control_collection s:shard1 r:core_node1 x:collection1] o.a.s.c.SolrCore [collection1] Registered new searcher Searcher@5db398[collection1] main{ExitableDirectoryReader(UninvertingDirectoryReader())}
   [junit4]   2> 444714 INFO  (coreLoadExecutor-927-thread-1-processing-n:127.0.0.1:48143_) [n:127.0.0.1:48143_ c:control_collection s:shard1 r:core_node1 x:collection1] o.a.s.u.UpdateLog Looking up max value of version field to seed version buckets
   [junit4]   2> 444714 INFO  (coreLoadExecutor-927-thread-1-processing-n:127.0.0.1:48143_) [n:127.0.0.1:48143_ c:control_collection s:shard1 r:core_node1 x:collection1] o.a.s.u.VersionInfo Refreshing highest value of _version_ for 65536 version buckets from index
   [junit4]   2> 444714 INFO  (coreLoadExecutor-927-thread-1-processing-n:127.0.0.1:48143_) [n:127.0.0.1:48143_ c:control_collection s:shard1 r:core_node1 x:collection1] o.a.s.u.VersionInfo No terms found for _version_, cannot seed version bucket highest value from index
   [junit4]   2> 444714 INFO  (coreLoadExecutor-927-thread-1-processing-n:127.0.0.1:48143_) [n:127.0.0.1:48143_ c:control_collection s:shard1 r:core_node1 x:collection1] o.a.s.u.UpdateLog Could not find max version in index or recent updates, using new clock 1519095022520107008
   [junit4]   2> 444716 INFO  (coreLoadExecutor-927-thread-1-processing-n:127.0.0.1:48143_) [n:127.0.0.1:48143_ c:control_collection s:shard1 r:core_node1 x:collection1] o.a.s.u.UpdateLog Took 1.0ms to seed version buckets with highest version 1519095022520107008
   [junit4]   2> 444716 INFO  (coreLoadExecutor-927-thread-1-processing-n:127.0.0.1:48143_) [n:127.0.0.1:48143_ c:control_collection s:shard1 r:core_node1 x:collection1] o.a.s.c.ZkController watch zkdir /configs/conf1
   [junit4]   2> 444718 INFO  (coreLoadExecutor-927-thread-1-processing-n:127.0.0.1:48143_) [n:127.0.0.1:48143_ c:control_collection s:shard1 r:core_node1 x:collection1] o.a.s.c.CoreContainer registering core: collection1
   [junit4]   2> 444718 INFO  (coreZkRegister-921-thread-1-processing-r:core_node1 n:127.0.0.1:48143_ c:control_collection s:shard1 x:collection1) [n:127.0.0.1:48143_ c:control_collection s:shard1 r:core_node1 x:collection1] o.a.s.c.ZkController Register replica - core:collection1 address:http://127.0.0.1:48143 collection:control_collection shard:shard1
   [junit4]   2> 444720 INFO  (coreZkRegister-921-thread-1-processing-r:core_node1 n:127.0.0.1:48143_ c:control_collection s:shard1 x:collection1) [n:127.0.0.1:48143_ c:control_collection s:shard1 r:core_node1 x:collection1] o.a.s.c.c.SolrZkClient makePath: /collections/control_collection/leader_elect/shard1/election
   [junit4]   2> 444728 INFO  (coreZkRegister-921-thread-1-processing-r:core_node1 n:127.0.0.1:48143_ c:control_collection s:shard1 x:collection1) [n:127.0.0.1:48143_ c:control_collection s:shard1 r:core_node1 x:collection1] o.a.s.c.LeaderElector Joined leadership election with path: /collections/control_collection/leader_elect/shard1/election/94943438721712132-core_node1-n_0000000000
   [junit4]   2> 444729 INFO  (coreZkRegister-921-thread-1-processing-r:core_node1 n:127.0.0.1:48143_ c:control_collection s:shard1 x:collection1) [n:127.0.0.1:48143_ c:control_collection s:shard1 r:core_node1 x:collection1] o.a.s.c.ShardLeaderElectionContext Running the leader process for shard shard1
   [junit4]   2> 444733 INFO  (coreZkRegister-921-thread-1-processing-r:core_node1 n:127.0.0.1:48143_ c:control_collection s:shard1 x:collection1) [n:127.0.0.1:48143_ c:control_collection s:shard1 r:core_node1 x:collection1] o.a.s.c.ShardLeaderElectionContext Enough replicas found to continue.
   [junit4]   2> 444733 INFO  (coreZkRegister-921-thread-1-processing-r:core_node1 n:127.0.0.1:48143_ c:control_collection s:shard1 x:collection1) [n:127.0.0.1:48143_ c:control_collection s:shard1 r:core_node1 x:collection1] o.a.s.c.ShardLeaderElectionContext I may be the new leader - try and sync
   [junit4]   2> 444733 INFO  (coreZkRegister-921-thread-1-processing-r:core_node1 n:127.0.0.1:48143_ c:control_collection s:shard1 x:collection1) [n:127.0.0.1:48143_ c:control_collection s:shard1 r:core_node1 x:collection1] o.a.s.c.SyncStrategy Sync replicas to http://127.0.0.1:48143/collection1/
   [junit4]   2> 444733 INFO  (coreZkRegister-921-thread-1-processing-r:core_node1 n:127.0.0.1:48143_ c:control_collection s:shard1 x:collection1) [n:127.0.0.1:48143_ c:control_collection s:shard1 r:core_node1 x:collection1] o.a.s.c.SyncStrategy Sync Success - now sync replicas to me
   [junit4]   2> 444733 INFO  (coreZkRegister-921-thread-1-processing-r:core_node1 n:127.0.0.1:48143_ c:control_collection s:shard1 x:collection1) [n:127.0.0.1:48143_ c:control_collection s:shard1 r:core_node1 x:collection1] o.a.s.c.SyncStrategy http://127.0.0.1:48143/collection1/ has no replicas
   [junit4]   2> 444734 INFO  (OverseerStateUpdate-94943438721712132-127.0.0.1:48143_-n_0000000000) [n:127.0.0.1:48143_    ] o.a.s.c.Overseer processMessage: queueSize: 1, message = {
   [junit4]   2>   "operation":"leader",
   [junit4]   2>   "shard":"shard1",
   [junit4]   2>   "collection":"control_collection"} current state version: 1
   [junit4]   2> 444751 INFO  (coreZkRegister-921-thread-1-processing-r:core_node1 n:127.0.0.1:48143_ c:control_collection s:shard1 x:collection1) [n:127.0.0.1:48143_ c:control_collection s:shard1 r:core_node1 x:collection1] o.a.s.c.c.SolrZkClient makePath: /collections/control_collection/leaders/shard1
   [junit4]   2> 444751 INFO  (zkCallback-661-thread-1-processing-n:127.0.0.1:48143_) [n:127.0.0.1:48143_    ] o.a.s.c.c.ZkStateReader A cluster state change: WatchedEvent state:SyncConnected type:NodeDataChanged path:/clusterstate.json, has occurred - updating... (live nodes size: 1)
   [junit4]   2> 444757 INFO  (coreZkRegister-921-thread-1-processing-r:core_node1 n:127.0.0.1:48143_ c:control_collection s:shard1 x:collection1) [n:127.0.0.1:48143_ c:control_collection s:shard1 r:core_node1 x:collection1] o.a.s.c.ShardLeaderElectionContextBase Creating leader registration node
   [junit4]   2> 444761 INFO  (coreZkRegister-921-thread-1-processing-r:core_node1 n:127.0.0.1:48143_ c:control_collection s:shard1 x:collection1) [n:127.0.0.1:48143_ c:control_collection s:shard1 r:core_node1 x:collection1] o.a.s.c.ShardLeaderElectionContext I am the new leader: http://127.0.0.1:48143/collection1/ shard1
   [junit4]   2> 444763 INFO  (OverseerStateUpdate-94943438721712132-127.0.0.1:48143_-n_0000000000) [n:127.0.0.1:48143_    ] o.a.s.c.Overseer processMessage: queueSize: 1, message = {
   [junit4]   2>   "operation":"leader",
   [junit4]   2>   "shard":"shard1",
   [junit4]   2>   "collection":"control_collection",
   [junit4]   2>   "base_url":"http://127.0.0.1:48143",
   [junit4]   2>   "core":"collection1",
   [junit4]   2>   "state":"active"} current state version: 2
   [junit4]   2> 444867 INFO  (zkCallback-661-thread-1-processing-n:127.0.0.1:48143_) [n:127.0.0.1:48143_    ] o.a.s.c.c.ZkStateReader A cluster state change: WatchedEvent state:SyncConnected type:NodeDataChanged path:/clusterstate.json, has occurred - updating... (live nodes size: 1)
   [junit4]   2> 444917 INFO  (coreZkRegister-921-thread-1-processing-r:core_node1 n:127.0.0.1:48143_ c:control_collection s:shard1 x:collection1) [n:127.0.0.1:48143_ c:control_collection s:shard1 r:core_node1 x:collection1] o.a.s.c.ZkController We are http://127.0.0.1:48143/collection1/ and leader is http://127.0.0.1:48143/collection1/
   [junit4]   2> 444918 INFO  (coreZkRegister-921-thread-1-processing-r:core_node1 n:127.0.0.1:48143_ c:control_collection s:shard1 x:collection1) [n:127.0.0.1:48143_ c:control_collection s:shard1 r:core_node1 x:collection1] o.a.s.c.ZkController No LogReplay needed for core=collection1 baseURL=http://127.0.0.1:48143
   [junit4]   2> 444918 INFO  (coreZkRegister-921-thread-1-processing-r:core_node1 n:127.0.0.1:48143_ c:control_collection s:shard1 x:collection1) [n:127.0.0.1:48143_ c:control_collection s:shard1 r:core_node1 x:collection1] o.a.s.c.ZkController I am the leader, no recovery necessary
   [junit4]   2> 444918 INFO  (coreZkRegister-921-thread-1-processing-r:core_node1 n:127.0.0.1:48143_ c:control_collection s:shard1 x:collection1) [n:127.0.0.1:48143_ c:control_collection s:shard1 r:core_node1 x:collection1] o.a.s.c.ZkController publishing state=active
   [junit4]   2> 444918 INFO  (coreZkRegister-921-thread-1-processing-r:core_node1 n:127.0.0.1:48143_ c:control_collection s:shard1 x:collection1) [n:127.0.0.1:48143_ c:control_collection s:shard1 r:core_node1 x:collection1] o.a.s.c.ZkController numShards not found on descriptor - reading it from system property
   [junit4]   2> 444922 INFO  (OverseerStateUpdate-94943438721712132-127.0.0.1:48143_-n_0000000000) [n:127.0.0.1:48143_    ] o.a.s.c.Overseer processMessage: queueSize: 1, message = {
   [junit4]   2>   "base_url":"http://127.0.0.1:48143",
   [junit4]   2>   "node_name":"127.0.0.1:48143_",
   [junit4]   2>   "collection":"control_collection",
   [junit4]   2>   "shard":"shard1",
   [junit4]   2>   "core":"collection1",
   [junit4]   2>   "core_node_name":"core_node1",
   [junit4]   2>   "operation":"state",
   [junit4]   2>   "state":"active",
   [junit4]   2>   "numShards":"1",
   [junit4]   2>   "roles":null} current state version: 3
   [junit4]   2> 444923 INFO  (OverseerStateUpdate-94943438721712132-127.0.0.1:48143_-n_0000000000) [n:127.0.0.1:48143_    ] o.a.s.c.o.ReplicaMutator Update state numShards=1 message={
   [junit4]   2>   "base_url":"http://127.0.0.1:48143",
   [junit4]   2>   "node_name":"127.0.0.1:48143_",
   [junit4]   2>   "collection":"control_collection",
   [junit4]   2>   "shard":"shard1",
   [junit4]   2>   "core":"collection1",
   [junit4]   2>   "core_node_name":"core_node1",
   [junit4]   2>   "operation":"state",
   [junit4]   2>   "state":"active",
   [junit4]   2>   "numShards":"1",
   [junit4]   2>   "roles":null}
   [junit4]   2> 445028 INFO  (zkCallback-661-thread-1-processing-n:127.0.0.1:48143_) [n:127.0.0.1:48143_    ] o.a.s.c.c.ZkStateReader A cluster state change: WatchedEvent state:SyncConnected type:NodeDataChanged path:/clusterstate.json, has occurred - updating... (live nodes size: 1)
   [junit4]   2> 445042 INFO  (TEST-CustomCollectionTest.test-seed#[8AF90EA9E7290C05]) [    ] o.a.s.c.c.SolrZkClient Using default ZkCredentialsProvider
   [junit4]   2> 445042 INFO  (TEST-CustomCollectionTest.test-seed#[8AF90EA9E7290C05]) [    ] o.a.s.c.c.ConnectionManager Waiting for client to connect to ZooKeeper
   [junit4]   2> 445044 INFO  (zkCallback-663-thread-1) [    ] o.a.s.c.c.ConnectionManager Watcher org.apache.solr.common.cloud.ConnectionManager@44a657 name:ZooKeeperConnection Watcher:127.0.0.1:58432/solr got event WatchedEvent state:SyncConnected type:None path:null path:null type:None
   [junit4]   2> 445044 INFO  (TEST-CustomCollectionTest.test-seed#[8AF90EA9E7290C05]) [    ] o.a.s.c.c.ConnectionManager Client is connected to ZooKeeper
   [junit4]   2> 445045 INFO  (TEST-CustomCollectionTest.test-seed#[8AF90EA9E7290C05]) [    ] o.a.s.c.c.SolrZkClient Using default ZkACLProvider
   [junit4]   2> 445045 INFO  (TEST-CustomCollectionTest.test-seed#[8AF90EA9E7290C05]) [    ] o.a.s.c.c.ZkStateReader Updating cluster state from ZooKeeper... 
   [junit4]   2> 445050 INFO  (TEST-CustomCollectionTest.test-seed#[8AF90EA9E7290C05]) [    ] o.a.s.c.ChaosMonkey monkey: init - expire sessions:false cause connection loss:false
   [junit4]   2> 445050 INFO  (TEST-CustomCollectionTest.test-seed#[8AF90EA9E7290C05]) [    ] o.a.s.c.AbstractFullDistribZkTestBase Creating collection1 with stateFormat=2
   [junit4]   2> 445050 INFO  (TEST-CustomCollectionTest.test-seed#[8AF90EA9E7290C05]) [    ] o.a.s.c.c.SolrZkClient Using default ZkCredentialsProvider
   [junit4]   2> 445051 INFO  (TEST-CustomCollectionTest.test-seed#[8AF90EA9E7290C05]) [    ] o.a.s.c.c.ConnectionManager Waiting for client to connect to ZooKeeper
   [junit4]   2> 445053 INFO  (zkCallback-664-thread-1) [    ] o.a.s.c.c.ConnectionManager Watcher org.apache.solr.common.cloud.ConnectionManager@735b21 name:ZooKeeperConnection Watcher:127.0.0.1:58432/solr got event WatchedEvent state:SyncConnected type:None path:null path:null type:None
   [junit4]   2> 445054 INFO  (TEST-CustomCollectionTest.test-seed#[8AF90EA9E7290C05]) [    ] o.a.s.c.c.ConnectionManager Client is connected to ZooKeeper
   [junit4]   2> 445055 INFO  (TEST-CustomCollectionTest.test-seed#[8AF90EA9E7290C05]) [    ] o.a.s.c.c.SolrZkClient Using default ZkACLProvider
   [junit4]   2> 445059 WARN  (NIOServerCxn.Factory:0.0.0.0/0.0.0.0:0) [    ] o.a.z.s.NIOServerCnxn caught end of stream exception
   [junit4]   2> EndOfStreamException: Unable to read additional data from client sessionid 0x1514e8df2c30006, likely client has closed socket
   [junit4]   2> 	at org.apache.zookeeper.server.NIOServerCnxn.doIO(NIOServerCnxn.java:228)
   [junit4]   2> 	at org.apache.zookeeper.server.NIOServerCnxnFactory.run(NIOServerCnxnFactory.java:208)
   [junit4]   2> 	at java.lang.Thread.run(Thread.java:745)
   [junit4]   2> 445061 INFO  (OverseerStateUpdate-94943438721712132-127.0.0.1:48143_-n_0000000000) [n:127.0.0.1:48143_    ] o.a.s.c.Overseer processMessage: queueSize: 1, message = {
   [junit4]   2>   "operation":"create",
   [junit4]   2>   "name":"collection1",
   [junit4]   2>   "numShards":"2",
   [junit4]   2>   "stateFormat":"2"} current state version: 4
   [junit4]   2> 445061 INFO  (OverseerStateUpdate-94943438721712132-127.0.0.1:48143_-n_0000000000) [n:127.0.0.1:48143_    ] o.a.s.c.o.ClusterStateMutator building a new cName: collection1
   [junit4]   2> 445173 INFO  (OverseerStateUpdate-94943438721712132-127.0.0.1:48143_-n_0000000000) [n:127.0.0.1:48143_    ] o.a.s.c.o.ZkStateWriter going to create_collection /collections/collection1/state.json
   [junit4]   2> 445238 INFO  (TEST-CustomCollectionTest.test-seed#[8AF90EA9E7290C05]) [    ] o.a.s.SolrTestCaseJ4 Writing core.properties file to /export/home/jenkins/workspace/Lucene-Solr-5.x-Solaris/solr/build/solr-core/test/J1/temp/solr.cloud.CustomCollectionTest_8AF90EA9E7290C05-001/shard-1-001/cores/collection1
   [junit4]   2> 445239 INFO  (TEST-CustomCollectionTest.test-seed#[8AF90EA9E7290C05]) [    ] o.a.s.c.AbstractFullDistribZkTestBase create jetty 1 in directory /export/home/jenkins/workspace/Lucene-Solr-5.x-Solaris/solr/build/solr-core/test/J1/temp/solr.cloud.CustomCollectionTest_8AF90EA9E7290C05-001/shard-1-001
   [junit4]   2> 445240 INFO  (TEST-CustomCollectionTest.test-seed#[8AF90EA9E7290C05]) [    ] o.e.j.s.Server jetty-9.2.13.v20150730
   [junit4]   2> 445242 INFO  (TEST-CustomCollectionTest.test-seed#[8AF90EA9E7290C05]) [    ] o.e.j.s.h.ContextHandler Started o.e.j.s.ServletContextHandler@ca633b{/,null,AVAILABLE}
   [junit4]   2> 445243 INFO  (TEST-CustomCollectionTest.test-seed#[8AF90EA9E7290C05]) [    ] o.e.j.s.ServerConnector Started ServerConnector@138c43a{HTTP/1.1}{127.0.0.1:40697}
   [junit4]   2> 445243 INFO  (TEST-CustomCollectionTest.test-seed#[8AF90EA9E7290C05]) [    ] o.e.j.s.Server Started @447892ms
   [junit4]   2> 445243 INFO  (TEST-CustomCollectionTest.test-seed#[8AF90EA9E7290C05]) [    ] o.a.s.c.s.e.JettySolrRunner Jetty properties: {solrconfig=solrconfig.xml, hostContext=/, solr.data.dir=/export/home/jenkins/workspace/Lucene-Solr-5.x-Solaris/solr/build/solr-core/test/J1/temp/solr.cloud.CustomCollectionTest_8AF90EA9E7290C05-001/tempDir-001/jetty1, hostPort=40697, coreRootDirectory=/export/home/jenkins/workspace/Lucene-Solr-5.x-Solaris/solr/build/solr-core/test/J1/../../../../../../../../../../export/home/jenkins/workspace/Lucene-Solr-5.x-Solaris/solr/build/solr-core/test/J1/temp/solr.cloud.CustomCollectionTest_8AF90EA9E7290C05-001/shard-1-001/cores}
   [junit4]   2> 445243 INFO  (TEST-CustomCollectionTest.test-seed#[8AF90EA9E7290C05]) [    ] o.a.s.s.SolrDispatchFilter SolrDispatchFilter.init(): sun.misc.Launcher$AppClassLoader@1e84195
   [junit4]   2> 445243 INFO  (TEST-CustomCollectionTest.test-seed#[8AF90EA9E7290C05]) [    ] o.a.s.c.SolrResourceLoader new SolrResourceLoader for directory: '/export/home/jenkins/workspace/Lucene-Solr-5.x-Solaris/solr/build/solr-core/test/J1/temp/solr.cloud.CustomCollectionTest_8AF90EA9E7290C05-001/shard-1-001'
   [junit4]   2> 445243 INFO  (TEST-CustomCollectionTest.test-seed#[8AF90EA9E7290C05]) [    ] o.a.s.c.SolrResourceLoader JNDI not configured for solr (NoInitialContextEx)
   [junit4]   2> 445243 INFO  (TEST-CustomCollectionTest.test-seed#[8AF90EA9E7290C05]) [    ] o.a.s.c.SolrResourceLoader solr home defaulted to 'solr/' (could not find system property or JNDI)
   [junit4]   2> 445244 INFO  (TEST-CustomCollectionTest.test-seed#[8AF90EA9E7290C05]) [    ] o.a.s.c.c.SolrZkClient Using default ZkCredentialsProvider
   [junit4]   2> 445244 INFO  (TEST-CustomCollectionTest.test-seed#[8AF90EA9E7290C05]) [    ] o.a.s.c.c.ConnectionManager Waiting for client to connect to ZooKeeper
   [junit4]   2> 445246 INFO  (zkCallback-665-thread-1) [    ] o.a.s.c.c.ConnectionManager Watcher org.apache.solr.common.cloud.ConnectionManager@e31602 name:ZooKeeperConnection Watcher:127.0.0.1:58432/solr got event WatchedEvent state:SyncConnected type:None path:null path:null type:None
   [junit4]   2> 445246 INFO  (TEST-CustomCollectionTest.test-seed#[8AF90EA9E7290C05]) [    ] o.a.s.c.c.ConnectionManager Client is connected to ZooKeeper
   [junit4]   2> 445247 INFO  (TEST-CustomCollectionTest.test-seed#[8AF90EA9E7290C05]) [    ] o.a.s.c.c.SolrZkClient Using default ZkACLProvider
   [junit4]   2> 445248 INFO  (TEST-CustomCollectionTest.test-seed#[8AF90EA9E7290C05]) [    ] o.a.s.s.SolrDispatchFilter Loading solr.xml from SolrHome (not found in ZooKeeper)
   [junit4]   2> 445248 INFO  (TEST-CustomCollectionTest.test-seed#[8AF90EA9E7290C05]) [    ] o.a.s.c.SolrXmlConfig Loading container configuration from /export/home/jenkins/workspace/Lucene-Solr-5.x-Solaris/solr/build/solr-core/test/J1/temp/solr.cloud.CustomCollectionTest_8AF90EA9E7290C05-001/shard-1-001/solr.xml
   [junit4]   2> 445284 INFO  (TEST-CustomCollectionTest.test-seed#[8AF90EA9E7290C05]) [    ] o.a.s.c.CoresLocator Config-defined core root directory: /export/home/jenkins/workspace/Lucene-Solr-5.x-Solaris/solr/build/solr-core/test/J1/../../../../../../../../../../export/home/jenkins/workspace/Lucene-Solr-5.x-Solaris/solr/build/solr-core/test/J1/temp/solr.cloud.CustomCollectionTest_8AF90EA9E7290C05-001/shard-1-001/cores
   [junit4]   2> 445284 INFO  (TEST-CustomCollectionTest.test-seed#[8AF90EA9E7290C05]) [    ] o.a.s.c.CoreContainer New CoreContainer 29536137
   [junit4]   2> 445284 INFO  (TEST-CustomCollectionTest.test-seed#[8AF90EA9E7290C05]) [    ] o.a.s.c.CoreContainer Loading cores into CoreContainer [instanceDir=/export/home/jenkins/workspace/Lucene-Solr-5.x-Solaris/solr/build/solr-core/test/J1/temp/solr.cloud.CustomCollectionTest_8AF90EA9E7290C05-001/shard-1-001]
   [junit4]   2> 445284 WARN  (TEST-CustomCollectionTest.test-seed#[8AF90EA9E7290C05]) [    ] o.a.s.c.CoreContainer Couldn't add files from /export/home/jenkins/workspace/Lucene-Solr-5.x-Solaris/solr/build/solr-core/test/J1/temp/solr.cloud.CustomCollectionTest_8AF90EA9E7290C05-001/shard-1-001/lib to classpath: /export/home/jenkins/workspace/Lucene-Solr-5.x-Solaris/solr/build/solr-core/test/J1/temp/solr.cloud.CustomCollectionTest_8AF90EA9E7290C05-001/shard-1-001/lib
   [junit4]   2> 445285 INFO  (TEST-CustomCollectionTest.test-seed#[8AF90EA9E7290C05]) [    ] o.a.s.h.c.HttpShardHandlerFactory created with socketTimeout : 90000,urlScheme : ,connTimeout : 15000,maxConnectionsPerHost : 20,maxConnections : 10000,corePoolSize : 0,maximumPoolSize : 2147483647,maxThreadIdleTime : 5,sizeOfQueue : -1,fairnessPolicy : false,useRetries : false,
   [junit4]   2> 445287 INFO  (TEST-CustomCollectionTest.test-seed#[8AF90EA9E7290C05]) [    ] o.a.s.u.UpdateShardHandler Creating UpdateShardHandler HTTP client with params: socketTimeout=340000&connTimeout=45000&retry=true
   [junit4]   2> 445287 INFO  (TEST-CustomCollectionTest.test-seed#[8AF90EA9E7290C05]) [    ] o.a.s.l.LogWatcher SLF4J impl is org.slf4j.impl.Log4jLoggerFactory
   [junit4]   2> 445287 INFO  (TEST-CustomCollectionTest.test-seed#[8AF90EA9E7290C05]) [    ] o.a.s.l.LogWatcher Registering Log Listener [Log4j (org.slf4j.impl.Log4jLoggerFactory)]
   [junit4]   2> 445288 INFO  (TEST-CustomCollectionTest.test-seed#[8AF90EA9E7290C05]) [    ] o.a.s.c.ZkContainer Zookeeper client=127.0.0.1:58432/solr
   [junit4]   2> 445288 INFO  (TEST-CustomCollectionTest.test-seed#[8AF90EA9E7290C05]) [    ] o.a.s.c.ZkController zkHost includes chroot
   [junit4]   2> 445288 INFO  (TEST-CustomCollectionTest.test-seed#[8AF90EA9E7290C05]) [    ] o.a.s.c.c.SolrZkClient Using default ZkCredentialsProvider
   [junit4]   2> 445288 INFO  (TEST-CustomCollectionTest.test-seed#[8AF90EA9E7290C05]) [    ] o.a.s.c.c.ConnectionManager Waiting for client to connect to ZooKeeper
   [junit4]   2> 445290 INFO  (zkCallback-667-thread-1) [    ] o.a.s.c.c.ConnectionManager Watcher org.apache.solr.common.cloud.ConnectionManager@1bb9dac name:ZooKeeperConnection Watcher:127.0.0.1:58432 got event WatchedEvent state:SyncConnected type:None path:null path:null type:None
   [junit4]   2> 445291 INFO  (TEST-CustomCollectionTest.test-seed#[8AF90EA9E7290C05]) [    ] o.a.s.c.c.ConnectionManager Client is connected to ZooKeeper
   [junit4]   2> 445291 INFO  (TEST-CustomCollectionTest.test-seed#[8AF90EA9E7290C05]) [    ] o.a.s.c.c.SolrZkClient Using default ZkACLProvider
   [junit4]   2> 445294 INFO  (TEST-CustomCollectionTest.test-seed#[8AF90EA9E7290C05]) [n:127.0.0.1:40697_    ] o.a.s.c.c.ConnectionManager Waiting for client to connect to ZooKeeper
   [junit4]   2> 445296 INFO  (zkCallback-668-thread-1-processing-n:127.0.0.1:40697_) [n:127.0.0.1:40697_    ] o.a.s.c.c.ConnectionManager Watcher org.apache.solr.common.cloud.ConnectionManager@e561d7 name:ZooKeeperConnection Watcher:127.0.0.1:58432/solr got event WatchedEvent state:SyncConnected type:None path:null path:null type:None
   [junit4]   2> 445296 INFO  (TEST-CustomCollectionTest.test-seed#[8AF90EA9E7290C05]) [n:127.0.0.1:40697_    ] o.a.s.c.c.ConnectionManager Client is connected to ZooKeeper
   [junit4]   2> 445306 INFO  (TEST-CustomCollectionTest.test-seed#[8AF90EA9E7290C05]) [n:127.0.0.1:40697_    ] o.a.s.c.c.ZkStateReader Updating cluster state from ZooKeeper... 
   [junit4]   2> 446319 INFO  (TEST-CustomCollectionTest.test-seed#[8AF90EA9E7290C05]) [n:127.0.0.1:40697_    ] o.a.s.c.ZkController Register node as live in ZooKeeper:/live_nodes/127.0.0.1:40697_
   [junit4]   2> 446320 INFO  (TEST-CustomCollectionTest.test-seed#[8AF90EA9E7290C05]) [n:127.0.0.1:40697_    ] o.a.s.c.c.SolrZkClient makePath: /live_nodes/127.0.0.1:40697_
   [junit4]   2> 446322 INFO  (zkCallback-663-thread-1) [    ] o.a.s.c.c.ZkStateReader A live node change: WatchedEvent state:SyncConnected type:NodeChildrenChanged path:/live_nodes, has occurred - updating... (live nodes size: 1)
   [junit4]   2> 446322 INFO  (zkCallback-661-thread-1-processing-n:127.0.0.1:48143_) [n:127.0.0.1:48143_    ] o.a.s.c.c.ZkStateReader A live node change: WatchedEvent state:SyncConnected type:NodeChildrenChanged path:/live_nodes, has occurred - updating... (live nodes size: 1)
   [junit4]   2> 446322 INFO  (zkCallback-668-thread-1-processing-n:127.0.0.1:40697_) [n:127.0.0.1:40697_    ] o.a.s.c.c.ZkStateReader A live node change: WatchedEvent state:SyncConnected type:NodeChildrenChanged path:/live_nodes, has occurred - updating... (live nodes size: 1)
   [junit4]   2> 446325 INFO  (TEST-CustomCollectionTest.test-seed#[8AF90EA9E7290C05]) [n:127.0.0.1:40697_    ] o.a.s.c.Overseer Overseer (id=null) closing
   [junit4]   2> 446325 INFO  (TEST-CustomCollectionTest.test-seed#[8AF90EA9E7290C05]) [n:127.0.0.1:40697_    ] o.a.s.c.LeaderElector Joined leadership election with path: /overseer_elect/election/94943438721712137-127.0.0.1:40697_-n_0000000001
   [junit4]   2> 446327 INFO  (TEST-CustomCollectionTest.test-seed#[8AF90EA9E7290C05]) [n:127.0.0.1:40697_    ] o.a.s.c.LeaderElector Watching path /overseer_elect/election/94943438721712132-127.0.0.1:48143_-n_0000000000 to know if I could be the leader
   [junit4]   2> 446350 INFO  (TEST-CustomCollectionTest.test-seed#[8AF90EA9E7290C05]) [n:127.0.0.1:40697_    ] o.a.s.c.CoreContainer Security conf doesn't exist. Skipping setup for authorization module.
   [junit4]   2> 446350 INFO  (TEST-CustomCollectionTest.test-seed#[8AF90EA9E7290C05]) [n:127.0.0.1:40697_    ] o.a.s.c.CoreContainer No authentication plugin used.
   [junit4]   2> 446352 INFO  (TEST-CustomCollectionTest.test-seed#[8AF90EA9E7290C05]) [n:127.0.0.1:40697_    ] o.a.s.c.CoresLocator Looking for core definitions underneath /export/home/jenkins/workspace/Lucene-Solr-5.x-Solaris/solr/build/solr-core/test/J1/../../../../../../../../../../export/home/jenkins/workspace/Lucene-Solr-5.x-Solaris/solr/build/solr-core/test/J1/temp/solr.cloud.CustomCollectionTest_8AF90EA9E7290C05-001/shard-1-001/cores
   [junit4]   2> 446353 INFO  (TEST-CustomCollectionTest.test-seed#[8AF90EA9E7290C05]) [n:127.0.0.1:40697_    ] o.a.s.c.SolrCore Created CoreDescriptor: {shard=, config=solrconfig.xml, schema=schema.xml, absoluteInstDir=/export/home/jenkins/workspace/Lucene-Solr-5.x-Solaris/solr/build/solr-core/test/J1/../../../../../../../../../../export/home/jenkins/workspace/Lucene-Solr-5.x-Solaris/solr/build/solr-core/test/J1/temp/solr.cloud.CustomCollectionTest_8AF90EA9E7290C05-001/shard-1-001/cores/collection1/, name=collection1, configSetProperties=configsetprops.json, dataDir=data/, transient=false, instanceDir=/export/home/jenkins/workspace/Lucene-Solr-5.x-Solaris/solr/build/solr-core/test/J1/../../../../../../../../../../export/home/jenkins/workspace/Lucene-Solr-5.x-Solaris/solr/build/solr-core/test/J1/temp/solr.cloud.CustomCollectionTest_8AF90EA9E7290C05-001/shard-1-001/cores/collection1, loadOnStartup=true, coreNodeName=, collection=collection1}
   [junit4]   2> 446353 INFO  (TEST-CustomCollectionTest.test-seed#[8AF90EA9E7290C05]) [n:127.0.0.1:40697_    ] o.a.s.c.CoresLocator Found core collection1 in /export/home/jenkins/workspace/Lucene-Solr-5.x-Solaris/solr/build/solr-core/test/J1/../../../../../../../../../../export/home/jenkins/workspace/Lucene-Solr-5.x-Solaris/solr/build/solr-core/test/J1/temp/solr.cloud.CustomCollectionTest_8AF90EA9E7290C05-001/shard-1-001/cores/collection1/
   [junit4]   2> 446353 INFO  (TEST-CustomCollectionTest.test-seed#[8AF90EA9E7290C05]) [n:127.0.0.1:40697_    ] o.a.s.c.CoresLocator Found 1 core definitions
   [junit4]   2> 446355 INFO  (TEST-CustomCollectionTest.test-seed#[8AF90EA9E7290C05]) [n:127.0.0.1:40697_    ] o.a.s.s.SolrDispatchFilter user.dir=/export/home/jenkins/workspace/Lucene-Solr-5.x-Solaris/solr/build/solr-core/test/J1
   [junit4]   2> 446355 INFO  (TEST-CustomCollectionTest.test-seed#[8AF90EA9E7290C05]) [n:127.0.0.1:40697_    ] o.a.s.s.SolrDispatchFilter SolrDispatchFilter.init() done
   [junit4]   2> 446356 INFO  (coreLoadExecutor-938-thread-1-processing-n:127.0.0.1:40697_) [n:127.0.0.1:40697_ c:collection1   x:collection1] o.a.s.c.ZkController publishing state=down
   [junit4]   2> 446356 INFO  (coreLoadExecutor-938-thread-1-processing-n:127.0.0.1:40697_) [n:127.0.0.1:40697_ c:collection1   x:collection1] o.a.s.c.ZkController numShards not found on descriptor - reading it from system property
   [junit4]   2> 446359 INFO  (coreLoadExecutor-938-thread-1-processing-n:127.0.0.1:40697_) [n:127.0.0.1:40697_ c:collection1   x:collection1] o.a.s.c.ZkController Registering watch for collection collection1
   [junit4]   2> 446359 INFO  (coreLoadExecutor-938-thread-1-processing-n:127.0.0.1:40697_) [n:127.0.0.1:40697_ c:collection1   x:collection1] o.a.s.c.c.ZkStateReader addZkWatch collection1
   [junit4]   2> 446359 INFO  (OverseerStateUpdate-94943438721712132-127.0.0.1:48143_-n_0000000000) [n:127.0.0.1:48143_    ] o.a.s.c.Overseer processMessage: queueSize: 1, message = {
   [junit4]   2>   "base_url":"http://127.0.0.1:40697",
   [junit4]   2>   "node_name":"127.0.0.1:40697_",
   [junit4]   2>   "collection":"collection1",
   [junit4]   2>   "shard":null,
   [junit4]   2>   "core":"collection1",
   [junit4]   2>   "operation":"state",
   [junit4]   2>   "state":"down",
   [junit4]   2>   "numShards":"2",
   [junit4]   2>   "roles":null} current state version: 4
   [junit4]   2> 446360 INFO  (OverseerStateUpdate-94943438721712132-127.0.0.1:48143_-n_0000000000) [n:127.0.0.1:48143_    ] o.a.s.c.o.ReplicaMutator Update state numShards=2 message={
   [junit4]   2>   "base_url":"http://127.0.0.1:40697",
   [junit4]   2>   "node_name":"127.0.0.1:40697_",
   [junit4]   2>   "collection":"collection1",
   [junit4]   2>   "shard":null,
   [junit4]   2>   "core":"collection1",
   [junit4]   2>   "operation":"state",
   [junit4]   2>   "state":"down",
   [junit4]   2>   "numShards":"2",
   [junit4]   2>   "roles":null}
   [junit4]   2> 446360 INFO  (coreLoadExecutor-938-thread-1-processing-n:127.0.0.1:40697_) [n:127.0.0.1:40697_ c:collection1   x:collection1] o.a.s.c.c.ZkStateReader Add data for collection1 ver 0 
   [junit4]   2> 446360 INFO  (OverseerStateUpdate-94943438721712132-127.0.0.1:48143_-n_0000000000) [n:127.0.0.1:48143_    ] o.a.s.c.o.ReplicaMutator Collection already exists with numShards=2
   [junit4]   2> 446360 INFO  (coreLoadExecutor-938-thread-1-processing-n:127.0.0.1:40697_) [n:127.0.0.1:40697_ c:collection1   x:collection1] o.a.s.c.ZkController look for our core node name
   [junit4]   2> 446360 INFO  (OverseerStateUpdate-94943438721712132-127.0.0.1:48143_-n_0000000000) [n:127.0.0.1:48143_    ] o.a.s.c.o.ReplicaMutator Assigning new node to shard shard=shard2
   [junit4]   2> 446464 INFO  (OverseerStateUpdate-94943438721712132-127.0.0.1:48143_-n_0000000000) [n:127.0.0.1:48143_    ] o.a.s.c.o.ZkStateWriter going to update_collection /collections/collection1/state.json version: 0
   [junit4]   2> 446466 INFO  (zkCallback-668-thread-1-processing-n:127.0.0.1:40697_) [n:127.0.0.1:40697_    ] o.a.s.c.c.ZkStateReader A cluster state change: WatchedEvent state:SyncConnected type:NodeDataChanged path:/collections/collection1/state.json for collection collection1 has occurred - updating... (live nodes size: 2)
   [junit4]   2> 446467 INFO  (zkCallback-668-thread-1-processing-n:127.0.0.1:40697_) [n:127.0.0.1:40697_    ] o.a.s.c.c.ZkStateReader Updating data for collection1 from 0 to 1 
   [junit4]   2> 447362 INFO  (coreLoadExecutor-938-thread-1-processing-n:127.0.0.1:40697_) [n:127.0.0.1:40697_ c:collection1   x:collection1] o.a.s.c.ZkController waiting to find shard id in clusterstate for collection1
   [junit4]   2> 447362 INFO  (coreLoadExecutor-938-thread-1-processing-n:127.0.0.1:40697_) [n:127.0.0.1:40697_ c:collection1   x:collection1] o.a.s.c.ZkController Check for collection zkNode:collection1
   [junit4]   2> 447363 INFO  (coreLoadExecutor-938-thread-1-processing-n:127.0.0.1:40697_) [n:127.0.0.1:40697_ c:collection1   x:collection1] o.a.s.c.ZkController Collection zkNode exists
   [junit4]   2> 447363 INFO  (coreLoadExecutor-938-thread-1-processing-n:127.0.0.1:40697_) [n:127.0.0.1:40697_ c:collection1   x:collection1] o.a.s.c.c.ZkStateReader Load collection config from:/collections/collection1
   [junit4]   2> 447364 INFO  (coreLoadExecutor-938-thread-1-processing-n:127.0.0.1:40697_) [n:127.0.0.1:40697_ c:collection1   x:collection1] o.a.s.c.c.ZkStateReader path=/collections/collection1 configName=conf1 specified config exists in ZooKeeper
   [junit4]   2> 447364 INFO  (coreLoadExecutor-938-thread-1-processing-n:127.0.0.1:40697_) [n:127.0.0.1:40697_ c:collection1   x:collection1] o.a.s.c.SolrResourceLoader new SolrResourceLoader for directory: '/export/home/jenkins/workspace/Lucene-Solr-5.x-Solaris/solr/build/solr-core/test/J1/temp/solr.cloud.CustomCollectionTest_8AF90EA9E7290C05-001/shard-1-001/cores/collection1'
   [junit4]   2> 447364 INFO  (coreLoadExecutor-938-thread-1-processing-n:127.0.0.1:40697_) [n:127.0.0.1:40697_ c:collection1   x:collection1] o.a.s.c.SolrResourceLoader JNDI not configured for solr (NoInitialContextEx)
   [junit4]   2> 447365 INFO  (coreLoadExecutor-938-thread-1-processing-n:127.0.0.1:40697_) [n:127.0.0.1:40697_ c:collection1   x:collection1] o.a.s.c.SolrResourceLoader solr home defaulted to 'solr/' (could not find system property or JNDI)
   [junit4]   2> 447367 INFO  (coreLoadExecutor-938-thread-1-processing-n:127.0.0.1:40697_) [n:127.0.0.1:40697_ c:collection1   x:collection1] o.a.s.c.Config loaded config solrconfig.xml with version 0 
   [junit4]   2> 447380 INFO  (coreLoadExecutor-938-thread-1-processing-n:127.0.0.1:40697_) [n:127.0.0.1:40697_ c:collection1   x:collection1] o.a.s.c.SolrConfig current version of requestparams : -1
   [junit4]   2> 447405 INFO  (coreLoadExecutor-938-thread-1-processing-n:127.0.0.1:40697_) [n:127.0.0.1:40697_ c:collection1   x:collection1] o.a.s.c.SolrConfig Using Lucene MatchVersion: 5.5.0
   [junit4]   2> 447473 INFO  (coreLoadExecutor-938-thread-1-processing-n:127.0.0.1:40697_) [n:127.0.0.1:40697_ c:collection1   x:collection1] o.a.s.c.Config Loaded SolrConfig: solrconfig.xml
   [junit4]   2> 447482 INFO  (coreLoadExecutor-938-thread-1-processing-n:127.0.0.1:40697_) [n:127.0.0.1:40697_ c:collection1   x:collection1] o.a.s.s.IndexSchema [collection1] Schema name=test
   [junit4]   2> 447988 INFO  (coreLoadExecutor-938-thread-1-processing-n:127.0.0.1:40697_) [n:127.0.0.1:40697_ c:collection1   x:collection1] o.a.s.s.OpenExchangeRatesOrgProvider Initialized with rates=open-exchange-rates.json, refreshInterval=1440.
   [junit4]   2> 447996 INFO  (coreLoadExecutor-938-thread-1-processing-n:127.0.0.1:40697_) [n:127.0.0.1:40697_ c:collection1   x:collection1] o.a.s.s.IndexSchema default search field in schema is text
   [junit4]   2> 448003 INFO  (coreLoadExecutor-938-thread-1-processing-n:127.0.0.1:40697_) [n:127.0.0.1:40697_ c:collection1   x:collection1] o.a.s.s.IndexSchema unique key field: id
   [junit4]   2> 448018 INFO  (coreLoadExecutor-938-thread-1-processing-n:127.0.0.1:40697_) [n:127.0.0.1:40697_ c:collection1   x:collection1] o.a.s.s.FileExchangeRateProvider Reloading exchange rates from file currency.xml
   [junit4]   2> 448022 INFO  (coreLoadExecutor-938-thread-1-processing-n:127.0.0.1:40697_) [n:127.0.0.1:40697_ c:collection1   x:collection1] o.a.s.s.FileExchangeRateProvider Reloading exchange rates from file currency.xml
   [junit4]   2> 448026 INFO  (coreLoadExecutor-938-thread-1-processing-n:127.0.0.1:40697_) [n:127.0.0.1:40697_ c:collection1   x:collection1] o.a.s.s.OpenExchangeRatesOrgProvider Reloading exchange rates from open-exchange-rates.json
   [junit4]   2> 448027 WARN  (coreLoadExecutor-938-thread-1-processing-n:127.0.0.1:40697_) [n:127.0.0.1:40697_ c:collection1   x:collection1] o.a.s.s.OpenExchangeRatesOrgProvider Unknown key IMPORTANT NOTE
   [junit4]   2> 448027 WARN  (coreLoadExecutor-938-thread-1-processing-n:127.0.0.1:40697_) [n:127.0.0.1:40697_ c:collection1   x:collection1] o.a.s.s.OpenExchangeRatesOrgProvider Expected key, got STRING
   [junit4]   2> 448027 INFO  (coreLoadExecutor-938-thread-1-processing-n:127.0.0.1:40697_) [n:127.0.0.1:40697_ c:collection1   x:collection1] o.a.s.s.OpenExchangeRatesOrgProvider Reloading exchange rates from open-exchange-rates.json
   [junit4]   2> 448028 WARN  (coreLoadExecutor-938-thread-1-processing-n:127.0.0.1:40697_) [n:127.0.0.1:40697_ c:collection1   x:collection1] o.a.s.s.OpenExchangeRatesOrgProvider Unknown key IMPORTANT NOTE
   [junit4]   2> 448029 WARN  (coreLoadExecutor-938-thread-1-processing-n:127.0.0.1:40697_) [n:127.0.0.1:40697_ c:collection1   x:collection1] o.a.s.s.OpenExchangeRatesOrgProvider Expected key, got STRING
   [junit4]   2> 448031 INFO  (coreLoadExecutor-938-thread-1-processing-n:127.0.0.1:40697_) [n:127.0.0.1:40697_ c:collection1   x:collection1] o.a.s.c.ConfigSetProperties Did not find ConfigSet properties, assuming default properties: Can't find resource 'configsetprops.json' in classpath or '/configs/conf1', cwd=/export/home/jenkins/workspace/Lucene-Solr-5.x-Solaris/solr/build/solr-core/test/J1
   [junit4]   2> 448031 INFO  (coreLoadExecutor-938-thread-1-processing-n:127.0.0.1:40697_) [n:127.0.0.1:40697_ c:collection1   x:collection1] o.a.s.c.CoreContainer Creating SolrCore 'collection1' using configuration from collection collection1
   [junit4]   2> 448031 INFO  (coreLoadExecutor-938-thread-1-processing-n:127.0.0.1:40697_) [n:127.0.0.1:40697_ c:collection1 s:shard2 r:core_node1 x:collection1] o.a.s.c.SolrCore org.apache.solr.core.MockDirectoryFactory
   [junit4]   2> 448037 INFO  (coreLoadExecutor-938-thread-1-processing-n:127.0.0.1:40697_) [n:127.0.0.1:40697_ c:collection1 s:shard2 r:core_node1 x:collection1] o.a.s.c.SolrCore [[collection1] ] Opening new SolrCore at [/export/home/jenkins/workspace/Lucene-Solr-5.x-Solaris/solr/build/solr-core/test/J1/temp/solr.cloud.CustomCollectionTest_8AF90EA9E7290C05-001/shard-1-001/cores/collection1], dataDir=[null]
   [junit4]   2> 448037 INFO  (coreLoadExecutor-938-thread-1-processing-n:127.0.0.1:40697_) [n:127.0.0.1:40697_ c:collection1 s:shard2 r:core_node1 x:collection1] o.a.s.c.JmxMonitoredMap JMX monitoring is enabled. Adding Solr mbeans to JMX Server: com.sun.jmx.mbeanserver.Jmx

[...truncated too long message...]

ommon.util.ExecutorUtil$MDCAwareThreadPoolExecutor$1.run(ExecutorUtil.java:231)
   [junit4]   2> 	at java.util.concurrent.ThreadPoolExecutor.runWorker(ThreadPoolExecutor.java:1145)
   [junit4]   2> 	at java.util.concurrent.ThreadPoolExecutor$Worker.run(ThreadPoolExecutor.java:615)
   [junit4]   2> 	at java.lang.Thread.run(Thread.java:745)
   [junit4]   2> 583516 WARN  (zkCallback-681-thread-4-processing-n:127.0.0.1:34368_) [n:127.0.0.1:34368_    ] o.a.s.c.c.ZkStateReader ZooKeeper watch triggered, but Solr cannot talk to ZK
   [junit4]   2> 583517 INFO  (TEST-CustomCollectionTest.test-seed#[8AF90EA9E7290C05]) [    ] o.e.j.s.ServerConnector Stopped ServerConnector@1e15cc8{HTTP/1.1}{127.0.0.1:0}
   [junit4]   2> 583517 INFO  (TEST-CustomCollectionTest.test-seed#[8AF90EA9E7290C05]) [    ] o.e.j.s.h.ContextHandler Stopped o.e.j.s.ServletContextHandler@1aee783{/,null,UNAVAILABLE}
   [junit4]   2> 583520 INFO  (TEST-CustomCollectionTest.test-seed#[8AF90EA9E7290C05]) [n:127.0.0.1:34368_ c:routeFieldColl s:shard2 r:core_node4 x:routeFieldColl_shard2_replica1] o.a.s.c.ZkTestServer connecting to 127.0.0.1:58432 58432
   [junit4]   2> 583548 INFO  (Thread-913) [    ] o.a.s.c.ZkTestServer connecting to 127.0.0.1:58432 58432
   [junit4]   2> 583549 WARN  (Thread-913) [    ] o.a.s.c.ZkTestServer Watch limit violations: 
   [junit4]   2> Maximum concurrent create/delete watches above limit:
   [junit4]   2> 
   [junit4]   2> 	13	/solr/aliases.json
   [junit4]   2> 	5	/solr/security.json
   [junit4]   2> 	5	/solr/configs/conf1
   [junit4]   2> 
   [junit4]   2> Maximum concurrent data watches above limit:
   [junit4]   2> 
   [junit4]   2> 	13	/solr/clusterstate.json
   [junit4]   2> 	5	/solr/collections/implicitcollwithShardField/state.json
   [junit4]   2> 	5	/solr/collections/implicitcoll1/state.json
   [junit4]   2> 	5	/solr/collections/routeFieldColl/state.json
   [junit4]   2> 	5	/solr/collections/implicitcoll0/state.json
   [junit4]   2> 	5	/solr/collections/implicitcoll2/state.json
   [junit4]   2> 	4	/solr/collections/collection1/state.json
   [junit4]   2> 	3	/solr/collections/implicitcoll1/leader_elect/b/election/94943438721712140-core_node8-n_0000000001
   [junit4]   2> 	3	/solr/collections/implicitcoll2/leader_elect/b/election/94943438721712140-core_node2-n_0000000001
   [junit4]   2> 	3	/solr/collections/implicitcoll0/leader_elect/x/election/94943438721712146-core_node20-n_0000000000
   [junit4]   2> 	2	/solr/collections/implicitcoll2/leader_elect/c/election/94943438721712143-core_node1-n_0000000001
   [junit4]   2> 	2	/solr/collections/implicitcoll2/leader_elect/b/election/94943438721712146-core_node7-n_0000000000
   [junit4]   2> 	2	/solr/collections/implicitcoll0/leader_elect/a/election/94943438721712143-core_node10-n_0000000001
   [junit4]   2> 	2	/solr/collections/implicitcollwithShardField/leader_elect/a/election/94943438721712146-core_node3-n_0000000000
   [junit4]   2> 	2	/solr/collections/implicitcoll2/leader_elect/a/election/94943438721712143-core_node15-n_0000000000
   [junit4]   2> 	2	/solr/collections/implicitcoll0/leader_elect/b/election/94943438721712143-core_node7-n_0000000001
   [junit4]   2> 	2	/solr/collections/implicitcoll2/leader_elect/a/election/94943438721712140-core_node8-n_0000000001
   [junit4]   2> 	2	/solr/collections/implicitcoll0/leader_elect/a/election/94943438721712140-core_node11-n_0000000002
   [junit4]   2> 	2	/solr/collections/implicitcoll1/leader_elect/a/election/94943438721712146-core_node13-n_0000000001
   [junit4]   2> 	2	/solr/collections/implicitcoll1/leader_elect/b/election/94943438721712143-core_node14-n_0000000000
   [junit4]   2> 	2	/solr/collections/implicitcoll2/leader_elect/c/election/94943438721712140-core_node9-n_0000000002
   [junit4]   2> 	2	/solr/collections/testCreateShardRepFactor/state.json
   [junit4]   2> 	2	/solr/collections/implicitcoll1/leader_elect/c/election/94943438721712143-core_node3-n_0000000000
   [junit4]   2> 	2	/solr/collections/implicitcoll0/leader_elect/c/election/94943438721712143-core_node6-n_0000000000
   [junit4]   2> 
   [junit4]   2> Maximum concurrent children watches above limit:
   [junit4]   2> 
   [junit4]   2> 	13	/solr/live_nodes
   [junit4]   2> 	13	/solr/collections
   [junit4]   2> 	5	/solr/overseer/collection-queue-work
   [junit4]   2> 	5	/solr/overseer/queue
   [junit4]   2> 	3	/solr/overseer/queue-work
   [junit4]   2> 
   [junit4]   2> NOTE: reproduce with: ant test  -Dtestcase=CustomCollectionTest -Dtests.method=test -Dtests.seed=8AF90EA9E7290C05 -Dtests.slow=true -Dtests.locale=mt -Dtests.timezone=Antarctica/McMurdo -Dtests.asserts=true -Dtests.file.encoding=US-ASCII
   [junit4] ERROR    142s J1 | CustomCollectionTest.test <<<
   [junit4]    > Throwable #1: org.apache.zookeeper.KeeperException$SessionExpiredException: KeeperErrorCode = Session expired for /clusterstate.json
   [junit4]    > 	at __randomizedtesting.SeedInfo.seed([8AF90EA9E7290C05:2AD317349D561FD]:0)
   [junit4]    > 	at org.apache.zookeeper.KeeperException.create(KeeperException.java:127)
   [junit4]    > 	at org.apache.zookeeper.KeeperException.create(KeeperException.java:51)
   [junit4]    > 	at org.apache.zookeeper.ZooKeeper.getData(ZooKeeper.java:1155)
   [junit4]    > 	at org.apache.solr.common.cloud.SolrZkClient$7.execute(SolrZkClient.java:345)
   [junit4]    > 	at org.apache.solr.common.cloud.SolrZkClient$7.execute(SolrZkClient.java:342)
   [junit4]    > 	at org.apache.solr.common.cloud.ZkCmdExecutor.retryOperation(ZkCmdExecutor.java:61)
   [junit4]    > 	at org.apache.solr.common.cloud.SolrZkClient.getData(SolrZkClient.java:342)
   [junit4]    > 	at org.apache.solr.common.cloud.ZkStateReader.refreshLegacyClusterState(ZkStateReader.java:477)
   [junit4]    > 	at org.apache.solr.common.cloud.ZkStateReader.updateClusterState(ZkStateReader.java:257)
   [junit4]    > 	at org.apache.solr.cloud.AbstractDistribZkTestBase.waitForRecoveriesToFinish(AbstractDistribZkTestBase.java:144)
   [junit4]    > 	at org.apache.solr.cloud.AbstractDistribZkTestBase.waitForRecoveriesToFinish(AbstractDistribZkTestBase.java:131)
   [junit4]    > 	at org.apache.solr.cloud.AbstractDistribZkTestBase.waitForRecoveriesToFinish(AbstractDistribZkTestBase.java:126)
   [junit4]    > 	at org.apache.solr.cloud.CustomCollectionTest.testCreateShardRepFactor(CustomCollectionTest.java:389)
   [junit4]    > 	at org.apache.solr.cloud.CustomCollectionTest.test(CustomCollectionTest.java:97)
   [junit4]    > 	at org.apache.solr.BaseDistributedSearchTestCase$ShardsRepeatRule$ShardsFixedStatement.callStatement(BaseDistributedSearchTestCase.java:964)
   [junit4]    > 	at org.apache.solr.BaseDistributedSearchTestCase$ShardsRepeatRule$ShardsStatement.evaluate(BaseDistributedSearchTestCase.java:939)
   [junit4]    > 	at java.lang.Thread.run(Thread.java:745)
   [junit4]   2> 583555 INFO  (SUITE-CustomCollectionTest-seed#[8AF90EA9E7290C05]-worker) [n:127.0.0.1:34368_ c:routeFieldColl s:shard2 r:core_node4 x:routeFieldColl_shard2_replica1] o.a.s.SolrTestCaseJ4 ###deleteCore
   [junit4]   2> NOTE: leaving temporary files on disk at: /export/home/jenkins/workspace/Lucene-Solr-5.x-Solaris/solr/build/solr-core/test/J1/temp/solr.cloud.CustomCollectionTest_8AF90EA9E7290C05-001
   [junit4]   2> NOTE: test params are: codec=Asserting(Lucene54): {id=FST50, timestamp=PostingsFormat(name=LuceneFixedGap), range_facet_l=PostingsFormat(name=LuceneFixedGap), multiDefault=PostingsFormat(name=LuceneFixedGap), _version_=PostingsFormat(name=LuceneVarGapDocFreqInterval), range_facet_l_dv=FST50, other_tl1=PostingsFormat(name=LuceneVarGapDocFreqInterval), intDefault=PostingsFormat(name=LuceneVarGapDocFreqInterval), shard_s=PostingsFormat(name=LuceneFixedGap), text=FSTOrd50, a_t=PostingsFormat(name=LuceneFixedGap), _route_=FSTOrd50, a_i1=PostingsFormat(name=LuceneFixedGap), range_facet_i_dv=PostingsFormat(name=LuceneFixedGap)}, docValues:{timestamp=DocValuesFormat(name=Memory), range_facet_l_dv=DocValuesFormat(name=Direct), range_facet_i_dv=DocValuesFormat(name=Memory)}, sim=DefaultSimilarity, locale=mt, timezone=Antarctica/McMurdo
   [junit4]   2> NOTE: SunOS 5.11 x86/Oracle Corporation 1.7.0_91 (32-bit)/cpus=3,threads=1,free=147192136,total=518979584
   [junit4]   2> NOTE: All tests run in this JVM: [TestCloudPivotFacet, TestManagedSchemaDynamicFieldResource, TestMiniSolrCloudCluster, CachingDirectoryFactoryTest, CleanupOldIndexTest, EchoParamsTest, TestScoreJoinQPNoScore, SortByFunctionTest, CursorMarkTest, TermVectorComponentTest, TestSystemIdResolver, TestCoreDiscovery, ResponseLogComponentTest, StatsComponentTest, TestDynamicLoading, CustomCollectionTest]
   [junit4] Completed [55/551] on J1 in 141.76s, 1 test, 1 error <<< FAILURES!

[...truncated 1573 lines...]
BUILD FAILED
/export/home/jenkins/workspace/Lucene-Solr-5.x-Solaris/build.xml:785: The following error occurred while executing this line:
/export/home/jenkins/workspace/Lucene-Solr-5.x-Solaris/build.xml:729: The following error occurred while executing this line:
/export/home/jenkins/workspace/Lucene-Solr-5.x-Solaris/build.xml:59: The following error occurred while executing this line:
/export/home/jenkins/workspace/Lucene-Solr-5.x-Solaris/solr/build.xml:233: The following error occurred while executing this line:
/export/home/jenkins/workspace/Lucene-Solr-5.x-Solaris/solr/common-build.xml:526: The following error occurred while executing this line:
/export/home/jenkins/workspace/Lucene-Solr-5.x-Solaris/lucene/common-build.xml:1452: The following error occurred while executing this line:
/export/home/jenkins/workspace/Lucene-Solr-5.x-Solaris/lucene/common-build.xml:1006: There were test failures: 551 suites (7 ignored), 2177 tests, 1 error, 52 ignored (38 assumptions) [seed: 8AF90EA9E7290C05]

Total time: 79 minutes 47 seconds
Build step 'Invoke Ant' marked build as failure
Archiving artifacts
[WARNINGS] Skipping publisher since build result is FAILURE
Recording test results
Email was triggered for: Failure - Any
Sending email for trigger: Failure - Any



Mime
View raw message