lucene-dev mailing list archives

Site index · List index
Message view « Date » · « Thread »
Top « Date » · « Thread »
From Policeman Jenkins Server <jenk...@thetaphi.de>
Subject [JENKINS] Lucene-Solr-5.x-Solaris (multiarch/jdk1.7.0) - Build # 205 - Still Failing!
Date Mon, 23 Nov 2015 17:18:08 GMT
Build: http://jenkins.thetaphi.de/job/Lucene-Solr-5.x-Solaris/205/
Java: multiarch/jdk1.7.0 -d32 -client -XX:+UseParallelGC

3 tests failed.
FAILED:  org.apache.solr.cloud.TestMiniSolrCloudClusterBase.testBasics

Error Message:
KeeperErrorCode = NodeExists for /solr/solr.xml

Stack Trace:
org.apache.zookeeper.KeeperException$NodeExistsException: KeeperErrorCode = NodeExists for
/solr/solr.xml
	at __randomizedtesting.SeedInfo.seed([C4873F997A1ABFFE:F95F91B542F4E18E]:0)
	at org.apache.zookeeper.KeeperException.create(KeeperException.java:119)
	at org.apache.zookeeper.KeeperException.create(KeeperException.java:51)
	at org.apache.zookeeper.ZooKeeper.create(ZooKeeper.java:783)
	at org.apache.solr.common.cloud.SolrZkClient$10.execute(SolrZkClient.java:501)
	at org.apache.solr.common.cloud.ZkCmdExecutor.retryOperation(ZkCmdExecutor.java:61)
	at org.apache.solr.common.cloud.SolrZkClient.makePath(SolrZkClient.java:498)
	at org.apache.solr.common.cloud.SolrZkClient.makePath(SolrZkClient.java:455)
	at org.apache.solr.common.cloud.SolrZkClient.makePath(SolrZkClient.java:442)
	at org.apache.solr.common.cloud.SolrZkClient.makePath(SolrZkClient.java:429)
	at org.apache.solr.cloud.MiniSolrCloudCluster.<init>(MiniSolrCloudCluster.java:199)
	at org.apache.solr.cloud.MiniSolrCloudCluster.<init>(MiniSolrCloudCluster.java:111)
	at org.apache.solr.cloud.TestMiniSolrCloudClusterBase.createMiniSolrCloudCluster(TestMiniSolrCloudClusterBase.java:83)
	at org.apache.solr.cloud.TestMiniSolrCloudClusterBase.testCollectionCreateSearchDelete(TestMiniSolrCloudClusterBase.java:105)
	at org.apache.solr.cloud.TestMiniSolrCloudClusterBase.testBasics(TestMiniSolrCloudClusterBase.java:77)
	at sun.reflect.NativeMethodAccessorImpl.invoke0(Native Method)
	at sun.reflect.NativeMethodAccessorImpl.invoke(NativeMethodAccessorImpl.java:57)
	at sun.reflect.DelegatingMethodAccessorImpl.invoke(DelegatingMethodAccessorImpl.java:43)
	at java.lang.reflect.Method.invoke(Method.java:606)
	at com.carrotsearch.randomizedtesting.RandomizedRunner.invoke(RandomizedRunner.java:1764)
	at com.carrotsearch.randomizedtesting.RandomizedRunner$8.evaluate(RandomizedRunner.java:871)
	at com.carrotsearch.randomizedtesting.RandomizedRunner$9.evaluate(RandomizedRunner.java:907)
	at com.carrotsearch.randomizedtesting.RandomizedRunner$10.evaluate(RandomizedRunner.java:921)
	at com.carrotsearch.randomizedtesting.rules.SystemPropertiesRestoreRule$1.evaluate(SystemPropertiesRestoreRule.java:57)
	at org.apache.lucene.util.TestRuleSetupTeardownChained$1.evaluate(TestRuleSetupTeardownChained.java:50)
	at org.apache.lucene.util.AbstractBeforeAfterRule$1.evaluate(AbstractBeforeAfterRule.java:46)
	at org.apache.lucene.util.TestRuleThreadAndTestName$1.evaluate(TestRuleThreadAndTestName.java:49)
	at org.apache.lucene.util.TestRuleIgnoreAfterMaxFailures$1.evaluate(TestRuleIgnoreAfterMaxFailures.java:65)
	at org.apache.lucene.util.TestRuleMarkFailure$1.evaluate(TestRuleMarkFailure.java:48)
	at com.carrotsearch.randomizedtesting.rules.StatementAdapter.evaluate(StatementAdapter.java:36)
	at com.carrotsearch.randomizedtesting.ThreadLeakControl$StatementRunner.run(ThreadLeakControl.java:367)
	at com.carrotsearch.randomizedtesting.ThreadLeakControl.forkTimeoutingTask(ThreadLeakControl.java:809)
	at com.carrotsearch.randomizedtesting.ThreadLeakControl$3.evaluate(ThreadLeakControl.java:460)
	at com.carrotsearch.randomizedtesting.RandomizedRunner.runSingleTest(RandomizedRunner.java:880)
	at com.carrotsearch.randomizedtesting.RandomizedRunner$5.evaluate(RandomizedRunner.java:781)
	at com.carrotsearch.randomizedtesting.RandomizedRunner$6.evaluate(RandomizedRunner.java:816)
	at com.carrotsearch.randomizedtesting.RandomizedRunner$7.evaluate(RandomizedRunner.java:827)
	at com.carrotsearch.randomizedtesting.rules.StatementAdapter.evaluate(StatementAdapter.java:36)
	at com.carrotsearch.randomizedtesting.rules.SystemPropertiesRestoreRule$1.evaluate(SystemPropertiesRestoreRule.java:57)
	at org.apache.lucene.util.AbstractBeforeAfterRule$1.evaluate(AbstractBeforeAfterRule.java:46)
	at com.carrotsearch.randomizedtesting.rules.StatementAdapter.evaluate(StatementAdapter.java:36)
	at org.apache.lucene.util.TestRuleStoreClassName$1.evaluate(TestRuleStoreClassName.java:42)
	at com.carrotsearch.randomizedtesting.rules.NoShadowingOrOverridesOnMethodsRule$1.evaluate(NoShadowingOrOverridesOnMethodsRule.java:40)
	at com.carrotsearch.randomizedtesting.rules.NoShadowingOrOverridesOnMethodsRule$1.evaluate(NoShadowingOrOverridesOnMethodsRule.java:40)
	at com.carrotsearch.randomizedtesting.rules.StatementAdapter.evaluate(StatementAdapter.java:36)
	at com.carrotsearch.randomizedtesting.rules.StatementAdapter.evaluate(StatementAdapter.java:36)
	at com.carrotsearch.randomizedtesting.rules.StatementAdapter.evaluate(StatementAdapter.java:36)
	at org.apache.lucene.util.TestRuleAssertionsRequired$1.evaluate(TestRuleAssertionsRequired.java:54)
	at org.apache.lucene.util.TestRuleMarkFailure$1.evaluate(TestRuleMarkFailure.java:48)
	at org.apache.lucene.util.TestRuleIgnoreAfterMaxFailures$1.evaluate(TestRuleIgnoreAfterMaxFailures.java:65)
	at org.apache.lucene.util.TestRuleIgnoreTestSuites$1.evaluate(TestRuleIgnoreTestSuites.java:55)
	at com.carrotsearch.randomizedtesting.rules.StatementAdapter.evaluate(StatementAdapter.java:36)
	at com.carrotsearch.randomizedtesting.ThreadLeakControl$StatementRunner.run(ThreadLeakControl.java:367)
	at java.lang.Thread.run(Thread.java:745)


FAILED:  junit.framework.TestSuite.org.apache.solr.cloud.TestMiniSolrCloudClusterBase

Error Message:
5 threads leaked from SUITE scope at org.apache.solr.cloud.TestMiniSolrCloudClusterBase: 
   1) Thread[id=2354, name=SessionTracker, state=TIMED_WAITING, group=TGRP-TestMiniSolrCloudClusterBase]
        at java.lang.Object.wait(Native Method)         at org.apache.zookeeper.server.SessionTrackerImpl.run(SessionTrackerImpl.java:146)
   2) Thread[id=2352, name=Thread-1004, state=WAITING, group=TGRP-TestMiniSolrCloudClusterBase]
        at java.lang.Object.wait(Native Method)         at java.lang.Thread.join(Thread.java:1281)
        at java.lang.Thread.join(Thread.java:1355)         at org.apache.zookeeper.server.NIOServerCnxnFactory.join(NIOServerCnxnFactory.java:302)
        at org.apache.solr.cloud.ZkTestServer$ZKServerMain.runFromConfig(ZkTestServer.java:310)
        at org.apache.solr.cloud.ZkTestServer$2.run(ZkTestServer.java:491)    3) Thread[id=2356,
name=ProcessThread(sid:0 cport:-1):, state=WAITING, group=TGRP-TestMiniSolrCloudClusterBase]
        at sun.misc.Unsafe.park(Native Method)         at java.util.concurrent.locks.LockSupport.park(LockSupport.java:186)
        at java.util.concurrent.locks.AbstractQueuedSynchronizer$ConditionObject.await(AbstractQueuedSynchronizer.java:2043)
        at java.util.concurrent.LinkedBlockingQueue.take(LinkedBlockingQueue.java:442)   
     at org.apache.zookeeper.server.PrepRequestProcessor.run(PrepRequestProcessor.java:120)
   4) Thread[id=2353, name=NIOServerCxn.Factory:0.0.0.0/0.0.0.0:0, state=RUNNABLE, group=TGRP-TestMiniSolrCloudClusterBase]
        at sun.nio.ch.DevPollArrayWrapper.poll0(Native Method)         at sun.nio.ch.DevPollArrayWrapper.poll(DevPollArrayWrapper.java:223)
        at sun.nio.ch.DevPollSelectorImpl.doSelect(DevPollSelectorImpl.java:84)         at
sun.nio.ch.SelectorImpl.lockAndDoSelect(SelectorImpl.java:87)         at sun.nio.ch.SelectorImpl.select(SelectorImpl.java:98)
        at org.apache.zookeeper.server.NIOServerCnxnFactory.run(NIOServerCnxnFactory.java:178)
        at java.lang.Thread.run(Thread.java:745)    5) Thread[id=2355, name=SyncThread:0,
state=WAITING, group=TGRP-TestMiniSolrCloudClusterBase]         at sun.misc.Unsafe.park(Native
Method)         at java.util.concurrent.locks.LockSupport.park(LockSupport.java:186)     
   at java.util.concurrent.locks.AbstractQueuedSynchronizer$ConditionObject.await(AbstractQueuedSynchronizer.java:2043)
        at java.util.concurrent.LinkedBlockingQueue.take(LinkedBlockingQueue.java:442)   
     at org.apache.zookeeper.server.SyncRequestProcessor.run(SyncRequestProcessor.java:127)

Stack Trace:
com.carrotsearch.randomizedtesting.ThreadLeakError: 5 threads leaked from SUITE scope at org.apache.solr.cloud.TestMiniSolrCloudClusterBase:

   1) Thread[id=2354, name=SessionTracker, state=TIMED_WAITING, group=TGRP-TestMiniSolrCloudClusterBase]
        at java.lang.Object.wait(Native Method)
        at org.apache.zookeeper.server.SessionTrackerImpl.run(SessionTrackerImpl.java:146)
   2) Thread[id=2352, name=Thread-1004, state=WAITING, group=TGRP-TestMiniSolrCloudClusterBase]
        at java.lang.Object.wait(Native Method)
        at java.lang.Thread.join(Thread.java:1281)
        at java.lang.Thread.join(Thread.java:1355)
        at org.apache.zookeeper.server.NIOServerCnxnFactory.join(NIOServerCnxnFactory.java:302)
        at org.apache.solr.cloud.ZkTestServer$ZKServerMain.runFromConfig(ZkTestServer.java:310)
        at org.apache.solr.cloud.ZkTestServer$2.run(ZkTestServer.java:491)
   3) Thread[id=2356, name=ProcessThread(sid:0 cport:-1):, state=WAITING, group=TGRP-TestMiniSolrCloudClusterBase]
        at sun.misc.Unsafe.park(Native Method)
        at java.util.concurrent.locks.LockSupport.park(LockSupport.java:186)
        at java.util.concurrent.locks.AbstractQueuedSynchronizer$ConditionObject.await(AbstractQueuedSynchronizer.java:2043)
        at java.util.concurrent.LinkedBlockingQueue.take(LinkedBlockingQueue.java:442)
        at org.apache.zookeeper.server.PrepRequestProcessor.run(PrepRequestProcessor.java:120)
   4) Thread[id=2353, name=NIOServerCxn.Factory:0.0.0.0/0.0.0.0:0, state=RUNNABLE, group=TGRP-TestMiniSolrCloudClusterBase]
        at sun.nio.ch.DevPollArrayWrapper.poll0(Native Method)
        at sun.nio.ch.DevPollArrayWrapper.poll(DevPollArrayWrapper.java:223)
        at sun.nio.ch.DevPollSelectorImpl.doSelect(DevPollSelectorImpl.java:84)
        at sun.nio.ch.SelectorImpl.lockAndDoSelect(SelectorImpl.java:87)
        at sun.nio.ch.SelectorImpl.select(SelectorImpl.java:98)
        at org.apache.zookeeper.server.NIOServerCnxnFactory.run(NIOServerCnxnFactory.java:178)
        at java.lang.Thread.run(Thread.java:745)
   5) Thread[id=2355, name=SyncThread:0, state=WAITING, group=TGRP-TestMiniSolrCloudClusterBase]
        at sun.misc.Unsafe.park(Native Method)
        at java.util.concurrent.locks.LockSupport.park(LockSupport.java:186)
        at java.util.concurrent.locks.AbstractQueuedSynchronizer$ConditionObject.await(AbstractQueuedSynchronizer.java:2043)
        at java.util.concurrent.LinkedBlockingQueue.take(LinkedBlockingQueue.java:442)
        at org.apache.zookeeper.server.SyncRequestProcessor.run(SyncRequestProcessor.java:127)
	at __randomizedtesting.SeedInfo.seed([C4873F997A1ABFFE]:0)


FAILED:  junit.framework.TestSuite.org.apache.solr.cloud.TestMiniSolrCloudClusterBase

Error Message:
There are still zombie threads that couldn't be terminated:    1) Thread[id=2353, name=NIOServerCxn.Factory:0.0.0.0/0.0.0.0:0,
state=RUNNABLE, group=TGRP-TestMiniSolrCloudClusterBase]         at sun.nio.ch.IOUtil.drain(Native
Method)         at sun.nio.ch.DevPollSelectorImpl.doSelect(DevPollSelectorImpl.java:95)  
      at sun.nio.ch.SelectorImpl.lockAndDoSelect(SelectorImpl.java:87)         at sun.nio.ch.SelectorImpl.select(SelectorImpl.java:98)
        at org.apache.zookeeper.server.NIOServerCnxnFactory.run(NIOServerCnxnFactory.java:178)
        at java.lang.Thread.run(Thread.java:745)

Stack Trace:
com.carrotsearch.randomizedtesting.ThreadLeakError: There are still zombie threads that couldn't
be terminated:
   1) Thread[id=2353, name=NIOServerCxn.Factory:0.0.0.0/0.0.0.0:0, state=RUNNABLE, group=TGRP-TestMiniSolrCloudClusterBase]
        at sun.nio.ch.IOUtil.drain(Native Method)
        at sun.nio.ch.DevPollSelectorImpl.doSelect(DevPollSelectorImpl.java:95)
        at sun.nio.ch.SelectorImpl.lockAndDoSelect(SelectorImpl.java:87)
        at sun.nio.ch.SelectorImpl.select(SelectorImpl.java:98)
        at org.apache.zookeeper.server.NIOServerCnxnFactory.run(NIOServerCnxnFactory.java:178)
        at java.lang.Thread.run(Thread.java:745)
	at __randomizedtesting.SeedInfo.seed([C4873F997A1ABFFE]:0)




Build Log:
[...truncated 9878 lines...]
   [junit4] Suite: org.apache.solr.cloud.TestMiniSolrCloudClusterBase
   [junit4]   2> 406678 INFO  (TEST-TestMiniSolrCloudClusterBase.testBasics-seed#[C4873F997A1ABFFE])
[    ] o.a.s.c.ZkTestServer STARTING ZK TEST SERVER
   [junit4]   2> 406678 INFO  (Thread-1004) [    ] o.a.s.c.ZkTestServer client port:0.0.0.0/0.0.0.0:0
   [junit4]   2> 406678 INFO  (Thread-1004) [    ] o.a.s.c.ZkTestServer Starting server
   [junit4]   2> 406778 INFO  (TEST-TestMiniSolrCloudClusterBase.testBasics-seed#[C4873F997A1ABFFE])
[    ] o.a.s.c.ZkTestServer start zk server on port:62972
   [junit4]   2> 406778 INFO  (TEST-TestMiniSolrCloudClusterBase.testBasics-seed#[C4873F997A1ABFFE])
[    ] o.a.s.c.c.SolrZkClient Using default ZkCredentialsProvider
   [junit4]   2> 406779 INFO  (TEST-TestMiniSolrCloudClusterBase.testBasics-seed#[C4873F997A1ABFFE])
[    ] o.a.s.c.c.ConnectionManager Waiting for client to connect to ZooKeeper
   [junit4]   2> 406863 INFO  (zkCallback-243-thread-1) [    ] o.a.s.c.c.ConnectionManager
Watcher org.apache.solr.common.cloud.ConnectionManager@10e654d name:ZooKeeperConnection Watcher:127.0.0.1:62972
got event WatchedEvent state:SyncConnected type:None path:null path:null type:None
   [junit4]   2> 406864 INFO  (TEST-TestMiniSolrCloudClusterBase.testBasics-seed#[C4873F997A1ABFFE])
[    ] o.a.s.c.c.ConnectionManager Client is connected to ZooKeeper
   [junit4]   2> 406865 INFO  (TEST-TestMiniSolrCloudClusterBase.testBasics-seed#[C4873F997A1ABFFE])
[    ] o.a.s.c.c.SolrZkClient Using default ZkACLProvider
   [junit4]   2> 406865 INFO  (TEST-TestMiniSolrCloudClusterBase.testBasics-seed#[C4873F997A1ABFFE])
[    ] o.a.s.c.c.SolrZkClient makePath: /solr/solr.xml
   [junit4]   2> 413572 WARN  (NIOServerCxn.Factory:0.0.0.0/0.0.0.0:0) [    ] o.a.z.s.NIOServerCnxn
caught end of stream exception
   [junit4]   2> EndOfStreamException: Unable to read additional data from client sessionid
0x151354e4b6c0000, likely client has closed socket
   [junit4]   2> 	at org.apache.zookeeper.server.NIOServerCnxn.doIO(NIOServerCnxn.java:228)
   [junit4]   2> 	at org.apache.zookeeper.server.NIOServerCnxnFactory.run(NIOServerCnxnFactory.java:208)
   [junit4]   2> 	at java.lang.Thread.run(Thread.java:745)
   [junit4]   2> 413672 INFO  (zkCallback-243-thread-1) [    ] o.a.s.c.c.ConnectionManager
Watcher org.apache.solr.common.cloud.ConnectionManager@10e654d name:ZooKeeperConnection Watcher:127.0.0.1:62972
got event WatchedEvent state:Disconnected type:None path:null path:null type:None
   [junit4]   2> 413672 INFO  (zkCallback-243-thread-1) [    ] o.a.s.c.c.ConnectionManager
zkClient has disconnected
   [junit4]   2> 415326 INFO  (zkCallback-243-thread-1) [    ] o.a.s.c.c.ConnectionManager
Watcher org.apache.solr.common.cloud.ConnectionManager@10e654d name:ZooKeeperConnection Watcher:127.0.0.1:62972
got event WatchedEvent state:SyncConnected type:None path:null path:null type:None
   [junit4]   2> 417498 WARN  (SyncThread:0) [    ] o.a.z.s.p.FileTxnLog fsync-ing the
write ahead log in SyncThread:0 took 10597ms which will adversely effect operation latency.
See the ZooKeeper troubleshooting guide
   [junit4]   2> 417498 ERROR (SyncThread:0) [    ] o.a.z.s.NIOServerCnxn Unexpected Exception:

   [junit4]   2> java.nio.channels.CancelledKeyException
   [junit4]   2> 	at sun.nio.ch.SelectionKeyImpl.ensureValid(SelectionKeyImpl.java:73)
   [junit4]   2> 	at sun.nio.ch.SelectionKeyImpl.interestOps(SelectionKeyImpl.java:77)
   [junit4]   2> 	at org.apache.zookeeper.server.NIOServerCnxn.sendBuffer(NIOServerCnxn.java:151)
   [junit4]   2> 	at org.apache.zookeeper.server.NIOServerCnxn.sendResponse(NIOServerCnxn.java:1081)
   [junit4]   2> 	at org.apache.zookeeper.server.FinalRequestProcessor.processRequest(FinalRequestProcessor.java:404)
   [junit4]   2> 	at org.apache.zookeeper.server.SyncRequestProcessor.flush(SyncRequestProcessor.java:200)
   [junit4]   2> 	at org.apache.zookeeper.server.SyncRequestProcessor.run(SyncRequestProcessor.java:131)
   [junit4]   2> 417498 ERROR (SyncThread:0) [    ] o.a.z.s.NIOServerCnxn Unexpected Exception:

   [junit4]   2> java.nio.channels.CancelledKeyException
   [junit4]   2> 	at sun.nio.ch.SelectionKeyImpl.ensureValid(SelectionKeyImpl.java:73)
   [junit4]   2> 	at sun.nio.ch.SelectionKeyImpl.interestOps(SelectionKeyImpl.java:77)
   [junit4]   2> 	at org.apache.zookeeper.server.NIOServerCnxn.sendBuffer(NIOServerCnxn.java:151)
   [junit4]   2> 	at org.apache.zookeeper.server.NIOServerCnxn.sendResponse(NIOServerCnxn.java:1081)
   [junit4]   2> 	at org.apache.zookeeper.server.FinalRequestProcessor.processRequest(FinalRequestProcessor.java:170)
   [junit4]   2> 	at org.apache.zookeeper.server.SyncRequestProcessor.run(SyncRequestProcessor.java:169)
   [junit4]   2> NOTE: reproduce with: ant test  -Dtestcase=TestMiniSolrCloudClusterBase
-Dtests.method=testBasics -Dtests.seed=C4873F997A1ABFFE -Dtests.slow=true -Dtests.locale=sl
-Dtests.timezone=Europe/Helsinki -Dtests.asserts=true -Dtests.file.encoding=US-ASCII
   [junit4] ERROR   10.9s J0 | TestMiniSolrCloudClusterBase.testBasics <<<
   [junit4]    > Throwable #1: org.apache.zookeeper.KeeperException$NodeExistsException:
KeeperErrorCode = NodeExists for /solr/solr.xml
   [junit4]    > 	at __randomizedtesting.SeedInfo.seed([C4873F997A1ABFFE:F95F91B542F4E18E]:0)
   [junit4]    > 	at org.apache.zookeeper.KeeperException.create(KeeperException.java:119)
   [junit4]    > 	at org.apache.zookeeper.KeeperException.create(KeeperException.java:51)
   [junit4]    > 	at org.apache.zookeeper.ZooKeeper.create(ZooKeeper.java:783)
   [junit4]    > 	at org.apache.solr.common.cloud.SolrZkClient$10.execute(SolrZkClient.java:501)
   [junit4]    > 	at org.apache.solr.common.cloud.ZkCmdExecutor.retryOperation(ZkCmdExecutor.java:61)
   [junit4]    > 	at org.apache.solr.common.cloud.SolrZkClient.makePath(SolrZkClient.java:498)
   [junit4]    > 	at org.apache.solr.common.cloud.SolrZkClient.makePath(SolrZkClient.java:455)
   [junit4]    > 	at org.apache.solr.common.cloud.SolrZkClient.makePath(SolrZkClient.java:442)
   [junit4]    > 	at org.apache.solr.common.cloud.SolrZkClient.makePath(SolrZkClient.java:429)
   [junit4]    > 	at org.apache.solr.cloud.MiniSolrCloudCluster.<init>(MiniSolrCloudCluster.java:199)
   [junit4]    > 	at org.apache.solr.cloud.MiniSolrCloudCluster.<init>(MiniSolrCloudCluster.java:111)
   [junit4]    > 	at org.apache.solr.cloud.TestMiniSolrCloudClusterBase.createMiniSolrCloudCluster(TestMiniSolrCloudClusterBase.java:83)
   [junit4]    > 	at org.apache.solr.cloud.TestMiniSolrCloudClusterBase.testCollectionCreateSearchDelete(TestMiniSolrCloudClusterBase.java:105)
   [junit4]    > 	at org.apache.solr.cloud.TestMiniSolrCloudClusterBase.testBasics(TestMiniSolrCloudClusterBase.java:77)
   [junit4]    > 	at java.lang.Thread.run(Thread.java:745)
   [junit4]   2> NOTE: leaving temporary files on disk at: /export/home/jenkins/workspace/Lucene-Solr-5.x-Solaris/solr/build/solr-core/test/J0/temp/solr.cloud.TestMiniSolrCloudClusterBase_C4873F997A1ABFFE-001
   [junit4]   2> Nov 23, 2015 5:05:13 PM com.carrotsearch.randomizedtesting.ThreadLeakControl
checkThreadLeaks
   [junit4]   2> WARNING: Will linger awaiting termination of 6 leaked thread(s).
   [junit4]   2> Nov 23, 2015 5:05:33 PM com.carrotsearch.randomizedtesting.ThreadLeakControl
checkThreadLeaks
   [junit4]   2> SEVERE: 5 threads leaked from SUITE scope at org.apache.solr.cloud.TestMiniSolrCloudClusterBase:

   [junit4]   2>    1) Thread[id=2354, name=SessionTracker, state=TIMED_WAITING, group=TGRP-TestMiniSolrCloudClusterBase]
   [junit4]   2>         at java.lang.Object.wait(Native Method)
   [junit4]   2>         at org.apache.zookeeper.server.SessionTrackerImpl.run(SessionTrackerImpl.java:146)
   [junit4]   2>    2) Thread[id=2352, name=Thread-1004, state=WAITING, group=TGRP-TestMiniSolrCloudClusterBase]
   [junit4]   2>         at java.lang.Object.wait(Native Method)
   [junit4]   2>         at java.lang.Thread.join(Thread.java:1281)
   [junit4]   2>         at java.lang.Thread.join(Thread.java:1355)
   [junit4]   2>         at org.apache.zookeeper.server.NIOServerCnxnFactory.join(NIOServerCnxnFactory.java:302)
   [junit4]   2>         at org.apache.solr.cloud.ZkTestServer$ZKServerMain.runFromConfig(ZkTestServer.java:310)
   [junit4]   2>         at org.apache.solr.cloud.ZkTestServer$2.run(ZkTestServer.java:491)
   [junit4]   2>    3) Thread[id=2356, name=ProcessThread(sid:0 cport:-1):, state=WAITING,
group=TGRP-TestMiniSolrCloudClusterBase]
   [junit4]   2>         at sun.misc.Unsafe.park(Native Method)
   [junit4]   2>         at java.util.concurrent.locks.LockSupport.park(LockSupport.java:186)
   [junit4]   2>         at java.util.concurrent.locks.AbstractQueuedSynchronizer$ConditionObject.await(AbstractQueuedSynchronizer.java:2043)
   [junit4]   2>         at java.util.concurrent.LinkedBlockingQueue.take(LinkedBlockingQueue.java:442)
   [junit4]   2>         at org.apache.zookeeper.server.PrepRequestProcessor.run(PrepRequestProcessor.java:120)
   [junit4]   2>    4) Thread[id=2353, name=NIOServerCxn.Factory:0.0.0.0/0.0.0.0:0, state=RUNNABLE,
group=TGRP-TestMiniSolrCloudClusterBase]
   [junit4]   2>         at sun.nio.ch.DevPollArrayWrapper.poll0(Native Method)
   [junit4]   2>         at sun.nio.ch.DevPollArrayWrapper.poll(DevPollArrayWrapper.java:223)
   [junit4]   2>         at sun.nio.ch.DevPollSelectorImpl.doSelect(DevPollSelectorImpl.java:84)
   [junit4]   2>         at sun.nio.ch.SelectorImpl.lockAndDoSelect(SelectorImpl.java:87)
   [junit4]   2>         at sun.nio.ch.SelectorImpl.select(SelectorImpl.java:98)
   [junit4]   2>         at org.apache.zookeeper.server.NIOServerCnxnFactory.run(NIOServerCnxnFactory.java:178)
   [junit4]   2>         at java.lang.Thread.run(Thread.java:745)
   [junit4]   2>    5) Thread[id=2355, name=SyncThread:0, state=WAITING, group=TGRP-TestMiniSolrCloudClusterBase]
   [junit4]   2>         at sun.misc.Unsafe.park(Native Method)
   [junit4]   2>         at java.util.concurrent.locks.LockSupport.park(LockSupport.java:186)
   [junit4]   2>         at java.util.concurrent.locks.AbstractQueuedSynchronizer$ConditionObject.await(AbstractQueuedSynchronizer.java:2043)
   [junit4]   2>         at java.util.concurrent.LinkedBlockingQueue.take(LinkedBlockingQueue.java:442)
   [junit4]   2>         at org.apache.zookeeper.server.SyncRequestProcessor.run(SyncRequestProcessor.java:127)
   [junit4]   2> Nov 23, 2015 5:05:33 PM com.carrotsearch.randomizedtesting.ThreadLeakControl
tryToInterruptAll
   [junit4]   2> INFO: Starting to interrupt leaked threads:
   [junit4]   2>    1) Thread[id=2354, name=SessionTracker, state=TIMED_WAITING, group=TGRP-TestMiniSolrCloudClusterBase]
   [junit4]   2>    2) Thread[id=2352, name=Thread-1004, state=WAITING, group=TGRP-TestMiniSolrCloudClusterBase]
   [junit4]   2>    3) Thread[id=2356, name=ProcessThread(sid:0 cport:-1):, state=WAITING,
group=TGRP-TestMiniSolrCloudClusterBase]
   [junit4]   2>    4) Thread[id=2353, name=NIOServerCxn.Factory:0.0.0.0/0.0.0.0:0, state=RUNNABLE,
group=TGRP-TestMiniSolrCloudClusterBase]
   [junit4]   2>    5) Thread[id=2355, name=SyncThread:0, state=WAITING, group=TGRP-TestMiniSolrCloudClusterBase]
   [junit4]   2> 437822 ERROR (ProcessThread(sid:0 cport:-1):) [    ] o.a.z.s.PrepRequestProcessor
Unexpected interruption
   [junit4]   2> java.lang.InterruptedException
   [junit4]   2> 	at java.util.concurrent.locks.AbstractQueuedSynchronizer$ConditionObject.reportInterruptAfterWait(AbstractQueuedSynchronizer.java:2017)
   [junit4]   2> 	at java.util.concurrent.locks.AbstractQueuedSynchronizer$ConditionObject.await(AbstractQueuedSynchronizer.java:2052)
   [junit4]   2> 	at java.util.concurrent.LinkedBlockingQueue.take(LinkedBlockingQueue.java:442)
   [junit4]   2> 	at org.apache.zookeeper.server.PrepRequestProcessor.run(PrepRequestProcessor.java:120)
   [junit4]   2> 437822 ERROR (SyncThread:0) [    ] o.a.z.s.SyncRequestProcessor Severe
unrecoverable error, exiting
   [junit4]   2> java.lang.InterruptedException
   [junit4]   2> 	at java.util.concurrent.locks.AbstractQueuedSynchronizer$ConditionObject.reportInterruptAfterWait(AbstractQueuedSynchronizer.java:2017)
   [junit4]   2> 	at java.util.concurrent.locks.AbstractQueuedSynchronizer$ConditionObject.await(AbstractQueuedSynchronizer.java:2052)
   [junit4]   2> 	at java.util.concurrent.LinkedBlockingQueue.take(LinkedBlockingQueue.java:442)
   [junit4]   2> 	at org.apache.zookeeper.server.SyncRequestProcessor.run(SyncRequestProcessor.java:127)
   [junit4]   2> 437822 ERROR (SessionTracker) [    ] o.a.z.s.SessionTrackerImpl Unexpected
interruption
   [junit4]   2> java.lang.InterruptedException
   [junit4]   2> 	at java.lang.Object.wait(Native Method)
   [junit4]   2> 	at org.apache.zookeeper.server.SessionTrackerImpl.run(SessionTrackerImpl.java:146)
   [junit4]   2> 437822 WARN  (Thread-1004) [    ] o.a.s.c.ZkTestServer Server interrupted
   [junit4]   2> java.lang.InterruptedException
   [junit4]   2> 	at java.lang.Object.wait(Native Method)
   [junit4]   2> 	at java.lang.Thread.join(Thread.java:1281)
   [junit4]   2> 	at java.lang.Thread.join(Thread.java:1355)
   [junit4]   2> 	at org.apache.zookeeper.server.NIOServerCnxnFactory.join(NIOServerCnxnFactory.java:302)
   [junit4]   2> 	at org.apache.solr.cloud.ZkTestServer$ZKServerMain.runFromConfig(ZkTestServer.java:310)
   [junit4]   2> 	at org.apache.solr.cloud.ZkTestServer$2.run(ZkTestServer.java:491)
   [junit4]   2> Nov 23, 2015 5:05:36 PM com.carrotsearch.randomizedtesting.ThreadLeakControl
tryToInterruptAll
   [junit4]   2> SEVERE: There are still zombie threads that couldn't be terminated:
   [junit4]   2>    1) Thread[id=2353, name=NIOServerCxn.Factory:0.0.0.0/0.0.0.0:0, state=RUNNABLE,
group=TGRP-TestMiniSolrCloudClusterBase]
   [junit4]   2>         at sun.nio.ch.IOUtil.drain(Native Method)
   [junit4]   2>         at sun.nio.ch.DevPollSelectorImpl.doSelect(DevPollSelectorImpl.java:95)
   [junit4]   2>         at sun.nio.ch.SelectorImpl.lockAndDoSelect(SelectorImpl.java:87)
   [junit4]   2>         at sun.nio.ch.SelectorImpl.select(SelectorImpl.java:98)
   [junit4]   2>         at org.apache.zookeeper.server.NIOServerCnxnFactory.run(NIOServerCnxnFactory.java:178)
   [junit4]   2>         at java.lang.Thread.run(Thread.java:745)
   [junit4]   2> NOTE: test params are: codec=Asserting(Lucene54): {}, docValues:{}, sim=RandomSimilarityProvider(queryNorm=true,coord=crazy):
{}, locale=sl, timezone=Europe/Helsinki
   [junit4]   2> NOTE: SunOS 5.11 x86/Oracle Corporation 1.7.0_91 (32-bit)/cpus=3,threads=2,free=131148816,total=261619712
   [junit4]   2> NOTE: All tests run in this JVM: [TestCopyFieldCollectionResource, TermsComponentTest,
TestImplicitCoreProperties, ChangedSchemaMergeTest, AnalyticsQueryTest, DistributedFacetPivotSmallTest,
ScriptEngineTest, TestSolrXml, TestExpandComponent, TestExactStatsCache, TestPostingsSolrHighlighter,
ShardSplitTest, CollectionsAPIAsyncDistributedZkTest, TestQuerySenderNoQuery, TestElisionMultitermQuery,
TestGroupingSearch, TestSolrDeletionPolicy1, AddSchemaFieldsUpdateProcessorFactoryTest, CursorMarkTest,
TestClassicSimilarityFactory, PathHierarchyTokenizerFactoryTest, DistribJoinFromCollectionTest,
TestManagedResource, DistributedSpellCheckComponentTest, DisMaxRequestHandlerTest, TestDynamicFieldResource,
DistributedFacetPivotLongTailTest, TestAnalyzeInfixSuggestions, TestCloudInspectUtil, ResponseHeaderTest,
TestHashPartitioner, TestAuthorizationFramework, TestFieldSortValues, TestRemoteStreaming,
TestFaceting, TestConfigSetsAPIZkFailure, AlternateDirectoryTest, TestDynamicFieldCollectionResource,
TestInfoStreamLogging, TestConfigOverlay, HLLUtilTest, SliceStateTest, SmileWriterTest, SolrRequestParserTest,
TestConfig, TestSolrDynamicMBean, UnloadDistributedZkTest, TestMiniSolrCloudClusterBase]
   [junit4]   2> NOTE: reproduce with: ant test  -Dtestcase=TestMiniSolrCloudClusterBase
-Dtests.seed=C4873F997A1ABFFE -Dtests.slow=true -Dtests.locale=sl -Dtests.timezone=Europe/Helsinki
-Dtests.asserts=true -Dtests.file.encoding=US-ASCII
   [junit4] ERROR   0.00s J0 | TestMiniSolrCloudClusterBase (suite) <<<
   [junit4]    > Throwable #1: com.carrotsearch.randomizedtesting.ThreadLeakError: 5 threads
leaked from SUITE scope at org.apache.solr.cloud.TestMiniSolrCloudClusterBase: 
   [junit4]    >    1) Thread[id=2354, name=SessionTracker, state=TIMED_WAITING, group=TGRP-TestMiniSolrCloudClusterBase]
   [junit4]    >         at java.lang.Object.wait(Native Method)
   [junit4]    >         at org.apache.zookeeper.server.SessionTrackerImpl.run(SessionTrackerImpl.java:146)
   [junit4]    >    2) Thread[id=2352, name=Thread-1004, state=WAITING, group=TGRP-TestMiniSolrCloudClusterBase]
   [junit4]    >         at java.lang.Object.wait(Native Method)
   [junit4]    >         at java.lang.Thread.join(Thread.java:1281)
   [junit4]    >         at java.lang.Thread.join(Thread.java:1355)
   [junit4]    >         at org.apache.zookeeper.server.NIOServerCnxnFactory.join(NIOServerCnxnFactory.java:302)
   [junit4]    >         at org.apache.solr.cloud.ZkTestServer$ZKServerMain.runFromConfig(ZkTestServer.java:310)
   [junit4]    >         at org.apache.solr.cloud.ZkTestServer$2.run(ZkTestServer.java:491)
   [junit4]    >    3) Thread[id=2356, name=ProcessThread(sid:0 cport:-1):, state=WAITING,
group=TGRP-TestMiniSolrCloudClusterBase]
   [junit4]    >         at sun.misc.Unsafe.park(Native Method)
   [junit4]    >         at java.util.concurrent.locks.LockSupport.park(LockSupport.java:186)
   [junit4]    >         at java.util.concurrent.locks.AbstractQueuedSynchronizer$ConditionObject.await(AbstractQueuedSynchronizer.java:2043)
   [junit4]    >         at java.util.concurrent.LinkedBlockingQueue.take(LinkedBlockingQueue.java:442)
   [junit4]    >         at org.apache.zookeeper.server.PrepRequestProcessor.run(PrepRequestProcessor.java:120)
   [junit4]    >    4) Thread[id=2353, name=NIOServerCxn.Factory:0.0.0.0/0.0.0.0:0, state=RUNNABLE,
group=TGRP-TestMiniSolrCloudClusterBase]
   [junit4]    >         at sun.nio.ch.DevPollArrayWrapper.poll0(Native Method)
   [junit4]    >         at sun.nio.ch.DevPollArrayWrapper.poll(DevPollArrayWrapper.java:223)
   [junit4]    >         at sun.nio.ch.DevPollSelectorImpl.doSelect(DevPollSelectorImpl.java:84)
   [junit4]    >         at sun.nio.ch.SelectorImpl.lockAndDoSelect(SelectorImpl.java:87)
   [junit4]    >         at sun.nio.ch.SelectorImpl.select(SelectorImpl.java:98)
   [junit4]    >         at org.apache.zookeeper.server.NIOServerCnxnFactory.run(NIOServerCnxnFactory.java:178)
   [junit4]    >         at java.lang.Thread.run(Thread.java:745)
   [junit4]    >    5) Thread[id=2355, name=SyncThread:0, state=WAITING, group=TGRP-TestMiniSolrCloudClusterBase]
   [junit4]    >         at sun.misc.Unsafe.park(Native Method)
   [junit4]    >         at java.util.concurrent.locks.LockSupport.park(LockSupport.java:186)
   [junit4]    >         at java.util.concurrent.locks.AbstractQueuedSynchronizer$ConditionObject.await(AbstractQueuedSynchronizer.java:2043)
   [junit4]    >         at java.util.concurrent.LinkedBlockingQueue.take(LinkedBlockingQueue.java:442)
   [junit4]    >         at org.apache.zookeeper.server.SyncRequestProcessor.run(SyncRequestProcessor.java:127)
   [junit4]    > 	at __randomizedtesting.SeedInfo.seed([C4873F997A1ABFFE]:0)Throwable #2:
com.carrotsearch.randomizedtesting.ThreadLeakError: There are still zombie threads that couldn't
be terminated:
   [junit4]    >    1) Thread[id=2353, name=NIOServerCxn.Factory:0.0.0.0/0.0.0.0:0, state=RUNNABLE,
group=TGRP-TestMiniSolrCloudClusterBase]
   [junit4]    >         at sun.nio.ch.IOUtil.drain(Native Method)
   [junit4]    >         at sun.nio.ch.DevPollSelectorImpl.doSelect(DevPollSelectorImpl.java:95)
   [junit4]    >         at sun.nio.ch.SelectorImpl.lockAndDoSelect(SelectorImpl.java:87)
   [junit4]    >         at sun.nio.ch.SelectorImpl.select(SelectorImpl.java:98)
   [junit4]    >         at org.apache.zookeeper.server.NIOServerCnxnFactory.run(NIOServerCnxnFactory.java:178)
   [junit4]    >         at java.lang.Thread.run(Thread.java:745)
   [junit4]    > 	at __randomizedtesting.SeedInfo.seed([C4873F997A1ABFFE]:0)
   [junit4] Completed [108/549] on J0 in 37.36s, 1 test, 3 errors <<< FAILURES!

[...truncated 1366 lines...]
BUILD FAILED
/export/home/jenkins/workspace/Lucene-Solr-5.x-Solaris/build.xml:785: The following error
occurred while executing this line:
/export/home/jenkins/workspace/Lucene-Solr-5.x-Solaris/build.xml:729: The following error
occurred while executing this line:
/export/home/jenkins/workspace/Lucene-Solr-5.x-Solaris/build.xml:59: The following error occurred
while executing this line:
/export/home/jenkins/workspace/Lucene-Solr-5.x-Solaris/solr/build.xml:233: The following error
occurred while executing this line:
/export/home/jenkins/workspace/Lucene-Solr-5.x-Solaris/solr/common-build.xml:526: The following
error occurred while executing this line:
/export/home/jenkins/workspace/Lucene-Solr-5.x-Solaris/lucene/common-build.xml:1452: The following
error occurred while executing this line:
/export/home/jenkins/workspace/Lucene-Solr-5.x-Solaris/lucene/common-build.xml:1006: There
were test failures: 549 suites (7 ignored), 2167 tests, 2 suite-level errors, 1 error, 1444
ignored (26 assumptions) [seed: C4873F997A1ABFFE]

Total time: 36 minutes 59 seconds
Build step 'Invoke Ant' marked build as failure
Archiving artifacts
[WARNINGS] Skipping publisher since build result is FAILURE
Recording test results
Email was triggered for: Failure - Any
Sending email for trigger: Failure - Any



Mime
View raw message