lucene-dev mailing list archives

Site index · List index
Message view « Date » · « Thread »
Top « Date » · « Thread »
From Policeman Jenkins Server <jenk...@thetaphi.de>
Subject [JENKINS-EA] Lucene-Solr-trunk-Linux (64bit/jdk1.9.0-ea-b85) - Build # 14706 - Failure!
Date Thu, 29 Oct 2015 04:25:37 GMT
Build: http://jenkins.thetaphi.de/job/Lucene-Solr-trunk-Linux/14706/
Java: 64bit/jdk1.9.0-ea-b85 -XX:-UseCompressedOops -XX:+UseG1GC

1 tests failed.
FAILED:  org.apache.solr.cloud.BasicDistributedZkTest.test

Error Message:
commitWithin did not work on node: http://127.0.0.1:48817/collection1 expected:<68> but was:<67>

Stack Trace:
java.lang.AssertionError: commitWithin did not work on node: http://127.0.0.1:48817/collection1 expected:<68> but was:<67>
	at __randomizedtesting.SeedInfo.seed([1F60B6F6759E2BB3:9734892CDB62464B]:0)
	at org.junit.Assert.fail(Assert.java:93)
	at org.junit.Assert.failNotEquals(Assert.java:647)
	at org.junit.Assert.assertEquals(Assert.java:128)
	at org.junit.Assert.assertEquals(Assert.java:472)
	at org.apache.solr.cloud.BasicDistributedZkTest.test(BasicDistributedZkTest.java:333)
	at sun.reflect.NativeMethodAccessorImpl.invoke0(Native Method)
	at sun.reflect.NativeMethodAccessorImpl.invoke(NativeMethodAccessorImpl.java:62)
	at sun.reflect.DelegatingMethodAccessorImpl.invoke(DelegatingMethodAccessorImpl.java:43)
	at java.lang.reflect.Method.invoke(Method.java:520)
	at com.carrotsearch.randomizedtesting.RandomizedRunner.invoke(RandomizedRunner.java:1665)
	at com.carrotsearch.randomizedtesting.RandomizedRunner$8.evaluate(RandomizedRunner.java:864)
	at com.carrotsearch.randomizedtesting.RandomizedRunner$9.evaluate(RandomizedRunner.java:900)
	at com.carrotsearch.randomizedtesting.RandomizedRunner$10.evaluate(RandomizedRunner.java:914)
	at org.apache.solr.BaseDistributedSearchTestCase$ShardsRepeatRule$ShardsFixedStatement.callStatement(BaseDistributedSearchTestCase.java:963)
	at org.apache.solr.BaseDistributedSearchTestCase$ShardsRepeatRule$ShardsStatement.evaluate(BaseDistributedSearchTestCase.java:938)
	at com.carrotsearch.randomizedtesting.rules.SystemPropertiesRestoreRule$1.evaluate(SystemPropertiesRestoreRule.java:57)
	at org.apache.lucene.util.TestRuleSetupTeardownChained$1.evaluate(TestRuleSetupTeardownChained.java:50)
	at org.apache.lucene.util.AbstractBeforeAfterRule$1.evaluate(AbstractBeforeAfterRule.java:46)
	at org.apache.lucene.util.TestRuleThreadAndTestName$1.evaluate(TestRuleThreadAndTestName.java:49)
	at org.apache.lucene.util.TestRuleIgnoreAfterMaxFailures$1.evaluate(TestRuleIgnoreAfterMaxFailures.java:65)
	at org.apache.lucene.util.TestRuleMarkFailure$1.evaluate(TestRuleMarkFailure.java:48)
	at com.carrotsearch.randomizedtesting.rules.StatementAdapter.evaluate(StatementAdapter.java:36)
	at com.carrotsearch.randomizedtesting.ThreadLeakControl$StatementRunner.run(ThreadLeakControl.java:367)
	at com.carrotsearch.randomizedtesting.ThreadLeakControl.forkTimeoutingTask(ThreadLeakControl.java:809)
	at com.carrotsearch.randomizedtesting.ThreadLeakControl$3.evaluate(ThreadLeakControl.java:460)
	at com.carrotsearch.randomizedtesting.RandomizedRunner.runSingleTest(RandomizedRunner.java:873)
	at com.carrotsearch.randomizedtesting.RandomizedRunner$5.evaluate(RandomizedRunner.java:775)
	at com.carrotsearch.randomizedtesting.RandomizedRunner$6.evaluate(RandomizedRunner.java:809)
	at com.carrotsearch.randomizedtesting.RandomizedRunner$7.evaluate(RandomizedRunner.java:820)
	at com.carrotsearch.randomizedtesting.rules.StatementAdapter.evaluate(StatementAdapter.java:36)
	at com.carrotsearch.randomizedtesting.rules.SystemPropertiesRestoreRule$1.evaluate(SystemPropertiesRestoreRule.java:57)
	at org.apache.lucene.util.AbstractBeforeAfterRule$1.evaluate(AbstractBeforeAfterRule.java:46)
	at com.carrotsearch.randomizedtesting.rules.StatementAdapter.evaluate(StatementAdapter.java:36)
	at org.apache.lucene.util.TestRuleStoreClassName$1.evaluate(TestRuleStoreClassName.java:42)
	at com.carrotsearch.randomizedtesting.rules.NoShadowingOrOverridesOnMethodsRule$1.evaluate(NoShadowingOrOverridesOnMethodsRule.java:39)
	at com.carrotsearch.randomizedtesting.rules.NoShadowingOrOverridesOnMethodsRule$1.evaluate(NoShadowingOrOverridesOnMethodsRule.java:39)
	at com.carrotsearch.randomizedtesting.rules.StatementAdapter.evaluate(StatementAdapter.java:36)
	at com.carrotsearch.randomizedtesting.rules.StatementAdapter.evaluate(StatementAdapter.java:36)
	at com.carrotsearch.randomizedtesting.rules.StatementAdapter.evaluate(StatementAdapter.java:36)
	at org.apache.lucene.util.TestRuleAssertionsRequired$1.evaluate(TestRuleAssertionsRequired.java:54)
	at org.apache.lucene.util.TestRuleMarkFailure$1.evaluate(TestRuleMarkFailure.java:48)
	at org.apache.lucene.util.TestRuleIgnoreAfterMaxFailures$1.evaluate(TestRuleIgnoreAfterMaxFailures.java:65)
	at org.apache.lucene.util.TestRuleIgnoreTestSuites$1.evaluate(TestRuleIgnoreTestSuites.java:55)
	at com.carrotsearch.randomizedtesting.rules.StatementAdapter.evaluate(StatementAdapter.java:36)
	at com.carrotsearch.randomizedtesting.ThreadLeakControl$StatementRunner.run(ThreadLeakControl.java:367)
	at java.lang.Thread.run(Thread.java:747)




Build Log:
[...truncated 9445 lines...]
   [junit4] Suite: org.apache.solr.cloud.BasicDistributedZkTest
   [junit4]   2> Creating dataDir: /home/jenkins/workspace/Lucene-Solr-trunk-Linux/solr/build/solr-core/test/J0/temp/solr.cloud.BasicDistributedZkTest_1F60B6F6759E2BB3-001/init-core-data-001
   [junit4]   2> 136194 INFO  (SUITE-BasicDistributedZkTest-seed#[1F60B6F6759E2BB3]-worker) [    ] o.a.s.BaseDistributedSearchTestCase Setting hostContext system property: /
   [junit4]   2> 136197 INFO  (TEST-BasicDistributedZkTest.test-seed#[1F60B6F6759E2BB3]) [    ] o.a.s.c.ZkTestServer STARTING ZK TEST SERVER
   [junit4]   2> 136197 INFO  (Thread-382) [    ] o.a.s.c.ZkTestServer client port:0.0.0.0/0.0.0.0:0
   [junit4]   2> 136197 INFO  (Thread-382) [    ] o.a.s.c.ZkTestServer Starting server
   [junit4]   2> 136297 INFO  (TEST-BasicDistributedZkTest.test-seed#[1F60B6F6759E2BB3]) [    ] o.a.s.c.ZkTestServer start zk server on port:54863
   [junit4]   2> 136297 INFO  (TEST-BasicDistributedZkTest.test-seed#[1F60B6F6759E2BB3]) [    ] o.a.s.c.c.SolrZkClient Using default ZkCredentialsProvider
   [junit4]   2> 136297 INFO  (TEST-BasicDistributedZkTest.test-seed#[1F60B6F6759E2BB3]) [    ] o.a.s.c.c.ConnectionManager Waiting for client to connect to ZooKeeper
   [junit4]   2> 136301 INFO  (zkCallback-92-thread-1) [    ] o.a.s.c.c.ConnectionManager Watcher org.apache.solr.common.cloud.ConnectionManager@5c5adc63 name:ZooKeeperConnection Watcher:127.0.0.1:54863 got event WatchedEvent state:SyncConnected type:None path:null path:null type:None
   [junit4]   2> 136301 INFO  (TEST-BasicDistributedZkTest.test-seed#[1F60B6F6759E2BB3]) [    ] o.a.s.c.c.ConnectionManager Client is connected to ZooKeeper
   [junit4]   2> 136301 INFO  (TEST-BasicDistributedZkTest.test-seed#[1F60B6F6759E2BB3]) [    ] o.a.s.c.c.SolrZkClient Using default ZkACLProvider
   [junit4]   2> 136302 INFO  (TEST-BasicDistributedZkTest.test-seed#[1F60B6F6759E2BB3]) [    ] o.a.s.c.c.SolrZkClient makePath: /solr
   [junit4]   2> 136304 INFO  (TEST-BasicDistributedZkTest.test-seed#[1F60B6F6759E2BB3]) [    ] o.a.s.c.c.SolrZkClient Using default ZkCredentialsProvider
   [junit4]   2> 136305 INFO  (TEST-BasicDistributedZkTest.test-seed#[1F60B6F6759E2BB3]) [    ] o.a.s.c.c.ConnectionManager Waiting for client to connect to ZooKeeper
   [junit4]   2> 136306 INFO  (zkCallback-93-thread-1) [    ] o.a.s.c.c.ConnectionManager Watcher org.apache.solr.common.cloud.ConnectionManager@25da33e name:ZooKeeperConnection Watcher:127.0.0.1:54863/solr got event WatchedEvent state:SyncConnected type:None path:null path:null type:None
   [junit4]   2> 136306 INFO  (TEST-BasicDistributedZkTest.test-seed#[1F60B6F6759E2BB3]) [    ] o.a.s.c.c.ConnectionManager Client is connected to ZooKeeper
   [junit4]   2> 136307 INFO  (TEST-BasicDistributedZkTest.test-seed#[1F60B6F6759E2BB3]) [    ] o.a.s.c.c.SolrZkClient Using default ZkACLProvider
   [junit4]   2> 136307 INFO  (TEST-BasicDistributedZkTest.test-seed#[1F60B6F6759E2BB3]) [    ] o.a.s.c.c.SolrZkClient makePath: /collections/collection1
   [junit4]   2> 136308 INFO  (TEST-BasicDistributedZkTest.test-seed#[1F60B6F6759E2BB3]) [    ] o.a.s.c.c.SolrZkClient makePath: /collections/collection1/shards
   [junit4]   2> 136309 INFO  (TEST-BasicDistributedZkTest.test-seed#[1F60B6F6759E2BB3]) [    ] o.a.s.c.c.SolrZkClient makePath: /collections/control_collection
   [junit4]   2> 136309 INFO  (TEST-BasicDistributedZkTest.test-seed#[1F60B6F6759E2BB3]) [    ] o.a.s.c.c.SolrZkClient makePath: /collections/control_collection/shards
   [junit4]   2> 136310 INFO  (TEST-BasicDistributedZkTest.test-seed#[1F60B6F6759E2BB3]) [    ] o.a.s.c.AbstractZkTestCase put /home/jenkins/workspace/Lucene-Solr-trunk-Linux/solr/core/src/test-files/solr/collection1/conf/solrconfig-tlog.xml to /configs/conf1/solrconfig.xml
   [junit4]   2> 136310 INFO  (TEST-BasicDistributedZkTest.test-seed#[1F60B6F6759E2BB3]) [    ] o.a.s.c.c.SolrZkClient makePath: /configs/conf1/solrconfig.xml
   [junit4]   2> 136312 INFO  (TEST-BasicDistributedZkTest.test-seed#[1F60B6F6759E2BB3]) [    ] o.a.s.c.AbstractZkTestCase put /home/jenkins/workspace/Lucene-Solr-trunk-Linux/solr/core/src/test-files/solr/collection1/conf/schema.xml to /configs/conf1/schema.xml
   [junit4]   2> 136312 INFO  (TEST-BasicDistributedZkTest.test-seed#[1F60B6F6759E2BB3]) [    ] o.a.s.c.c.SolrZkClient makePath: /configs/conf1/schema.xml
   [junit4]   2> 136313 INFO  (TEST-BasicDistributedZkTest.test-seed#[1F60B6F6759E2BB3]) [    ] o.a.s.c.AbstractZkTestCase put /home/jenkins/workspace/Lucene-Solr-trunk-Linux/solr/core/src/test-files/solr/collection1/conf/solrconfig.snippet.randomindexconfig.xml to /configs/conf1/solrconfig.snippet.randomindexconfig.xml
   [junit4]   2> 136313 INFO  (TEST-BasicDistributedZkTest.test-seed#[1F60B6F6759E2BB3]) [    ] o.a.s.c.c.SolrZkClient makePath: /configs/conf1/solrconfig.snippet.randomindexconfig.xml
   [junit4]   2> 136313 INFO  (TEST-BasicDistributedZkTest.test-seed#[1F60B6F6759E2BB3]) [    ] o.a.s.c.AbstractZkTestCase put /home/jenkins/workspace/Lucene-Solr-trunk-Linux/solr/core/src/test-files/solr/collection1/conf/stopwords.txt to /configs/conf1/stopwords.txt
   [junit4]   2> 136313 INFO  (TEST-BasicDistributedZkTest.test-seed#[1F60B6F6759E2BB3]) [    ] o.a.s.c.c.SolrZkClient makePath: /configs/conf1/stopwords.txt
   [junit4]   2> 136314 INFO  (TEST-BasicDistributedZkTest.test-seed#[1F60B6F6759E2BB3]) [    ] o.a.s.c.AbstractZkTestCase put /home/jenkins/workspace/Lucene-Solr-trunk-Linux/solr/core/src/test-files/solr/collection1/conf/protwords.txt to /configs/conf1/protwords.txt
   [junit4]   2> 136314 INFO  (TEST-BasicDistributedZkTest.test-seed#[1F60B6F6759E2BB3]) [    ] o.a.s.c.c.SolrZkClient makePath: /configs/conf1/protwords.txt
   [junit4]   2> 136315 INFO  (TEST-BasicDistributedZkTest.test-seed#[1F60B6F6759E2BB3]) [    ] o.a.s.c.AbstractZkTestCase put /home/jenkins/workspace/Lucene-Solr-trunk-Linux/solr/core/src/test-files/solr/collection1/conf/currency.xml to /configs/conf1/currency.xml
   [junit4]   2> 136315 INFO  (TEST-BasicDistributedZkTest.test-seed#[1F60B6F6759E2BB3]) [    ] o.a.s.c.c.SolrZkClient makePath: /configs/conf1/currency.xml
   [junit4]   2> 136316 INFO  (TEST-BasicDistributedZkTest.test-seed#[1F60B6F6759E2BB3]) [    ] o.a.s.c.AbstractZkTestCase put /home/jenkins/workspace/Lucene-Solr-trunk-Linux/solr/core/src/test-files/solr/collection1/conf/enumsConfig.xml to /configs/conf1/enumsConfig.xml
   [junit4]   2> 136316 INFO  (TEST-BasicDistributedZkTest.test-seed#[1F60B6F6759E2BB3]) [    ] o.a.s.c.c.SolrZkClient makePath: /configs/conf1/enumsConfig.xml
   [junit4]   2> 136317 INFO  (TEST-BasicDistributedZkTest.test-seed#[1F60B6F6759E2BB3]) [    ] o.a.s.c.AbstractZkTestCase put /home/jenkins/workspace/Lucene-Solr-trunk-Linux/solr/core/src/test-files/solr/collection1/conf/open-exchange-rates.json to /configs/conf1/open-exchange-rates.json
   [junit4]   2> 136317 INFO  (TEST-BasicDistributedZkTest.test-seed#[1F60B6F6759E2BB3]) [    ] o.a.s.c.c.SolrZkClient makePath: /configs/conf1/open-exchange-rates.json
   [junit4]   2> 136317 INFO  (TEST-BasicDistributedZkTest.test-seed#[1F60B6F6759E2BB3]) [    ] o.a.s.c.AbstractZkTestCase put /home/jenkins/workspace/Lucene-Solr-trunk-Linux/solr/core/src/test-files/solr/collection1/conf/mapping-ISOLatin1Accent.txt to /configs/conf1/mapping-ISOLatin1Accent.txt
   [junit4]   2> 136317 INFO  (TEST-BasicDistributedZkTest.test-seed#[1F60B6F6759E2BB3]) [    ] o.a.s.c.c.SolrZkClient makePath: /configs/conf1/mapping-ISOLatin1Accent.txt
   [junit4]   2> 136318 INFO  (TEST-BasicDistributedZkTest.test-seed#[1F60B6F6759E2BB3]) [    ] o.a.s.c.AbstractZkTestCase put /home/jenkins/workspace/Lucene-Solr-trunk-Linux/solr/core/src/test-files/solr/collection1/conf/old_synonyms.txt to /configs/conf1/old_synonyms.txt
   [junit4]   2> 136318 INFO  (TEST-BasicDistributedZkTest.test-seed#[1F60B6F6759E2BB3]) [    ] o.a.s.c.c.SolrZkClient makePath: /configs/conf1/old_synonyms.txt
   [junit4]   2> 136318 INFO  (TEST-BasicDistributedZkTest.test-seed#[1F60B6F6759E2BB3]) [    ] o.a.s.c.AbstractZkTestCase put /home/jenkins/workspace/Lucene-Solr-trunk-Linux/solr/core/src/test-files/solr/collection1/conf/synonyms.txt to /configs/conf1/synonyms.txt
   [junit4]   2> 136318 INFO  (TEST-BasicDistributedZkTest.test-seed#[1F60B6F6759E2BB3]) [    ] o.a.s.c.c.SolrZkClient makePath: /configs/conf1/synonyms.txt
   [junit4]   2> 136369 INFO  (TEST-BasicDistributedZkTest.test-seed#[1F60B6F6759E2BB3]) [    ] o.a.s.SolrTestCaseJ4 Writing core.properties file to /home/jenkins/workspace/Lucene-Solr-trunk-Linux/solr/build/solr-core/test/J0/temp/solr.cloud.BasicDistributedZkTest_1F60B6F6759E2BB3-001/control-001/cores/collection1
   [junit4]   2> 136370 INFO  (TEST-BasicDistributedZkTest.test-seed#[1F60B6F6759E2BB3]) [    ] o.e.j.s.Server jetty-9.2.13.v20150730
   [junit4]   2> 136371 INFO  (TEST-BasicDistributedZkTest.test-seed#[1F60B6F6759E2BB3]) [    ] o.e.j.s.h.ContextHandler Started o.e.j.s.ServletContextHandler@26f9940b{/,null,AVAILABLE}
   [junit4]   2> 136373 INFO  (TEST-BasicDistributedZkTest.test-seed#[1F60B6F6759E2BB3]) [    ] o.e.j.s.ServerConnector Started ServerConnector@679736d5{HTTP/1.1}{127.0.0.1:۵۲۷۹۸}
   [junit4]   2> 136373 INFO  (TEST-BasicDistributedZkTest.test-seed#[1F60B6F6759E2BB3]) [    ] o.e.j.s.Server Started @۱۳۸۰۲۰ms
   [junit4]   2> 136373 INFO  (TEST-BasicDistributedZkTest.test-seed#[1F60B6F6759E2BB3]) [    ] o.a.s.c.s.e.JettySolrRunner Jetty properties: {solr.data.dir=/home/jenkins/workspace/Lucene-Solr-trunk-Linux/solr/build/solr-core/test/J0/temp/solr.cloud.BasicDistributedZkTest_1F60B6F6759E2BB3-001/tempDir-001/control/data, hostContext=/, hostPort=52798, coreRootDirectory=/home/jenkins/workspace/Lucene-Solr-trunk-Linux/solr/build/solr-core/test/J0/temp/solr.cloud.BasicDistributedZkTest_1F60B6F6759E2BB3-001/control-001/cores}
   [junit4]   2> 136374 INFO  (TEST-BasicDistributedZkTest.test-seed#[1F60B6F6759E2BB3]) [    ] o.a.s.s.SolrDispatchFilter SolrDispatchFilter.init(): sun.misc.Launcher$AppClassLoader@73c6c3b2
   [junit4]   2> 136374 INFO  (TEST-BasicDistributedZkTest.test-seed#[1F60B6F6759E2BB3]) [    ] o.a.s.c.SolrResourceLoader new SolrResourceLoader for directory: '/home/jenkins/workspace/Lucene-Solr-trunk-Linux/solr/build/solr-core/test/J0/temp/solr.cloud.BasicDistributedZkTest_1F60B6F6759E2BB3-001/control-001/'
   [junit4]   2> 136374 INFO  (TEST-BasicDistributedZkTest.test-seed#[1F60B6F6759E2BB3]) [    ] o.a.s.c.SolrResourceLoader JNDI not configured for solr (NoInitialContextEx)
   [junit4]   2> 136374 INFO  (TEST-BasicDistributedZkTest.test-seed#[1F60B6F6759E2BB3]) [    ] o.a.s.c.SolrResourceLoader solr home defaulted to 'solr/' (could not find system property or JNDI)
   [junit4]   2> 136382 INFO  (TEST-BasicDistributedZkTest.test-seed#[1F60B6F6759E2BB3]) [    ] o.a.s.c.c.SolrZkClient Using default ZkCredentialsProvider
   [junit4]   2> 136382 INFO  (TEST-BasicDistributedZkTest.test-seed#[1F60B6F6759E2BB3]) [    ] o.a.s.c.c.ConnectionManager Waiting for client to connect to ZooKeeper
   [junit4]   2> 136384 INFO  (zkCallback-94-thread-1) [    ] o.a.s.c.c.ConnectionManager Watcher org.apache.solr.common.cloud.ConnectionManager@6ec54dac name:ZooKeeperConnection Watcher:127.0.0.1:54863/solr got event WatchedEvent state:SyncConnected type:None path:null path:null type:None
   [junit4]   2> 136384 INFO  (TEST-BasicDistributedZkTest.test-seed#[1F60B6F6759E2BB3]) [    ] o.a.s.c.c.ConnectionManager Client is connected to ZooKeeper
   [junit4]   2> 136384 INFO  (TEST-BasicDistributedZkTest.test-seed#[1F60B6F6759E2BB3]) [    ] o.a.s.c.c.SolrZkClient Using default ZkACLProvider
   [junit4]   2> 136385 INFO  (TEST-BasicDistributedZkTest.test-seed#[1F60B6F6759E2BB3]) [    ] o.a.s.s.SolrDispatchFilter Loading solr.xml from SolrHome (not found in ZooKeeper)
   [junit4]   2> 136385 INFO  (TEST-BasicDistributedZkTest.test-seed#[1F60B6F6759E2BB3]) [    ] o.a.s.c.SolrXmlConfig Loading container configuration from /home/jenkins/workspace/Lucene-Solr-trunk-Linux/solr/build/solr-core/test/J0/temp/solr.cloud.BasicDistributedZkTest_1F60B6F6759E2BB3-001/control-001/solr.xml
   [junit4]   2> 136390 INFO  (TEST-BasicDistributedZkTest.test-seed#[1F60B6F6759E2BB3]) [    ] o.a.s.c.CoresLocator Config-defined core root directory: /home/jenkins/workspace/Lucene-Solr-trunk-Linux/solr/build/solr-core/test/J0/temp/solr.cloud.BasicDistributedZkTest_1F60B6F6759E2BB3-001/control-001/cores
   [junit4]   2> 136390 INFO  (TEST-BasicDistributedZkTest.test-seed#[1F60B6F6759E2BB3]) [    ] o.a.s.c.CoreContainer New CoreContainer 680358540
   [junit4]   2> 136390 INFO  (TEST-BasicDistributedZkTest.test-seed#[1F60B6F6759E2BB3]) [    ] o.a.s.c.CoreContainer Loading cores into CoreContainer [instanceDir=/home/jenkins/workspace/Lucene-Solr-trunk-Linux/solr/build/solr-core/test/J0/temp/solr.cloud.BasicDistributedZkTest_1F60B6F6759E2BB3-001/control-001/]
   [junit4]   2> 136390 INFO  (TEST-BasicDistributedZkTest.test-seed#[1F60B6F6759E2BB3]) [    ] o.a.s.c.CoreContainer loading shared library: /home/jenkins/workspace/Lucene-Solr-trunk-Linux/solr/build/solr-core/test/J0/temp/solr.cloud.BasicDistributedZkTest_1F60B6F6759E2BB3-001/control-001/lib
   [junit4]   2> 136390 WARN  (TEST-BasicDistributedZkTest.test-seed#[1F60B6F6759E2BB3]) [    ] o.a.s.c.SolrResourceLoader Can't find (or read) directory to add to classloader: lib (resolved as: /home/jenkins/workspace/Lucene-Solr-trunk-Linux/solr/build/solr-core/test/J0/temp/solr.cloud.BasicDistributedZkTest_1F60B6F6759E2BB3-001/control-001/lib).
   [junit4]   2> 136394 INFO  (TEST-BasicDistributedZkTest.test-seed#[1F60B6F6759E2BB3]) [    ] o.a.s.h.c.HttpShardHandlerFactory created with socketTimeout : 90000,urlScheme : ,connTimeout : 15000,maxConnectionsPerHost : 20,maxConnections : 10000,corePoolSize : 0,maximumPoolSize : 2147483647,maxThreadIdleTime : 5,sizeOfQueue : -1,fairnessPolicy : false,useRetries : false,
   [junit4]   2> 136395 INFO  (TEST-BasicDistributedZkTest.test-seed#[1F60B6F6759E2BB3]) [    ] o.a.s.u.UpdateShardHandler Creating UpdateShardHandler HTTP client with params: socketTimeout=340000&connTimeout=45000&retry=true
   [junit4]   2> 136396 INFO  (TEST-BasicDistributedZkTest.test-seed#[1F60B6F6759E2BB3]) [    ] o.a.s.l.LogWatcher SLF4J impl is org.slf4j.impl.Log4jLoggerFactory
   [junit4]   2> 136396 INFO  (TEST-BasicDistributedZkTest.test-seed#[1F60B6F6759E2BB3]) [    ] o.a.s.l.LogWatcher Registering Log Listener [Log4j (org.slf4j.impl.Log4jLoggerFactory)]
   [junit4]   2> 136396 INFO  (TEST-BasicDistributedZkTest.test-seed#[1F60B6F6759E2BB3]) [    ] o.a.s.c.ZkContainer Zookeeper client=127.0.0.1:54863/solr
   [junit4]   2> 136396 INFO  (TEST-BasicDistributedZkTest.test-seed#[1F60B6F6759E2BB3]) [    ] o.a.s.c.ZkController zkHost includes chroot
   [junit4]   2> 136396 INFO  (TEST-BasicDistributedZkTest.test-seed#[1F60B6F6759E2BB3]) [    ] o.a.s.c.c.SolrZkClient Using default ZkCredentialsProvider
   [junit4]   2> 136396 INFO  (TEST-BasicDistributedZkTest.test-seed#[1F60B6F6759E2BB3]) [    ] o.a.s.c.c.ConnectionManager Waiting for client to connect to ZooKeeper
   [junit4]   2> 136398 INFO  (zkCallback-96-thread-1) [    ] o.a.s.c.c.ConnectionManager Watcher org.apache.solr.common.cloud.ConnectionManager@1f63ef33 name:ZooKeeperConnection Watcher:127.0.0.1:54863 got event WatchedEvent state:SyncConnected type:None path:null path:null type:None
   [junit4]   2> 136398 INFO  (TEST-BasicDistributedZkTest.test-seed#[1F60B6F6759E2BB3]) [    ] o.a.s.c.c.ConnectionManager Client is connected to ZooKeeper
   [junit4]   2> 136399 INFO  (TEST-BasicDistributedZkTest.test-seed#[1F60B6F6759E2BB3]) [    ] o.a.s.c.c.SolrZkClient Using default ZkACLProvider
   [junit4]   2> 136400 INFO  (TEST-BasicDistributedZkTest.test-seed#[1F60B6F6759E2BB3]) [n:127.0.0.1:52798_    ] o.a.s.c.c.ConnectionManager Waiting for client to connect to ZooKeeper
   [junit4]   2> 136401 INFO  (zkCallback-97-thread-1-processing-n:127.0.0.1:52798_) [n:127.0.0.1:52798_    ] o.a.s.c.c.ConnectionManager Watcher org.apache.solr.common.cloud.ConnectionManager@2136f24f name:ZooKeeperConnection Watcher:127.0.0.1:54863/solr got event WatchedEvent state:SyncConnected type:None path:null path:null type:None
   [junit4]   2> 136401 INFO  (TEST-BasicDistributedZkTest.test-seed#[1F60B6F6759E2BB3]) [n:127.0.0.1:52798_    ] o.a.s.c.c.ConnectionManager Client is connected to ZooKeeper
   [junit4]   2> 136402 INFO  (TEST-BasicDistributedZkTest.test-seed#[1F60B6F6759E2BB3]) [n:127.0.0.1:52798_    ] o.a.s.c.c.SolrZkClient makePath: /overseer/queue
   [junit4]   2> 136403 INFO  (TEST-BasicDistributedZkTest.test-seed#[1F60B6F6759E2BB3]) [n:127.0.0.1:52798_    ] o.a.s.c.c.SolrZkClient makePath: /overseer/collection-queue-work
   [junit4]   2> 136404 INFO  (TEST-BasicDistributedZkTest.test-seed#[1F60B6F6759E2BB3]) [n:127.0.0.1:52798_    ] o.a.s.c.c.SolrZkClient makePath: /overseer/collection-map-running
   [junit4]   2> 136404 INFO  (TEST-BasicDistributedZkTest.test-seed#[1F60B6F6759E2BB3]) [n:127.0.0.1:52798_    ] o.a.s.c.c.SolrZkClient makePath: /overseer/collection-map-completed
   [junit4]   2> 136405 INFO  (TEST-BasicDistributedZkTest.test-seed#[1F60B6F6759E2BB3]) [n:127.0.0.1:52798_    ] o.a.s.c.c.SolrZkClient makePath: /overseer/collection-map-failure
   [junit4]   2> 136406 INFO  (TEST-BasicDistributedZkTest.test-seed#[1F60B6F6759E2BB3]) [n:127.0.0.1:52798_    ] o.a.s.c.c.SolrZkClient makePath: /live_nodes
   [junit4]   2> 136406 INFO  (TEST-BasicDistributedZkTest.test-seed#[1F60B6F6759E2BB3]) [n:127.0.0.1:52798_    ] o.a.s.c.c.SolrZkClient makePath: /aliases.json
   [junit4]   2> 136406 INFO  (TEST-BasicDistributedZkTest.test-seed#[1F60B6F6759E2BB3]) [n:127.0.0.1:52798_    ] o.a.s.c.c.SolrZkClient makePath: /clusterstate.json
   [junit4]   2> 136407 INFO  (TEST-BasicDistributedZkTest.test-seed#[1F60B6F6759E2BB3]) [n:127.0.0.1:52798_    ] o.a.s.c.c.SolrZkClient makePath: /security.json
   [junit4]   2> 136407 INFO  (TEST-BasicDistributedZkTest.test-seed#[1F60B6F6759E2BB3]) [n:127.0.0.1:52798_    ] o.a.s.c.ZkController Register node as live in ZooKeeper:/live_nodes/127.0.0.1:52798_
   [junit4]   2> 136408 INFO  (TEST-BasicDistributedZkTest.test-seed#[1F60B6F6759E2BB3]) [n:127.0.0.1:52798_    ] o.a.s.c.c.SolrZkClient makePath: /live_nodes/127.0.0.1:52798_
   [junit4]   2> 136408 INFO  (TEST-BasicDistributedZkTest.test-seed#[1F60B6F6759E2BB3]) [n:127.0.0.1:52798_    ] o.a.s.c.c.SolrZkClient makePath: /overseer_elect
   [junit4]   2> 136408 INFO  (TEST-BasicDistributedZkTest.test-seed#[1F60B6F6759E2BB3]) [n:127.0.0.1:52798_    ] o.a.s.c.c.SolrZkClient makePath: /overseer_elect/election
   [junit4]   2> 136409 INFO  (TEST-BasicDistributedZkTest.test-seed#[1F60B6F6759E2BB3]) [n:127.0.0.1:52798_    ] o.a.s.c.Overseer Overseer (id=null) closing
   [junit4]   2> 136409 INFO  (TEST-BasicDistributedZkTest.test-seed#[1F60B6F6759E2BB3]) [n:127.0.0.1:52798_    ] o.a.s.c.LeaderElector Joined leadership election with path: /overseer_elect/election/94771037125148676-127.0.0.1:52798_-n_0000000000
   [junit4]   2> 136409 INFO  (TEST-BasicDistributedZkTest.test-seed#[1F60B6F6759E2BB3]) [n:127.0.0.1:52798_    ] o.a.s.c.OverseerElectionContext I am going to be the leader 127.0.0.1:52798_
   [junit4]   2> 136409 INFO  (TEST-BasicDistributedZkTest.test-seed#[1F60B6F6759E2BB3]) [n:127.0.0.1:52798_    ] o.a.s.c.c.SolrZkClient makePath: /overseer_elect/leader
   [junit4]   2> 136409 INFO  (TEST-BasicDistributedZkTest.test-seed#[1F60B6F6759E2BB3]) [n:127.0.0.1:52798_    ] o.a.s.c.Overseer Overseer (id=94771037125148676-127.0.0.1:52798_-n_0000000000) starting
   [junit4]   2> 136410 INFO  (TEST-BasicDistributedZkTest.test-seed#[1F60B6F6759E2BB3]) [n:127.0.0.1:52798_    ] o.a.s.c.c.SolrZkClient makePath: /overseer/queue-work
   [junit4]   2> 136412 INFO  (TEST-BasicDistributedZkTest.test-seed#[1F60B6F6759E2BB3]) [n:127.0.0.1:52798_    ] o.a.s.c.OverseerAutoReplicaFailoverThread Starting OverseerAutoReplicaFailoverThread autoReplicaFailoverWorkLoopDelay=10000 autoReplicaFailoverWaitAfterExpiration=30000 autoReplicaFailoverBadNodeExpiration=60000
   [junit4]   2> 136412 INFO  (TEST-BasicDistributedZkTest.test-seed#[1F60B6F6759E2BB3]) [n:127.0.0.1:52798_    ] o.a.s.c.c.ZkStateReader Updating cluster state from ZooKeeper... 
   [junit4]   2> 136412 INFO  (OverseerCollectionConfigSetProcessor-94771037125148676-127.0.0.1:52798_-n_0000000000) [n:127.0.0.1:52798_    ] o.a.s.c.OverseerTaskProcessor Process current queue of overseer operations
   [junit4]   2> 136412 INFO  (OverseerStateUpdate-94771037125148676-127.0.0.1:52798_-n_0000000000) [n:127.0.0.1:52798_    ] o.a.s.c.Overseer Starting to work on the main queue
   [junit4]   2> 136421 INFO  (TEST-BasicDistributedZkTest.test-seed#[1F60B6F6759E2BB3]) [n:127.0.0.1:52798_    ] o.a.s.c.CoreContainer Security conf doesn't exist. Skipping setup for authorization module.
   [junit4]   2> 136421 INFO  (TEST-BasicDistributedZkTest.test-seed#[1F60B6F6759E2BB3]) [n:127.0.0.1:52798_    ] o.a.s.c.CoreContainer No authentication plugin used.
   [junit4]   2> 136422 INFO  (TEST-BasicDistributedZkTest.test-seed#[1F60B6F6759E2BB3]) [n:127.0.0.1:52798_    ] o.a.s.c.CoresLocator Looking for core definitions underneath /home/jenkins/workspace/Lucene-Solr-trunk-Linux/solr/build/solr-core/test/J0/temp/solr.cloud.BasicDistributedZkTest_1F60B6F6759E2BB3-001/control-001/cores
   [junit4]   2> 136422 INFO  (TEST-BasicDistributedZkTest.test-seed#[1F60B6F6759E2BB3]) [n:127.0.0.1:52798_    ] o.a.s.c.SolrCore Created CoreDescriptor: {name=collection1, config=solrconfig.xml, transient=false, schema=schema.xml, loadOnStartup=true, configSetProperties=configsetprops.json, instanceDir=/home/jenkins/workspace/Lucene-Solr-trunk-Linux/solr/build/solr-core/test/J0/temp/solr.cloud.BasicDistributedZkTest_1F60B6F6759E2BB3-001/control-001/cores/collection1, collection=control_collection, absoluteInstDir=/home/jenkins/workspace/Lucene-Solr-trunk-Linux/solr/build/solr-core/test/J0/temp/solr.cloud.BasicDistributedZkTest_1F60B6F6759E2BB3-001/control-001/cores/collection1/, coreNodeName=, dataDir=data/, shard=}
   [junit4]   2> 136422 INFO  (TEST-BasicDistributedZkTest.test-seed#[1F60B6F6759E2BB3]) [n:127.0.0.1:52798_    ] o.a.s.c.CoresLocator Found core collection1 in /home/jenkins/workspace/Lucene-Solr-trunk-Linux/solr/build/solr-core/test/J0/temp/solr.cloud.BasicDistributedZkTest_1F60B6F6759E2BB3-001/control-001/cores/collection1/
   [junit4]   2> 136422 INFO  (TEST-BasicDistributedZkTest.test-seed#[1F60B6F6759E2BB3]) [n:127.0.0.1:52798_    ] o.a.s.c.CoresLocator Found 1 core definitions
   [junit4]   2> 136423 INFO  (TEST-BasicDistributedZkTest.test-seed#[1F60B6F6759E2BB3]) [n:127.0.0.1:52798_    ] o.a.s.s.SolrDispatchFilter user.dir=/home/jenkins/workspace/Lucene-Solr-trunk-Linux/solr/build/solr-core/test/J0
   [junit4]   2> 136423 INFO  (TEST-BasicDistributedZkTest.test-seed#[1F60B6F6759E2BB3]) [n:127.0.0.1:52798_    ] o.a.s.s.SolrDispatchFilter SolrDispatchFilter.init() done
   [junit4]   2> 136423 INFO  (coreLoadExecutor-349-thread-1-processing-n:127.0.0.1:52798_) [n:127.0.0.1:52798_ c:control_collection   x:collection1] o.a.s.c.ZkController publishing state=down
   [junit4]   2> 136423 INFO  (coreLoadExecutor-349-thread-1-processing-n:127.0.0.1:52798_) [n:127.0.0.1:52798_ c:control_collection   x:collection1] o.a.s.c.ZkController numShards not found on descriptor - reading it from system property
   [junit4]   2> 136424 INFO  (OverseerStateUpdate-94771037125148676-127.0.0.1:52798_-n_0000000000) [n:127.0.0.1:52798_    ] o.a.s.c.Overseer processMessage: queueSize: 1, message = {
   [junit4]   2>   "core":"collection1",
   [junit4]   2>   "roles":null,
   [junit4]   2>   "base_url":"http://127.0.0.1:52798",
   [junit4]   2>   "node_name":"127.0.0.1:52798_",
   [junit4]   2>   "numShards":"1",
   [junit4]   2>   "state":"down",
   [junit4]   2>   "shard":null,
   [junit4]   2>   "collection":"control_collection",
   [junit4]   2>   "operation":"state"} current state version: 0
   [junit4]   2> 136424 INFO  (coreLoadExecutor-349-thread-1-processing-n:127.0.0.1:52798_) [n:127.0.0.1:52798_ c:control_collection   x:collection1] o.a.s.c.ZkController look for our core node name
   [junit4]   2> 136424 INFO  (OverseerStateUpdate-94771037125148676-127.0.0.1:52798_-n_0000000000) [n:127.0.0.1:52798_    ] o.a.s.c.o.ReplicaMutator Update state numShards=1 message={
   [junit4]   2>   "core":"collection1",
   [junit4]   2>   "roles":null,
   [junit4]   2>   "base_url":"http://127.0.0.1:52798",
   [junit4]   2>   "node_name":"127.0.0.1:52798_",
   [junit4]   2>   "numShards":"1",
   [junit4]   2>   "state":"down",
   [junit4]   2>   "shard":null,
   [junit4]   2>   "collection":"control_collection",
   [junit4]   2>   "operation":"state"}
   [junit4]   2> 136424 INFO  (OverseerStateUpdate-94771037125148676-127.0.0.1:52798_-n_0000000000) [n:127.0.0.1:52798_    ] o.a.s.c.o.ClusterStateMutator building a new cName: control_collection
   [junit4]   2> 136424 INFO  (OverseerStateUpdate-94771037125148676-127.0.0.1:52798_-n_0000000000) [n:127.0.0.1:52798_    ] o.a.s.c.o.ReplicaMutator Assigning new node to shard shard=shard1
   [junit4]   2> 136425 INFO  (zkCallback-97-thread-1-processing-n:127.0.0.1:52798_) [n:127.0.0.1:52798_    ] o.a.s.c.c.ZkStateReader A cluster state change: WatchedEvent state:SyncConnected type:NodeDataChanged path:/clusterstate.json, has occurred - updating... (live nodes size: 1)
   [junit4]   2> 137424 INFO  (coreLoadExecutor-349-thread-1-processing-n:127.0.0.1:52798_) [n:127.0.0.1:52798_ c:control_collection   x:collection1] o.a.s.c.ZkController waiting to find shard id in clusterstate for collection1
   [junit4]   2> 137424 INFO  (coreLoadExecutor-349-thread-1-processing-n:127.0.0.1:52798_) [n:127.0.0.1:52798_ c:control_collection   x:collection1] o.a.s.c.ZkController Check for collection zkNode:control_collection
   [junit4]   2> 137425 INFO  (coreLoadExecutor-349-thread-1-processing-n:127.0.0.1:52798_) [n:127.0.0.1:52798_ c:control_collection   x:collection1] o.a.s.c.ZkController Collection zkNode exists
   [junit4]   2> 137425 INFO  (coreLoadExecutor-349-thread-1-processing-n:127.0.0.1:52798_) [n:127.0.0.1:52798_ c:control_collection   x:collection1] o.a.s.c.c.ZkStateReader Load collection config from:/collections/control_collection
   [junit4]   2> 137425 INFO  (coreLoadExecutor-349-thread-1-processing-n:127.0.0.1:52798_) [n:127.0.0.1:52798_ c:control_collection   x:collection1] o.a.s.c.c.ZkStateReader path=/collections/control_collection configName=conf1 specified config exists in ZooKeeper
   [junit4]   2> 137425 INFO  (coreLoadExecutor-349-thread-1-processing-n:127.0.0.1:52798_) [n:127.0.0.1:52798_ c:control_collection   x:collection1] o.a.s.c.SolrResourceLoader new SolrResourceLoader for directory: '/home/jenkins/workspace/Lucene-Solr-trunk-Linux/solr/build/solr-core/test/J0/temp/solr.cloud.BasicDistributedZkTest_1F60B6F6759E2BB3-001/control-001/cores/collection1/'
   [junit4]   2> 137425 INFO  (coreLoadExecutor-349-thread-1-processing-n:127.0.0.1:52798_) [n:127.0.0.1:52798_ c:control_collection   x:collection1] o.a.s.c.SolrResourceLoader JNDI not configured for solr (NoInitialContextEx)
   [junit4]   2> 137425 INFO  (coreLoadExecutor-349-thread-1-processing-n:127.0.0.1:52798_) [n:127.0.0.1:52798_ c:control_collection   x:collection1] o.a.s.c.SolrResourceLoader solr home defaulted to 'solr/' (could not find system property or JNDI)
   [junit4]   2> 137432 INFO  (coreLoadExecutor-349-thread-1-processing-n:127.0.0.1:52798_) [n:127.0.0.1:52798_ c:control_collection   x:collection1] o.a.s.c.Config loaded config solrconfig.xml with version 0 
   [junit4]   2> 137435 INFO  (coreLoadExecutor-349-thread-1-processing-n:127.0.0.1:52798_) [n:127.0.0.1:52798_ c:control_collection   x:collection1] o.a.s.c.SolrConfig current version of requestparams : -1
   [junit4]   2> 137438 INFO  (coreLoadExecutor-349-thread-1-processing-n:127.0.0.1:52798_) [n:127.0.0.1:52798_ c:control_collection   x:collection1] o.a.s.c.SolrConfig Using Lucene MatchVersion: 6.0.0
   [junit4]   2> 137444 INFO  (coreLoadExecutor-349-thread-1-processing-n:127.0.0.1:52798_) [n:127.0.0.1:52798_ c:control_collection   x:collection1] o.a.s.c.Config Loaded SolrConfig: solrconfig.xml
   [junit4]   2> 137444 INFO  (coreLoadExecutor-349-thread-1-processing-n:127.0.0.1:52798_) [n:127.0.0.1:52798_ c:control_collection   x:collection1] o.a.s.s.IndexSchema Reading Solr Schema from /configs/conf1/schema.xml
   [junit4]   2> 137448 INFO  (coreLoadExecutor-349-thread-1-processing-n:127.0.0.1:52798_) [n:127.0.0.1:52798_ c:control_collection   x:collection1] o.a.s.s.IndexSchema [collection1] Schema name=test
   [junit4]   2> 137522 INFO  (coreLoadExecutor-349-thread-1-processing-n:127.0.0.1:52798_) [n:127.0.0.1:52798_ c:control_collection   x:collection1] o.a.s.s.OpenExchangeRatesOrgProvider Initialized with rates=open-exchange-rates.json, refreshInterval=1440.
   [junit4]   2> 137526 INFO  (coreLoadExecutor-349-thread-1-processing-n:127.0.0.1:52798_) [n:127.0.0.1:52798_ c:control_collection   x:collection1] o.a.s.s.IndexSchema default search field in schema is text
   [junit4]   2> 137527 INFO  (coreLoadExecutor-349-thread-1-processing-n:127.0.0.1:52798_) [n:127.0.0.1:52798_ c:control_collection   x:collection1] o.a.s.s.IndexSchema unique key field: id
   [junit4]   2> 137531 INFO  (coreLoadExecutor-349-thread-1-processing-n:127.0.0.1:52798_) [n:127.0.0.1:52798_ c:control_collection   x:collection1] o.a.s.s.FileExchangeRateProvider Reloading exchange rates from file currency.xml
   [junit4]   2> 137532 INFO  (coreLoadExecutor-349-thread-1-processing-n:127.0.0.1:52798_) [n:127.0.0.1:52798_ c:control_collection   x:collection1] o.a.s.s.FileExchangeRateProvider Reloading exchange rates from file currency.xml
   [junit4]   2> 137533 INFO  (coreLoadExecutor-349-thread-1-processing-n:127.0.0.1:52798_) [n:127.0.0.1:52798_ c:control_collection   x:collection1] o.a.s.s.OpenExchangeRatesOrgProvider Reloading exchange rates from open-exchange-rates.json
   [junit4]   2> 137534 WARN  (coreLoadExecutor-349-thread-1-processing-n:127.0.0.1:52798_) [n:127.0.0.1:52798_ c:control_collection   x:collection1] o.a.s.s.OpenExchangeRatesOrgProvider Unknown key IMPORTANT NOTE
   [junit4]   2> 137534 WARN  (coreLoadExecutor-349-thread-1-processing-n:127.0.0.1:52798_) [n:127.0.0.1:52798_ c:control_collection   x:collection1] o.a.s.s.OpenExchangeRatesOrgProvider Expected key, got STRING
   [junit4]   2> 137534 INFO  (coreLoadExecutor-349-thread-1-processing-n:127.0.0.1:52798_) [n:127.0.0.1:52798_ c:control_collection   x:collection1] o.a.s.s.OpenExchangeRatesOrgProvider Reloading exchange rates from open-exchange-rates.json
   [junit4]   2> 137534 WARN  (coreLoadExecutor-349-thread-1-processing-n:127.0.0.1:52798_) [n:127.0.0.1:52798_ c:control_collection   x:collection1] o.a.s.s.OpenExchangeRatesOrgProvider Unknown key IMPORTANT NOTE
   [junit4]   2> 137534 WARN  (coreLoadExecutor-349-thread-1-processing-n:127.0.0.1:52798_) [n:127.0.0.1:52798_ c:control_collection   x:collection1] o.a.s.s.OpenExchangeRatesOrgProvider Expected key, got STRING
   [junit4]   2> 137535 INFO  (coreLoadExecutor-349-thread-1-processing-n:127.0.0.1:52798_) [n:127.0.0.1:52798_ c:control_collection   x:collection1] o.a.s.c.ConfigSetProperties Did not find ConfigSet properties, assuming default properties: Can't find resource 'configsetprops.json' in classpath or '/configs/conf1', cwd=/home/jenkins/workspace/Lucene-Solr-trunk-Linux/solr/build/solr-core/test/J0
   [junit4]   2> 137535 INFO  (coreLoadExecutor-349-thread-1-processing-n:127.0.0.1:52798_) [n:127.0.0.1:52798_ c:control_collection   x:collection1] o.a.s.c.CoreContainer Creating SolrCore 'collection1' using configuration from collection control_collection
   [junit4]   2> 137535 INFO  (coreLoadExecutor-349-thread-1-processing-n:127.0.0.1:52798_) [n:127.0.0.1:52798_ c:control_collection s:shard1 r:core_node1 x:collection1] o.a.s.c.SolrCore org.apache.solr.core.MockDirectoryFactory
   [junit4]   2> 137535 INFO  (coreLoadExecutor-349-thread-1-processing-n:127.0.0.1:52798_) [n:127.0.0.1:52798_ c:control_collection s:shard1 r:core_node1 x:collection1] o.a.s.c.SolrCore [[collection1] ] Opening new SolrCore at [/home/jenkins/workspace/Lucene-Solr-trunk-Linux/solr/build/solr-core/test/J0/temp/solr.cloud.BasicDistributedZkTest_1F60B6F6759E2BB3-001/control-001/cores/collection1/], dataDir=[null]
   [junit4]   2> 137535 INFO  (coreLoadExecutor-349-thread-1-processing-n:127.0.0.1:52798_) [n:127.0.0.1:52798_ c:control_collection s:shard1 r:core_node1 x:collection1] o.a.s.c.JmxMonitoredMap JMX monitoring is enabled. Adding Solr mbeans to JMX Server: com.sun.jmx.mbeanserver.JmxMBeanServer@1acb48fa
   [junit4]   2> 137536 INFO  (coreLoadExecutor-349-thread-1-processing-n:127.0.0.1:52798_) [n:127.0.0.1:52798_ c:control_collection s:shard1 r:core_node1 x:collection1] o.a.s.c.CachingDirectoryFactory return new directory for /home/jenkins/workspace/Lucene-Solr-trunk-Linux/solr/build/solr-core/test/J0/temp/solr.cloud.BasicDistributedZkTest_1F60B6F6759E2BB3-001/control-001/cores/collection1/data
   [junit4]   2> 137536 INFO  (coreLoadExecutor-349-thread-1-processing-n:127.0.0.1:52798_) [n:127.0.0.1:52798_ c:control_collection s:shard1 r:core_node1 x:collection1] o.a.s.c.SolrCore New index directory detected: old=null new=/home/jenkins/workspace/Lucene-Solr-trunk-Linux/solr/build/solr-core/test/J0/temp/solr.cloud.BasicDistributedZkTest_1F60B6F6759E2BB3-001/control-001/cores/collection1/data/index/
   [junit4]   2> 137536 WARN  (coreLoadExecutor-349-thread-1-processing-n:127.0.0.1:52798_) [n:127.0.0.1:52798_ c:control_collection s:shard1 r:core_node1 x:collection1] o.a.s.c.SolrCore [collection1] Solr index directory '/home/jenkins/workspace/Lucene-Solr-trunk-Linux/solr/build/solr-core/test/J0/temp/solr.cloud.BasicDistributedZkTest_1F60B6F6759E2BB3-001/control-001/cores/collection1/data/index' doesn't exist. Creating new index...
   [junit4]   2> 137536 INFO  (coreLoadExecutor-349-thread-1-processing-n:127.0.0.1:52798_) [n:127.0.0.1:52798_ c:control_collection s:shard1 r:core_node1 x:collection1] o.a.s.c.CachingDirectoryFactory return new directory for /home/jenkins/workspace/Lucene-Solr-trunk-Linux/solr/build/solr-core/test/J0/temp/solr.cloud.BasicDistributedZkTest_1F60B6F6759E2BB3-001/control-001/cores/collection1/data/index
   [junit4]   2> 137536 INFO  (coreLoadExecutor-349-thread-1-processing-n:127.0.0.1:52798_) [n:127.0.0.1:52798_ c:control_collection s:shard1 r:core_node1 x:collection1] o.a.s.u.RandomMergePolicy RandomMergePolicy wrapping class org.apache.lucene.index.TieredMergePolicy: [TieredMergePolicy: maxMergeAtOnce=33, maxMergeAtOnceExplicit=38, maxMergedSegmentMB=85.2265625, floorSegmentMB=1.7783203125, forceMergeDeletesPctAllowed=16.966370578827174, segmentsPerTier=42.0, maxCFSSegmentSizeMB=1.8701171875, noCFSRatio=0.0
   [junit4]   2> 137536 INFO  (coreLoadExecutor-349-thread-1-processing-n:127.0.0.1:52798_) [n:127.0.0.1:52798_ c:control_collection s:shard1 r:core_node1 x:collection1] o.a.s.c.SolrCore SolrDeletionPolicy.onCommit: commits: num=1
   [junit4]   2> 	commit{dir=MockDirectoryWrapper(RAMDirectory@674f9942 lockFactory=org.apache.lucene.store.SingleInstanceLockFactory@74371d2a),segFN=segments_1,generation=1}
   [junit4]   2> 137537 INFO  (coreLoadExecutor-349-thread-1-processing-n:127.0.0.1:52798_) [n:127.0.0.1:52798_ c:control_collection s:shard1 r:core_node1 x:collection1] o.a.s.c.SolrCore newest commit generation = 1
   [junit4]   2> 137537 INFO  (OldIndexDirectoryCleanupThreadForCore-collection1) [n:127.0.0.1:52798_ c:control_collection s:shard1 r:core_node1 x:collection1] o.a.s.c.SolrCore Looking for old index directories to cleanup for core collection1 in /home/jenkins/workspace/Lucene-Solr-trunk-Linux/solr/build/solr-core/test/J0/temp/solr.cloud.BasicDistributedZkTest_1F60B6F6759E2BB3-001/control-001/cores/collection1/data/
   [junit4]   2> 137537 WARN  (OldIndexDirectoryCleanupThreadForCore-collection1) [n:127.0.0.1:52798_ c:control_collection s:shard1 r:core_node1 x:collection1] o.a.s.c.DirectoryFactory /home/jenkins/workspace/Lucene-Solr-trunk-Linux/solr/build/solr-core/test/J0/temp/solr.cloud.BasicDistributedZkTest_1F60B6F6759E2BB3-001/control-001/cores/collection1/data/ does not point to a valid data directory; skipping clean-up of old index directories.
   [junit4]   2> 137539 INFO  (coreLoadExecutor-349-thread-1-processing-n:127.0.0.1:52798_) [n:127.0.0.1:52798_ c:control_collection s:shard1 r:core_node1 x:collection1] o.a.s.u.p.UpdateRequestProcessorChain creating updateRequestProcessorChain "nodistrib"
   [junit4]   2> 137540 INFO  (coreLoadExecutor-349-thread-1-processing-n:127.0.0.1:52798_) [n:127.0.0.1:52798_ c:control_collection s:shard1 r:core_node1 x:collection1] o.a.s.u.p.UpdateRequestProcessorChain creating updateRequestProcessorChain "dedupe"
   [junit4]   2> 137540 INFO  (coreLoadExecutor-349-thread-1-processing-n:127.0.0.1:52798_) [n:127.0.0.1:52798_ c:control_collection s:shard1 r:core_node1 x:collection1] o.a.s.u.p.UpdateRequestProcessorChain inserting DistributedUpdateProcessorFactory into updateRequestProcessorChain "dedupe"
   [junit4]   2> 137540 INFO  (coreLoadExecutor-349-thread-1-processing-n:127.0.0.1:52798_) [n:127.0.0.1:52798_ c:control_collection s:shard1 r:core_node1 x:collection1] o.a.s.u.p.UpdateRequestProcessorChain creating updateRequestProcessorChain "stored_sig"
   [junit4]   2> 137540 INFO  (coreLoadExecutor-349-thread-1-processing-n:127.0.0.1:52798_) [n:127.0.0.1:52798_ c:control_collection s:shard1 r:core_node1 x:collection1] o.a.s.u.p.UpdateRequestProcessorChain inserting DistributedUpdateProcessorFactory into updateRequestProcessorChain "stored_sig"
   [junit4]   2> 137540 INFO  (coreLoadExecutor-349-thread-1-processing-n:127.0.0.1:52798_) [n:127.0.0.1:52798_ c:control_collection s:shard1 r:core_node1 x:collection1] o.a.s.u.p.UpdateRequestProcessorChain creating updateRequestProcessorChain "distrib-dup-test-chain-explicit"
   [junit4]   2> 137540 INFO  (coreLoadExecutor-349-thread-1-processing-n:127.0.0.1:52798_) [n:127.0.0.1:52798_ c:control_collection s:shard1 r:core_node1 x:collection1] o.a.s.u.p.UpdateRequestProcessorChain creating updateRequestProcessorChain "distrib-dup-test-chain-implicit"
   [junit4]   2> 137540 INFO  (coreLoadExecutor-349-thread-1-processing-n:127.0.0.1:52798_) [n:127.0.0.1:52798_ c:control_collection s:shard1 r:core_node1 x:collection1] o.a.s.u.p.UpdateRequestProcessorChain inserting DistributedUpdateProcessorFactory into updateRequestProcessorChain "distrib-dup-test-chain-implicit"
   [junit4]   2> 137540 INFO  (coreLoadExecutor-349-thread-1-processing-n:127.0.0.1:52798_) [n:127.0.0.1:52798_ c:control_collection s:shard1 r:core_node1 x:collection1] o.a.s.c.SolrCore no updateRequestProcessorChain defined as default, creating implicit default
   [junit4]   2> 137541 INFO  (coreLoadExecutor-349-thread-1-processing-n:127.0.0.1:52798_) [n:127.0.0.1:52798_ c:control_collection s:shard1 r:core_node1 x:collection1] o.a.s.h.l.XMLLoader xsltCacheLifetimeSeconds=60
   [junit4]   2> 137542 INFO  (coreLoadExecutor-349-thread-1-processing-n:127.0.0.1:52798_) [n:127.0.0.1:52798_ c:control_collection s:shard1 r:core_node1 x:collection1] o.a.s.h.l.XMLLoader xsltCacheLifetimeSeconds=60
   [junit4]   2> 137542 INFO  (coreLoadExecutor-349-thread-1-processing-n:127.0.0.1:52798_) [n:127.0.0.1:52798_ c:control_collection s:shard1 r:core_node1 x:collection1] o.a.s.h.l.XMLLoader xsltCacheLifetimeSeconds=60
   [junit4]   2> 137543 INFO  (coreLoadExecutor-349-thread-1-processing-n:127.0.0.1:52798_) [n:127.0.0.1:52798_ c:control_collection s:shard1 r:core_node1 x:collection1] o.a.s.h.l.XMLLoader xsltCacheLifetimeSeconds=60
   [junit4]   2> 137545 INFO  (coreLoadExecutor-349-thread-1-processing-n:127.0.0.1:52798_) [n:127.0.0.1:52798_ c:control_collection s:shard1 r:core_node1 x:collection1] o.a.s.c.RequestHandlers Registered paths: /admin/mbeans,standard,/update/csv,/update/json/docs,/admin/luke,/admin/segments,/get,/admin/system,/replication,/admin/properties,/config,/schema,/admin/plugins,/admin/logging,/update/json,/admin/threads,/admin/ping,/update,/admin/file
   [junit4]   2> 137545 INFO  (coreLoadExecutor-349-thread-1-processing-n:127.0.0.1:52798_) [n:127.0.0.1:52798_ c:control_collection s:shard1 r:core_node1 x:collection1] o.a.s.c.SolrCore Using default statsCache cache: org.apache.solr.search.stats.LocalStatsCache
   [junit4]   2> 137545 INFO  (coreLoadExecutor-349-thread-1-processing-n:127.0.0.1:52798_) [n:127.0.0.1:52798_ c:control_collection s:shard1 r:core_node1 x:collection1] o.a.s.u.UpdateHandler Using UpdateLog implementation: org.apache.solr.update.UpdateLog
   [junit4]   2> 137545 INFO  (coreLoadExecutor-349-thread-1-processing-n:127.0.0.1:52798_) [n:127.0.0.1:52798_ c:control_collection s:shard1 r:core_node1 x:collection1] o.a.s.u.UpdateLog Initializing UpdateLog: dataDir= defaultSyncLevel=FLUSH numRecordsToKeep=100 maxNumLogsToKeep=10 numVersionBuckets=65536
   [junit4]   2> 137546 INFO  (coreLoadExecutor-349-thread-1-processing-n:127.0.0.1:52798_) [n:127.0.0.1:52798_ c:control_collection s:shard1 r:core_node1 x:collection1] o.a.s.c.SolrCore Hard AutoCommit: disabled
   [junit4]   2> 137546 INFO  (coreLoadExecutor-349-thread-1-processing-n:127.0.0.1:52798_) [n:127.0.0.1:52798_ c:control_collection s:shard1 r:core_node1 x:collection1] o.a.s.c.SolrCore Soft AutoCommit: disabled
   [junit4]   2> 137547 INFO  (coreLoadExecutor-349-thread-1-processing-n:127.0.0.1:52798_) [n:127.0.0.1:52798_ c:control_collection s:shard1 r:core_node1 x:collection1] o.a.s.u.RandomMergePolicy RandomMergePolicy wrapping class org.apache.lucene.index.TieredMergePolicy: [TieredMergePolicy: maxMergeAtOnce=43, maxMergeAtOnceExplicit=22, maxMergedSegmentMB=46.32421875, floorSegmentMB=1.93359375, forceMergeDeletesPctAllowed=29.15006397007141, segmentsPerTier=47.0, maxCFSSegmentSizeMB=8.796093022207999E12, noCFSRatio=1.0
   [junit4]   2> 137547 INFO  (coreLoadExecutor-349-thread-1-processing-n:127.0.0.1:52798_) [n:127.0.0.1:52798_ c:control_collection s:shard1 r:core_node1 x:collection1] o.a.s.c.SolrCore SolrDeletionPolicy.onInit: commits: num=1
   [junit4]   2> 	commit{dir=MockDirectoryWrapper(RAMDirectory@674f9942 lockFactory=org.apache.lucene.store.SingleInstanceLockFactory@74371d2a),segFN=segments_1,generation=1}
   [junit4]   2> 137548 INFO  (coreLoadExecutor-349-thread-1-processing-n:127.0.0.1:52798_) [n:127.0.0.1:52798_ c:control_collection s:shard1 r:core_node1 x:collection1] o.a.s.c.SolrCore newest commit generation = 1
   [junit4]   2> 137548 INFO  (coreLoadExecutor-349-thread-1-processing-n:127.0.0.1:52798_) [n:127.0.0.1:52798_ c:control_collection s:shard1 r:core_node1 x:collection1] o.a.s.s.SolrIndexSearcher Opening Searcher@5297b843[collection1] main
   [junit4]   2> 137548 INFO  (coreLoadExecutor-349-thread-1-processing-n:127.0.0.1:52798_) [n:127.0.0.1:52798_ c:control_collection s:shard1 r:core_node1 x:collection1] o.a.s.c.c.ZkStateReader Load collection config from:/collections/control_collection
   [junit4]   2> 137548 INFO  (coreLoadExecutor-349-thread-1-processing-n:127.0.0.1:52798_) [n:127.0.0.1:52798_ c:control_collection s:shard1 r:core_node1 x:collection1] o.a.s.c.c.ZkStateReader path=/collections/control_collection configName=conf1 specified config exists in ZooKeeper
   [junit4]   2> 137548 INFO  (coreLoadExecutor-349-thread-1-processing-n:127.0.0.1:52798_) [n:127.0.0.1:52798_ c:control_collection s:shard1 r:core_node1 x:collection1] o.a.s.r.ManagedResourceStorage Setting up ZooKeeper-based storage for the RestManager with znodeBase: /configs/conf1
   [junit4]   2> 137548 INFO  (coreLoadExecutor-349-thread-1-processing-n:127.0.0.1:52798_) [n:127.0.0.1:52798_ c:control_collection s:shard1 r:core_node1 x:collection1] o.a.s.r.ManagedResourceStorage Configured ZooKeeperStorageIO with znodeBase: /configs/conf1
   [junit4]   2> 137548 INFO  (coreLoadExecutor-349-thread-1-processing-n:127.0.0.1:52798_) [n:127.0.0.1:52798_ c:control_collection s:shard1 r:core_node1 x:collection1] o.a.s.r.RestManager Initializing RestManager with initArgs: {}
   [junit4]   2> 137548 INFO  (coreLoadExecutor-349-thread-1-processing-n:127.0.0.1:52798_) [n:127.0.0.1:52798_ c:control_collection s:shard1 r:core_node1 x:collection1] o.a.s.r.ManagedResourceStorage Reading _rest_managed.json using ZooKeeperStorageIO:path=/configs/conf1
   [junit4]   2> 137548 INFO  (coreLoadExecutor-349-thread-1-processing-n:127.0.0.1:52798_) [n:127.0.0.1:52798_ c:control_collection s:shard1 r:core_node1 x:collection1] o.a.s.r.ManagedResourceStorage No data found for znode /configs/conf1/_rest_managed.json
   [junit4]   2> 137548 INFO  (coreLoadExecutor-349-thread-1-processing-n:127.0.0.1:52798_) [n:127.0.0.1:52798_ c:control_collection s:shard1 r:core_node1 x:collection1] o.a.s.r.ManagedResourceStorage Loaded null at path _rest_managed.json using ZooKeeperStorageIO:path=/configs/conf1
   [junit4]   2> 137549 INFO  (coreLoadExecutor-349-thread-1-processing-n:127.0.0.1:52798_) [n:127.0.0.1:52798_ c:control_collection s:shard1 r:core_node1 x:collection1] o.a.s.r.RestManager Initializing 0 registered ManagedResources
   [junit4]   2> 137549 INFO  (coreLoadExecutor-349-thread-1-processing-n:127.0.0.1:52798_) [n:127.0.0.1:52798_ c:control_collection s:shard1 r:core_node1 x:collection1] o.a.s.h.ReplicationHandler Commits will be reserved for  10000
   [junit4]   2> 137549 INFO  (searcherExecutor-350-thread-1-processing-n:127.0.0.1:52798_ x:collection1 s:shard1 c:control_collection r:core_node1) [n:127.0.0.1:52798_ c:control_collection s:shard1 r:core_node1 x:collection1] o.a.s.c.SolrCore [collection1] Registered new searcher Searcher@5297b843[collection1] main{ExitableDirectoryReader(UninvertingDirectoryReader())}
   [junit4]   2> 137549 INFO  (coreLoadExecutor-349-thread-1-processing-n:127.0.0.1:52798_) [n:127.0.0.1:52798_ c:control_collection s:shard1 r:core_node1 x:collection1] o.a.s.u.UpdateLog Looking up max value of version field to seed version buckets
   [junit4]   2> 137549 INFO  (coreLoadExecutor-349-thread-1-processing-n:127.0.0.1:52798_) [n:127.0.0.1:52798_ c:control_collection s:shard1 r:core_node1 x:collection1] o.a.s.u.VersionInfo Refreshing highest value of _version_ for 65536 version buckets from index
   [junit4]   2> 137549 INFO  (coreLoadExecutor-349-thread-1-processing-n:127.0.0.1:52798_) [n:127.0.0.1:52798_ c:control_collection s:shard1 r:core_node1 x:collection1] o.a.s.u.VersionInfo No terms found for _version_, cannot seed version bucket highest value from index
   [junit4]   2> 137549 INFO  (coreLoadExecutor-349-thread-1-processing-n:127.0.0.1:52798_) [n:127.0.0.1:52798_ c:control_collection s:shard1 r:core_node1 x:collection1] o.a.s.u.UpdateLog Could not find max version in index or recent updates, using new clock 1516336595417956352
   [junit4]   2> 137551 INFO  (coreLoadExecutor-349-thread-1-processing-n:127.0.0.1:52798_) [n:127.0.0.1:52798_ c:control_collection s:shard1 r:core_node1 x:collection1] o.a.s.u.UpdateLog Took 1.0ms to seed version buckets with highest version 1516336595417956352
   [junit4]   2> 137551 INFO  (coreLoadExecutor-349-thread-1-processing-n:127.0.0.1:52798_) [n:127.0.0.1:52798_ c:control_collection s:shard1 r:core_node1 x:collection1] o.a.s.c.ZkController watch zkdir /configs/conf1
   [junit4]   2> 137551 INFO  (coreLoadExecutor-349-thread-1-processing-n:127.0.0.1:52798_) [n:127.0.0.1:52798_ c:control_collection s:shard1 r:core_node1 x:collection1] o.a.s.c.CoreContainer registering core: collection1
   [junit4]   2> 137551 INFO  (coreZkRegister-343-thread-1-processing-n:127.0.0.1:52798_ x:collection1 s:shard1 c:control_collection r:core_node1) [n:127.0.0.1:52798_ c:control_collection s:shard1 r:core_node1 x:collection1] o.a.s.c.ZkController Register replica - core:collection1 address:http://127.0.0.1:52798 collection:control_collection shard:shard1
   [junit4]   2> 137552 INFO  (coreZkRegister-343-thread-1-processing-n:127.0.0.1:52798_ x:collection1 s:shard1 c:control_collection r:core_node1) [n:127.0.0.1:52798_ c:control_collection s:shard1 r:core_node1 x:collection1] o.a.s.c.c.SolrZkClient makePath: /collections/control_collection/leader_elect/shard1/election
   [junit4]   2> 137553 INFO  (coreZkRegister-343-thread-1-processing-n:127.0.0.1:52798_ x:collection1 s:shard1 c:control_collection r:core_node1) [n:127.0.0.1:52798_ c:control_collection s:shard1 r:core_node1 x:collection1] o.a.s.c.LeaderElector Joined leadership election with path: /collections/control_collection/leader_elect/shard1/election/94771037125148676-core_node1-n_0000000000
   [junit4]   2> 137553 INFO  (coreZkRegister-343-thread-1-processing-n:127.0.0.1:52798_ x:collection1 s:shard1 c:control_collection r:core_node1) [n:127.0.0.1:52798_ c:control_collection s:shard1 r:core_node1 x:collection1] o.a.s.c.ShardLeaderElectionContext Running the leader process for shard shard1
   [junit4]   2> 137553 INFO  (coreZkRegister-343-thread-1-processing-n:127.0.0.1:52798_ x:collection1 s:shard1 c:control_collection r:core_node1) [n:127.0.0.1:52798_ c:control_collection s:shard1 r:core_node1 x:collection1] o.a.s.c.ShardLeaderElectionContext Enough replicas found to continue.
   [junit4]   2> 137553 INFO  (coreZkRegister-343-thread-1-processing-n:127.0.0.1:52798_ x:collection1 s:shard1 c:control_collection r:core_node1) [n:127.0.0.1:52798_ c:control_collection s:shard1 r:core_node1 x:collection1] o.a.s.c.ShardLeaderElectionContext I may be the new leader - try and sync
   [junit4]   2> 137553 INFO  (coreZkRegister-343-thread-1-processing-n:127.0.0.1:52798_ x:collection1 s:shard1 c:control_collection r:core_node1) [n:127.0.0.1:52798_ c:control_collection s:shard1 r:core_node1 x:collection1] o.a.s.c.SyncStrategy Sync replicas to http://127.0.0.1:52798/collection1/
   [junit4]   2> 137553 INFO  (coreZkRegister-343-thread-1-processing-n:127.0.0.1:52798_ x:collection1 s:shard1 c:control_collection r:core_node1) [n:127.0.0.1:52798_ c:control_collection s:shard1 r:core_node1 x:collection1] o.a.s.c.SyncStrategy Sync Success - now sync replicas to me
   [junit4]   2> 137553 INFO  (coreZkRegister-343-thread-1-processing-n:127.0.0.1:52798_ x:collection1 s:shard1 c:control_collection r:core_node1) [n:127.0.0.1:52798_ c:control_collection s:shard1 r:core_node1 x:collection1] o.a.s.c.SyncStrategy http://127.0.0.1:52798/collection1/ has no replicas
   [junit4]   2> 137553 INFO  (coreZkRegister-343-thread-1-processing-n:127.0.0.1:52798_ x:collection1 s:shard1 c:control_collection r:core_node1) [n:127.0.0.1:52798_ c:control_collection s:shard1 r:core_node1 x:collection1] o.a.s.c.ShardLeaderElectionContext I am the new leader: http://127.0.0.1:52798/collection1/ shard1
   [junit4]   2> 137553 INFO  (OverseerStateUpdate-94771037125148676-127.0.0.1:52798_-n_0000000000) [n:127.0.0.1:52798_    ] o.a.s.c.Overseer processMessage: queueSize: 1, message = {
   [junit4]   2>   "operation":"leader",
   [junit4]   2>   "shard":"shard1",
   [junit4]   2>   "collection":"control_collection"} current state version: 1
   [junit4]   2> 137554 INFO  (coreZkRegister-343-thread-1-processing-n:127.0.0.1:52798_ x:collection1 s:shard1 c:control_collection r:core_node1) [n:127.0.0.1:52798_ c:control_collection s:shard1 r:core_node1 x:collection1] o.a.s.c.c.SolrZkClient makePath: /collections/control_collection/leaders/shard1
   [junit4]   2> 137554 INFO  (coreZkRegister-343-thread-1-processing-n:127.0.0.1:52798_ x:collection1 s:shard1 c:control_collection r:core_node1) [n:127.0.0.1:52798_ c:control_collection s:shard1 r:core_node1 x:collection1] o.a.s.c.ShardLeaderElectionContextBase Creating leader registration node
   [junit4]   2> 137556 INFO  (OverseerStateUpdate-94771037125148676-127.0.0.1:52798_-n_0000000000) [n:127.0.0.1:52798_    ] o.a.s.c.Overseer processMessage: queueSize: 1, message = {
   [junit4]   2>   "operation":"leader",
   [junit4]   2>   "shard":"shard1",
   [junit4]   2>   "collection":"control_collection",
   [junit4]   2>   "base_url":"http://127.0.0.1:52798",
   [junit4]   2>   "core":"collection1",
   [junit4]   2>   "state":"active"} current state version: 1
   [junit4]   2> 137657 INFO  (zkCallback-97-thread-1-processing-n:127.0.0.1:52798_) [n:127.0.0.1:52798_    ] o.a.s.c.c.ZkStateReader A cluster state change: WatchedEvent state:SyncConnected type:NodeDataChanged path:/clusterstate.json, has occurred - updating... (live nodes size: 1)
   [junit4]   2> 137706 INFO  (coreZkRegister-343-thread-1-processing-n:127.0.0.1:52798_ x:collection1 s:shard1 c:control_collection r:core_node1) [n:127.0.0.1:52798_ c:control_collection s:shard1 r:core_node1 x:collection1] o.a.s.c.ZkController We are http://127.0.0.1:52798/collection1/ and leader is http://127.0.0.1:52798/collection1/
   [junit4]   2> 137706 INFO  (coreZkRegister-343-thread-1-processing-n:127.0.0.1:52798_ x:collection1 s:shard1 c:control_collection r:core_node1) [n:127.0.0.1:52798_ c:control_collection s:shard1 r:core_node1 x:collection1] o.a.s.c.ZkController No LogReplay needed for core=collection1 baseURL=http://127.0.0.1:52798
   [junit4]   2> 137706 INFO  (coreZkRegister-343-thread-1-processing-n:127.0.0.1:52798_ x:collection1 s:shard1 c:control_collection r:core_node1) [n:127.0.0.1:52798_ c:control_collection s:shard1 r:core_node1 x:collection1] o.a.s.c.ZkController I am the leader, no recovery necessary
   [junit4]   2> 137706 INFO  (coreZkRegister-343-thread-1-processing-n:127.0.0.1:52798_ x:collection1 s:shard1 c:control_collection r:core_node1) [n:127.0.0.1:52798_ c:control_collection s:shard1 r:core_node1 x:collection1] o.a.s.c.ZkController publishing state=active
   [junit4]   2> 137706 INFO  (coreZkRegister-343-thread-1-processing-n:127.0.0.1:52798_ x:collection1 s:shard1 c:control_collection r:core_node1) [n:127.0.0.1:52798_ c:control_collection s:shard1 r:core_node1 x:collection1] o.a.s.c.ZkController numShards not found on descriptor - reading it from system property
   [junit4]   2> 137707 INFO  (OverseerStateUpdate-94771037125148676-127.0.0.1:52798_-n_0000000000) [n:127.0.0.1:52798_    ] o.a.s.c.Overseer processMessage: queueSize: 1, message = {
   [junit4]   2>   "core":"collection1",
   [junit4]   2>   "core_node_name":"core_node1",
   [junit4]   2>   "roles":null,
   [junit4]   2>   "base_url":"http://127.0.0.1:52798",
   [junit4]   2>   "node_name":"127.0.0.1:52798_",
   [junit4]   2>   "numShards":"1",
   [junit4]   2>   "state":"active",
   [junit4]   2>   "shard":"shard1",
   [junit4]   2>   "collection":"control_collection",
   [junit4]   2>   "operation":"state"} current state version: 2
   [junit4]   2> 137707 INFO  (OverseerStateUpdate-94771037125148676-127.0.0.1:52798_-n_0000000000) [n:127.0.0.1:52798_    ] o.a.s.c.o.ReplicaMutator Update state numShards=1 message={
   [junit4]   2>   "core":"collection1",
   [junit4]   2>   "core_node_name":"core_node1",
   [junit4]   2>   "roles":null,
   [junit4]   2>   "base_url":"http://127.0.0.1:52798",
   [junit4]   2>   "node_name":"127.0.0.1:52798_",
   [junit4]   2>   "numShards":"1",
   [junit4]   2>   "state":"active",
   [junit4]   2>   "shard":"shard1",
   [junit4]   2>   "collection":"control_collection",
   [junit4]   2>   "operation":"state"}
   [junit4]   2> 137808 INFO  (zkCallback-97-thread-1-processing-n:127.0.0.1:52798_) [n:127.0.0.1:52798_    ] o.a.s.c.c.ZkStateReader A cluster state change: WatchedEvent state:SyncConnected type:NodeDataChanged path:/clusterstate.json, has occurred - updating... (live nodes size: 1)
   [junit4]   2> 137924 INFO  (TEST-BasicDistributedZkTest.test-seed#[1F60B6F6759E2BB3]) [    ] o.a.s.c.c.SolrZkClient Using default ZkCredentialsProvider
   [junit4]   2> 137924 INFO  (TEST-BasicDistributedZkTest.test-seed#[1F60B6F6759E2BB3]) [    ] o.a.s.c.c.ConnectionManager Waiting for client to connect to ZooKeeper
   [junit4]   2> 137926 INFO  (zkCallback-99-thread-1) [    ] o.a.s.c.c.ConnectionManager Watcher org.apache.solr.common.cloud.ConnectionManager@79f1cde4 name:ZooKeeperConnection Watcher:127.0.0.1:54863/solr got event WatchedEvent state:SyncConnected type:None path:null path:null type:None
   [junit4]   2> 137926 INFO  (TEST-BasicDistributedZkTest.test-seed#[1F60B6F6759E2BB3]) [    ] o.a.s.c.c.ConnectionManager Client is connected to ZooKeeper
   [junit4]   2> 137926 INFO  (TEST-BasicDistributedZkTest.test-seed#[1F60B6F6759E2BB3]) [    ] o.a.s.c.c.SolrZkClient Using default ZkACLProvider
   [junit4]   2> 137926 INFO  (TEST-BasicDistributedZkTest.test-seed#[1F60B6F6759E2BB3]) [    ] o.a.s.c.c.ZkStateReader Updating cluster state from ZooKeeper... 
   [junit4]   2> 137927 INFO  (TEST-BasicDistributedZkTest.test-seed#[1F60B6F6759E2BB3]) [    ] o.a.s.c.ChaosMonkey monkey: init - expire sessions:false cause connection loss:false
   [junit4]   2> 137976 INFO  (TEST-BasicDistributedZkTest.test-seed#[1F60B6F6759E2BB3]) [    ] o.a.s.SolrTestCaseJ4 Writing core.properties file to /home/jenkins/workspace/Lucene-Solr-trunk-Linux/solr/build/solr-core/test/J0/temp/solr.cloud.BasicDistributedZkTest_1F60B6F6759E2BB3-001/shard-1-001/cores/collection1
   [junit4]   2> 137976 INFO  (TEST-BasicDistributedZkTest.test-seed#[1F60B6F6759E2BB3]) [    ] o.a.s.c.AbstractFullDistribZkTestBase create jetty 1 in directory /home/jenkins/workspace/Lucene-Solr-trunk-Linux/solr/build/solr-core/test/J0/temp/solr.cloud.BasicDistributedZkTest_1F60B6F6759E2BB3-001/shard-1-001
   [junit4]   2> 137977 INFO  (TEST-BasicDistributedZkTest.test-seed#[1F60B6F6759E2BB3]) [    ] o.e.j.s.Server jetty-9.2.13.v20150730
   [junit4]   2> 137978 INFO  (TEST-BasicDistributedZkTest.test-seed#[1F60B6F6759E2BB3]) [    ] o.e.j.s.h.ContextHandler Started o.e.j.s.ServletContextHandler@14a33069{/,null,AVAILABLE}
   [junit4]   2> 137978 INFO  (TEST-BasicDistributedZkTest.test-seed#[1F60B6F6759E2BB3]) [    ] o.e.j.s.ServerConnector Started ServerConnector@31aa6abe{HTTP/1.1}{127.0.0.1:۴۸۸۱۷}
   [junit4]   2> 137978 INFO  (TEST-BasicDistributedZkTest.test-seed#[1F60B6F6759E2BB3]) [    ] o.e.j.s.Server Started @۱۳۹۶۲۵ms
   [junit4]   2> 137978 INFO  (TEST-BasicDistributedZkTest.test-seed#[1F60B6F6759E2BB3]) [    ] o.a.s.c.s.e.JettySolrRunner Jetty properties: {solr.data.dir=/home/jenkins/workspace/Lucene-Solr-trunk-Linux/solr/build/solr-core/test/J0/temp/solr.cloud.BasicDistributedZkTest_1F60B6F6759E2BB3-001/tempDir-001/jetty1, solrconfig=solrconfig.xml, hostContext=/, hostPort=48817, coreRootDirectory=/home/jenkins/workspace/Lucene-Solr-trunk-Linux/solr/build/solr-core/test/J0/temp/solr.cloud.BasicDistributedZkTest_1F60B6F6759E2BB3-001/shard-1-001/cores}
   [junit4]   2> 137978 INFO  (TEST-BasicDistributedZkTest.test-seed#[1F60B6F6759E2BB3]) [    ] o.a.s.s.SolrDispatchFilter SolrDispatchFilter.init(): sun.misc.Launcher$AppClassLoader@73c6c3b2
   [junit4]   2> 137978 INFO  (TEST-BasicDistributedZkTest.test-seed#[1F60B6F6759E2BB3]) [    ] o.a.s.c.SolrResourceLoader new SolrResourceLoader for directory: '/home/jenkins/workspace/Lucene-Solr-trunk-Linux/solr/build/solr-core/test/J0/temp/solr.cloud.BasicDistributedZkTest_1F60B6F6759E2BB3-001/shard-1-001/'
   [junit4]   2> 137979 INFO  (TEST-BasicDistributedZkTest.test-seed#[1F60B6F6759E2BB3]) [    ] o.a.s.c.SolrResourceLoader JNDI not configured for solr (NoInitialContextEx)
   [junit4]   2> 137979 INFO  (TEST-BasicDistributedZkTest.test-seed#[1F60B6F6759E2BB3]) [    ] o.a.s.c.SolrResourceLoader solr home defaulted to 'solr/' (could not find system property or JNDI)
   [junit4]   2> 137986 INFO  (TEST-BasicDistributedZkTest.test-seed#[1F60B6F6759E2BB3]) [    ] o.a.s.c.c.SolrZkClient Using default ZkCredentialsProvider
   [junit4]   2> 137986 INFO  (TEST-BasicDistributedZkTest.test-seed#[1F60B6F6759E2BB3]) [    ] o.a.s.c.c.ConnectionManager Waiting for client to connect to ZooKeeper
   [junit4]   2> 137989 INFO  (zkCallback-100-thread-1) [    ] o.a.s.c.c.ConnectionManager Watcher org.apache.solr.common.cloud.ConnectionManager@5e1ca227 name:ZooKeeperConnection Watcher:127.0.0.1:54863/solr got event WatchedEvent state:SyncConnected type:None path:null path:null type:None
   [junit4]   2> 137989 INFO  (TEST-BasicDistributedZkTest.test-seed#[1F60B6F6759E2BB3]) [    ] o.a.s.c.c.ConnectionManager Client is connected to ZooKeeper
   [junit4]   2> 137989 INFO  (TEST-BasicDistributedZkTest.test-seed#[1F60B6F6759E2BB3]) [    ] o.a.s.c.c.SolrZkClient Using default ZkACLProvider
   [junit4]   2> 137990 INFO  (TEST-BasicDistributedZkTest.test-seed#[1F60B6F6759E2BB3]) [    ] o.a.s.s.SolrDispatchFilter Loading solr.xml from SolrHome (not found in ZooKeeper)
   [junit4]   2> 137990 INFO  (TEST-BasicDistributedZkTest.test-seed#[1F60B6F6759E2BB3]) [    ] o.a.s.c.SolrXmlConfig Loading container configuration from /home/jenkins/workspace/Lucene-Solr-trunk-Linux/solr/build/solr-core/test/J0/temp/solr.cloud.BasicDistributedZkTest_1F60B6F6759E2BB3-001/shard-1-001/solr.xml
   [junit4]   2> 137994 INFO  (TEST-BasicDistributedZkTest.test-seed#[1F60B6F6759E2BB3]) [    ] o.a.s.c.CoresLocator Config-defined core root directory: /home/jenkins/workspace/Lucene-Solr-trunk-Linux/solr/build/solr-core/test/J0/temp/solr.cloud.BasicDistributedZkTest_1F60B6F6759E2BB3-001/shard-1-001/cores
   [junit4]   2> 137994 INFO  (TEST-BasicDistributedZkTest.test-seed#[1F60B6F6759E2BB3]) [    ] o.a.s.c.CoreContainer New CoreContainer 556038434
   [junit4]   2> 137994 INFO  (TEST-BasicDistributedZkTest.test-seed#[1F60B6F6759E2BB3]) [    ] o.a.s.c.CoreContainer Loading cores into CoreContainer [instanceDir=/home/jenkins/workspace/Lucene-Solr-trunk-Linux/solr/build/solr-core/test/J0/temp/solr.cloud.BasicDistributedZkTest_1F60B6F6759E2BB3-001/shard-1-001/]
   [junit4]   2> 137994 INFO  (TEST-BasicDistributedZkTest.test-seed#[1F60B6F6759E2BB3]) [    ] o.a.s.c.CoreContainer loading shared library: /home/jenkins/workspace/Lucene-Solr-trunk-Linux/solr/build/solr-core/test/J0/temp/solr.cloud.BasicDistributedZkTest_1F60B6F6759E2BB3-001/shard-1-001/lib
   [junit4]   2> 137994 WARN  (TEST-BasicDistributedZkTest.test-seed#[1F60B6F6759E2BB3]) [    ] o.a.s.c.SolrResourceLoader Can't find (or read) directory to add to classloader: lib (resolved as: /home/jenkins/workspace/Lucene-Solr-trunk-Linux/solr/build/solr-core/test/J0/temp/solr.cloud.BasicDistributedZkTest_1F60B6F6759E2BB3-001/shard-1-001/lib).
   [junit4]   2> 137998 INFO  (TEST-BasicDistributedZkTest.test-seed#[1F60B6F6759E2BB3]) [    ] o.a.s.h.c.HttpShardHandlerFactory created with socketTimeout : 90000,urlScheme : ,connTimeout : 15000,maxConnectionsPerHost : 20,maxConnections : 10000,corePoolSize : 0,maximumPoolSize : 2147483647,maxThreadIdleTime : 5,sizeOfQueue : -1,fairnessPolicy : false,useRetries : false,
   [junit4]   2> 138000 INFO  (TEST-BasicDistributedZkTest.test-seed#[1F60B6F6759E2BB3]) [    ] o.a.s.u.UpdateShardHandler Creating UpdateShardHandler HTTP client with params: socketTimeout=340000&connTimeout=45000&retry=true
   [junit4]   2> 138000 INFO  (TEST-BasicDistributedZkTest.test-seed#[1F60B6F6759E2BB3]) [    ] o.a.s.l.LogWatcher SLF4J impl is org.slf4j.impl.Log4jLoggerFactory
   [junit4]   2> 138000 INFO  (TEST-BasicDistributedZkTest.test-seed#[1F60B6F6759E2BB3]) [    ] o.a.s.l.LogWatcher Registering Log Listener [Log4j (org.slf4j.impl.Log4jLoggerFactory)]
   [junit4]   2> 138000 INFO  (TEST-BasicDistributedZkTest.test-seed#[1F60B6F6759E2BB3]) [    ] o.a.s.c.ZkContainer Zookeeper client=127.0.0.1:54863/solr
   [junit4]   2> 138000 INFO  (TEST-BasicDistributedZkTest.test-seed#[1F60B6F6759E2BB3]) [    ] o.a.s.c.ZkController zkHost includes chroot
   [junit4]   2> 138000 INFO  (TEST-BasicDistributedZkTest.test-seed#[1F60B6F6759E2BB3]) [    ] o.a.s.c.c.SolrZkClient Using default ZkCredentialsProvider
   [junit4]   2> 138000 INFO  (TEST-BasicDistributedZkTest.test-seed#[1F60B6F6759E2BB3]) [    ] o.a.s.c.c.ConnectionManager Waiting for client to connect to ZooKeeper
   [junit4]   2> 138002 INFO  (zkCallback-102-thread-1) [    ] o.a.s.c.c.ConnectionManager Watcher org.apache.solr.common.cloud.ConnectionManager@3c96a06f name:ZooKeeperConnection Watcher:127.0.0.1:54863 got event WatchedEvent state:SyncConnected type:None path:null path:null type:None
   [junit4]   2> 138002 INFO  (TEST-BasicDistributedZkTest.test-seed#[1F60B6F6759E2BB3]) [    ] o.a.s.c.c.ConnectionManager Client is connected to ZooKeeper
   [junit4]   2> 138002 INFO  (TEST-BasicDistributedZkTest.test-seed#[1F60B6F6759E2BB3]) [    ] o.a.s.c.c.SolrZkClient Using default ZkACLProvider
   [junit4]   2> 138004 INFO  (TEST-BasicDistributedZkTest.test-seed#[1F60B6F6759E2BB3]) [n:127.0.0.1:48817_    ] o.a.s.c.c.ConnectionManager Waiting for client to connect to ZooKeeper
   [junit4]   2> 138005 INFO  (zkCallback-103-thread-1-processing-n:127.0.0.1:48817_) [n:127.0.0.1:48817_    ] o.a.s.c.c.ConnectionManager Watcher org.apache.solr.common.cloud.ConnectionManager@48fff080 name:ZooKeeperConnection Watcher:127.0.0.1:54863/solr got event WatchedEvent state:SyncConnected type:None path:null path:null type:None
   [junit4]   2> 138005 INFO  (TEST-BasicDistributedZkTest.test-seed#[1F60B6F6759E2BB3]) [n:127.0.0.1:48817_    ] o.a.s.c.c.ConnectionManager Client is connected to ZooKeeper
   [junit4]   2> 138007 INFO  (TEST-BasicDistributedZkTest.test-seed#[1F60B6F6759E2BB3]) [n:127.0.0.1:48817_    ] o.a.s.c.c.ZkStateReader Updating cluster state from ZooKeeper... 
   [junit4]   2> 139009 INFO  (TEST-BasicDistributedZkTest.test-seed#[1F60B6F6759E2BB3]) [n:127.0.0.1:48817_    ] o.a.s.c.ZkController Register node as live in ZooKeeper:/live_nodes/127.0.0.1:48817_
   [junit4]   2> 139009 INFO  (TEST-BasicDistributedZkTest.test-seed#[1F60B6F6759E2BB3]) [n:127.0.0.1:48817_    ] o.a.s.c.c.SolrZkClient makePath: /live_nodes/127.0.0.1:48817_
   [junit4]   2> 139009 INFO  (zkCallback-99-thread-1) [    ] o.a.s.c.c.ZkStateReader A live node change: WatchedEvent state:SyncConnected type:NodeChildrenChanged path:/live_nodes, has occurred - updating... (live nodes size: 1)
   [junit4]   2> 139009 INFO  (zkCallback-103-thread-1-processing-n:127.0.0.1:48817_) [n:127.0.0.1:48817_    ] o.a.s.c.c.ZkStateReader A live node change: WatchedEvent state:SyncConnected type:NodeChildrenChanged path:/live_nodes, has occurred - updating... (live nodes size: 1)
   [junit4]   2> 139009 INFO  (zkCallback-97-thread-1-processing-n:127.0.0.1:52798_) [n:127.0.0.1:52798_    ] o.a.s.c.c.ZkStateReader A live node change: WatchedEvent state:SyncConnected type:NodeChildrenChanged path:/live_nodes, has occurred - updating... (live nodes size: 1)
   [junit4]   2> 139010 INFO  (TEST-BasicDistributedZkTest.test-seed#[1F60B6F6759E2BB3]) [n:127.0.0.1:48817_    ] o.a.s.c.Overseer Overseer (id=null) closing
   [junit4]   2> 139011 INFO  (TEST-BasicDistributedZkTest.test-seed#[1F60B6F6759E2BB3]) [n:127.0.0.1:48817_    ] o.a.s.c.LeaderElector Joined leadership election with path: /overseer_elect/election/94771037125148680-127.0.0.1:48817_-n_0000000001
   [junit4]   2> 139011 INFO  (TEST-BasicDistributedZkTest.test-seed#[1F60B6F6759E2BB3]) [n:127.0.0.1:48817_    ] o.a.s.c.LeaderElector Watching path /overseer_elect/election/94771037125148676-127.0.0.1:52798_-n_0000000000 to know if I could be the leader
   [junit4]   2> 139015 INFO  (TEST-BasicDistributedZkTest.test-seed#[1F60B6F6759E2BB3]) [n:127.0.0.1:48817_    ] o.a.s.c.CoreContainer Security conf doesn't exist. Skipping setup for authorization module.
   [junit4]   2> 139015 INFO  (TEST-BasicDistributedZkTest.test-seed#[1F60B6F6759E2BB3]) [n:127.0.0.1:48817_    ] o.a.s.c.CoreContainer No authentication plugin used.
   [junit4]   2> 139015 INFO  (TEST-BasicDistributedZkTest.test-seed#[1F60B6F6759E2BB3]) [n:127.0.0.1:48817_    ] o.a.s.c.CoresLocator Looking for core definitions underneath /home/jenkins/workspace/Lucene-Solr-trunk-Linux/solr/build/solr-core/test/J0/temp/solr.cloud.BasicDistributedZkTest_1F60B6F6759E2BB3-001/shard-1-001/cores
   [junit4]   2> 139016 INFO  (TEST-BasicDistributedZkTest.test-seed#[1F60B6F6759E2BB3]) [n:127.0.0.1:48817_    ] o.a.s.c.SolrCore Created CoreDescriptor: {name=collection1, config=solrconfig.xml, transient=false, schema=schema.xml, loadOnStartup=true, configSetProperties=configsetprops.json, instanceDir=/home/jenkins/workspace/Lucene-Solr-trunk-Linux/solr/build/solr-core/test/J0/temp/solr.cloud.BasicDistributedZkTest_1F60B6F6759E2BB3-001/shard-1-001/cores/collection1, collection=collection1, absoluteInstDir=/home/jenkins/workspace/Lucene-Solr-trunk-Linux/solr/build/solr-core/test/J0/temp/solr.cloud.BasicDistributedZkTest_1F60B6F6759E2BB3-001/shard-1-001/cores/collection1/, coreNodeName=, dataDir=data/, shard=}
   [junit4]   2> 139016 INFO  (TEST-BasicDistributedZkTest.test-seed#[1F60B6F6759E2BB3]) [n:127.0.0.1:48817_    ] o.a.s.c.CoresLocator Found core collection1 in /home/jenkins/workspace/Lucene-Solr-trunk-Linux/solr/build/solr-core/test/J0/temp/solr.cloud.BasicDistributedZkTest_1F60B6F6759E2BB3-001/shard-1-001/cores/collection1/
   [junit4]   2> 139016 INFO  (TEST-BasicDistributedZkTest.test-seed#[1F60B6F6759E2BB3]) [n:127.0.0.1:48817_    ] o.a.s.c.CoresLocator Found 1 core definitions
   [junit4]   2> 139016 INFO  (TEST-BasicDistributedZkTest.test-seed#[1F60B6F6759E2BB3]) [n:127.0.0.1:48817_    ] o.a.s.s.SolrDispatchFilter user.dir=/home/jenkins/workspace/Lucene-Solr-trunk-Linux/solr/build/solr-core/test/J0
   [junit4]   2> 139016 INFO  (TEST-BasicDistributedZkTest.test-seed#[1F60B6F6759E2BB3]) [n:127.0.0.1:48817_    ] o.a.s.s.SolrDispatchFilter SolrDispatchFilter.init() done
   [junit4]   2> 139016 INFO  (coreLoadExecutor-360-thread-1-processing-n:127.0.0.1:48817_) [n:127.0.0.1:48817_ c:collection1   x:collection1] o.a.s.c.ZkController publishing state=down
   [junit4]   2> 139016 INFO  (coreLoadExecutor-360-thread-1-processing-n:127.0.0.1:48817_) [n:127.0.0.1:48817_ c:collection1   x:collection1] o.a.s.c.ZkController numShards not found on descriptor - reading it from system property
   [junit4]   2> 139017 INFO  (coreLoadExecutor-360-thread-1-processing-n:127.0.0.1:48817_) [n:127.0.0.1:48817_ c:collection1   x:collection1] o.a.s.c.ZkController look for our core node name
   [junit4]   2> 139017 INFO  (OverseerStateUpdate-94771037125148676-127.0.0.1:52798_-n_0000000000) [n:127.0.0.1:52798_    ] o.a.s.c.Overseer processMessage: queueSize: 1, message = {
   [junit4]   2>   "core":"collection1",
   [junit4]   2>   "roles":null,
   [junit4]   2>   "base_url":"http://127.0.0.1:48817",
   [junit4]   2>   "node_name":"127.0.0.1:48817_",
   [junit4]   2>   "numShards":"2",
   [junit4]   2>   "state":"down",
   [junit4]   2>   "shard":null,
   [junit4]   2>   "collection":"collection1",
   [junit4]   2>   "operation":"state"} current state version: 3
   [junit4]   2> 139017 INFO  (OverseerStateUpdate-94771037125148676-127.0.0.1:52798_-n_0000000000) [n:127.0.0.1:52798_    ] o.a.s.c.o.ReplicaMutator Update state numShards=2 message={
   [junit4]   2>   "core":"collection1",
   [junit4]   2>   "roles":null,
   [junit4]   2>   "base_url":"http://127.0.0.1:48817",
   [junit4]   2>   "node_name":"127.0.0.1:48817_",
   [junit4]   2>   "numShards":"2",
   [junit4]   2>   "state":"down",
   [junit4]   2>   "shard":null,
   [junit4]   2>   "collection":"collection1",
   [junit4]   2>   "operation":"state"}
   [junit4]   2> 139017 INFO  (OverseerStateUpdate-94771037125148676-127.0.0.1:52798_-n_0000000000) [n:127.0.0.1:52798_    ] o.a.s.c.o.ClusterStateMutator building a new cName: collection1
   [junit4]   2> 139017 INFO  (OverseerStateUpdate-94771037125148676-127.0.0.1:52798_-n_0000000000) [n:127.0.0.1:52798_    ] o.a.s.c.o.ReplicaMutator Assigning new node to shard shard=shard2
   [junit4]   2> 139119 INFO  (zkCallback-97-thread-1-processing-n:127.0.0.1:52798_) [n:127.0.0.1:52798_    ] o.a.s.c.c.ZkStateReader A cluster state change: WatchedEvent state:SyncConnected type:NodeDataChanged path:/clusterstate.json, has occurred - updating... (live nodes size: 2)
   [junit4]   2> 139119 INFO  (zkCallback-99-thread-1) [    ] o.a.s.c.c.ZkStateReader A cluster state change: WatchedEvent state:SyncConnected type:NodeDataChanged path:/clusterstate.json, has occurred - updating... (live nodes size: 2)
   [junit4]   2> 139119 INFO  (zkCallback-103-thread-1-processing-n:127.0.0.1:48817_) [n:127.0.0.1:48817_    ] o.a.s.c.c.ZkStateReader A cluster state change: WatchedEvent state:SyncConnected type:NodeDataChanged path:/clusterstate.json, has occurred - updating... (live nodes size: 2)
   [junit4]   2> 140017 INFO  (coreLoadExecutor-360-thread-1-processing-n:127.0.0.1:48817_) [n:127.0.0.1:48817_ c:collection1   x:collection1] o.a.s.c.ZkController waiting to find shard id in clusterstate for collection1
   [junit4]   2> 140017 INFO  (coreLoadExecutor-360-thread-1-processing-n:127.0.0.1:48817_) [n:127.0.0.1:48817_ c:collection1   x:collection1] o.a.s.c.ZkController Check for collection zkNode:collection1
   [junit4]   2> 140018 INFO  (coreLoadExecutor-360-thread-1-processing-n:127.0.0.1:48817_) [n:127.0.0.1:48817_ c:collection1   x:collection1] o.a.s.c.ZkController Collection zkNode exists
   [junit4]   2> 140018 INFO  (coreLoadExecutor-360-thread-1-processing-n:127.0.0.1:48817_) [n:127.0.0.1:48817_ c:collection1   x:collection1] o.a.s.c.c.ZkStateReader Load collection config from:/collections/collection1
   [junit4]   2> 140018 INFO  (coreLoadExecutor-360-thread-1-processing-n:127.0.0.1:48817_) [n:127.0.0.1:48817_ c:collection1   x:collection1] o.a.s.c.c.ZkStateReader path=/collections/collection1 configName=conf1 specified config exists in ZooKeeper
   [junit4]   2> 140018 INFO  (coreLoadExecutor-360-thread-1-processing-n:127.0.0.1:48817_) [n:127.0.0.1:48817_ c:collection1   x:collection1] o.a.s.c.SolrResourceLoader new SolrResourceLoader for directory: '/home/jenkins/workspace/Lucene-Solr-trunk-Linux/solr/build/solr-core/test/J0/temp/solr.cloud.BasicDistributedZkTest_1F60B6F6759E2BB3-001/shard-1-001/cores/collection1/'
   [junit4]   2> 140018 INFO  (coreLoadExecutor-360-thread-1-processing-n:127.0.0.1:48817_) [n:127.0.0.1:48817_ c:collection1   x:collection1] o.a.s.c.SolrResourceLoader JNDI not configured for solr (NoInitialContextEx)
   [junit4]   2> 140018 INFO  (coreLoadExecutor-360-thread-1-processing-n:127.0.0.1:48817_) [n:127.0.0.1:48817_ c:collection1   x:collection1] o.a.s.c.SolrResourceLoader solr home defaulted to 'solr/' (could not find system property or JNDI)
   [junit4]   2> 140025 INFO  (coreLoadExecutor-360-thread-1-processing-n:127.0.0.1:48817_) [n:127.0.0.1:48817_ c:collection1   x:collection1] o.a.s.c.Config loaded config solrconfig.xml with version 0 
   [junit4]   2> 140028 INFO  (coreLoadExecutor-360-thread-1-processing-n:127.0.0.1:48817_) [n:127.0.0.1:48817_ c:collection1   x:collection1] o.a.s.c.SolrConfig current version of requestparams : -1
   [junit4]   2> 140032 INFO  (coreLoadExecutor-360-thread-1-processing-n:127.0.0.1:48817_) [n:127.0.0.1:48817_ c:collection1   x:collection1] o.a.s.c.SolrConfig Using Lucene MatchVersion: 6.0.0
   [junit4]   2> 140051 INFO  (coreLoadExecutor-360-thread-1-processing-n:127.0.0.1:48817_) [n:127.0.0.1:48817_ c:collection1   x:collection1] o.a.s.c.Config Loaded SolrConfig: solrconfig.xml
   [junit4]   2> 140051 INFO  (coreLoadExecutor-360-thread-1-processing-n:127.0.0.1:48817_) [n:127.0.0.1:48817_ c:collection1   x:collection1] o.a.s.s.IndexSchema Reading Solr Schema from /configs/conf1/schema.xml
   [junit4]   2> 140055 INFO  (coreLoadExecutor-360-thread-1-processing-n:127.0.0.1:48817_) [n:127.0.0.1:48817_ c:collection1   x:collection1] o.a.s.s.IndexSchema [collection1] Schema name=test
   [junit4]   2> 140113 INFO  (coreLoadExecutor-360-thread-1-processing-n:127.0.0.1:48817_) [n:127.0.0.1:48817_ c:collection1   x:collection1] o.a.s.s.OpenExchangeRatesOrgProvider Initialized with rates=open-exchange-rates.json, refreshInterval=1440.
   [junit4]   2> 140117 INFO  (coreLoadExecutor-360-thread-1-processing-n:127.0.0.1:48817_) [n:127.0.0.1:48817_ c:collection1   x:collection1] o.a.s.s.IndexSchema default search field in schema is text
   [junit4]   2> 140118 INFO  (coreLoadExecutor-360-thread-1-processing-n:127.0.0.1:48817_) [n:127.0.0.1:48817_ c:collection1   x:collection1] o.a.s.s.IndexSchema unique key field: id
   [junit4]   2> 140122 INFO  (coreLoadExecutor-360-thread-1-processing-n:127.0.0.1:48817_) [n:127.0.0.1:48817_ c:collection1   x:collection1] o.a.s.s.FileExchangeRateProvider Reloading exchange rates from file currency.xml
   [junit4]   2> 140124 INFO  (coreLoadExecutor-360-thread-1-processing-n:127.0.0.1:48817_) [n:127.0.0.1:48817_ c:collection1   x:collection1] o.a.s.s.FileExchangeRateProvider Reloading exchange rates from file currency.xml
   [junit4]   2> 140125 INFO  (coreLoadExecutor-360-thread-1-processing-n:127.0.0.1:48817_) [n:127.0.0.1:48817_ c:collection1   x:collection1] o.a.s.s.OpenExchangeRatesOrgProvider Reloading exchange rates from open-exchange-rates.json
   [junit4]   2> 140125 WARN  (coreLoadExecutor-360-thread-1-processing-n:127.0.0.1:48817_) [n:127.0.0.1:48817_ c:collection1   x:collection1] o.a.s.s.OpenExchangeRatesOrgProvider Unknown key IMPORTANT NOTE
   [junit4]   2> 140125 WARN  (coreLoadExecutor-360-thread-1-processing-n:127.0.0.1:48817_) [n:127.0.0.1:48817_ c:collection1   x:collection1] o.a.s.s.OpenExchangeRatesOrgProvider Expected key, got STRING
   [junit4]   2> 140125 INFO  (coreLoadExecutor-360-thread-1-processing-n:127.0.0.1:48817_) [n:127.0.0.1:48817_ c:collection1   x:collection1] o.a.s.s.OpenExchangeRatesOrgProvider Reloading exchange rates from open-exchange-rates.json
   [junit4]   2> 140125 WARN  (coreLoadExecutor-360-thread-1-processing-n:127.0.0.1:48817_) [n:127.0.0.1:48817_ c:collection1   x:collection1] o.a.s.s.OpenExchangeRatesOrgProvider Unknown key IMPORTANT NOTE
   [junit4]   2> 140125 WARN  (coreLoadExecutor-360-thread-1-processing-n:127.0.0.1:48817_) [n:127.0.0.1:48817_ c:collection1   x:collection1] o.a.s.s.OpenExchangeRatesOrgProvider Expected key, got STRING
   [junit4]   2> 140126 INFO  (coreLoadExecutor-360-thread-1-processing-n:127.0.0.1:48817_) [n:127.0.0.1:48817_ c:collection1   x:collection1] o.a.s.c.ConfigSetProperties Did not find ConfigSet properties, assuming default properties: Can't find resource 'configsetprops.json' in classpath or '/configs/conf1', cwd=/home/jenkins/workspace/Lucene-Solr-trunk-Linux/solr/build/solr-core/test/J0
   [junit4]   2> 140126 INFO  (coreLoadExecutor-360-thread-1-processing-n:127.0.0.1:48817_) [n:127.0.0.1:48817_ c:collection1   x:collection1] o.a.s.c.CoreContainer Creating SolrCore 'collection1' using configuration from collection collection1
   [junit4]   2> 140126 INFO  (coreLoadExecutor-360-thread-1-processing-n:127.0.0.1:48817_) [n:127.0.0.1:48817_ c:collection1 s:shard2 r:core_node1 x:collection1] o.a.s.c.SolrCore org.apache.solr.core.MockDirectoryFactory
   [junit4]   2> 140126 INFO  (coreLoadExecutor-360-thread-1-processing-n:127.0.0.1:48817_) [n:127.0.0.1:48817_ c:collection1 s:shard2 r:core_node1 x:collection1] o.a.s.c.SolrCore [[collection1] ] Opening new SolrCore at [/home/jenkins/workspace/Lucene-Solr-trunk-Linux/solr/build/solr-core/test/J0/temp/solr.cloud.BasicDistributedZkTest_1F60B6F6759E2BB3-001/shard-1-001/cores/collection1/], dataDir=[null]
   [junit4]   2> 140126 INFO  (coreLoadExecutor-360-thread-1-processing-n:127.0.0.1:48817_) [n:127.0.0.1:48817_ c:collection1 s:shard2 r:core_node1 x:collection1] o.a.s.c.JmxMonitoredMap JMX monitoring is enabled. Adding Solr mbeans to JMX Server: com.sun.jmx.mbeanserver.JmxMBeanServer@1acb48fa
   [junit4]   2> 140127 INFO  (coreLoadExecutor-360-thread-1-processing-n:127.0.0.1:48817_) [n:127.0.0.1:48817_ c:collection1 s:shard2 r:core_node1 x:collection1] o.a.s.c.CachingDirectoryFactory return new directory for /home/jenkins/workspace/Lucene-Solr-trunk-Linux/solr/build/solr-core/test/J0/temp/solr.cloud.BasicDistributedZkTest_1F60B6F6759E2BB3-001/shard-1-001/cores/collection1/data
   [junit4]   2> 140127 INFO  (coreLoadExecutor-360-thread-1-processing-n:127.0.0.1:48817_) [n:127.0.0.1:48817_ c:collection1 s:shard2 r:core_node1 x:collection1] o.a.s.c.SolrCore New index directory detected: old=null new=/home/jenkins/workspace/Lucene-Solr-trunk-Linux/solr/build/solr-core/test/J0/temp/solr.cloud.BasicDistributedZkTest_1F60B6F6759E2BB3-001/shard-1-001/cores/collection1/data/index/
   [junit4]   2> 140127 WARN  (coreLoadExecutor-360-thread-1-processing-n:127.0.0.1:48817_) [n:127.0.0.1:48817_ c:collection1 s:shard2 r:core_node1 x:collection1] o.a.s.c.SolrCore [collection1] Solr index directory '/home/jenkins/workspace/Lucene-Solr-trunk-Linux/solr/build/solr-core/test/J0/temp/solr.cloud.BasicDistributedZkTest_1F60B6F6759E2BB3-001/shard-1-001/cores/collection1/data/index' doesn't exist. Creating new index...
   [junit4]   2> 140128 INFO  (coreLoadExecutor-360-thread-1-processing-n:127.0.0.1:48817_) [n:127.0.0.1:48817_ c:collection1 s:shard2 r:core_node1 x:collection1] o.a.s.c.CachingDirectoryFactory return new directory for /home/jenkins/workspace/Lucene-Solr-trunk-Linux/solr/build/solr-core/test/J0/temp/solr.cloud.BasicDistributedZkTest_1F60B6F6759E2BB3-001/shard-1-001/cores/collection1/data/index
   [junit4]   2> 140128 INFO  (coreLoadExecutor-360-thread-1-processing-n:127.0.0.1:48817_) [n:127.0.0.1:48817_ c:collection1 s:shard2 r:core_node1 x:collection1] o.a.s.u.RandomMergePolicy RandomMergePolicy wrapping class org.apache.lucene.index.TieredMergePolicy: [TieredMergePolicy: maxMergeAtOnce=33, maxMergeAtOnceExplicit=38, maxMergedSegmentMB=85.2265625, floorSegmentMB=1.7783203125, forceMergeDeletesPctAllowed=16.966370578827174, segmentsPerTier=42.0, maxCFSSegmentSizeMB=1.8701171875, noCFSRatio=0.0
   [junit4]   2> 140128 INFO  (coreLoadExecutor-360-thread-1-processing-n:127.0.0.1:48817_) [n:127.0.0.1:48817_ c:collection1 s:shard2 r:core_node1 x:collection1] o.a.s.c.SolrCore SolrDeletionPolicy.onCommit: commits: num=1
   [junit4]   2> 	commit{dir=MockDirectoryWrapper(RAMDirectory@5dc92c2d lockFactory=org.apache.lucene.store.SingleInstanceLockFactory@539f6c6a),segFN=segments_1,generation=1}
   [junit4]   2> 140128 INFO  (coreLoadExecutor-360-thread-1-processing-n:127.0.0.1:48817_) [n:127.0.0.1:48817_ c:collection1 s:shard2 r:core_node1 x:collection1] o.a.s.c.SolrCore newest commit generation = 1
   [junit4]   2> 140128 INFO  (OldIndexDirectoryCleanupThreadForCore-collection1) [n:127.0.0.1:48817_ c:collection1 s:shard2 r:core_node1 x:collection1] o.a.s.c.SolrCore Looking for old index directories to cleanup for core collection1 in /home/jenkins/workspace/Lucene-Solr-trunk-Linux/solr/build/solr-core/test/J0/temp/solr.cloud.BasicDistributedZkTest_1F60B6F6759E2BB3-001/shard-1-001/cores/collection1/data/
   [junit4]   2> 140128 WARN  (OldIndexDirectoryCleanupThreadForCore-collection1) [n:127.0.0.1:48817_ c:collection1 s:shard2 r:core_node1 x:collection1] o.a.s.c.DirectoryFactory /home/jenkins/workspace/Lucene-Solr-trunk-Linux/solr/build/solr-core/test/J0/temp/solr.cloud.BasicDistributedZkTest_1F60B6F6759E2BB3-001/shard-1-001/cores/collection1/data/ does not point to a valid data directory; skipping clean-up of old index directories.
   [junit4]   2> 140132 INFO  (coreLoadExecutor-360-thread-1-processing-n:127.0.0.1:48817_) [n:127.0.0.1:48817_ c:collection1 s:shard2 r:core_node1 x:collection1] o.a.s.u.p.UpdateRequestProcessorChain creating updateRequestProcessorChain "nodistrib"
   [junit4]   2> 140132 INFO  (coreLoadExecutor-360-thread-1-processing-n:127.0.0.1:48817_) [n:127.0.0.1:48817_ c:collection1 s:shard2 r:core_node1 x:collection1] o.a.s.u.p.UpdateRequestProcessorChain creating updateRequestProcessorChain "dedupe"
   [junit4]   2> 140132 INFO  (coreLoadExecutor-360-thread-1-processing-n:127.0.0.1:48817_) [n:127.0.0.1:48817_ c:collection1 s:shard2 r:core_node1 x:collection1] o.a.s.u.p.UpdateRequestProcessorChain inserting DistributedUpdateProcessorFactory into updateRequestProcessorChain "dedupe"
   [junit4]   2> 140132 INFO  (coreLoadExecutor-360-thread-1-processing-n:127.0.0.1:48817_) [n:127.0.0.1:48817_ c:collection1 s:shard2 r:core_node1 x:collection1] o.a.s.u.p.UpdateRequestProcessorChain creating updateRequestProcessorChain "stored_sig"
   [junit4]   2> 140132 INFO  (coreLoadExecutor-360-thread-1-processing-n:127.0.0.1:48817_) [n:127.0.0.1:48817_ c:collection1 s:shard2 r:core_node1 x:collection1] o.a.s.u.p.UpdateRequestProcessorChain inserting DistributedUpdateProcessorFactory into updateRequestProcessorChain "stored_sig"
   [junit4]   2> 140132 INFO  (coreLoadExecutor-360-thread-1-processing-n:127.0.0.1:48817_) [n:127.0.0.1:48817_ c:collection1 s:shard2 r:core_node1 x:collection1] o.a.s.u.p.UpdateRequestProcessorChain creating updateRequestProcessorChain "distrib-dup-test-chain-explicit"
   [junit4]   2> 140132 INFO  (coreLoadExecutor-360-thread-1-processing-n:127.0.0.1:48817_) [n:127.0.0.1:48817_ c:collection1 s:shard2 r:core_node1 x:collection1] o.a.s.u.p.UpdateRequestProcessorChain creating updateRequestProcessorChain "distrib-dup-test-chain-implicit"
   [junit4]   2> 140132 INFO  (coreLoadExecutor-360-thread-1-processing-n:127.0.0.1:48817_) [n:127.0.0.1:48817_ c:collection1 s:shard2 r:core_node1 x:colle

[...truncated too long message...]

0.1:44413_ c:collection1 s:shard1 r:core_node4 x:collection1] o.a.s.c.SolrCore SolrDeletionPolicy.onCommit: commits: num=2
   [junit4]   2> 	commit{dir=MockDirectoryWrapper(RAMDirectory@3c0559d9 lockFactory=org.apache.lucene.store.SingleInstanceLockFactory@6582b1ae),segFN=segments_7,generation=7}
   [junit4]   2> 	commit{dir=MockDirectoryWrapper(RAMDirectory@3c0559d9 lockFactory=org.apache.lucene.store.SingleInstanceLockFactory@6582b1ae),segFN=segments_8,generation=8}
   [junit4]   2> 160561 INFO  (zkCallback-116-thread-1-processing-n:127.0.0.1:44413_) [n:127.0.0.1:44413_ c:collection1 s:shard1 r:core_node4 x:collection1] o.a.s.c.SolrCore newest commit generation = 8
   [junit4]   2> 160562 INFO  (zkCallback-116-thread-1-processing-n:127.0.0.1:44413_) [n:127.0.0.1:44413_ c:collection1 s:shard1 r:core_node4 x:collection1] o.a.s.c.SolrCore [collection1] Closing main searcher on request.
   [junit4]   2> 160566 INFO  (zkCallback-116-thread-1-processing-n:127.0.0.1:44413_) [n:127.0.0.1:44413_ c:collection1 s:shard1 r:core_node4 x:collection1] o.a.s.c.CachingDirectoryFactory Closing MockDirectoryFactory - 2 directories currently being tracked
   [junit4]   2> 160566 INFO  (zkCallback-116-thread-1-processing-n:127.0.0.1:44413_) [n:127.0.0.1:44413_ c:collection1 s:shard1 r:core_node4 x:collection1] o.a.s.c.CachingDirectoryFactory looking to close /home/jenkins/workspace/Lucene-Solr-trunk-Linux/solr/build/solr-core/test/J0/../../../../../../../../../home/jenkins/workspace/Lucene-Solr-trunk-Linux/solr/build/solr-core/test/J0/temp/solr.cloud.BasicDistributedZkTest_1F60B6F6759E2BB3-001/shard-4-001/cores/collection1/data [CachedDir<<refCount=0;path=/home/jenkins/workspace/Lucene-Solr-trunk-Linux/solr/build/solr-core/test/J0/../../../../../../../../../home/jenkins/workspace/Lucene-Solr-trunk-Linux/solr/build/solr-core/test/J0/temp/solr.cloud.BasicDistributedZkTest_1F60B6F6759E2BB3-001/shard-4-001/cores/collection1/data;done=false>>]
   [junit4]   2> 160566 INFO  (zkCallback-116-thread-1-processing-n:127.0.0.1:44413_) [n:127.0.0.1:44413_ c:collection1 s:shard1 r:core_node4 x:collection1] o.a.s.c.CachingDirectoryFactory Closing directory: /home/jenkins/workspace/Lucene-Solr-trunk-Linux/solr/build/solr-core/test/J0/../../../../../../../../../home/jenkins/workspace/Lucene-Solr-trunk-Linux/solr/build/solr-core/test/J0/temp/solr.cloud.BasicDistributedZkTest_1F60B6F6759E2BB3-001/shard-4-001/cores/collection1/data
   [junit4]   2> 160566 INFO  (zkCallback-116-thread-1-processing-n:127.0.0.1:44413_) [n:127.0.0.1:44413_ c:collection1 s:shard1 r:core_node4 x:collection1] o.a.s.c.CachingDirectoryFactory looking to close /home/jenkins/workspace/Lucene-Solr-trunk-Linux/solr/build/solr-core/test/J0/../../../../../../../../../home/jenkins/workspace/Lucene-Solr-trunk-Linux/solr/build/solr-core/test/J0/temp/solr.cloud.BasicDistributedZkTest_1F60B6F6759E2BB3-001/shard-4-001/cores/collection1/data/index [CachedDir<<refCount=0;path=/home/jenkins/workspace/Lucene-Solr-trunk-Linux/solr/build/solr-core/test/J0/../../../../../../../../../home/jenkins/workspace/Lucene-Solr-trunk-Linux/solr/build/solr-core/test/J0/temp/solr.cloud.BasicDistributedZkTest_1F60B6F6759E2BB3-001/shard-4-001/cores/collection1/data/index;done=false>>]
   [junit4]   2> 160566 INFO  (zkCallback-116-thread-1-processing-n:127.0.0.1:44413_) [n:127.0.0.1:44413_ c:collection1 s:shard1 r:core_node4 x:collection1] o.a.s.c.CachingDirectoryFactory Closing directory: /home/jenkins/workspace/Lucene-Solr-trunk-Linux/solr/build/solr-core/test/J0/../../../../../../../../../home/jenkins/workspace/Lucene-Solr-trunk-Linux/solr/build/solr-core/test/J0/temp/solr.cloud.BasicDistributedZkTest_1F60B6F6759E2BB3-001/shard-4-001/cores/collection1/data/index
   [junit4]   2> 160568 INFO  (TEST-BasicDistributedZkTest.test-seed#[1F60B6F6759E2BB3]) [    ] o.e.j.s.ServerConnector Stopped ServerConnector@20779465{HTTP/1.1}{127.0.0.1:۰}
   [junit4]   2> 160568 INFO  (TEST-BasicDistributedZkTest.test-seed#[1F60B6F6759E2BB3]) [    ] o.e.j.s.h.ContextHandler Stopped o.e.j.s.ServletContextHandler@367b3fcd{/,null,UNAVAILABLE}
   [junit4]   2> 160569 INFO  (TEST-BasicDistributedZkTest.test-seed#[1F60B6F6759E2BB3]) [n:127.0.0.1:44413_ c:collection1 s:shard1 r:core_node4 x:collection1] o.a.s.c.ZkTestServer connecting to 127.0.0.1:54863 54863
   [junit4]   2> 160582 INFO  (Thread-382) [    ] o.a.s.c.ZkTestServer connecting to 127.0.0.1:54863 54863
   [junit4]   2> 160583 WARN  (Thread-382) [    ] o.a.s.c.ZkTestServer Watch limit violations: 
   [junit4]   2> Maximum concurrent create/delete watches above limit:
   [junit4]   2> 
   [junit4]   2> 	7	/solr/aliases.json
   [junit4]   2> 	5	/solr/security.json
   [junit4]   2> 	5	/solr/configs/conf1
   [junit4]   2> 
   [junit4]   2> Maximum concurrent data watches above limit:
   [junit4]   2> 
   [junit4]   2> 	7	/solr/clusterstate.json
   [junit4]   2> 
   [junit4]   2> Maximum concurrent children watches above limit:
   [junit4]   2> 
   [junit4]   2> 	7	/solr/live_nodes
   [junit4]   2> 	7	/solr/collections
   [junit4]   2> 	4	/solr/overseer/queue
   [junit4]   2> 	4	/solr/overseer/collection-queue-work
   [junit4]   2> 	2	/solr/overseer/queue-work
   [junit4]   2> 
   [junit4]   2> NOTE: reproduce with: ant test  -Dtestcase=BasicDistributedZkTest -Dtests.method=test -Dtests.seed=1F60B6F6759E2BB3 -Dtests.multiplier=3 -Dtests.slow=true -Dtests.locale=fa -Dtests.timezone=Africa/Asmera -Dtests.asserts=true -Dtests.file.encoding=UTF-8
   [junit4] FAILURE 24.4s J0 | BasicDistributedZkTest.test <<<
   [junit4]    > Throwable #1: java.lang.AssertionError: commitWithin did not work on node: http://127.0.0.1:48817/collection1 expected:<68> but was:<67>
   [junit4]    > 	at __randomizedtesting.SeedInfo.seed([1F60B6F6759E2BB3:9734892CDB62464B]:0)
   [junit4]    > 	at org.apache.solr.cloud.BasicDistributedZkTest.test(BasicDistributedZkTest.java:333)
   [junit4]    > 	at org.apache.solr.BaseDistributedSearchTestCase$ShardsRepeatRule$ShardsFixedStatement.callStatement(BaseDistributedSearchTestCase.java:963)
   [junit4]    > 	at org.apache.solr.BaseDistributedSearchTestCase$ShardsRepeatRule$ShardsStatement.evaluate(BaseDistributedSearchTestCase.java:938)
   [junit4]    > 	at java.lang.Thread.run(Thread.java:747)
   [junit4]   2> 160587 INFO  (SUITE-BasicDistributedZkTest-seed#[1F60B6F6759E2BB3]-worker) [n:127.0.0.1:44413_ c:collection1 s:shard1 r:core_node4 x:collection1] o.a.s.SolrTestCaseJ4 ###deleteCore
   [junit4]   2> NOTE: leaving temporary files on disk at: /home/jenkins/workspace/Lucene-Solr-trunk-Linux/solr/build/solr-core/test/J0/temp/solr.cloud.BasicDistributedZkTest_1F60B6F6759E2BB3-001
   [junit4]   2> Oct 29, 2015 4:01:29 AM com.carrotsearch.randomizedtesting.ThreadLeakControl checkThreadLeaks
   [junit4]   2> WARNING: Will linger awaiting termination of 2 leaked thread(s).
   [junit4]   2> NOTE: test params are: codec=Asserting(Lucene54): {other_tl1=Lucene50(blocksize=128), range_facet_l_dv=PostingsFormat(name=Asserting), SubjectTerms_mfacet=Lucene50(blocksize=128), n_l1=Lucene50(blocksize=128), multiDefault=PostingsFormat(name=MockRandom), intDefault=Lucene50(blocksize=128), n_td1=PostingsFormat(name=MockRandom), n_d1=Lucene50(blocksize=128), range_facet_l=Lucene50(blocksize=128), n_f1=PostingsFormat(name=MockRandom), n_tl1=PostingsFormat(name=MockRandom), oddField_s=FST50, n_tf1=Lucene50(blocksize=128), a_t=Lucene50(blocksize=128), id=PostingsFormat(name=Asserting), text=FST50, timestamp=Lucene50(blocksize=128), foo_i=PostingsFormat(name=MockRandom), n_dt1=PostingsFormat(name=MockRandom), a_i1=Lucene50(blocksize=128), n_ti1=PostingsFormat(name=Asserting), rnd_b=PostingsFormat(name=Asserting), _version_=Lucene50(blocksize=128), foo_b=FST50, n_tdt1=Lucene50(blocksize=128), foo_d=PostingsFormat(name=Asserting), range_facet_i_dv=Lucene50(blocksize=128), foo_f=FST50}, docValues:{range_facet_l_dv=DocValuesFormat(name=Direct), range_facet_i_dv=DocValuesFormat(name=Lucene54), timestamp=DocValuesFormat(name=Lucene54)}, sim=ClassicSimilarity, locale=fa, timezone=Africa/Asmera
   [junit4]   2> NOTE: Linux 3.19.0-31-generic amd64/Oracle Corporation 1.9.0-ea (64-bit)/cpus=12,threads=1,free=325141768,total=526385152
   [junit4]   2> NOTE: All tests run in this JVM: [AssignTest, AnalysisErrorHandlingTest, AliasIntegrationTest, TestRandomDVFaceting, CursorPagingTest, SimpleCollectionCreateDeleteTest, HdfsBasicDistributedZk2Test, OutputWriterTest, TestSolrXml, TestRTimerTree, DistributedFacetPivotLargeTest, LeaderInitiatedRecoveryOnCommitTest, CurrencyFieldOpenExchangeTest, PathHierarchyTokenizerFactoryTest, PolyFieldTest, TestSchemaResource, BasicDistributedZkTest]
   [junit4] Completed [38/553] on J0 in 25.42s, 1 test, 1 failure <<< FAILURES!

[...truncated 1623 lines...]
BUILD FAILED
/home/jenkins/workspace/Lucene-Solr-trunk-Linux/build.xml:775: The following error occurred while executing this line:
/home/jenkins/workspace/Lucene-Solr-trunk-Linux/build.xml:719: The following error occurred while executing this line:
/home/jenkins/workspace/Lucene-Solr-trunk-Linux/build.xml:59: The following error occurred while executing this line:
/home/jenkins/workspace/Lucene-Solr-trunk-Linux/solr/build.xml:233: The following error occurred while executing this line:
/home/jenkins/workspace/Lucene-Solr-trunk-Linux/solr/common-build.xml:516: The following error occurred while executing this line:
/home/jenkins/workspace/Lucene-Solr-trunk-Linux/lucene/common-build.xml:1432: The following error occurred while executing this line:
/home/jenkins/workspace/Lucene-Solr-trunk-Linux/lucene/common-build.xml:987: There were test failures: 553 suites (8 ignored), 2176 tests, 1 failure, 76 ignored (38 assumptions) [seed: 1F60B6F6759E2BB3]

Total time: 47 minutes 18 seconds
Build step 'Invoke Ant' marked build as failure
Archiving artifacts
[WARNINGS] Skipping publisher since build result is FAILURE
Recording test results
Email was triggered for: Failure - Any
Sending email for trigger: Failure - Any



Mime
View raw message