lucene-dev mailing list archives

Site index · List index
Message view « Date » · « Thread »
Top « Date » · « Thread »
From Policeman Jenkins Server <jenk...@thetaphi.de>
Subject [JENKINS-EA] Lucene-Solr-trunk-Linux (64bit/jdk1.9.0-ea-b85) - Build # 14549 - Still Failing!
Date Fri, 16 Oct 2015 10:50:26 GMT
Build: http://jenkins.thetaphi.de/job/Lucene-Solr-trunk-Linux/14549/
Java: 64bit/jdk1.9.0-ea-b85 -XX:+UseCompressedOops -XX:+UseConcMarkSweepGC

1 tests failed.
FAILED:  org.apache.lucene.codecs.simpletext.TestSimpleTextNormsFormat.testLongRange

Error Message:


Stack Trace:
java.lang.NullPointerException
	at __randomizedtesting.SeedInfo.seed([7185BFF5968EDACF:3317D7E9523C0611]:0)
	at java.util.ComparableTimSort.binarySort(ComparableTimSort.java:262)
	at java.util.ComparableTimSort.sort(ComparableTimSort.java:207)
	at java.util.Arrays.sort(Arrays.java:1247)
	at org.apache.lucene.index.SegmentInfos$FindSegmentsFile.run(SegmentInfos.java:653)
	at org.apache.lucene.index.StandardDirectoryReader.open(StandardDirectoryReader.java:73)
	at org.apache.lucene.index.DirectoryReader.open(DirectoryReader.java:63)
	at org.apache.lucene.index.BaseNormsFormatTestCase.doTestNormsVersusDocValues(BaseNormsFormatTestCase.java:277)
	at org.apache.lucene.index.BaseNormsFormatTestCase.testLongRange(BaseNormsFormatTestCase.java:79)
	at sun.reflect.NativeMethodAccessorImpl.invoke0(Native Method)
	at sun.reflect.NativeMethodAccessorImpl.invoke(NativeMethodAccessorImpl.java:62)
	at sun.reflect.DelegatingMethodAccessorImpl.invoke(DelegatingMethodAccessorImpl.java:43)
	at java.lang.reflect.Method.invoke(Method.java:520)
	at com.carrotsearch.randomizedtesting.RandomizedRunner.invoke(RandomizedRunner.java:1665)
	at com.carrotsearch.randomizedtesting.RandomizedRunner$8.evaluate(RandomizedRunner.java:864)
	at com.carrotsearch.randomizedtesting.RandomizedRunner$9.evaluate(RandomizedRunner.java:900)
	at com.carrotsearch.randomizedtesting.RandomizedRunner$10.evaluate(RandomizedRunner.java:914)
	at org.apache.lucene.util.TestRuleSetupTeardownChained$1.evaluate(TestRuleSetupTeardownChained.java:50)
	at org.apache.lucene.util.AbstractBeforeAfterRule$1.evaluate(AbstractBeforeAfterRule.java:46)
	at org.apache.lucene.util.TestRuleThreadAndTestName$1.evaluate(TestRuleThreadAndTestName.java:49)
	at org.apache.lucene.util.TestRuleIgnoreAfterMaxFailures$1.evaluate(TestRuleIgnoreAfterMaxFailures.java:65)
	at org.apache.lucene.util.TestRuleMarkFailure$1.evaluate(TestRuleMarkFailure.java:48)
	at com.carrotsearch.randomizedtesting.rules.StatementAdapter.evaluate(StatementAdapter.java:36)
	at com.carrotsearch.randomizedtesting.ThreadLeakControl$StatementRunner.run(ThreadLeakControl.java:367)
	at com.carrotsearch.randomizedtesting.ThreadLeakControl.forkTimeoutingTask(ThreadLeakControl.java:809)
	at com.carrotsearch.randomizedtesting.ThreadLeakControl$3.evaluate(ThreadLeakControl.java:460)
	at com.carrotsearch.randomizedtesting.RandomizedRunner.runSingleTest(RandomizedRunner.java:873)
	at com.carrotsearch.randomizedtesting.RandomizedRunner$5.evaluate(RandomizedRunner.java:775)
	at com.carrotsearch.randomizedtesting.RandomizedRunner$6.evaluate(RandomizedRunner.java:809)
	at com.carrotsearch.randomizedtesting.RandomizedRunner$7.evaluate(RandomizedRunner.java:820)
	at org.apache.lucene.util.AbstractBeforeAfterRule$1.evaluate(AbstractBeforeAfterRule.java:46)
	at com.carrotsearch.randomizedtesting.rules.StatementAdapter.evaluate(StatementAdapter.java:36)
	at org.apache.lucene.util.TestRuleStoreClassName$1.evaluate(TestRuleStoreClassName.java:42)
	at com.carrotsearch.randomizedtesting.rules.NoShadowingOrOverridesOnMethodsRule$1.evaluate(NoShadowingOrOverridesOnMethodsRule.java:39)
	at com.carrotsearch.randomizedtesting.rules.NoShadowingOrOverridesOnMethodsRule$1.evaluate(NoShadowingOrOverridesOnMethodsRule.java:39)
	at com.carrotsearch.randomizedtesting.rules.StatementAdapter.evaluate(StatementAdapter.java:36)
	at com.carrotsearch.randomizedtesting.rules.StatementAdapter.evaluate(StatementAdapter.java:36)
	at com.carrotsearch.randomizedtesting.rules.StatementAdapter.evaluate(StatementAdapter.java:36)
	at org.apache.lucene.util.TestRuleAssertionsRequired$1.evaluate(TestRuleAssertionsRequired.java:54)
	at org.apache.lucene.util.TestRuleMarkFailure$1.evaluate(TestRuleMarkFailure.java:48)
	at org.apache.lucene.util.TestRuleIgnoreAfterMaxFailures$1.evaluate(TestRuleIgnoreAfterMaxFailures.java:65)
	at org.apache.lucene.util.TestRuleIgnoreTestSuites$1.evaluate(TestRuleIgnoreTestSuites.java:55)
	at com.carrotsearch.randomizedtesting.rules.StatementAdapter.evaluate(StatementAdapter.java:36)
	at com.carrotsearch.randomizedtesting.ThreadLeakControl$StatementRunner.run(ThreadLeakControl.java:367)
	at java.lang.Thread.run(Thread.java:747)




Build Log:
[...truncated 5579 lines...]
   [junit4] Suite: org.apache.lucene.codecs.simpletext.TestSimpleTextNormsFormat
   [junit4] IGNOR/A 0.05s J0 | TestSimpleTextNormsFormat.testNCommonBig
   [junit4]    > Assumption #1: 'nightly' test group is disabled (@Nightly())
   [junit4]   2> NOTE: reproduce with: ant test  -Dtestcase=TestSimpleTextNormsFormat -Dtests.method=testLongRange
-Dtests.seed=7185BFF5968EDACF -Dtests.multiplier=3 -Dtests.slow=true -Dtests.locale=teo_KE
-Dtests.timezone=Africa/Addis_Ababa -Dtests.asserts=true -Dtests.file.encoding=UTF-8
   [junit4] ERROR   1.93s J0 | TestSimpleTextNormsFormat.testLongRange <<<
   [junit4]    > Throwable #1: java.lang.NullPointerException
   [junit4]    > 	at __randomizedtesting.SeedInfo.seed([7185BFF5968EDACF:3317D7E9523C0611]:0)
   [junit4]    > 	at java.util.ComparableTimSort.binarySort(ComparableTimSort.java:262)
   [junit4]    > 	at java.util.ComparableTimSort.sort(ComparableTimSort.java:207)
   [junit4]    > 	at java.util.Arrays.sort(Arrays.java:1247)
   [junit4]    > 	at org.apache.lucene.index.SegmentInfos$FindSegmentsFile.run(SegmentInfos.java:653)
   [junit4]    > 	at org.apache.lucene.index.StandardDirectoryReader.open(StandardDirectoryReader.java:73)
   [junit4]    > 	at org.apache.lucene.index.DirectoryReader.open(DirectoryReader.java:63)
   [junit4]    > 	at org.apache.lucene.index.BaseNormsFormatTestCase.doTestNormsVersusDocValues(BaseNormsFormatTestCase.java:277)
   [junit4]    > 	at org.apache.lucene.index.BaseNormsFormatTestCase.testLongRange(BaseNormsFormatTestCase.java:79)
   [junit4]    > 	at java.lang.Thread.run(Thread.java:747)
   [junit4] IGNOR/A 0.00s J0 | TestSimpleTextNormsFormat.testMergeStability
   [junit4]    > Assumption #1: The MockRandom PF randomizes content on the fly, so we
can't check it
   [junit4]   2> NOTE: leaving temporary files on disk at: /home/jenkins/workspace/Lucene-Solr-trunk-Linux/lucene/build/codecs/test/J0/temp/lucene.codecs.simpletext.TestSimpleTextNormsFormat_7185BFF5968EDACF-001
   [junit4]   2> NOTE: test params are: codec=Asserting(Lucene53): {}, docValues:{}, sim=RandomSimilarityProvider(queryNorm=false,coord=yes):
{foobar=DFR I(F)LZ(0.3), content=DFR G2}, locale=teo_KE, timezone=Africa/Addis_Ababa
   [junit4]   2> NOTE: Linux 3.19.0-30-generic amd64/Oracle Corporation 1.9.0-ea (64-bit)/cpus=12,threads=1,free=399395528,total=508887040
   [junit4]   2> NOTE: All tests run in this JVM: [TestMemoryDocValuesFormat, TestSimpleTextCompoundFormat,
TestSimpleTextNormsFormat]
   [junit4] Completed [11/21] on J0 in 18.15s, 17 tests, 1 error, 2 skipped <<< FAILURES!

[...truncated 44 lines...]
BUILD FAILED
/home/jenkins/workspace/Lucene-Solr-trunk-Linux/build.xml:775: The following error occurred
while executing this line:
/home/jenkins/workspace/Lucene-Solr-trunk-Linux/build.xml:719: The following error occurred
while executing this line:
/home/jenkins/workspace/Lucene-Solr-trunk-Linux/build.xml:59: The following error occurred
while executing this line:
/home/jenkins/workspace/Lucene-Solr-trunk-Linux/lucene/build.xml:471: The following error
occurred while executing this line:
/home/jenkins/workspace/Lucene-Solr-trunk-Linux/lucene/common-build.xml:2162: The following
error occurred while executing this line:
/home/jenkins/workspace/Lucene-Solr-trunk-Linux/lucene/module-build.xml:58: The following
error occurred while executing this line:
/home/jenkins/workspace/Lucene-Solr-trunk-Linux/lucene/common-build.xml:1432: The following
error occurred while executing this line:
/home/jenkins/workspace/Lucene-Solr-trunk-Linux/lucene/common-build.xml:987: There were test
failures: 21 suites, 631 tests, 1 error, 27 ignored (27 assumptions) [seed: 7185BFF5968EDACF]

Total time: 13 minutes 9 seconds
Build step 'Invoke Ant' marked build as failure
Archiving artifacts
[WARNINGS] Skipping publisher since build result is FAILURE
Recording test results
Email was triggered for: Failure - Any
Sending email for trigger: Failure - Any



Mime
View raw message