lucene-dev mailing list archives

Site index · List index
Message view « Date » · « Thread »
Top « Date » · « Thread »
From Apache Jenkins Server <jenk...@builds.apache.org>
Subject [JENKINS] Lucene-Solr-Tests-5.x-Java7 - Build # 3575 - Failure
Date Sat, 03 Oct 2015 13:56:00 GMT
Build: https://builds.apache.org/job/Lucene-Solr-Tests-5.x-Java7/3575/

1 tests failed.
FAILED:  org.apache.solr.cloud.HttpPartitionTest.test

Error Message:
Doc with id=2 not found in http://127.0.0.1:42002/c8n_1x2_leader_session_loss due to: Path not found: /id; rsp={doc=null}

Stack Trace:
java.lang.AssertionError: Doc with id=2 not found in http://127.0.0.1:42002/c8n_1x2_leader_session_loss due to: Path not found: /id; rsp={doc=null}
	at __randomizedtesting.SeedInfo.seed([CFCD65694B24B9AA:47995AB3E5D8D452]:0)
	at org.junit.Assert.fail(Assert.java:93)
	at org.junit.Assert.assertTrue(Assert.java:43)
	at org.apache.solr.cloud.HttpPartitionTest.assertDocExists(HttpPartitionTest.java:622)
	at org.apache.solr.cloud.HttpPartitionTest.assertDocsExistInAllReplicas(HttpPartitionTest.java:577)
	at org.apache.solr.cloud.HttpPartitionTest.testLeaderZkSessionLoss(HttpPartitionTest.java:525)
	at org.apache.solr.cloud.HttpPartitionTest.test(HttpPartitionTest.java:121)
	at sun.reflect.NativeMethodAccessorImpl.invoke0(Native Method)
	at sun.reflect.NativeMethodAccessorImpl.invoke(NativeMethodAccessorImpl.java:57)
	at sun.reflect.DelegatingMethodAccessorImpl.invoke(DelegatingMethodAccessorImpl.java:43)
	at java.lang.reflect.Method.invoke(Method.java:606)
	at com.carrotsearch.randomizedtesting.RandomizedRunner.invoke(RandomizedRunner.java:1665)
	at com.carrotsearch.randomizedtesting.RandomizedRunner$8.evaluate(RandomizedRunner.java:864)
	at com.carrotsearch.randomizedtesting.RandomizedRunner$9.evaluate(RandomizedRunner.java:900)
	at com.carrotsearch.randomizedtesting.RandomizedRunner$10.evaluate(RandomizedRunner.java:914)
	at org.apache.solr.BaseDistributedSearchTestCase$ShardsRepeatRule$ShardsFixedStatement.callStatement(BaseDistributedSearchTestCase.java:963)
	at org.apache.solr.BaseDistributedSearchTestCase$ShardsRepeatRule$ShardsStatement.evaluate(BaseDistributedSearchTestCase.java:938)
	at com.carrotsearch.randomizedtesting.rules.SystemPropertiesRestoreRule$1.evaluate(SystemPropertiesRestoreRule.java:57)
	at org.apache.lucene.util.TestRuleSetupTeardownChained$1.evaluate(TestRuleSetupTeardownChained.java:50)
	at org.apache.lucene.util.AbstractBeforeAfterRule$1.evaluate(AbstractBeforeAfterRule.java:46)
	at org.apache.lucene.util.TestRuleThreadAndTestName$1.evaluate(TestRuleThreadAndTestName.java:49)
	at org.apache.lucene.util.TestRuleIgnoreAfterMaxFailures$1.evaluate(TestRuleIgnoreAfterMaxFailures.java:65)
	at org.apache.lucene.util.TestRuleMarkFailure$1.evaluate(TestRuleMarkFailure.java:48)
	at com.carrotsearch.randomizedtesting.rules.StatementAdapter.evaluate(StatementAdapter.java:36)
	at com.carrotsearch.randomizedtesting.ThreadLeakControl$StatementRunner.run(ThreadLeakControl.java:367)
	at com.carrotsearch.randomizedtesting.ThreadLeakControl.forkTimeoutingTask(ThreadLeakControl.java:809)
	at com.carrotsearch.randomizedtesting.ThreadLeakControl$3.evaluate(ThreadLeakControl.java:460)
	at com.carrotsearch.randomizedtesting.RandomizedRunner.runSingleTest(RandomizedRunner.java:873)
	at com.carrotsearch.randomizedtesting.RandomizedRunner$5.evaluate(RandomizedRunner.java:775)
	at com.carrotsearch.randomizedtesting.RandomizedRunner$6.evaluate(RandomizedRunner.java:809)
	at com.carrotsearch.randomizedtesting.RandomizedRunner$7.evaluate(RandomizedRunner.java:820)
	at com.carrotsearch.randomizedtesting.rules.StatementAdapter.evaluate(StatementAdapter.java:36)
	at com.carrotsearch.randomizedtesting.rules.SystemPropertiesRestoreRule$1.evaluate(SystemPropertiesRestoreRule.java:57)
	at org.apache.lucene.util.AbstractBeforeAfterRule$1.evaluate(AbstractBeforeAfterRule.java:46)
	at com.carrotsearch.randomizedtesting.rules.StatementAdapter.evaluate(StatementAdapter.java:36)
	at org.apache.lucene.util.TestRuleStoreClassName$1.evaluate(TestRuleStoreClassName.java:42)
	at com.carrotsearch.randomizedtesting.rules.NoShadowingOrOverridesOnMethodsRule$1.evaluate(NoShadowingOrOverridesOnMethodsRule.java:39)
	at com.carrotsearch.randomizedtesting.rules.NoShadowingOrOverridesOnMethodsRule$1.evaluate(NoShadowingOrOverridesOnMethodsRule.java:39)
	at com.carrotsearch.randomizedtesting.rules.StatementAdapter.evaluate(StatementAdapter.java:36)
	at com.carrotsearch.randomizedtesting.rules.StatementAdapter.evaluate(StatementAdapter.java:36)
	at com.carrotsearch.randomizedtesting.rules.StatementAdapter.evaluate(StatementAdapter.java:36)
	at org.apache.lucene.util.TestRuleAssertionsRequired$1.evaluate(TestRuleAssertionsRequired.java:54)
	at org.apache.lucene.util.TestRuleMarkFailure$1.evaluate(TestRuleMarkFailure.java:48)
	at org.apache.lucene.util.TestRuleIgnoreAfterMaxFailures$1.evaluate(TestRuleIgnoreAfterMaxFailures.java:65)
	at org.apache.lucene.util.TestRuleIgnoreTestSuites$1.evaluate(TestRuleIgnoreTestSuites.java:55)
	at com.carrotsearch.randomizedtesting.rules.StatementAdapter.evaluate(StatementAdapter.java:36)
	at com.carrotsearch.randomizedtesting.ThreadLeakControl$StatementRunner.run(ThreadLeakControl.java:367)
	at java.lang.Thread.run(Thread.java:745)




Build Log:
[...truncated 10133 lines...]
   [junit4] Suite: org.apache.solr.cloud.HttpPartitionTest
   [junit4]   2> Creating dataDir: /x1/jenkins/jenkins-slave/workspace/Lucene-Solr-Tests-5.x-Java7/solr/build/solr-core/test/J1/temp/solr.cloud.HttpPartitionTest_CFCD65694B24B9AA-001/init-core-data-001
   [junit4]   2> 528206 INFO  (SUITE-HttpPartitionTest-seed#[CFCD65694B24B9AA]-worker) [    ] o.a.s.BaseDistributedSearchTestCase Setting hostContext system property: /
   [junit4]   2> 528211 INFO  (TEST-HttpPartitionTest.test-seed#[CFCD65694B24B9AA]) [    ] o.a.s.c.ZkTestServer STARTING ZK TEST SERVER
   [junit4]   2> 528211 INFO  (Thread-901) [    ] o.a.s.c.ZkTestServer client port:0.0.0.0/0.0.0.0:0
   [junit4]   2> 528211 INFO  (Thread-901) [    ] o.a.s.c.ZkTestServer Starting server
   [junit4]   2> 528311 INFO  (TEST-HttpPartitionTest.test-seed#[CFCD65694B24B9AA]) [    ] o.a.s.c.ZkTestServer start zk server on port:47412
   [junit4]   2> 528311 INFO  (TEST-HttpPartitionTest.test-seed#[CFCD65694B24B9AA]) [    ] o.a.s.c.c.SolrZkClient Using default ZkCredentialsProvider
   [junit4]   2> 528312 INFO  (TEST-HttpPartitionTest.test-seed#[CFCD65694B24B9AA]) [    ] o.a.s.c.c.ConnectionManager Waiting for client to connect to ZooKeeper
   [junit4]   2> 528315 INFO  (zkCallback-291-thread-1) [    ] o.a.s.c.c.ConnectionManager Watcher org.apache.solr.common.cloud.ConnectionManager@5e11e71f name:ZooKeeperConnection Watcher:127.0.0.1:47412 got event WatchedEvent state:SyncConnected type:None path:null path:null type:None
   [junit4]   2> 528315 INFO  (TEST-HttpPartitionTest.test-seed#[CFCD65694B24B9AA]) [    ] o.a.s.c.c.ConnectionManager Client is connected to ZooKeeper
   [junit4]   2> 528315 INFO  (TEST-HttpPartitionTest.test-seed#[CFCD65694B24B9AA]) [    ] o.a.s.c.c.SolrZkClient Using default ZkACLProvider
   [junit4]   2> 528315 INFO  (TEST-HttpPartitionTest.test-seed#[CFCD65694B24B9AA]) [    ] o.a.s.c.c.SolrZkClient makePath: /solr
   [junit4]   2> 528319 INFO  (TEST-HttpPartitionTest.test-seed#[CFCD65694B24B9AA]) [    ] o.a.s.c.c.SolrZkClient Using default ZkCredentialsProvider
   [junit4]   2> 528320 INFO  (TEST-HttpPartitionTest.test-seed#[CFCD65694B24B9AA]) [    ] o.a.s.c.c.ConnectionManager Waiting for client to connect to ZooKeeper
   [junit4]   2> 528321 INFO  (zkCallback-292-thread-1) [    ] o.a.s.c.c.ConnectionManager Watcher org.apache.solr.common.cloud.ConnectionManager@2a435d5e name:ZooKeeperConnection Watcher:127.0.0.1:47412/solr got event WatchedEvent state:SyncConnected type:None path:null path:null type:None
   [junit4]   2> 528321 INFO  (TEST-HttpPartitionTest.test-seed#[CFCD65694B24B9AA]) [    ] o.a.s.c.c.ConnectionManager Client is connected to ZooKeeper
   [junit4]   2> 528321 INFO  (TEST-HttpPartitionTest.test-seed#[CFCD65694B24B9AA]) [    ] o.a.s.c.c.SolrZkClient Using default ZkACLProvider
   [junit4]   2> 528321 INFO  (TEST-HttpPartitionTest.test-seed#[CFCD65694B24B9AA]) [    ] o.a.s.c.c.SolrZkClient makePath: /collections/collection1
   [junit4]   2> 528324 INFO  (TEST-HttpPartitionTest.test-seed#[CFCD65694B24B9AA]) [    ] o.a.s.c.c.SolrZkClient makePath: /collections/collection1/shards
   [junit4]   2> 528325 INFO  (TEST-HttpPartitionTest.test-seed#[CFCD65694B24B9AA]) [    ] o.a.s.c.c.SolrZkClient makePath: /collections/control_collection
   [junit4]   2> 528326 INFO  (TEST-HttpPartitionTest.test-seed#[CFCD65694B24B9AA]) [    ] o.a.s.c.c.SolrZkClient makePath: /collections/control_collection/shards
   [junit4]   2> 528328 INFO  (TEST-HttpPartitionTest.test-seed#[CFCD65694B24B9AA]) [    ] o.a.s.c.AbstractZkTestCase put /x1/jenkins/jenkins-slave/workspace/Lucene-Solr-Tests-5.x-Java7/solr/core/src/test-files/solr/collection1/conf/solrconfig-tlog.xml to /configs/conf1/solrconfig.xml
   [junit4]   2> 528328 INFO  (TEST-HttpPartitionTest.test-seed#[CFCD65694B24B9AA]) [    ] o.a.s.c.c.SolrZkClient makePath: /configs/conf1/solrconfig.xml
   [junit4]   2> 528330 INFO  (TEST-HttpPartitionTest.test-seed#[CFCD65694B24B9AA]) [    ] o.a.s.c.AbstractZkTestCase put /x1/jenkins/jenkins-slave/workspace/Lucene-Solr-Tests-5.x-Java7/solr/core/src/test-files/solr/collection1/conf/schema.xml to /configs/conf1/schema.xml
   [junit4]   2> 528330 INFO  (TEST-HttpPartitionTest.test-seed#[CFCD65694B24B9AA]) [    ] o.a.s.c.c.SolrZkClient makePath: /configs/conf1/schema.xml
   [junit4]   2> 528332 INFO  (TEST-HttpPartitionTest.test-seed#[CFCD65694B24B9AA]) [    ] o.a.s.c.AbstractZkTestCase put /x1/jenkins/jenkins-slave/workspace/Lucene-Solr-Tests-5.x-Java7/solr/core/src/test-files/solr/collection1/conf/solrconfig.snippet.randomindexconfig.xml to /configs/conf1/solrconfig.snippet.randomindexconfig.xml
   [junit4]   2> 528332 INFO  (TEST-HttpPartitionTest.test-seed#[CFCD65694B24B9AA]) [    ] o.a.s.c.c.SolrZkClient makePath: /configs/conf1/solrconfig.snippet.randomindexconfig.xml
   [junit4]   2> 528334 INFO  (TEST-HttpPartitionTest.test-seed#[CFCD65694B24B9AA]) [    ] o.a.s.c.AbstractZkTestCase put /x1/jenkins/jenkins-slave/workspace/Lucene-Solr-Tests-5.x-Java7/solr/core/src/test-files/solr/collection1/conf/stopwords.txt to /configs/conf1/stopwords.txt
   [junit4]   2> 528334 INFO  (TEST-HttpPartitionTest.test-seed#[CFCD65694B24B9AA]) [    ] o.a.s.c.c.SolrZkClient makePath: /configs/conf1/stopwords.txt
   [junit4]   2> 528335 INFO  (TEST-HttpPartitionTest.test-seed#[CFCD65694B24B9AA]) [    ] o.a.s.c.AbstractZkTestCase put /x1/jenkins/jenkins-slave/workspace/Lucene-Solr-Tests-5.x-Java7/solr/core/src/test-files/solr/collection1/conf/protwords.txt to /configs/conf1/protwords.txt
   [junit4]   2> 528335 INFO  (TEST-HttpPartitionTest.test-seed#[CFCD65694B24B9AA]) [    ] o.a.s.c.c.SolrZkClient makePath: /configs/conf1/protwords.txt
   [junit4]   2> 528337 INFO  (TEST-HttpPartitionTest.test-seed#[CFCD65694B24B9AA]) [    ] o.a.s.c.AbstractZkTestCase put /x1/jenkins/jenkins-slave/workspace/Lucene-Solr-Tests-5.x-Java7/solr/core/src/test-files/solr/collection1/conf/currency.xml to /configs/conf1/currency.xml
   [junit4]   2> 528337 INFO  (TEST-HttpPartitionTest.test-seed#[CFCD65694B24B9AA]) [    ] o.a.s.c.c.SolrZkClient makePath: /configs/conf1/currency.xml
   [junit4]   2> 528338 INFO  (TEST-HttpPartitionTest.test-seed#[CFCD65694B24B9AA]) [    ] o.a.s.c.AbstractZkTestCase put /x1/jenkins/jenkins-slave/workspace/Lucene-Solr-Tests-5.x-Java7/solr/core/src/test-files/solr/collection1/conf/enumsConfig.xml to /configs/conf1/enumsConfig.xml
   [junit4]   2> 528339 INFO  (TEST-HttpPartitionTest.test-seed#[CFCD65694B24B9AA]) [    ] o.a.s.c.c.SolrZkClient makePath: /configs/conf1/enumsConfig.xml
   [junit4]   2> 528340 INFO  (TEST-HttpPartitionTest.test-seed#[CFCD65694B24B9AA]) [    ] o.a.s.c.AbstractZkTestCase put /x1/jenkins/jenkins-slave/workspace/Lucene-Solr-Tests-5.x-Java7/solr/core/src/test-files/solr/collection1/conf/open-exchange-rates.json to /configs/conf1/open-exchange-rates.json
   [junit4]   2> 528340 INFO  (TEST-HttpPartitionTest.test-seed#[CFCD65694B24B9AA]) [    ] o.a.s.c.c.SolrZkClient makePath: /configs/conf1/open-exchange-rates.json
   [junit4]   2> 528341 INFO  (TEST-HttpPartitionTest.test-seed#[CFCD65694B24B9AA]) [    ] o.a.s.c.AbstractZkTestCase put /x1/jenkins/jenkins-slave/workspace/Lucene-Solr-Tests-5.x-Java7/solr/core/src/test-files/solr/collection1/conf/mapping-ISOLatin1Accent.txt to /configs/conf1/mapping-ISOLatin1Accent.txt
   [junit4]   2> 528342 INFO  (TEST-HttpPartitionTest.test-seed#[CFCD65694B24B9AA]) [    ] o.a.s.c.c.SolrZkClient makePath: /configs/conf1/mapping-ISOLatin1Accent.txt
   [junit4]   2> 528343 INFO  (TEST-HttpPartitionTest.test-seed#[CFCD65694B24B9AA]) [    ] o.a.s.c.AbstractZkTestCase put /x1/jenkins/jenkins-slave/workspace/Lucene-Solr-Tests-5.x-Java7/solr/core/src/test-files/solr/collection1/conf/old_synonyms.txt to /configs/conf1/old_synonyms.txt
   [junit4]   2> 528343 INFO  (TEST-HttpPartitionTest.test-seed#[CFCD65694B24B9AA]) [    ] o.a.s.c.c.SolrZkClient makePath: /configs/conf1/old_synonyms.txt
   [junit4]   2> 528345 INFO  (TEST-HttpPartitionTest.test-seed#[CFCD65694B24B9AA]) [    ] o.a.s.c.AbstractZkTestCase put /x1/jenkins/jenkins-slave/workspace/Lucene-Solr-Tests-5.x-Java7/solr/core/src/test-files/solr/collection1/conf/synonyms.txt to /configs/conf1/synonyms.txt
   [junit4]   2> 528345 INFO  (TEST-HttpPartitionTest.test-seed#[CFCD65694B24B9AA]) [    ] o.a.s.c.c.SolrZkClient makePath: /configs/conf1/synonyms.txt
   [junit4]   2> 528636 INFO  (TEST-HttpPartitionTest.test-seed#[CFCD65694B24B9AA]) [    ] o.a.s.SolrTestCaseJ4 Writing core.properties file to /x1/jenkins/jenkins-slave/workspace/Lucene-Solr-Tests-5.x-Java7/solr/build/solr-core/test/J1/temp/solr.cloud.HttpPartitionTest_CFCD65694B24B9AA-001/control-001/cores/collection1
   [junit4]   2> 528638 INFO  (TEST-HttpPartitionTest.test-seed#[CFCD65694B24B9AA]) [    ] o.e.j.s.Server jetty-9.2.13.v20150730
   [junit4]   2> 528640 INFO  (TEST-HttpPartitionTest.test-seed#[CFCD65694B24B9AA]) [    ] o.e.j.s.h.ContextHandler Started o.e.j.s.ServletContextHandler@6e52578c{/,null,AVAILABLE}
   [junit4]   2> 528641 INFO  (TEST-HttpPartitionTest.test-seed#[CFCD65694B24B9AA]) [    ] o.e.j.s.ServerConnector Started ServerConnector@5bcede2a{HTTP/1.1}{127.0.0.1:53698}
   [junit4]   2> 528642 INFO  (TEST-HttpPartitionTest.test-seed#[CFCD65694B24B9AA]) [    ] o.e.j.s.Server Started @531859ms
   [junit4]   2> 528642 INFO  (TEST-HttpPartitionTest.test-seed#[CFCD65694B24B9AA]) [    ] o.a.s.c.s.e.JettySolrRunner Jetty properties: {hostPort=42002, coreRootDirectory=/x1/jenkins/jenkins-slave/workspace/Lucene-Solr-Tests-5.x-Java7/solr/build/solr-core/test/J1/temp/solr.cloud.HttpPartitionTest_CFCD65694B24B9AA-001/control-001/cores, solr.data.dir=/x1/jenkins/jenkins-slave/workspace/Lucene-Solr-Tests-5.x-Java7/solr/build/solr-core/test/J1/temp/solr.cloud.HttpPartitionTest_CFCD65694B24B9AA-001/tempDir-001/control/data, hostContext=/}
   [junit4]   2> 528642 INFO  (TEST-HttpPartitionTest.test-seed#[CFCD65694B24B9AA]) [    ] o.a.s.s.SolrDispatchFilter SolrDispatchFilter.init(): sun.misc.Launcher$AppClassLoader@6b482747
   [junit4]   2> 528642 INFO  (TEST-HttpPartitionTest.test-seed#[CFCD65694B24B9AA]) [    ] o.a.s.c.SolrResourceLoader new SolrResourceLoader for directory: '/x1/jenkins/jenkins-slave/workspace/Lucene-Solr-Tests-5.x-Java7/solr/build/solr-core/test/J1/temp/solr.cloud.HttpPartitionTest_CFCD65694B24B9AA-001/control-001/'
   [junit4]   2> 528658 INFO  (TEST-HttpPartitionTest.test-seed#[CFCD65694B24B9AA]) [    ] o.a.s.c.c.SolrZkClient Using default ZkCredentialsProvider
   [junit4]   2> 528658 INFO  (TEST-HttpPartitionTest.test-seed#[CFCD65694B24B9AA]) [    ] o.a.s.c.c.ConnectionManager Waiting for client to connect to ZooKeeper
   [junit4]   2> 528660 INFO  (zkCallback-293-thread-1) [    ] o.a.s.c.c.ConnectionManager Watcher org.apache.solr.common.cloud.ConnectionManager@7e23af27 name:ZooKeeperConnection Watcher:127.0.0.1:47412/solr got event WatchedEvent state:SyncConnected type:None path:null path:null type:None
   [junit4]   2> 528660 INFO  (TEST-HttpPartitionTest.test-seed#[CFCD65694B24B9AA]) [    ] o.a.s.c.c.ConnectionManager Client is connected to ZooKeeper
   [junit4]   2> 528660 INFO  (TEST-HttpPartitionTest.test-seed#[CFCD65694B24B9AA]) [    ] o.a.s.c.c.SolrZkClient Using default ZkACLProvider
   [junit4]   2> 528662 INFO  (TEST-HttpPartitionTest.test-seed#[CFCD65694B24B9AA]) [    ] o.a.s.s.SolrDispatchFilter Loading solr.xml from SolrHome (not found in ZooKeeper)
   [junit4]   2> 528662 INFO  (TEST-HttpPartitionTest.test-seed#[CFCD65694B24B9AA]) [    ] o.a.s.c.SolrXmlConfig Loading container configuration from /x1/jenkins/jenkins-slave/workspace/Lucene-Solr-Tests-5.x-Java7/solr/build/solr-core/test/J1/temp/solr.cloud.HttpPartitionTest_CFCD65694B24B9AA-001/control-001/solr.xml
   [junit4]   2> 528675 INFO  (TEST-HttpPartitionTest.test-seed#[CFCD65694B24B9AA]) [    ] o.a.s.c.CoresLocator Config-defined core root directory: /x1/jenkins/jenkins-slave/workspace/Lucene-Solr-Tests-5.x-Java7/solr/build/solr-core/test/J1/temp/solr.cloud.HttpPartitionTest_CFCD65694B24B9AA-001/control-001/cores
   [junit4]   2> 528676 INFO  (TEST-HttpPartitionTest.test-seed#[CFCD65694B24B9AA]) [    ] o.a.s.c.CoreContainer New CoreContainer 1730634162
   [junit4]   2> 528676 INFO  (TEST-HttpPartitionTest.test-seed#[CFCD65694B24B9AA]) [    ] o.a.s.c.CoreContainer Loading cores into CoreContainer [instanceDir=/x1/jenkins/jenkins-slave/workspace/Lucene-Solr-Tests-5.x-Java7/solr/build/solr-core/test/J1/temp/solr.cloud.HttpPartitionTest_CFCD65694B24B9AA-001/control-001/]
   [junit4]   2> 528676 INFO  (TEST-HttpPartitionTest.test-seed#[CFCD65694B24B9AA]) [    ] o.a.s.c.CoreContainer loading shared library: /x1/jenkins/jenkins-slave/workspace/Lucene-Solr-Tests-5.x-Java7/solr/build/solr-core/test/J1/temp/solr.cloud.HttpPartitionTest_CFCD65694B24B9AA-001/control-001/lib
   [junit4]   2> 528676 WARN  (TEST-HttpPartitionTest.test-seed#[CFCD65694B24B9AA]) [    ] o.a.s.c.SolrResourceLoader Can't find (or read) directory to add to classloader: lib (resolved as: /x1/jenkins/jenkins-slave/workspace/Lucene-Solr-Tests-5.x-Java7/solr/build/solr-core/test/J1/temp/solr.cloud.HttpPartitionTest_CFCD65694B24B9AA-001/control-001/lib).
   [junit4]   2> 528683 INFO  (TEST-HttpPartitionTest.test-seed#[CFCD65694B24B9AA]) [    ] o.a.s.h.c.HttpShardHandlerFactory created with socketTimeout : 90000,urlScheme : ,connTimeout : 15000,maxConnectionsPerHost : 20,maxConnections : 10000,corePoolSize : 0,maximumPoolSize : 2147483647,maxThreadIdleTime : 5,sizeOfQueue : -1,fairnessPolicy : false,useRetries : false,
   [junit4]   2> 528684 INFO  (TEST-HttpPartitionTest.test-seed#[CFCD65694B24B9AA]) [    ] o.a.s.u.UpdateShardHandler Creating UpdateShardHandler HTTP client with params: socketTimeout=340000&connTimeout=45000&retry=true
   [junit4]   2> 528685 INFO  (TEST-HttpPartitionTest.test-seed#[CFCD65694B24B9AA]) [    ] o.a.s.l.LogWatcher SLF4J impl is org.slf4j.impl.Log4jLoggerFactory
   [junit4]   2> 528685 INFO  (TEST-HttpPartitionTest.test-seed#[CFCD65694B24B9AA]) [    ] o.a.s.l.LogWatcher Registering Log Listener [Log4j (org.slf4j.impl.Log4jLoggerFactory)]
   [junit4]   2> 528685 INFO  (TEST-HttpPartitionTest.test-seed#[CFCD65694B24B9AA]) [    ] o.a.s.c.ZkContainer Zookeeper client=127.0.0.1:47412/solr
   [junit4]   2> 528685 INFO  (TEST-HttpPartitionTest.test-seed#[CFCD65694B24B9AA]) [    ] o.a.s.c.ZkController zkHost includes chroot
   [junit4]   2> 528685 INFO  (TEST-HttpPartitionTest.test-seed#[CFCD65694B24B9AA]) [    ] o.a.s.c.c.SolrZkClient Using default ZkCredentialsProvider
   [junit4]   2> 528685 INFO  (TEST-HttpPartitionTest.test-seed#[CFCD65694B24B9AA]) [    ] o.a.s.c.c.ConnectionManager Waiting for client to connect to ZooKeeper
   [junit4]   2> 528687 INFO  (zkCallback-295-thread-1) [    ] o.a.s.c.c.ConnectionManager Watcher org.apache.solr.common.cloud.ConnectionManager@32e61b3e name:ZooKeeperConnection Watcher:127.0.0.1:47412 got event WatchedEvent state:SyncConnected type:None path:null path:null type:None
   [junit4]   2> 528687 INFO  (TEST-HttpPartitionTest.test-seed#[CFCD65694B24B9AA]) [    ] o.a.s.c.c.ConnectionManager Client is connected to ZooKeeper
   [junit4]   2> 528688 INFO  (TEST-HttpPartitionTest.test-seed#[CFCD65694B24B9AA]) [    ] o.a.s.c.c.SolrZkClient Using default ZkACLProvider
   [junit4]   2> 528690 INFO  (TEST-HttpPartitionTest.test-seed#[CFCD65694B24B9AA]) [n:127.0.0.1:42002_    ] o.a.s.c.c.ConnectionManager Waiting for client to connect to ZooKeeper
   [junit4]   2> 528691 INFO  (zkCallback-296-thread-1-processing-n:127.0.0.1:42002_) [n:127.0.0.1:42002_    ] o.a.s.c.c.ConnectionManager Watcher org.apache.solr.common.cloud.ConnectionManager@3347ecf7 name:ZooKeeperConnection Watcher:127.0.0.1:47412/solr got event WatchedEvent state:SyncConnected type:None path:null path:null type:None
   [junit4]   2> 528691 INFO  (TEST-HttpPartitionTest.test-seed#[CFCD65694B24B9AA]) [n:127.0.0.1:42002_    ] o.a.s.c.c.ConnectionManager Client is connected to ZooKeeper
   [junit4]   2> 528692 INFO  (TEST-HttpPartitionTest.test-seed#[CFCD65694B24B9AA]) [n:127.0.0.1:42002_    ] o.a.s.c.c.SolrZkClient makePath: /overseer/queue
   [junit4]   2> 528694 INFO  (TEST-HttpPartitionTest.test-seed#[CFCD65694B24B9AA]) [n:127.0.0.1:42002_    ] o.a.s.c.c.SolrZkClient makePath: /overseer/collection-queue-work
   [junit4]   2> 528697 INFO  (TEST-HttpPartitionTest.test-seed#[CFCD65694B24B9AA]) [n:127.0.0.1:42002_    ] o.a.s.c.c.SolrZkClient makePath: /overseer/collection-map-running
   [junit4]   2> 528699 INFO  (TEST-HttpPartitionTest.test-seed#[CFCD65694B24B9AA]) [n:127.0.0.1:42002_    ] o.a.s.c.c.SolrZkClient makePath: /overseer/collection-map-completed
   [junit4]   2> 528701 INFO  (TEST-HttpPartitionTest.test-seed#[CFCD65694B24B9AA]) [n:127.0.0.1:42002_    ] o.a.s.c.c.SolrZkClient makePath: /overseer/collection-map-failure
   [junit4]   2> 528703 INFO  (TEST-HttpPartitionTest.test-seed#[CFCD65694B24B9AA]) [n:127.0.0.1:42002_    ] o.a.s.c.c.SolrZkClient makePath: /live_nodes
   [junit4]   2> 528704 INFO  (TEST-HttpPartitionTest.test-seed#[CFCD65694B24B9AA]) [n:127.0.0.1:42002_    ] o.a.s.c.c.SolrZkClient makePath: /aliases.json
   [junit4]   2> 528705 INFO  (TEST-HttpPartitionTest.test-seed#[CFCD65694B24B9AA]) [n:127.0.0.1:42002_    ] o.a.s.c.c.SolrZkClient makePath: /clusterstate.json
   [junit4]   2> 528706 INFO  (TEST-HttpPartitionTest.test-seed#[CFCD65694B24B9AA]) [n:127.0.0.1:42002_    ] o.a.s.c.c.SolrZkClient makePath: /security.json
   [junit4]   2> 528707 INFO  (TEST-HttpPartitionTest.test-seed#[CFCD65694B24B9AA]) [n:127.0.0.1:42002_    ] o.a.s.c.ZkController Register node as live in ZooKeeper:/live_nodes/127.0.0.1:42002_
   [junit4]   2> 528708 INFO  (TEST-HttpPartitionTest.test-seed#[CFCD65694B24B9AA]) [n:127.0.0.1:42002_    ] o.a.s.c.c.SolrZkClient makePath: /live_nodes/127.0.0.1:42002_
   [junit4]   2> 528709 INFO  (TEST-HttpPartitionTest.test-seed#[CFCD65694B24B9AA]) [n:127.0.0.1:42002_    ] o.a.s.c.c.SolrZkClient makePath: /overseer_elect
   [junit4]   2> 528710 INFO  (TEST-HttpPartitionTest.test-seed#[CFCD65694B24B9AA]) [n:127.0.0.1:42002_    ] o.a.s.c.c.SolrZkClient makePath: /overseer_elect/election
   [junit4]   2> 528712 INFO  (TEST-HttpPartitionTest.test-seed#[CFCD65694B24B9AA]) [n:127.0.0.1:42002_    ] o.a.s.c.Overseer Overseer (id=null) closing
   [junit4]   2> 528712 INFO  (TEST-HttpPartitionTest.test-seed#[CFCD65694B24B9AA]) [n:127.0.0.1:42002_    ] o.a.s.c.LeaderElector Joined leadership election with path: /overseer_elect/election/94626050627141636-127.0.0.1:42002_-n_0000000000
   [junit4]   2> 528712 INFO  (TEST-HttpPartitionTest.test-seed#[CFCD65694B24B9AA]) [n:127.0.0.1:42002_    ] o.a.s.c.OverseerElectionContext I am going to be the leader 127.0.0.1:42002_
   [junit4]   2> 528713 INFO  (TEST-HttpPartitionTest.test-seed#[CFCD65694B24B9AA]) [n:127.0.0.1:42002_    ] o.a.s.c.c.SolrZkClient makePath: /overseer_elect/leader
   [junit4]   2> 528714 INFO  (TEST-HttpPartitionTest.test-seed#[CFCD65694B24B9AA]) [n:127.0.0.1:42002_    ] o.a.s.c.Overseer Overseer (id=94626050627141636-127.0.0.1:42002_-n_0000000000) starting
   [junit4]   2> 528715 INFO  (TEST-HttpPartitionTest.test-seed#[CFCD65694B24B9AA]) [n:127.0.0.1:42002_    ] o.a.s.c.c.SolrZkClient makePath: /overseer/queue-work
   [junit4]   2> 528721 INFO  (TEST-HttpPartitionTest.test-seed#[CFCD65694B24B9AA]) [n:127.0.0.1:42002_    ] o.a.s.c.OverseerAutoReplicaFailoverThread Starting OverseerAutoReplicaFailoverThread autoReplicaFailoverWorkLoopDelay=10000 autoReplicaFailoverWaitAfterExpiration=30000 autoReplicaFailoverBadNodeExpiration=60000
   [junit4]   2> 528722 INFO  (OverseerCollectionConfigSetProcessor-94626050627141636-127.0.0.1:42002_-n_0000000000) [n:127.0.0.1:42002_    ] o.a.s.c.OverseerTaskProcessor Process current queue of overseer operations
   [junit4]   2> 528722 INFO  (TEST-HttpPartitionTest.test-seed#[CFCD65694B24B9AA]) [n:127.0.0.1:42002_    ] o.a.s.c.c.ZkStateReader Updating cluster state from ZooKeeper... 
   [junit4]   2> 528722 INFO  (OverseerStateUpdate-94626050627141636-127.0.0.1:42002_-n_0000000000) [n:127.0.0.1:42002_    ] o.a.s.c.Overseer Starting to work on the main queue
   [junit4]   2> 528740 INFO  (TEST-HttpPartitionTest.test-seed#[CFCD65694B24B9AA]) [n:127.0.0.1:42002_    ] o.a.s.c.CoreContainer Security conf doesn't exist. Skipping setup for authorization module.
   [junit4]   2> 528740 INFO  (TEST-HttpPartitionTest.test-seed#[CFCD65694B24B9AA]) [n:127.0.0.1:42002_    ] o.a.s.c.CoreContainer No authentication plugin used.
   [junit4]   2> 528741 INFO  (TEST-HttpPartitionTest.test-seed#[CFCD65694B24B9AA]) [n:127.0.0.1:42002_    ] o.a.s.c.CoresLocator Looking for core definitions underneath /x1/jenkins/jenkins-slave/workspace/Lucene-Solr-Tests-5.x-Java7/solr/build/solr-core/test/J1/temp/solr.cloud.HttpPartitionTest_CFCD65694B24B9AA-001/control-001/cores
   [junit4]   2> 528741 INFO  (TEST-HttpPartitionTest.test-seed#[CFCD65694B24B9AA]) [n:127.0.0.1:42002_    ] o.a.s.c.SolrCore Created CoreDescriptor: {coreNodeName=, schema=schema.xml, name=collection1, config=solrconfig.xml, instanceDir=/x1/jenkins/jenkins-slave/workspace/Lucene-Solr-Tests-5.x-Java7/solr/build/solr-core/test/J1/temp/solr.cloud.HttpPartitionTest_CFCD65694B24B9AA-001/control-001/cores/collection1, shard=, loadOnStartup=true, transient=false, configSetProperties=configsetprops.json, absoluteInstDir=/x1/jenkins/jenkins-slave/workspace/Lucene-Solr-Tests-5.x-Java7/solr/build/solr-core/test/J1/temp/solr.cloud.HttpPartitionTest_CFCD65694B24B9AA-001/control-001/cores/collection1/, collection=control_collection, dataDir=data/}
   [junit4]   2> 528741 INFO  (TEST-HttpPartitionTest.test-seed#[CFCD65694B24B9AA]) [n:127.0.0.1:42002_    ] o.a.s.c.CoresLocator Found core collection1 in /x1/jenkins/jenkins-slave/workspace/Lucene-Solr-Tests-5.x-Java7/solr/build/solr-core/test/J1/temp/solr.cloud.HttpPartitionTest_CFCD65694B24B9AA-001/control-001/cores/collection1/
   [junit4]   2> 528741 INFO  (TEST-HttpPartitionTest.test-seed#[CFCD65694B24B9AA]) [n:127.0.0.1:42002_    ] o.a.s.c.CoresLocator Found 1 core definitions
   [junit4]   2> 528742 INFO  (TEST-HttpPartitionTest.test-seed#[CFCD65694B24B9AA]) [n:127.0.0.1:42002_    ] o.a.s.s.SolrDispatchFilter user.dir=/x1/jenkins/jenkins-slave/workspace/Lucene-Solr-Tests-5.x-Java7/solr/build/solr-core/test/J1
   [junit4]   2> 528742 INFO  (TEST-HttpPartitionTest.test-seed#[CFCD65694B24B9AA]) [n:127.0.0.1:42002_    ] o.a.s.s.SolrDispatchFilter SolrDispatchFilter.init() done
   [junit4]   2> 528743 INFO  (coreLoadExecutor-1097-thread-1-processing-n:127.0.0.1:42002_) [n:127.0.0.1:42002_ c:control_collection   x:collection1] o.a.s.c.ZkController publishing state=down
   [junit4]   2> 528743 INFO  (coreLoadExecutor-1097-thread-1-processing-n:127.0.0.1:42002_) [n:127.0.0.1:42002_ c:control_collection   x:collection1] o.a.s.c.ZkController numShards not found on descriptor - reading it from system property
   [junit4]   2> 528744 INFO  (OverseerStateUpdate-94626050627141636-127.0.0.1:42002_-n_0000000000) [n:127.0.0.1:42002_    ] o.a.s.c.Overseer processMessage: queueSize: 1, message = {
   [junit4]   2>   "state":"down",
   [junit4]   2>   "shard":null,
   [junit4]   2>   "roles":null,
   [junit4]   2>   "collection":"control_collection",
   [junit4]   2>   "core":"collection1",
   [junit4]   2>   "operation":"state",
   [junit4]   2>   "node_name":"127.0.0.1:42002_",
   [junit4]   2>   "numShards":"1",
   [junit4]   2>   "base_url":"http://127.0.0.1:42002"} current state version: 0
   [junit4]   2> 528744 INFO  (coreLoadExecutor-1097-thread-1-processing-n:127.0.0.1:42002_) [n:127.0.0.1:42002_ c:control_collection   x:collection1] o.a.s.c.ZkController look for our core node name
   [junit4]   2> 528745 INFO  (OverseerStateUpdate-94626050627141636-127.0.0.1:42002_-n_0000000000) [n:127.0.0.1:42002_    ] o.a.s.c.o.ReplicaMutator Update state numShards=1 message={
   [junit4]   2>   "state":"down",
   [junit4]   2>   "shard":null,
   [junit4]   2>   "roles":null,
   [junit4]   2>   "collection":"control_collection",
   [junit4]   2>   "core":"collection1",
   [junit4]   2>   "operation":"state",
   [junit4]   2>   "node_name":"127.0.0.1:42002_",
   [junit4]   2>   "numShards":"1",
   [junit4]   2>   "base_url":"http://127.0.0.1:42002"}
   [junit4]   2> 528745 INFO  (OverseerStateUpdate-94626050627141636-127.0.0.1:42002_-n_0000000000) [n:127.0.0.1:42002_    ] o.a.s.c.o.ClusterStateMutator building a new cName: control_collection
   [junit4]   2> 528745 INFO  (OverseerStateUpdate-94626050627141636-127.0.0.1:42002_-n_0000000000) [n:127.0.0.1:42002_    ] o.a.s.c.o.ReplicaMutator Assigning new node to shard shard=shard1
   [junit4]   2> 528747 INFO  (zkCallback-296-thread-1-processing-n:127.0.0.1:42002_) [n:127.0.0.1:42002_    ] o.a.s.c.c.ZkStateReader A cluster state change: WatchedEvent state:SyncConnected type:NodeDataChanged path:/clusterstate.json, has occurred - updating... (live nodes size: 1)
   [junit4]   2> 529745 INFO  (coreLoadExecutor-1097-thread-1-processing-n:127.0.0.1:42002_) [n:127.0.0.1:42002_ c:control_collection   x:collection1] o.a.s.c.ZkController waiting to find shard id in clusterstate for collection1
   [junit4]   2> 529745 INFO  (coreLoadExecutor-1097-thread-1-processing-n:127.0.0.1:42002_) [n:127.0.0.1:42002_ c:control_collection   x:collection1] o.a.s.c.ZkController Check for collection zkNode:control_collection
   [junit4]   2> 529745 INFO  (coreLoadExecutor-1097-thread-1-processing-n:127.0.0.1:42002_) [n:127.0.0.1:42002_ c:control_collection   x:collection1] o.a.s.c.ZkController Collection zkNode exists
   [junit4]   2> 529745 INFO  (coreLoadExecutor-1097-thread-1-processing-n:127.0.0.1:42002_) [n:127.0.0.1:42002_ c:control_collection   x:collection1] o.a.s.c.c.ZkStateReader Load collection config from:/collections/control_collection
   [junit4]   2> 529746 INFO  (coreLoadExecutor-1097-thread-1-processing-n:127.0.0.1:42002_) [n:127.0.0.1:42002_ c:control_collection   x:collection1] o.a.s.c.c.ZkStateReader path=/collections/control_collection configName=conf1 specified config exists in ZooKeeper
   [junit4]   2> 529746 INFO  (coreLoadExecutor-1097-thread-1-processing-n:127.0.0.1:42002_) [n:127.0.0.1:42002_ c:control_collection   x:collection1] o.a.s.c.SolrResourceLoader new SolrResourceLoader for directory: '/x1/jenkins/jenkins-slave/workspace/Lucene-Solr-Tests-5.x-Java7/solr/build/solr-core/test/J1/temp/solr.cloud.HttpPartitionTest_CFCD65694B24B9AA-001/control-001/cores/collection1/'
   [junit4]   2> 529761 INFO  (coreLoadExecutor-1097-thread-1-processing-n:127.0.0.1:42002_) [n:127.0.0.1:42002_ c:control_collection   x:collection1] o.a.s.c.Config loaded config solrconfig.xml with version 0 
   [junit4]   2> 529767 INFO  (coreLoadExecutor-1097-thread-1-processing-n:127.0.0.1:42002_) [n:127.0.0.1:42002_ c:control_collection   x:collection1] o.a.s.c.SolrConfig current version of requestparams : -1
   [junit4]   2> 529780 INFO  (coreLoadExecutor-1097-thread-1-processing-n:127.0.0.1:42002_) [n:127.0.0.1:42002_ c:control_collection   x:collection1] o.a.s.c.SolrConfig Using Lucene MatchVersion: 5.4.0
   [junit4]   2> 529827 INFO  (coreLoadExecutor-1097-thread-1-processing-n:127.0.0.1:42002_) [n:127.0.0.1:42002_ c:control_collection   x:collection1] o.a.s.c.Config Loaded SolrConfig: solrconfig.xml
   [junit4]   2> 529828 INFO  (coreLoadExecutor-1097-thread-1-processing-n:127.0.0.1:42002_) [n:127.0.0.1:42002_ c:control_collection   x:collection1] o.a.s.s.IndexSchema Reading Solr Schema from /configs/conf1/schema.xml
   [junit4]   2> 529835 INFO  (coreLoadExecutor-1097-thread-1-processing-n:127.0.0.1:42002_) [n:127.0.0.1:42002_ c:control_collection   x:collection1] o.a.s.s.IndexSchema [collection1] Schema name=test
   [junit4]   2> 530077 INFO  (coreLoadExecutor-1097-thread-1-processing-n:127.0.0.1:42002_) [n:127.0.0.1:42002_ c:control_collection   x:collection1] o.a.s.s.OpenExchangeRatesOrgProvider Initialized with rates=open-exchange-rates.json, refreshInterval=1440.
   [junit4]   2> 530085 INFO  (coreLoadExecutor-1097-thread-1-processing-n:127.0.0.1:42002_) [n:127.0.0.1:42002_ c:control_collection   x:collection1] o.a.s.s.IndexSchema default search field in schema is text
   [junit4]   2> 530086 INFO  (coreLoadExecutor-1097-thread-1-processing-n:127.0.0.1:42002_) [n:127.0.0.1:42002_ c:control_collection   x:collection1] o.a.s.s.IndexSchema unique key field: id
   [junit4]   2> 530096 INFO  (coreLoadExecutor-1097-thread-1-processing-n:127.0.0.1:42002_) [n:127.0.0.1:42002_ c:control_collection   x:collection1] o.a.s.s.FileExchangeRateProvider Reloading exchange rates from file currency.xml
   [junit4]   2> 530099 INFO  (coreLoadExecutor-1097-thread-1-processing-n:127.0.0.1:42002_) [n:127.0.0.1:42002_ c:control_collection   x:collection1] o.a.s.s.FileExchangeRateProvider Reloading exchange rates from file currency.xml
   [junit4]   2> 530101 INFO  (coreLoadExecutor-1097-thread-1-processing-n:127.0.0.1:42002_) [n:127.0.0.1:42002_ c:control_collection   x:collection1] o.a.s.s.OpenExchangeRatesOrgProvider Reloading exchange rates from open-exchange-rates.json
   [junit4]   2> 530102 WARN  (coreLoadExecutor-1097-thread-1-processing-n:127.0.0.1:42002_) [n:127.0.0.1:42002_ c:control_collection   x:collection1] o.a.s.s.OpenExchangeRatesOrgProvider Unknown key IMPORTANT NOTE
   [junit4]   2> 530102 WARN  (coreLoadExecutor-1097-thread-1-processing-n:127.0.0.1:42002_) [n:127.0.0.1:42002_ c:control_collection   x:collection1] o.a.s.s.OpenExchangeRatesOrgProvider Expected key, got STRING
   [junit4]   2> 530102 INFO  (coreLoadExecutor-1097-thread-1-processing-n:127.0.0.1:42002_) [n:127.0.0.1:42002_ c:control_collection   x:collection1] o.a.s.s.OpenExchangeRatesOrgProvider Reloading exchange rates from open-exchange-rates.json
   [junit4]   2> 530103 WARN  (coreLoadExecutor-1097-thread-1-processing-n:127.0.0.1:42002_) [n:127.0.0.1:42002_ c:control_collection   x:collection1] o.a.s.s.OpenExchangeRatesOrgProvider Unknown key IMPORTANT NOTE
   [junit4]   2> 530103 WARN  (coreLoadExecutor-1097-thread-1-processing-n:127.0.0.1:42002_) [n:127.0.0.1:42002_ c:control_collection   x:collection1] o.a.s.s.OpenExchangeRatesOrgProvider Expected key, got STRING
   [junit4]   2> 530104 INFO  (coreLoadExecutor-1097-thread-1-processing-n:127.0.0.1:42002_) [n:127.0.0.1:42002_ c:control_collection   x:collection1] o.a.s.c.ConfigSetProperties Did not find ConfigSet properties, assuming default properties: Can't find resource 'configsetprops.json' in classpath or '/configs/conf1', cwd=/x1/jenkins/jenkins-slave/workspace/Lucene-Solr-Tests-5.x-Java7/solr/build/solr-core/test/J1
   [junit4]   2> 530104 INFO  (coreLoadExecutor-1097-thread-1-processing-n:127.0.0.1:42002_) [n:127.0.0.1:42002_ c:control_collection   x:collection1] o.a.s.c.CoreContainer Creating SolrCore 'collection1' using configuration from collection control_collection
   [junit4]   2> 530105 INFO  (coreLoadExecutor-1097-thread-1-processing-n:127.0.0.1:42002_) [n:127.0.0.1:42002_ c:control_collection s:shard1 r:core_node1 x:collection1] o.a.s.c.SolrCore org.apache.solr.core.MockDirectoryFactory
   [junit4]   2> 530105 INFO  (coreLoadExecutor-1097-thread-1-processing-n:127.0.0.1:42002_) [n:127.0.0.1:42002_ c:control_collection s:shard1 r:core_node1 x:collection1] o.a.s.c.SolrCore [[collection1] ] Opening new SolrCore at [/x1/jenkins/jenkins-slave/workspace/Lucene-Solr-Tests-5.x-Java7/solr/build/solr-core/test/J1/temp/solr.cloud.HttpPartitionTest_CFCD65694B24B9AA-001/control-001/cores/collection1/], dataDir=[null]
   [junit4]   2> 530105 INFO  (coreLoadExecutor-1097-thread-1-processing-n:127.0.0.1:42002_) [n:127.0.0.1:42002_ c:control_collection s:shard1 r:core_node1 x:collection1] o.a.s.c.JmxMonitoredMap JMX monitoring is enabled. Adding Solr mbeans to JMX Server: com.sun.jmx.mbeanserver.JmxMBeanServer@7bcfcac3
   [junit4]   2> 530106 INFO  (coreLoadExecutor-1097-thread-1-processing-n:127.0.0.1:42002_) [n:127.0.0.1:42002_ c:control_collection s:shard1 r:core_node1 x:collection1] o.a.s.c.CachingDirectoryFactory return new directory for /x1/jenkins/jenkins-slave/workspace/Lucene-Solr-Tests-5.x-Java7/solr/build/solr-core/test/J1/temp/solr.cloud.HttpPartitionTest_CFCD65694B24B9AA-001/control-001/cores/collection1/data
   [junit4]   2> 530106 INFO  (coreLoadExecutor-1097-thread-1-processing-n:127.0.0.1:42002_) [n:127.0.0.1:42002_ c:control_collection s:shard1 r:core_node1 x:collection1] o.a.s.c.SolrCore New index directory detected: old=null new=/x1/jenkins/jenkins-slave/workspace/Lucene-Solr-Tests-5.x-Java7/solr/build/solr-core/test/J1/temp/solr.cloud.HttpPartitionTest_CFCD65694B24B9AA-001/control-001/cores/collection1/data/index/
   [junit4]   2> 530106 WARN  (coreLoadExecutor-1097-thread-1-processing-n:127.0.0.1:42002_) [n:127.0.0.1:42002_ c:control_collection s:shard1 r:core_node1 x:collection1] o.a.s.c.SolrCore [collection1] Solr index directory '/x1/jenkins/jenkins-slave/workspace/Lucene-Solr-Tests-5.x-Java7/solr/build/solr-core/test/J1/temp/solr.cloud.HttpPartitionTest_CFCD65694B24B9AA-001/control-001/cores/collection1/data/index' doesn't exist. Creating new index...
   [junit4]   2> 530106 INFO  (coreLoadExecutor-1097-thread-1-processing-n:127.0.0.1:42002_) [n:127.0.0.1:42002_ c:control_collection s:shard1 r:core_node1 x:collection1] o.a.s.c.CachingDirectoryFactory return new directory for /x1/jenkins/jenkins-slave/workspace/Lucene-Solr-Tests-5.x-Java7/solr/build/solr-core/test/J1/temp/solr.cloud.HttpPartitionTest_CFCD65694B24B9AA-001/control-001/cores/collection1/data/index
   [junit4]   2> 530106 INFO  (coreLoadExecutor-1097-thread-1-processing-n:127.0.0.1:42002_) [n:127.0.0.1:42002_ c:control_collection s:shard1 r:core_node1 x:collection1] o.a.s.u.RandomMergePolicy RandomMergePolicy wrapping class org.apache.lucene.index.LogByteSizeMergePolicy: [LogByteSizeMergePolicy: minMergeSize=1677721, mergeFactor=42, maxMergeSize=2147483648, maxMergeSizeForForcedMerge=9223372036854775807, calibrateSizeByDeletes=true, maxMergeDocs=2147483647, maxCFSSegmentSizeMB=8.796093022207999E12, noCFSRatio=1.0]
   [junit4]   2> 530107 INFO  (coreLoadExecutor-1097-thread-1-processing-n:127.0.0.1:42002_) [n:127.0.0.1:42002_ c:control_collection s:shard1 r:core_node1 x:collection1] o.a.s.c.SolrCore SolrDeletionPolicy.onCommit: commits: num=1
   [junit4]   2> 	commit{dir=MockDirectoryWrapper(RAMDirectory@33f72ea0 lockFactory=org.apache.lucene.store.SingleInstanceLockFactory@29162507),segFN=segments_1,generation=1}
   [junit4]   2> 530107 INFO  (coreLoadExecutor-1097-thread-1-processing-n:127.0.0.1:42002_) [n:127.0.0.1:42002_ c:control_collection s:shard1 r:core_node1 x:collection1] o.a.s.c.SolrCore newest commit generation = 1
   [junit4]   2> 530108 INFO  (OldIndexDirectoryCleanupThreadForCore-collection1) [n:127.0.0.1:42002_ c:control_collection s:shard1 r:core_node1 x:collection1] o.a.s.c.SolrCore Looking for old index directories to cleanup for core collection1 in /x1/jenkins/jenkins-slave/workspace/Lucene-Solr-Tests-5.x-Java7/solr/build/solr-core/test/J1/temp/solr.cloud.HttpPartitionTest_CFCD65694B24B9AA-001/control-001/cores/collection1/data/
   [junit4]   2> 530108 WARN  (OldIndexDirectoryCleanupThreadForCore-collection1) [n:127.0.0.1:42002_ c:control_collection s:shard1 r:core_node1 x:collection1] o.a.s.c.DirectoryFactory /x1/jenkins/jenkins-slave/workspace/Lucene-Solr-Tests-5.x-Java7/solr/build/solr-core/test/J1/temp/solr.cloud.HttpPartitionTest_CFCD65694B24B9AA-001/control-001/cores/collection1/data/ does not point to a valid data directory; skipping clean-up of old index directories.
   [junit4]   2> 530112 INFO  (coreLoadExecutor-1097-thread-1-processing-n:127.0.0.1:42002_) [n:127.0.0.1:42002_ c:control_collection s:shard1 r:core_node1 x:collection1] o.a.s.u.p.UpdateRequestProcessorChain creating updateRequestProcessorChain "nodistrib"
   [junit4]   2> 530112 INFO  (coreLoadExecutor-1097-thread-1-processing-n:127.0.0.1:42002_) [n:127.0.0.1:42002_ c:control_collection s:shard1 r:core_node1 x:collection1] o.a.s.u.p.UpdateRequestProcessorChain creating updateRequestProcessorChain "dedupe"
   [junit4]   2> 530113 INFO  (coreLoadExecutor-1097-thread-1-processing-n:127.0.0.1:42002_) [n:127.0.0.1:42002_ c:control_collection s:shard1 r:core_node1 x:collection1] o.a.s.u.p.UpdateRequestProcessorChain inserting DistributedUpdateProcessorFactory into updateRequestProcessorChain "dedupe"
   [junit4]   2> 530113 INFO  (coreLoadExecutor-1097-thread-1-processing-n:127.0.0.1:42002_) [n:127.0.0.1:42002_ c:control_collection s:shard1 r:core_node1 x:collection1] o.a.s.u.p.UpdateRequestProcessorChain creating updateRequestProcessorChain "stored_sig"
   [junit4]   2> 530113 INFO  (coreLoadExecutor-1097-thread-1-processing-n:127.0.0.1:42002_) [n:127.0.0.1:42002_ c:control_collection s:shard1 r:core_node1 x:collection1] o.a.s.u.p.UpdateRequestProcessorChain inserting DistributedUpdateProcessorFactory into updateRequestProcessorChain "stored_sig"
   [junit4]   2> 530113 INFO  (coreLoadExecutor-1097-thread-1-processing-n:127.0.0.1:42002_) [n:127.0.0.1:42002_ c:control_collection s:shard1 r:core_node1 x:collection1] o.a.s.u.p.UpdateRequestProcessorChain creating updateRequestProcessorChain "distrib-dup-test-chain-explicit"
   [junit4]   2> 530113 INFO  (coreLoadExecutor-1097-thread-1-processing-n:127.0.0.1:42002_) [n:127.0.0.1:42002_ c:control_collection s:shard1 r:core_node1 x:collection1] o.a.s.u.p.UpdateRequestProcessorChain creating updateRequestProcessorChain "distrib-dup-test-chain-implicit"
   [junit4]   2> 530113 INFO  (coreLoadExecutor-1097-thread-1-processing-n:127.0.0.1:42002_) [n:127.0.0.1:42002_ c:control_collection s:shard1 r:core_node1 x:collection1] o.a.s.u.p.UpdateRequestProcessorChain inserting DistributedUpdateProcessorFactory into updateRequestProcessorChain "distrib-dup-test-chain-implicit"
   [junit4]   2> 530113 INFO  (coreLoadExecutor-1097-thread-1-processing-n:127.0.0.1:42002_) [n:127.0.0.1:42002_ c:control_collection s:shard1 r:core_node1 x:collection1] o.a.s.c.SolrCore no updateRequestProcessorChain defined as default, creating implicit default
   [junit4]   2> 530116 INFO  (coreLoadExecutor-1097-thread-1-processing-n:127.0.0.1:42002_) [n:127.0.0.1:42002_ c:control_collection s:shard1 r:core_node1 x:collection1] o.a.s.h.l.XMLLoader xsltCacheLifetimeSeconds=60
   [junit4]   2> 530117 INFO  (coreLoadExecutor-1097-thread-1-processing-n:127.0.0.1:42002_) [n:127.0.0.1:42002_ c:control_collection s:shard1 r:core_node1 x:collection1] o.a.s.h.l.XMLLoader xsltCacheLifetimeSeconds=60
   [junit4]   2> 530119 INFO  (coreLoadExecutor-1097-thread-1-processing-n:127.0.0.1:42002_) [n:127.0.0.1:42002_ c:control_collection s:shard1 r:core_node1 x:collection1] o.a.s.h.l.XMLLoader xsltCacheLifetimeSeconds=60
   [junit4]   2> 530120 INFO  (coreLoadExecutor-1097-thread-1-processing-n:127.0.0.1:42002_) [n:127.0.0.1:42002_ c:control_collection s:shard1 r:core_node1 x:collection1] o.a.s.h.l.XMLLoader xsltCacheLifetimeSeconds=60
   [junit4]   2> 530123 INFO  (coreLoadExecutor-1097-thread-1-processing-n:127.0.0.1:42002_) [n:127.0.0.1:42002_ c:control_collection s:shard1 r:core_node1 x:collection1] o.a.s.c.RequestHandlers Registered paths: /update/json,/admin/file,/admin/plugins,/admin/mbeans,standard,/replication,/update,/admin/segments,/admin/threads,/admin/properties,/update/json/docs,/admin/luke,/config,/admin/logging,/get,/admin/system,/schema,/update/csv,/admin/ping
   [junit4]   2> 530124 INFO  (coreLoadExecutor-1097-thread-1-processing-n:127.0.0.1:42002_) [n:127.0.0.1:42002_ c:control_collection s:shard1 r:core_node1 x:collection1] o.a.s.c.SolrCore Using default statsCache cache: org.apache.solr.search.stats.LocalStatsCache
   [junit4]   2> 530125 INFO  (coreLoadExecutor-1097-thread-1-processing-n:127.0.0.1:42002_) [n:127.0.0.1:42002_ c:control_collection s:shard1 r:core_node1 x:collection1] o.a.s.u.UpdateHandler Using UpdateLog implementation: org.apache.solr.update.UpdateLog
   [junit4]   2> 530125 INFO  (coreLoadExecutor-1097-thread-1-processing-n:127.0.0.1:42002_) [n:127.0.0.1:42002_ c:control_collection s:shard1 r:core_node1 x:collection1] o.a.s.u.UpdateLog Initializing UpdateLog: dataDir= defaultSyncLevel=FLUSH numRecordsToKeep=100 maxNumLogsToKeep=10 numVersionBuckets=65536
   [junit4]   2> 530126 INFO  (coreLoadExecutor-1097-thread-1-processing-n:127.0.0.1:42002_) [n:127.0.0.1:42002_ c:control_collection s:shard1 r:core_node1 x:collection1] o.a.s.c.SolrCore Hard AutoCommit: disabled
   [junit4]   2> 530126 INFO  (coreLoadExecutor-1097-thread-1-processing-n:127.0.0.1:42002_) [n:127.0.0.1:42002_ c:control_collection s:shard1 r:core_node1 x:collection1] o.a.s.c.SolrCore Soft AutoCommit: disabled
   [junit4]   2> 530126 INFO  (coreLoadExecutor-1097-thread-1-processing-n:127.0.0.1:42002_) [n:127.0.0.1:42002_ c:control_collection s:shard1 r:core_node1 x:collection1] o.a.s.u.RandomMergePolicy RandomMergePolicy wrapping class org.apache.lucene.index.LogByteSizeMergePolicy: [LogByteSizeMergePolicy: minMergeSize=1677721, mergeFactor=15, maxMergeSize=2147483648, maxMergeSizeForForcedMerge=9223372036854775807, calibrateSizeByDeletes=false, maxMergeDocs=2147483647, maxCFSSegmentSizeMB=8.796093022207999E12, noCFSRatio=0.0]
   [junit4]   2> 530126 INFO  (coreLoadExecutor-1097-thread-1-processing-n:127.0.0.1:42002_) [n:127.0.0.1:42002_ c:control_collection s:shard1 r:core_node1 x:collection1] o.a.s.c.SolrCore SolrDeletionPolicy.onInit: commits: num=1
   [junit4]   2> 	commit{dir=MockDirectoryWrapper(RAMDirectory@33f72ea0 lockFactory=org.apache.lucene.store.SingleInstanceLockFactory@29162507),segFN=segments_1,generation=1}
   [junit4]   2> 530126 INFO  (coreLoadExecutor-1097-thread-1-processing-n:127.0.0.1:42002_) [n:127.0.0.1:42002_ c:control_collection s:shard1 r:core_node1 x:collection1] o.a.s.c.SolrCore newest commit generation = 1
   [junit4]   2> 530127 INFO  (coreLoadExecutor-1097-thread-1-processing-n:127.0.0.1:42002_) [n:127.0.0.1:42002_ c:control_collection s:shard1 r:core_node1 x:collection1] o.a.s.s.SolrIndexSearcher Opening Searcher@7e403597[collection1] main
   [junit4]   2> 530127 INFO  (coreLoadExecutor-1097-thread-1-processing-n:127.0.0.1:42002_) [n:127.0.0.1:42002_ c:control_collection s:shard1 r:core_node1 x:collection1] o.a.s.c.c.ZkStateReader Load collection config from:/collections/control_collection
   [junit4]   2> 530128 INFO  (coreLoadExecutor-1097-thread-1-processing-n:127.0.0.1:42002_) [n:127.0.0.1:42002_ c:control_collection s:shard1 r:core_node1 x:collection1] o.a.s.c.c.ZkStateReader path=/collections/control_collection configName=conf1 specified config exists in ZooKeeper
   [junit4]   2> 530128 INFO  (coreLoadExecutor-1097-thread-1-processing-n:127.0.0.1:42002_) [n:127.0.0.1:42002_ c:control_collection s:shard1 r:core_node1 x:collection1] o.a.s.r.ManagedResourceStorage Setting up ZooKeeper-based storage for the RestManager with znodeBase: /configs/conf1
   [junit4]   2> 530128 INFO  (coreLoadExecutor-1097-thread-1-processing-n:127.0.0.1:42002_) [n:127.0.0.1:42002_ c:control_collection s:shard1 r:core_node1 x:collection1] o.a.s.r.ManagedResourceStorage Configured ZooKeeperStorageIO with znodeBase: /configs/conf1
   [junit4]   2> 530128 INFO  (coreLoadExecutor-1097-thread-1-processing-n:127.0.0.1:42002_) [n:127.0.0.1:42002_ c:control_collection s:shard1 r:core_node1 x:collection1] o.a.s.r.RestManager Initializing RestManager with initArgs: {}
   [junit4]   2> 530128 INFO  (coreLoadExecutor-1097-thread-1-processing-n:127.0.0.1:42002_) [n:127.0.0.1:42002_ c:control_collection s:shard1 r:core_node1 x:collection1] o.a.s.r.ManagedResourceStorage Reading _rest_managed.json using ZooKeeperStorageIO:path=/configs/conf1
   [junit4]   2> 530128 INFO  (coreLoadExecutor-1097-thread-1-processing-n:127.0.0.1:42002_) [n:127.0.0.1:42002_ c:control_collection s:shard1 r:core_node1 x:collection1] o.a.s.r.ManagedResourceStorage No data found for znode /configs/conf1/_rest_managed.json
   [junit4]   2> 530129 INFO  (coreLoadExecutor-1097-thread-1-processing-n:127.0.0.1:42002_) [n:127.0.0.1:42002_ c:control_collection s:shard1 r:core_node1 x:collection1] o.a.s.r.ManagedResourceStorage Loaded null at path _rest_managed.json using ZooKeeperStorageIO:path=/configs/conf1
   [junit4]   2> 530129 INFO  (coreLoadExecutor-1097-thread-1-processing-n:127.0.0.1:42002_) [n:127.0.0.1:42002_ c:control_collection s:shard1 r:core_node1 x:collection1] o.a.s.r.RestManager Initializing 0 registered ManagedResources
   [junit4]   2> 530129 INFO  (coreLoadExecutor-1097-thread-1-processing-n:127.0.0.1:42002_) [n:127.0.0.1:42002_ c:control_collection s:shard1 r:core_node1 x:collection1] o.a.s.h.ReplicationHandler Commits will be reserved for  10000
   [junit4]   2> 530129 INFO  (searcherExecutor-1098-thread-1-processing-s:shard1 c:control_collection x:collection1 n:127.0.0.1:42002_ r:core_node1) [n:127.0.0.1:42002_ c:control_collection s:shard1 r:core_node1 x:collection1] o.a.s.c.SolrCore [collection1] Registered new searcher Searcher@7e403597[collection1] main{ExitableDirectoryReader(UninvertingDirectoryReader())}
   [junit4]   2> 530129 INFO  (coreLoadExecutor-1097-thread-1-processing-n:127.0.0.1:42002_) [n:127.0.0.1:42002_ c:control_collection s:shard1 r:core_node1 x:collection1] o.a.s.u.UpdateLog Looking up max value of version field to seed version buckets
   [junit4]   2> 530129 INFO  (coreLoadExecutor-1097-thread-1-processing-n:127.0.0.1:42002_) [n:127.0.0.1:42002_ c:control_collection s:shard1 r:core_node1 x:collection1] o.a.s.u.VersionInfo Refreshing highest value of _version_ for 65536 version buckets from index
   [junit4]   2> 530129 INFO  (coreLoadExecutor-1097-thread-1-processing-n:127.0.0.1:42002_) [n:127.0.0.1:42002_ c:control_collection s:shard1 r:core_node1 x:collection1] o.a.s.u.VersionInfo No terms found for _version_, cannot seed version bucket highest value from index
   [junit4]   2> 530130 INFO  (coreLoadExecutor-1097-thread-1-processing-n:127.0.0.1:42002_) [n:127.0.0.1:42002_ c:control_collection s:shard1 r:core_node1 x:collection1] o.a.s.u.UpdateLog Could not find max version in index or recent updates, using new clock 1514016812045434880
   [junit4]   2> 530132 INFO  (coreLoadExecutor-1097-thread-1-processing-n:127.0.0.1:42002_) [n:127.0.0.1:42002_ c:control_collection s:shard1 r:core_node1 x:collection1] o.a.s.u.UpdateLog Took 2.0ms to seed version buckets with highest version 1514016812045434880
   [junit4]   2> 530132 INFO  (coreLoadExecutor-1097-thread-1-processing-n:127.0.0.1:42002_) [n:127.0.0.1:42002_ c:control_collection s:shard1 r:core_node1 x:collection1] o.a.s.c.ZkController watch zkdir /configs/conf1
   [junit4]   2> 530132 INFO  (coreLoadExecutor-1097-thread-1-processing-n:127.0.0.1:42002_) [n:127.0.0.1:42002_ c:control_collection s:shard1 r:core_node1 x:collection1] o.a.s.c.CoreContainer registering core: collection1
   [junit4]   2> 530133 INFO  (coreZkRegister-1091-thread-1-processing-s:shard1 c:control_collection x:collection1 n:127.0.0.1:42002_ r:core_node1) [n:127.0.0.1:42002_ c:control_collection s:shard1 r:core_node1 x:collection1] o.a.s.c.ZkController Register replica - core:collection1 address:http://127.0.0.1:42002 collection:control_collection shard:shard1
   [junit4]   2> 530134 INFO  (coreZkRegister-1091-thread-1-processing-s:shard1 c:control_collection x:collection1 n:127.0.0.1:42002_ r:core_node1) [n:127.0.0.1:42002_ c:control_collection s:shard1 r:core_node1 x:collection1] o.a.s.c.c.SolrZkClient makePath: /collections/control_collection/leader_elect/shard1/election
   [junit4]   2> 530138 INFO  (coreZkRegister-1091-thread-1-processing-s:shard1 c:control_collection x:collection1 n:127.0.0.1:42002_ r:core_node1) [n:127.0.0.1:42002_ c:control_collection s:shard1 r:core_node1 x:collection1] o.a.s.c.LeaderElector Joined leadership election with path: /collections/control_collection/leader_elect/shard1/election/94626050627141636-core_node1-n_0000000000
   [junit4]   2> 530138 INFO  (coreZkRegister-1091-thread-1-processing-s:shard1 c:control_collection x:collection1 n:127.0.0.1:42002_ r:core_node1) [n:127.0.0.1:42002_ c:control_collection s:shard1 r:core_node1 x:collection1] o.a.s.c.ShardLeaderElectionContext Running the leader process for shard shard1
   [junit4]   2> 530140 INFO  (coreZkRegister-1091-thread-1-processing-s:shard1 c:control_collection x:collection1 n:127.0.0.1:42002_ r:core_node1) [n:127.0.0.1:42002_ c:control_collection s:shard1 r:core_node1 x:collection1] o.a.s.c.ShardLeaderElectionContext Enough replicas found to continue.
   [junit4]   2> 530140 INFO  (coreZkRegister-1091-thread-1-processing-s:shard1 c:control_collection x:collection1 n:127.0.0.1:42002_ r:core_node1) [n:127.0.0.1:42002_ c:control_collection s:shard1 r:core_node1 x:collection1] o.a.s.c.ShardLeaderElectionContext I may be the new leader - try and sync
   [junit4]   2> 530140 INFO  (coreZkRegister-1091-thread-1-processing-s:shard1 c:control_collection x:collection1 n:127.0.0.1:42002_ r:core_node1) [n:127.0.0.1:42002_ c:control_collection s:shard1 r:core_node1 x:collection1] o.a.s.c.SyncStrategy Sync replicas to http://127.0.0.1:42002/collection1/
   [junit4]   2> 530140 INFO  (OverseerStateUpdate-94626050627141636-127.0.0.1:42002_-n_0000000000) [n:127.0.0.1:42002_    ] o.a.s.c.Overseer processMessage: queueSize: 1, message = {
   [junit4]   2>   "operation":"leader",
   [junit4]   2>   "shard":"shard1",
   [junit4]   2>   "collection":"control_collection"} current state version: 1
   [junit4]   2> 530140 INFO  (coreZkRegister-1091-thread-1-processing-s:shard1 c:control_collection x:collection1 n:127.0.0.1:42002_ r:core_node1) [n:127.0.0.1:42002_ c:control_collection s:shard1 r:core_node1 x:collection1] o.a.s.c.SyncStrategy Sync Success - now sync replicas to me
   [junit4]   2> 530140 INFO  (coreZkRegister-1091-thread-1-processing-s:shard1 c:control_collection x:collection1 n:127.0.0.1:42002_ r:core_node1) [n:127.0.0.1:42002_ c:control_collection s:shard1 r:core_node1 x:collection1] o.a.s.c.SyncStrategy http://127.0.0.1:42002/collection1/ has no replicas
   [junit4]   2> 530140 INFO  (coreZkRegister-1091-thread-1-processing-s:shard1 c:control_collection x:collection1 n:127.0.0.1:42002_ r:core_node1) [n:127.0.0.1:42002_ c:control_collection s:shard1 r:core_node1 x:collection1] o.a.s.c.ShardLeaderElectionContext I am the new leader: http://127.0.0.1:42002/collection1/ shard1
   [junit4]   2> 530141 INFO  (coreZkRegister-1091-thread-1-processing-s:shard1 c:control_collection x:collection1 n:127.0.0.1:42002_ r:core_node1) [n:127.0.0.1:42002_ c:control_collection s:shard1 r:core_node1 x:collection1] o.a.s.c.c.SolrZkClient makePath: /collections/control_collection/leaders/shard1
   [junit4]   2> 530144 INFO  (coreZkRegister-1091-thread-1-processing-s:shard1 c:control_collection x:collection1 n:127.0.0.1:42002_ r:core_node1) [n:127.0.0.1:42002_ c:control_collection s:shard1 r:core_node1 x:collection1] o.a.s.c.ShardLeaderElectionContextBase Creating leader registration node
   [junit4]   2> 530147 INFO  (OverseerStateUpdate-94626050627141636-127.0.0.1:42002_-n_0000000000) [n:127.0.0.1:42002_    ] o.a.s.c.Overseer processMessage: queueSize: 1, message = {
   [junit4]   2>   "operation":"leader",
   [junit4]   2>   "shard":"shard1",
   [junit4]   2>   "collection":"control_collection",
   [junit4]   2>   "base_url":"http://127.0.0.1:42002",
   [junit4]   2>   "core":"collection1",
   [junit4]   2>   "state":"active"} current state version: 1
   [junit4]   2> 530246 INFO  (TEST-HttpPartitionTest.test-seed#[CFCD65694B24B9AA]) [    ] o.a.s.c.c.SolrZkClient Using default ZkCredentialsProvider
   [junit4]   2> 530246 INFO  (TEST-HttpPartitionTest.test-seed#[CFCD65694B24B9AA]) [    ] o.a.s.c.c.ConnectionManager Waiting for client to connect to ZooKeeper
   [junit4]   2> 530248 INFO  (zkCallback-298-thread-1) [    ] o.a.s.c.c.ConnectionManager Watcher org.apache.solr.common.cloud.ConnectionManager@12b3d8e9 name:ZooKeeperConnection Watcher:127.0.0.1:47412/solr got event WatchedEvent state:SyncConnected type:None path:null path:null type:None
   [junit4]   2> 530248 INFO  (TEST-HttpPartitionTest.test-seed#[CFCD65694B24B9AA]) [    ] o.a.s.c.c.ConnectionManager Client is connected to ZooKeeper
   [junit4]   2> 530248 INFO  (TEST-HttpPartitionTest.test-seed#[CFCD65694B24B9AA]) [    ] o.a.s.c.c.SolrZkClient Using default ZkACLProvider
   [junit4]   2> 530248 INFO  (TEST-HttpPartitionTest.test-seed#[CFCD65694B24B9AA]) [    ] o.a.s.c.c.ZkStateReader Updating cluster state from ZooKeeper... 
   [junit4]   2> 530249 INFO  (zkCallback-296-thread-1-processing-n:127.0.0.1:42002_) [n:127.0.0.1:42002_    ] o.a.s.c.c.ZkStateReader A cluster state change: WatchedEvent state:SyncConnected type:NodeDataChanged path:/clusterstate.json, has occurred - updating... (live nodes size: 1)
   [junit4]   2> 530253 INFO  (TEST-HttpPartitionTest.test-seed#[CFCD65694B24B9AA]) [    ] o.a.s.c.ChaosMonkey monkey: init - expire sessions:false cause connection loss:false
   [junit4]   2> 530298 INFO  (coreZkRegister-1091-thread-1-processing-s:shard1 c:control_collection x:collection1 n:127.0.0.1:42002_ r:core_node1) [n:127.0.0.1:42002_ c:control_collection s:shard1 r:core_node1 x:collection1] o.a.s.c.ZkController We are http://127.0.0.1:42002/collection1/ and leader is http://127.0.0.1:42002/collection1/
   [junit4]   2> 530298 INFO  (coreZkRegister-1091-thread-1-processing-s:shard1 c:control_collection x:collection1 n:127.0.0.1:42002_ r:core_node1) [n:127.0.0.1:42002_ c:control_collection s:shard1 r:core_node1 x:collection1] o.a.s.c.ZkController No LogReplay needed for core=collection1 baseURL=http://127.0.0.1:42002
   [junit4]   2> 530298 INFO  (coreZkRegister-1091-thread-1-processing-s:shard1 c:control_collection x:collection1 n:127.0.0.1:42002_ r:core_node1) [n:127.0.0.1:42002_ c:control_collection s:shard1 r:core_node1 x:collection1] o.a.s.c.ZkController I am the leader, no recovery necessary
   [junit4]   2> 530298 INFO  (coreZkRegister-1091-thread-1-processing-s:shard1 c:control_collection x:collection1 n:127.0.0.1:42002_ r:core_node1) [n:127.0.0.1:42002_ c:control_collection s:shard1 r:core_node1 x:collection1] o.a.s.c.ZkController publishing state=active
   [junit4]   2> 530298 INFO  (coreZkRegister-1091-thread-1-processing-s:shard1 c:control_collection x:collection1 n:127.0.0.1:42002_ r:core_node1) [n:127.0.0.1:42002_ c:control_collection s:shard1 r:core_node1 x:collection1] o.a.s.c.ZkController numShards not found on descriptor - reading it from system property
   [junit4]   2> 530300 INFO  (OverseerStateUpdate-94626050627141636-127.0.0.1:42002_-n_0000000000) [n:127.0.0.1:42002_    ] o.a.s.c.Overseer processMessage: queueSize: 1, message = {
   [junit4]   2>   "core_node_name":"core_node1",
   [junit4]   2>   "state":"active",
   [junit4]   2>   "shard":"shard1",
   [junit4]   2>   "roles":null,
   [junit4]   2>   "collection":"control_collection",
   [junit4]   2>   "core":"collection1",
   [junit4]   2>   "operation":"state",
   [junit4]   2>   "node_name":"127.0.0.1:42002_",
   [junit4]   2>   "numShards":"2",
   [junit4]   2>   "base_url":"http://127.0.0.1:42002"} current state version: 2
   [junit4]   2> 530301 INFO  (OverseerStateUpdate-94626050627141636-127.0.0.1:42002_-n_0000000000) [n:127.0.0.1:42002_    ] o.a.s.c.o.ReplicaMutator Update state numShards=2 message={
   [junit4]   2>   "core_node_name":"core_node1",
   [junit4]   2>   "state":"active",
   [junit4]   2>   "shard":"shard1",
   [junit4]   2>   "roles":null,
   [junit4]   2>   "collection":"control_collection",
   [junit4]   2>   "core":"collection1",
   [junit4]   2>   "operation":"state",
   [junit4]   2>   "node_name":"127.0.0.1:42002_",
   [junit4]   2>   "numShards":"2",
   [junit4]   2>   "base_url":"http://127.0.0.1:42002"}
   [junit4]   2> 530403 INFO  (zkCallback-298-thread-1) [    ] o.a.s.c.c.ZkStateReader A cluster state change: WatchedEvent state:SyncConnected type:NodeDataChanged path:/clusterstate.json, has occurred - updating... (live nodes size: 1)
   [junit4]   2> 530404 INFO  (zkCallback-296-thread-1-processing-n:127.0.0.1:42002_) [n:127.0.0.1:42002_    ] o.a.s.c.c.ZkStateReader A cluster state change: WatchedEvent state:SyncConnected type:NodeDataChanged path:/clusterstate.json, has occurred - updating... (live nodes size: 1)
   [junit4]   2> 530548 INFO  (TEST-HttpPartitionTest.test-seed#[CFCD65694B24B9AA]) [    ] o.a.s.SolrTestCaseJ4 Writing core.properties file to /x1/jenkins/jenkins-slave/workspace/Lucene-Solr-Tests-5.x-Java7/solr/build/solr-core/test/J1/temp/solr.cloud.HttpPartitionTest_CFCD65694B24B9AA-001/shard-1-001/cores/collection1
   [junit4]   2> 530548 INFO  (TEST-HttpPartitionTest.test-seed#[CFCD65694B24B9AA]) [    ] o.a.s.c.AbstractFullDistribZkTestBase create jetty 1 in directory /x1/jenkins/jenkins-slave/workspace/Lucene-Solr-Tests-5.x-Java7/solr/build/solr-core/test/J1/temp/solr.cloud.HttpPartitionTest_CFCD65694B24B9AA-001/shard-1-001
   [junit4]   2> 530549 INFO  (TEST-HttpPartitionTest.test-seed#[CFCD65694B24B9AA]) [    ] o.e.j.s.Server jetty-9.2.13.v20150730
   [junit4]   2> 530551 INFO  (TEST-HttpPartitionTest.test-seed#[CFCD65694B24B9AA]) [    ] o.e.j.s.h.ContextHandler Started o.e.j.s.ServletContextHandler@276535ad{/,null,AVAILABLE}
   [junit4]   2> 530551 INFO  (TEST-HttpPartitionTest.test-seed#[CFCD65694B24B9AA]) [    ] o.e.j.s.ServerConnector Started ServerConnector@383d4fec{HTTP/1.1}{127.0.0.1:56606}
   [junit4]   2> 530551 INFO  (TEST-HttpPartitionTest.test-seed#[CFCD65694B24B9AA]) [    ] o.e.j.s.Server Started @533769ms
   [junit4]   2> 530551 INFO  (TEST-HttpPartitionTest.test-seed#[CFCD65694B24B9AA]) [    ] o.a.s.c.s.e.JettySolrRunner Jetty properties: {hostContext=/, hostPort=45143, solr.data.dir=/x1/jenkins/jenkins-slave/workspace/Lucene-Solr-Tests-5.x-Java7/solr/build/solr-core/test/J1/temp/solr.cloud.HttpPartitionTest_CFCD65694B24B9AA-001/tempDir-001/jetty1, solrconfig=solrconfig.xml, coreRootDirectory=/x1/jenkins/jenkins-slave/workspace/Lucene-Solr-Tests-5.x-Java7/solr/build/solr-core/test/J1/temp/solr.cloud.HttpPartitionTest_CFCD65694B24B9AA-001/shard-1-001/cores}
   [junit4]   2> 530552 INFO  (TEST-HttpPartitionTest.test-seed#[CFCD65694B24B9AA]) [    ] o.a.s.s.SolrDispatchFilter SolrDispatchFilter.init(): sun.misc.Launcher$AppClassLoader@6b482747
   [junit4]   2> 530552 INFO  (TEST-HttpPartitionTest.test-seed#[CFCD65694B24B9AA]) [    ] o.a.s.c.SolrResourceLoader new SolrResourceLoader for directory: '/x1/jenkins/jenkins-slave/workspace/Lucene-Solr-Tests-5.x-Java7/solr/build/solr-core/test/J1/temp/solr.cloud.HttpPartitionTest_CFCD65694B24B9AA-001/shard-1-001/'
   [junit4]   2> 530567 INFO  (TEST-HttpPartitionTest.test-seed#[CFCD65694B24B9AA]) [    ] o.a.s.c.c.SolrZkClient Using default ZkCredentialsProvider
   [junit4]   2> 530568 INFO  (TEST-HttpPartitionTest.test-seed#[CFCD65694B24B9AA]) [    ] o.a.s.c.c.ConnectionManager Waiting for client to connect to ZooKeeper
   [junit4]   2> 530569 INFO  (zkCallback-299-thread-1) [    ] o.a.s.c.c.ConnectionManager Watcher org.apache.solr.common.cloud.ConnectionManager@51d6cda7 name:ZooKeeperConnection Watcher:127.0.0.1:47412/solr got event WatchedEvent state:SyncConnected type:None path:null path:null type:None
   [junit4]   2> 530570 INFO  (TEST-HttpPartitionTest.test-seed#[CFCD65694B24B9AA]) [    ] o.a.s.c.c.ConnectionManager Client is connected to ZooKeeper
   [junit4]   2> 530570 INFO  (TEST-HttpPartitionTest.test-seed#[CFCD65694B24B9AA]) [    ] o.a.s.c.c.SolrZkClient Using default ZkACLProvider
   [junit4]   2> 530571 INFO  (TEST-HttpPartitionTest.test-seed#[CFCD65694B24B9AA]) [    ] o.a.s.s.SolrDispatchFilter Loading solr.xml from SolrHome (not found in ZooKeeper)
   [junit4]   2> 530571 INFO  (TEST-HttpPartitionTest.test-seed#[CFCD65694B24B9AA]) [    ] o.a.s.c.SolrXmlConfig Loading container configuration from /x1/jenkins/jenkins-slave/workspace/Lucene-Solr-Tests-5.x-Java7/solr/build/solr-core/test/J1/temp/solr.cloud.HttpPartitionTest_CFCD65694B24B9AA-001/shard-1-001/solr.xml
   [junit4]   2> 530586 INFO  (TEST-HttpPartitionTest.test-seed#[CFCD65694B24B9AA]) [    ] o.a.s.c.CoresLocator Config-defined core root directory: /x1/jenkins/jenkins-slave/workspace/Lucene-Solr-Tests-5.x-Java7/solr/build/solr-core/test/J1/temp/solr.cloud.HttpPartitionTest_CFCD65694B24B9AA-001/shard-1-001/cores
   [junit4]   2> 530586 INFO  (TEST-HttpPartitionTest.test-seed#[CFCD65694B24B9AA]) [    ] o.a.s.c.CoreContainer New CoreContainer 1742114643
   [junit4]   2> 530586 INFO  (TEST-HttpPartitionTest.test-seed#[CFCD65694B24B9AA]) [    ] o.a.s.c.CoreContainer Loading cores into CoreContainer [instanceDir=/x1/jenkins/jenkins-slave/workspace/Lucene-Solr-Tests-5.x-Java7/solr/build/solr-core/test/J1/temp/solr.cloud.HttpPartitionTest_CFCD65694B24B9AA-001/shard-1-001/]
   [junit4]   2> 530586 INFO  (TEST-HttpPartitionTest.test-seed#[CFCD65694B24B9AA]) [    ] o.a.s.c.CoreContainer loading shared library: /x1/jenkins/jenkins-slave/workspace/Lucene-Solr-Tests-5.x-Java7/solr/build/solr-core/test/J1/temp/solr.cloud.HttpPartitionTest_CFCD65694B24B9AA-001/shard-1-001/lib
   [junit4]   2> 530586 WARN  (TEST-HttpPartitionTest.test-seed#[CFCD65694B24B9AA]) [    ] o.a.s.c.SolrResourceLoader Can't find (or read) directory to add to classloader: lib (resolved as: /x1/jenkins/jenkins-slave/workspace/Lucene-Solr-Tests-5.x-Java7/solr/build/solr-core/test/J1/temp/solr.cloud.HttpPartitionTest_CFCD65694B24B9AA-001/shard-1-001/lib).
   [junit4]   2> 530594 INFO  (TEST-HttpPartitionTest.test-seed#[CFCD65694B24B9AA]) [    ] o.a.s.h.c.HttpShardHandlerFactory created with socketTimeout : 90000,urlScheme : ,connTimeout : 15000,maxConnectionsPerHost : 20,maxConnections : 10000,corePoolSize : 0,maximumPoolSize : 2147483647,maxThreadIdleTime : 5,sizeOfQueue : -1,fairnessPolicy : false,useRetries : false,
   [junit4]   2> 530595 INFO  (TEST-HttpPartitionTest.test-seed#[CFCD65694B24B9AA]) [    ] o.a.s.u.UpdateShardHandler Creating UpdateShardHandler HTTP client with params: socketTimeout=340000&connTimeout=45000&retry=true
   [junit4]   2> 530596 INFO  (TEST-HttpPartitionTest.test-seed#[CFCD65694B24B9AA]) [    ] o.a.s.l.LogWatcher SLF4J impl is org.slf4j.impl.Log4jLoggerFactory
   [junit4]   2> 530596 INFO  (TEST-HttpPartitionTest.test-seed#[CFCD65694B24B9AA]) [    ] o.a.s.l.LogWatcher Registering Log Listener [Log4j (org.slf4j.impl.Log4jLoggerFactory)]
   [junit4]   2> 530596 INFO  (TEST-HttpPartitionTest.test-seed#[CFCD65694B24B9AA]) [    ] o.a.s.c.ZkContainer Zookeeper client=127.0.0.1:47412/solr
   [junit4]   2> 530596 INFO  (TEST-HttpPartitionTest.test-seed#[CFCD65694B24B9AA]) [    ] o.a.s.c.ZkController zkHost includes chroot
   [junit4]   2> 530596 INFO  (TEST-HttpPartitionTest.test-seed#[CFCD65694B24B9AA]) [    ] o.a.s.c.c.SolrZkClient Using default ZkCredentialsProvider
   [junit4]   2> 530598 INFO  (TEST-HttpPartitionTest.test-seed#[CFCD65694B24B9AA]) [    ] o.a.s.c.c.ConnectionManager Waiting for client to connect to ZooKeeper
   [junit4]   2> 530599 INFO  (zkCallback-301-thread-1) [    ] o.a.s.c.c.ConnectionManager Watcher org.apache.solr.common.cloud.ConnectionManager@15512049 name:ZooKeeperConnection Watcher:127.0.0.1:47412 got event WatchedEvent state:SyncConnected type:None path:null path:null type:None
   [junit4]   2> 530599 INFO  (TEST-HttpPartitionTest.test-seed#[CFCD65694B24B9AA]) [    ] o.a.s.c.c.ConnectionManager Client is connected to ZooKeeper
   [junit4]   2> 530600 INFO  (TEST-HttpPartitionTest.test-seed#[CFCD65694B24B9AA]) [    ] o.a.s.c.c.SolrZkClient Using default ZkACLProvider
   [junit4]   2> 530603 INFO  (TEST-HttpPartitionTest.test-seed#[CFCD65694B24B9AA]) [n:127.0.0.1:45143_    ] o.a.s.c.c.ConnectionManager Waiting for client to connect to ZooKeeper
   [junit4]   2> 530603 INFO  (zkCallback-302-thread-1-processing-n:127.0.0.1:45143_) [n:127.0.0.1:45143_    ] o.a.s.c.c.ConnectionManager Watcher org.apache.solr.common.cloud.ConnectionManager@7f0b38c name:ZooKeeperConnection Watcher:127.0.0.1:47412/solr got event WatchedEvent state:SyncConnected type:None path:null path:null type:None
   [junit4]   2> 530603 INFO  (TEST-HttpPartitionTest.test-seed#[CFCD65694B24B9AA]) [n:127.0.0.1:45143_    ] o.a.s.c.c.ConnectionManager Client is connected to ZooKeeper
   [junit4]   2> 530609 INFO  (TEST-HttpPartitionTest.test-seed#[CFCD65694B24B9AA]) [n:127.0.0.1:45143_    ] o.a.s.c.c.ZkStateReader Updating cluster state from ZooKeeper... 
   [junit4]   2> 531614 INFO  (TEST-HttpPartitionTest.test-seed#[CFCD65694B24B9AA]) [n:127.0.0.1:45143_    ] o.a.s.c.ZkController Register node as live in ZooKeeper:/live_nodes/127.0.0.1:45143_
   [junit4]   2> 531614 INFO  (TEST-HttpPartitionTest.test-seed#[CFCD65694B24B9AA]) [n:127.0.0.1:45143_    ] o.a.s.c.c.SolrZkClient makePath: /live_nodes/127.0.0.1:45143_
   [junit4]   2> 531615 INFO  (zkCallback-302-thread-1-processing-n:127.0.0.1:45143_) [n:127.0.0.1:45143_    ] o.a.s.c.c.ZkStateReader A live node change: WatchedEvent state:SyncConnected type:NodeChildrenChanged path:/live_nodes, has occurred - updating... (live nodes size: 1)
   [junit4]   2> 531615 INFO  (zkCallback-296-thread-1-processing-n:127.0.0.1:42002_) [n:127.0.0.1:42002_    ] o.a.s.c.c.ZkStateReader A live node change: WatchedEvent state:SyncConnected type:NodeChildrenChanged path:/live_nodes, has occurred - updating... (live nodes size: 1)
   [junit4]   2> 531615 INFO  (zkCallback-298-thread-1) [    ] o.a.s.c.c.ZkStateReader A live node change: WatchedEvent state:SyncConnected type:NodeChildrenChanged path:/live_nodes, has occurred - updating... (live nodes size: 1)
   [junit4]   2> 531617 INFO  (TEST-HttpPartitionTest.test-seed#[CFCD65694B24B9AA]) [n:127.0.0.1:45143_    ] o.a.s.c.Overseer Overseer (id=null) closing
   [junit4]   2> 531618 INFO  (TEST-HttpPartitionTest.test-seed#[CFCD65694B24B9AA]) [n:127.0.0.1:45143_    ] o.a.s.c.LeaderElector Joined leadership election with path: /overseer_elect/election/94626050627141640-127.0.0.1:45143_-n_0000000001
   [junit4]   2> 531618 INFO  (TEST-HttpPartitionTest.test-seed#[CFCD65694B24B9AA]) [n:127.0.0.1:45143_    ] o.a.s.c.LeaderElector Watching path /overseer_elect/election/94626050627141636-127.0.0.1:42002_-n_0000000000 to know if I could be the leader
   [junit4]   2> 531639 INFO  (TEST-HttpPartitionTest.test-seed#[CFCD65694B24B9AA]) [n:127.0.0.1:45143_    ] o.a.s.c.CoreContainer Security conf doesn't exist. Skipping setup for authorization module.
   [junit4]   2> 531639 INFO  (TEST-HttpPartitionTest.test-seed#[CFCD65694B24B9AA]) [n:127.0.0.1:45143_    ] o.a.s.c.CoreContainer No authentication plugin used.
   [junit4]   2> 531641 INFO  (TEST-HttpPartitionTest.test-seed#[CFCD65694B24B9AA]) [n:127.0.0.1:45143_    ] o.a.s.c.CoresLocator Looking for core definitions underneath /x1/jenkins/jenkins-slave/workspace/Lucene-Solr-Tests-5.x-Java7/solr/build/solr-core/test/J1/temp/solr.cloud.HttpPartitionTest_CFCD65694B24B9AA-001/shard-1-001/cores
   [junit4]   2> 531643 INFO  (TEST-HttpPartitionTest.test-seed#[CFCD65694B24B9AA]) [n:127.0.0.1:45143_    ] o.a.s.c.SolrCore Created CoreDescriptor: {absoluteInstDir=/x1/jenkins/jenkins-slave/workspace/Lucene-Solr-Tests-5.x-Java7/solr/build/solr-core/test/J1/temp/solr.cloud.HttpPartitionTest_CFCD65694B24B9AA-001/shard-1-001/cores/collection1/, shard=, loadOnStartup=true, configSetProperties=configsetprops.json, name=collection1, transient=false, dataDir=data/, coreNodeName=, instanceDir=/x1/jenkins/jenkins-slave/workspace/Lucene-Solr-Tests-5.x-Java7/solr/build/solr-core/test/J1/temp/solr.cloud.HttpPartitionTest_CFCD65694B24B9AA-001/shard-1-001/cores/collection1, schema=schema.xml, collection=collection1, config=solrconfig.xml}
   [junit4]   2> 531643 INFO  (TEST-HttpPartitionTest.test-seed#[CFCD65694B24B9AA]) [n:127.0.0.1:45143_    ] o.a.s.c.CoresLocator Found core collection1 in /x1/jenkins/jenkins-slave/workspace/Lucene-Solr-Tests-5.x-Java7/solr/build/solr-core/test/J1/temp/solr.cloud.HttpPartitionTest_CFCD65694B24B9AA-001/shard-1-001/cores/collection1/
   [junit4]   2> 531643 INFO  (TEST-HttpPartitionTest.test-seed#[CFCD65694B24B9AA]) [n:127.0.0.1:45143_    ] o.a.s.c.CoresLocator Found 1 core definitions
   [junit4]   2> 531644 INFO  (TEST-HttpPartitionTest.test-seed#[CFCD65694B24B9AA]) [n:127.0.0.1:45143_    ] o.a.s.s.SolrDispatchFilter user.dir=/x1/jenkins/jenkins-slave/workspace/Lucene-Solr-Tests-5.x-Java7/solr/build/solr-core/test/J1
   [junit4]   2> 531644 INFO  (TEST-HttpPartitionTest.test-seed#[CFCD65694B24B9AA]) [n:127.0.0.1:45143_    ] o.a.s.s.SolrDispatchFilter SolrDispatchFilter.init() done
   [junit4]   2> 531644 INFO  (coreLoadExecutor-1108-thread-1-processing-n:127.0.0.1:45143_) [n:127.0.0.1:45143_ c:collection1   x:collection1] o.a.s.c.ZkController publishing state=down
   [junit4]   2> 531645 INFO  (coreLoadExecutor-1108-thread-1-processing-n:127.0.0.1:45143_) [n:127.0.0.1:45143_ c:collection1   x:collection1] o.a.s.c.ZkController numShards not found on descriptor - reading it from system property
   [junit4]   2> 531647 INFO  (OverseerStateUpdate-94626050627141636-127.0.0.1:42002_-n_0000000000) [n:127.0.0.1:42002_    ] o.a.s.c.Overseer processMessage: queueSize: 1, message = {
   [junit4]   2>   "state":"down",
   [junit4]   2>   "shard":null,
   [junit4]   2>   "roles":null,
   [junit4]   2>   "collection":"collection1",
   [junit4]   2>   "core":"collection1",
   [junit4]   2>   "operation":"state",
   [junit4]   2>   "node_name":"127.0.0.1:45143_",
   [junit4]   2>   "numShards":"2",
   [junit4]   2>   "base_url":"http://127.0.0.1:45143"} current state version: 3
   [junit4]   2> 531647 INFO  (coreLoadExecutor-1108-thread-1-processing-n:127.0.0.1:45143_) [n:127.0.0.1:45143_ c:collection1   x:collection1] o.a.s.c.ZkController look for our core node name
   [junit4]   2> 531650 INFO  (OverseerStateUpdate-94626050627141636-127.0.0.1:42002_-n_0000000000) [n:127.0.0.1:42002_    ] o.a.s.c.o.ReplicaMutator Update state numShards=2 message={
   [junit4]   2>   "state":"down",
   [junit4]   2>   "shard":null,
   [junit4]   2>   "roles":null,
   [junit4]   2>   "collection":"collection1",
   [junit4]   2>   "core":"collection1",
   [junit4]   2>   "operation":"state",
   [junit4]   2>   "node_name":"127.0.0.1:45143_",
   [junit4]   2>   "numShards":"2",
   [junit4]   2>   "base_url":"http://127.0.0.1:45143"}
   [junit4]   2> 531650 INFO  (OverseerStateUpdate-94626050627141636-127.0.0.1:42002_-n_0000000000) [n:127.0.0.1:42002_    ] o.a.s.c.o.ClusterStateMutator building a new cName: collection1
   [junit4]   2> 531650 INFO  (OverseerStateUpdate-94626050627141636-127.0.0.1:42002_-n_0000000000) [n:127.0.0.1:42002_    ] o.a.s.c.o.ReplicaMutator Assigning new node to shard shard=shard2
   [junit4]   2> 531753 INFO  (zkCallback-296-thread-1-processing-n:127.0.0.1:42002_) [n:127.0.0.1:42002_    ] o.a.s.c.c.ZkStateReader A cluster state change: WatchedEvent state:SyncConnected type:NodeDataChanged path:/clusterstate.json, has occurred - updating... (live nodes size: 2)
   [junit4]   2> 531753 INFO  (zkCallback-302-thread-1-processing-n:127.0.0.1:45143_) [n:127.0.0.1:45143_    ] o.a.s.c.c.ZkStateReader A cluster state change: WatchedEvent state:SyncConnected type:NodeDataChanged path:/clusterstate.json, has occurred - updating... (live nodes size: 2)
   [junit4]   2> 531754 INFO  (zkCallback-298-thread-1) [    ] o.a.s.c.c.ZkStateReader A cluster state change: WatchedEvent state:SyncConnected type:NodeDataChanged path:/clusterstate.json, has occurred - updating... (live nodes size: 2)
   [junit4]   2> 532650 INFO  (coreLoadExecutor-1108-thread-1-processing-n:127.0.0.1:45143_) [n:127.0.0.1:45143_ c:collection1   x:collection1] o.a.s.c.ZkController waiting to find shard id in clusterstate for collection1
   [junit4]   2> 532650 INFO  (coreLoadExecutor-1108-thread-1-processing-n:127.0.0.1:45143_) [n:127.0.0.1:45143_ c:collection1   x:collection1] o.a.s.c.ZkController Check for collection zkNode:collection1
   [junit4]   2> 532650 INFO  (coreLoadExecutor-1108-thread-1-processing-n:127.0.0.1:45143_) [n:127.0.0.1:45143_ c:collection1   x:collection1] o.a.s.c.ZkController Collection zkNode exists
   [junit4]   2> 532650 INFO  (coreLoadExecutor-1108-thread-1-processing-n:127.0.0.1:45143_) [n:127.0.0.1:45143_ c:collection1   x:collection1] o.a.s.c.c.ZkStateReader Load collection config from:/collections/collection1
   [junit4]   2> 532651 INFO  (coreLoadExecutor-1108-thread-1-processing-n:127.0.0.1:45143_) [n:127.0.0.1:45143_ c:collection1   x:collection1] o.a.s.c.c.ZkStateReader path=/collections/collection1 configName=conf1 specified config exists in ZooKeeper
   [junit4]   2> 532651 INFO  (coreLoadExecutor-1108-thread-1-processing-n:127.0.0.1:45143_) [n:127.0.0.1:45143_ c:collection1   x:collection1] o.a.s.c.SolrResourceLoader new SolrResourceLoader for directory: '/x1/jenkins/jenkins-slave/workspace/Lucene-Solr-Tests-5.x-Java7/solr/build/solr-core/test/J1/temp/solr.cloud.HttpPartitionTest_CFCD65694B24B9AA-001/shard-1-001/cores/collection1/'
   [junit4]   2> 532666 INFO  (coreLoadExecutor-1108-thread-1-processing-n:127.0.0.1:45143_) [n:127.0.0.1:45143_ c:collection1   x:collection1] o.a.s.c.Config loaded config solrconfig.xml with version 0 
   [junit4]   2> 532672 INFO  (coreLoadExecutor-1108-thread-1-processing-n:127.0.0.1:45143_) [n:127.0.0.1:45143_ c:collection1   x:collection1] o.a.s.c.SolrConfig current version of requestparams : -1
   [junit4]   2> 532701 INFO  (coreLoadExecutor-1108-thread-1-processing-n:127.0.0.1:45143_) [n:127.0.0.1:45143_ c:collection1   x:collection1] o.a.s.c.SolrConfig Using Lucene MatchVersion: 5.4.0
   [junit4]   2> 532732 INFO  (coreLoadExecutor-1108-thread-1-processing-n:127.0.0.1:45143_) [n:127.0.0.1:45143_ c:collection1   x:collection1] o.a.s.c.Config Loaded SolrConfig: solrconfig.xml
   [junit4]   2> 532733 INFO  (coreLoadExecutor-1108-thread-1-processing-n:127.0.0.1:45143_) [n:127.0.0.1:45143_ c:collection1   x:collection1] o.a.s.s.IndexSchema Reading Solr Schema from /configs/conf1/schema.xml
   [junit4]   2> 532740 INFO  (coreLoadExecutor-1108-thread-1-processing-n:127.0.0.1:45143_) [n:127.0.0.1:45143_ c:collection1   x:collection1] o.a.s.s.IndexSchema [collection1] Schema name=test
   [junit4]   2> 533037 INFO  (coreLoadExecutor-1108-thread-1-processing-n:127.0.0.1:45143_) [n:127.0.0.1:45143_ c:collection1   x:collection1] o.a.s.s.OpenExchangeRatesOrgProvider Initialized with rates=open-exchange-rates.json, refreshInterval=1440.
   [junit4]   2> 533045 INFO  (coreLoadExecutor-1108-thread-1-processing-n:127.0.0.1:45143_) [n:127.0.0.1:45143_ c:collection1   x:collection1] o.a.s.s.IndexSchema default search field in schema is text
   [junit4]   2> 533046 INFO  (coreLoadExecutor-1108-thread-1-processing-n:127.0.0.1:45143_) [n:127.0.0.1:45143_ c:collection1   x:collection1] o.a.s.s.IndexSchema unique key field: id
   [junit4]   2> 533056 INFO  (coreLoadExecutor-1108-thread-1-processing-n:127.0.0.1:45143_) [n:127.0.0.1:45143_ c:collection1   x:collection1] o.a.s.s.FileExchangeRateProvider Reloading exchange rates from file currency.xml
   [junit4]   2> 533059 INFO  (coreLoadExecutor-1108-thread-1-processing-n:127.0.0.1:45143_) [n:127.0.0.1:45143_ c:collection1   x:collection1] o.a.s.s.FileExchangeRateProvider Reloading exchange rates from file currency.xml
   [junit4]   2> 533062 INFO  (coreLoadExecutor-1108-thread-1-processing-n:127.0.0.1:45143_) [n:127.0.0.1:45143_ c:collection1   x:collection1] o.a.s.s.OpenExchangeRatesOrgProvider Reloading exchange rates from open-exchange-rates.json
   [junit4]   2> 533063 WARN  (coreLoadExecutor-1108-thread-1-processing-n:127.0.0.1:45143_) [n:127.0.0.1:45143_ c:collection1   x:collection1] o.a.s.s.OpenExchangeRatesOrgProvider Unknown key IMPORTANT NOTE
   [junit4]   2> 533063 WARN  (coreLoadExecutor-1108-thread-1-processing-n:127.0.0.1:45143_) [n:127.0.0.1:45143_ c:collection1   x:collection1] o.a.s.s.OpenExchangeRatesOrgProvider Expected key, got STRING
   [junit4]   2> 533063 INFO  (coreLoadExecutor-1108-thread-1-processing-n:127.0.0.1:45143_) [n:127.0.0.1:45143_ c:collection1   x:collection1] o.a.s.s.OpenExchangeRatesOrgProvider Reloading exchange rates from open-exchange-rates.json
   [junit4]   2> 533063 WARN  (coreLoadExecutor-1108-thread-1-processing-n:127.0.0.1:45143_) [n:127.0.0.1:45143_ c:collection1   x:collection1] o.a.s.s.OpenExchangeRatesOrgProvider Unknown key IMPORTANT NOTE
   [junit4]   2> 533063 WARN  (coreLoadExecutor-1108-thread-1-processing-n:127.0.0.1:45143_) [n:127.0.0.1:45143_ c:collection1   x:collection1] o.a.s.s.OpenExchangeRatesOrgProvider Expected key, got STRING
   [junit4]   2> 533064 INFO  (coreLoadExecutor-1108-thread-1-processing-n:127.0.0.1:45143_) [n:127.0.0.1:45143_ c:collection1   x:collection1] o.a.s.c.ConfigSetProperties Did not find ConfigSet properties, assuming default properties: Can't find resource 'configsetprops.json' in classpath or '/configs/conf1', cwd=/x1/jenkins/jenkins-slave/workspace/Lucene-Solr-Tests-5.x-Java7/solr/build/solr-core/test/J1
   [junit4]   2> 533064 INFO  (coreLoadExecutor-1108-thread-1-processing-n:127.0.0.1:45143_) [n:127.0.0.1:45143_ c:collection1   x:collection1] o.a.s.c.CoreContainer Creating SolrCore 'collection1' using configuration from collection collection1
   [junit4]   2> 533064 INFO  (coreLoadExecutor-1108-thread-1-processing-n:127.0.0.1:45143_) [n:127.0.0.1:45143_ c:collection1 s:shard2 r:core_node1 x:collection1] o.a.s.c.SolrCore org.apache.solr.core.MockDirectoryFactory
   [junit4]   2> 533065 INFO  (coreLoadExecutor-1108-thread-1-processing-n:127.0.0.1:45143_) [n:127.0.0.1:45143_ c:collection1 s:shard2 r:core_node1 x:collection1] o.a.s.c.SolrCore [[collection1] ] Opening new SolrCore at [/x1/jenkins/jenkins-slave/workspace/Lucene-Solr-Tests-5.x-Java7/solr/build/solr-core/test/J1/temp/solr.cloud.HttpPartitionTest_CFCD65694B24B9AA-001/shard-1-001/cores/collection1/], dataDir=[null]
   [junit4]   2> 533065 INFO  (coreLoadExecutor-1108-thread-1-processing-n:127.0.0.1:45143_) [n:127.0.0.1:45143_ c:collection1 s:shard2 r:core_node1 x:collection1] o.a.s.c.JmxMonitoredMap JMX monitoring is enabled. Adding Solr mbeans to JMX Server: com.sun.jmx.mbeanserver.JmxMBeanServer@7bcfcac3
   [junit4]   2> 533065 INFO  (coreLoadExecutor-1108-thread-1-processing-n:127.0.0.1:45143_) [n:127.0.0.1:45143_ c:collection1 s:shard2 r:core_node1 x:collection1] o.a.s.c.CachingDirectoryFactory return new directory for /x1/jenkins/jenkins-slave/workspace/Lucene-Solr-Tests-5.x-Java7/solr/build/solr-core/test/J1/temp/solr.cloud.HttpPartitionTest_CFCD65694B24B9AA-001/shard-1-001/cores/collection1/data
   [junit4]   2> 533065 INFO  (coreLoadExecutor-1108-thread-1-processing-n:127.0.0.1:45143_) [n:127.0.0.1:45143_ c:collection1 s:shard2 r:core_node1 x:collection1] o.a.s.c.SolrCore New index directory detected: old=null new=/x1/jenkins/jenkins-slave/workspace/Lucene-Solr-Tests-5.x-Java7/solr/build/solr-core/test/J1/temp/solr.cloud.HttpPartitionTest_CFCD65694B24B9AA-001/shard-1-001/cores/collection1/data/index/
   [junit4]   2> 533065 WARN  (coreLoadExecutor-1108-thread-1-processing-n:127.0.0.1:45143_) [n:127.0.0.1:45143_ c:collection1 s:shard2 r:core_node1 x:collection1] o.a.s.c.SolrCore [collection1] Solr index directory '/x1/jenkins/jenkins-slave/workspace/Lucene-Solr-Tests-5.x-Java7/solr/build/solr-core/test/J1/temp/solr.cloud.HttpPartitionTest_CFCD65694B24B9AA-001/shard-1-001/cores/collection1/data/index' doesn't exist. Creating new index...
   [junit4]   2> 533066 INFO  (coreLoadExecutor-1108-thread-1-processing-n:127.0.0.1:45143_) [n:127.0.0.1:45143_ c:collection1 s:shard2 r:core_node1 x:collection1] o.a.s.c.CachingDirectoryFactory return new directory for /x1/jenkins/jenkins-slave/workspace/Lucene-Solr-Tests-5.x-Java7/solr/build/solr-core/test/J1/temp/solr.cloud.HttpPartitionTest_CFCD65694B24B9AA-001/shard-1-001/cores/collection1/data/index
   [junit4]   2> 533066 INFO  (coreLoadExecutor-1108-thread-1-processing-n:127.0.0.1:45143_) [n:127.0.0.1:45143_ c:collection1 s:shard2 r:core_node1 x:collection1] o.a.s.u.RandomMergePolicy RandomMergePolicy wrapping class org.apache.lucene.index.LogByteSizeMergePolicy: [LogByteSizeMergePolicy: minMergeSize=1677721, mergeFactor=42, maxMergeSize=2147483648, maxMergeSizeForForcedMerge=9223372036854775807, calibrateSizeByDeletes=true, maxMergeDocs=2147483647, maxCFSSegmentSizeMB=8.796093022207999E12, noCFSRatio=1.0]
   [junit4]   2> 533066 INFO  (coreLoadExecutor-1108-thread-1-processing-n:127.0.0.1:45143_) [n:127.0.0.1:45143_ c:collection1 s:shard2 r:core_node1 x:collection1] o.a.s.c.SolrCore SolrDeletionPolicy.onCommit: commits: num=1
   [junit4]   2> 	commit{dir=MockDirectoryWrapper(RAMDirectory@6c4997b lockFactory=org.apache.lucene.store.SingleInstanceLockFactory@55385db5),segFN=segments_1,generation=1}
   [junit4]   2> 533066 INFO  (coreLoadExecutor-1108-thread-1-processing-n:127.0.0.1:45143_) [n:127.0.0.1:45143_ c:collection1 s:shard2 r:core_node1 x:collection1] o.a.s.c.SolrCore newest commit generation = 1
   [junit4]   2> 533072 INFO  (coreLoadExecutor-1108-thread-1-processing-n:127.0.0.1:45143_) [n:127.0.0.1:45143_ c:collection1 s:shard2 r:core_node1 x:collection1] o.a.s.u.p.UpdateRequestProcessorChain creating updateRequestProcessorChain "nodistrib"
   [junit4]   2> 533072 INFO  (coreLoadExecutor-1108-thread-1-processing-n:127.0.0.1:45143_) [n:127.0.0.1:45143_ c:collection1 s:shard2 r:core_node1 x:collection1] o.a.s.u.p.UpdateRequestProcessorChain creating updateRequestProcessorChain "dedupe"
   [junit4]   2> 533072 INFO  (coreLoadExecutor-1108-thread-1-processing-n:127.0.0.1:45143_) [n:127.0.0.1:45143_ c:collection1 s:shard2 r:core_node1 x:collection1] o.a.s.u.p.UpdateRequestProcessorChain inserting DistributedUpdateProcessorFactory into updateRequestProcessorChain "dedupe"
   [junit4]   2> 533072 INFO  (coreLoadExecutor-1108-thread-1-processing-n:127.0.0.1:45143_) [n:127.0.0.1:45143_ c:collection1 s:shard2 r:core_node1 x:collection1] o.a.s.u.p.UpdateRequestProcessorChain creating updateRequestProcessorChain "stored_sig"
   [junit4]   2> 533072 INFO  (coreLoadExecutor-1108-thread-1-processing-n:127.0.0.1:45143_) [n:127.0.0.1:45143_ c:collection1 s:shard2 r:core_node1 x:collection1] o.a.s.u.p.UpdateRequestProcessorChain inserting DistributedUpdateProcessorFactory into updateRequestProcessorChain "stored_sig"
   [junit4]   2> 533072 INFO  (coreLoadExecutor-1108-thread-1-processing-n:127.0.0.1:45143_) [n:127.0.0.1:45143_ c:collection1 s:shard2 r:core_node1 x:collection1] o.a.s.u.p.UpdateRequestProcessorChain creating updateRequestProcessorChain "distrib-dup-test-chain-explicit"
   [junit4]   2> 533073 INFO  (coreLoadExecutor-1108-thread-1-processing-n:127.0.0.1:45143_) [n:127.0.0.1:45143_ c:collection1 s:shard2 r:core_node1 x:collection1] o.a.s.u.p.UpdateRequestProcessorChain creating updateRequestProcessorChain "distrib-dup-test-chain-implicit"
   [junit4]   2> 533073 INFO  (coreLoadExecutor-1108-thread-1-processing-n:127.0.0.1:45143_) [n:127.0.0.1:45143_ c:collection1 s:shard2 r:core_node1 x:collection1] o.a.s.u.p.UpdateRequestProcessorChain inserting DistributedUpdateProcessorFactory into updateRequestProcessorChain "distrib-dup-test-chain-implicit"
   [junit4]   2> 533073 INFO  (coreLoadExecutor-1108-thread-1-processing-n:127.0.0.1:45143_) [n:127.0.0.1:45143_ c:collection1 s:shard2 r:core_node1 x:collection1] o.a.s.c.SolrCore no updateRequestProcessorChain defined as default, creating implicit default
   [junit4]   2> 533076 INFO  (coreLoadExecutor-1108-thread-1-processing-n:127.0.0.1:45143_) [n:127.0.0.1:45143_ c:collection1 s:shard2 r:core_node1 x:collection1] o.a.s.h.l.XMLLoader xsltCacheLifetimeSeconds=60
   [junit4]   2> 533077 INFO  (coreLoadExecutor-1108-thread-1-processing-n:127.0.0.1:45143_) [n:127.0.0.1:45143_ c:collection1 s:shard2 r:core_node1 x:collection1] o.a.s.h.l.XMLLoader xsltCacheLifetimeSeconds=60
   [junit4]   2> 533079 INFO  (coreLoadExecutor-1108-thread-1-processing-n:127.0.0.1:45143_) [n:127.0.0.1:45143_ c:collection1 s:shard2 r:core_node1 x:collection1] o.a.s.h.l.XMLLoader xsltCacheLifetimeSeconds=60
   [junit4]   2> 533079 INFO  (OldIndexDirectoryCleanupThreadForCore-collection1) [n:127.0.0.1:45143_ c:collection1 s:shard2 r:core_node1 x:collection1] o.a.s.c.SolrCore Looking for old index directories to cleanup for core collection1 in /x1/jenkins/jenkins-slave/workspace/Lucene-Solr-Tests-5.x-Java7/solr/build/solr-core/test/J1/temp/solr.cloud.HttpPartitionTest_CFCD65694B24B9AA-001/shard-1-001/cores/collection1/data/
   [junit4]   2> 533079 WARN  (OldIndexDirectoryCleanupThreadForCore-collection1) [n:127.0.0.1:45143_ c:collection1 s:shard2 r:core_node1 x:collection1] o.a.s.c.DirectoryFactory /x1/jenkins/jenkins-slave/workspace/Lucene-Solr-Tests-5.x-Java7/solr/build/solr-core/test/J1/temp/solr.cloud.HttpPartitionTest_CFCD65694B24B9AA-001/shard-1-001/cores/collection1/data/ does not point to a valid data directory; skipping clean-up of old index directories.
   [junit4]   2> 533081 INFO  (coreLoadExecutor-1108-thread-1-processing-n:127.0.0.1:45143_) [

[...truncated too long message...]

core_node1 x:collMinRf_1x3_shard1_replica3] o.a.s.c.CachingDirectoryFactory Closing MockDirectoryFactory - 2 directories currently being tracked
   [junit4]   2> 699073 INFO  (zkCallback-310-thread-2-processing-n:127.0.0.1:53451_) [n:127.0.0.1:53451_ c:collMinRf_1x3 s:shard1 r:core_node1 x:collMinRf_1x3_shard1_replica3] o.a.s.c.CachingDirectoryFactory looking to close /x1/jenkins/jenkins-slave/workspace/Lucene-Solr-Tests-5.x-Java7/solr/build/solr-core/test/J1/temp/solr.cloud.HttpPartitionTest_CFCD65694B24B9AA-001/shard-3-001/cores/collMinRf_1x3_shard1_replica3/data [CachedDir<<refCount=0;path=/x1/jenkins/jenkins-slave/workspace/Lucene-Solr-Tests-5.x-Java7/solr/build/solr-core/test/J1/temp/solr.cloud.HttpPartitionTest_CFCD65694B24B9AA-001/shard-3-001/cores/collMinRf_1x3_shard1_replica3/data;done=false>>]
   [junit4]   2> 699073 INFO  (zkCallback-310-thread-2-processing-n:127.0.0.1:53451_) [n:127.0.0.1:53451_ c:collMinRf_1x3 s:shard1 r:core_node1 x:collMinRf_1x3_shard1_replica3] o.a.s.c.CachingDirectoryFactory Closing directory: /x1/jenkins/jenkins-slave/workspace/Lucene-Solr-Tests-5.x-Java7/solr/build/solr-core/test/J1/temp/solr.cloud.HttpPartitionTest_CFCD65694B24B9AA-001/shard-3-001/cores/collMinRf_1x3_shard1_replica3/data
   [junit4]   2> 699073 INFO  (zkCallback-310-thread-2-processing-n:127.0.0.1:53451_) [n:127.0.0.1:53451_ c:collMinRf_1x3 s:shard1 r:core_node1 x:collMinRf_1x3_shard1_replica3] o.a.s.c.CachingDirectoryFactory looking to close /x1/jenkins/jenkins-slave/workspace/Lucene-Solr-Tests-5.x-Java7/solr/build/solr-core/test/J1/temp/solr.cloud.HttpPartitionTest_CFCD65694B24B9AA-001/shard-3-001/cores/collMinRf_1x3_shard1_replica3/data/index [CachedDir<<refCount=0;path=/x1/jenkins/jenkins-slave/workspace/Lucene-Solr-Tests-5.x-Java7/solr/build/solr-core/test/J1/temp/solr.cloud.HttpPartitionTest_CFCD65694B24B9AA-001/shard-3-001/cores/collMinRf_1x3_shard1_replica3/data/index;done=false>>]
   [junit4]   2> 699073 INFO  (zkCallback-310-thread-2-processing-n:127.0.0.1:53451_) [n:127.0.0.1:53451_ c:collMinRf_1x3 s:shard1 r:core_node1 x:collMinRf_1x3_shard1_replica3] o.a.s.c.CachingDirectoryFactory Closing directory: /x1/jenkins/jenkins-slave/workspace/Lucene-Solr-Tests-5.x-Java7/solr/build/solr-core/test/J1/temp/solr.cloud.HttpPartitionTest_CFCD65694B24B9AA-001/shard-3-001/cores/collMinRf_1x3_shard1_replica3/data/index
   [junit4]   2> 699074 INFO  (TEST-HttpPartitionTest.test-seed#[CFCD65694B24B9AA]) [    ] o.e.j.s.ServerConnector Stopped ServerConnector@4c47d576{HTTP/1.1}{127.0.0.1:0}
   [junit4]   2> 699074 INFO  (TEST-HttpPartitionTest.test-seed#[CFCD65694B24B9AA]) [    ] o.e.j.s.h.ContextHandler Stopped o.e.j.s.ServletContextHandler@67aec3dd{/,null,UNAVAILABLE}
   [junit4]   2> 699077 INFO  (TEST-HttpPartitionTest.test-seed#[CFCD65694B24B9AA]) [n:127.0.0.1:53451_ c:c8n_1x2_leader_session_loss s:shard1 r:core_node1 x:c8n_1x2_leader_session_loss_shard1_replica1] o.a.s.c.ZkTestServer connecting to 127.0.0.1:47412 47412
   [junit4]   2> 699201 INFO  (Thread-901) [    ] o.a.s.c.ZkTestServer connecting to 127.0.0.1:47412 47412
   [junit4]   2> 699203 WARN  (Thread-901) [    ] o.a.s.c.ZkTestServer Watch limit violations: 
   [junit4]   2> Maximum concurrent create/delete watches above limit:
   [junit4]   2> 
   [junit4]   2> 	5	/solr/aliases.json
   [junit4]   2> 	4	/solr/configs/conf1
   [junit4]   2> 	4	/solr/security.json
   [junit4]   2> 
   [junit4]   2> Maximum concurrent data watches above limit:
   [junit4]   2> 
   [junit4]   2> 	5	/solr/clusterstate.json
   [junit4]   2> 	2	/solr/collections/collMinRf_1x3/leader_elect/shard1/election/94626050627141643-core_node3-n_0000000000
   [junit4]   2> 
   [junit4]   2> Maximum concurrent children watches above limit:
   [junit4]   2> 
   [junit4]   2> 	5	/solr/collections
   [junit4]   2> 	5	/solr/live_nodes
   [junit4]   2> 	4	/solr/overseer/queue
   [junit4]   2> 	4	/solr/overseer/collection-queue-work
   [junit4]   2> 	2	/solr/overseer/queue-work
   [junit4]   2> 
   [junit4]   2> 699203 WARN  (TEST-HttpPartitionTest.test-seed#[CFCD65694B24B9AA]) [n:127.0.0.1:53451_ c:c8n_1x2_leader_session_loss s:shard1 r:core_node1 x:c8n_1x2_leader_session_loss_shard1_replica1] o.a.s.c.SocketProxy Closing 10 connections to: http://127.0.0.1:42002/, target: http://127.0.0.1:53698/
   [junit4]   2> 699203 WARN  (TEST-HttpPartitionTest.test-seed#[CFCD65694B24B9AA]) [n:127.0.0.1:53451_ c:c8n_1x2_leader_session_loss s:shard1 r:core_node1 x:c8n_1x2_leader_session_loss_shard1_replica1] o.a.s.c.SocketProxy Closing 4 connections to: http://127.0.0.1:45143/, target: http://127.0.0.1:56606/
   [junit4]   2> 699203 WARN  (TEST-HttpPartitionTest.test-seed#[CFCD65694B24B9AA]) [n:127.0.0.1:53451_ c:c8n_1x2_leader_session_loss s:shard1 r:core_node1 x:c8n_1x2_leader_session_loss_shard1_replica1] o.a.s.c.SocketProxy Closing 5 connections to: http://127.0.0.1:45373/, target: http://127.0.0.1:51603/
   [junit4]   2> 699204 WARN  (TEST-HttpPartitionTest.test-seed#[CFCD65694B24B9AA]) [n:127.0.0.1:53451_ c:c8n_1x2_leader_session_loss s:shard1 r:core_node1 x:c8n_1x2_leader_session_loss_shard1_replica1] o.a.s.c.SocketProxy Closing 20 connections to: http://127.0.0.1:53451/, target: http://127.0.0.1:55170/
   [junit4]   2> NOTE: reproduce with: ant test  -Dtestcase=HttpPartitionTest -Dtests.method=test -Dtests.seed=CFCD65694B24B9AA -Dtests.multiplier=2 -Dtests.slow=true -Dtests.locale=no -Dtests.timezone=America/Montreal -Dtests.asserts=true -Dtests.file.encoding=ISO-8859-1
   [junit4] FAILURE  171s J1 | HttpPartitionTest.test <<<
   [junit4]    > Throwable #1: java.lang.AssertionError: Doc with id=2 not found in http://127.0.0.1:42002/c8n_1x2_leader_session_loss due to: Path not found: /id; rsp={doc=null}
   [junit4]    > 	at __randomizedtesting.SeedInfo.seed([CFCD65694B24B9AA:47995AB3E5D8D452]:0)
   [junit4]    > 	at org.apache.solr.cloud.HttpPartitionTest.assertDocExists(HttpPartitionTest.java:622)
   [junit4]    > 	at org.apache.solr.cloud.HttpPartitionTest.assertDocsExistInAllReplicas(HttpPartitionTest.java:577)
   [junit4]    > 	at org.apache.solr.cloud.HttpPartitionTest.testLeaderZkSessionLoss(HttpPartitionTest.java:525)
   [junit4]    > 	at org.apache.solr.cloud.HttpPartitionTest.test(HttpPartitionTest.java:121)
   [junit4]    > 	at org.apache.solr.BaseDistributedSearchTestCase$ShardsRepeatRule$ShardsFixedStatement.callStatement(BaseDistributedSearchTestCase.java:963)
   [junit4]    > 	at org.apache.solr.BaseDistributedSearchTestCase$ShardsRepeatRule$ShardsStatement.evaluate(BaseDistributedSearchTestCase.java:938)
   [junit4]    > 	at java.lang.Thread.run(Thread.java:745)
   [junit4]   2> 699216 INFO  (SUITE-HttpPartitionTest-seed#[CFCD65694B24B9AA]-worker) [n:127.0.0.1:53451_ c:c8n_1x2_leader_session_loss s:shard1 r:core_node1 x:c8n_1x2_leader_session_loss_shard1_replica1] o.a.s.SolrTestCaseJ4 ###deleteCore
   [junit4]   2> NOTE: leaving temporary files on disk at: /x1/jenkins/jenkins-slave/workspace/Lucene-Solr-Tests-5.x-Java7/solr/build/solr-core/test/J1/temp/solr.cloud.HttpPartitionTest_CFCD65694B24B9AA-001
   [junit4]   2> Oct 03, 2015 9:31:57 AM com.carrotsearch.randomizedtesting.ThreadLeakControl checkThreadLeaks
   [junit4]   2> WARNING: Will linger awaiting termination of 1 leaked thread(s).
   [junit4]   2> NOTE: test params are: codec=Asserting(Lucene53), sim=DefaultSimilarity, locale=no, timezone=America/Montreal
   [junit4]   2> NOTE: Linux 3.13.0-52-generic amd64/Oracle Corporation 1.7.0_72 (64-bit)/cpus=4,threads=1,free=150847824,total=520617984
   [junit4]   2> NOTE: All tests run in this JVM: [ChaosMonkeyNothingIsSafeTest, DistanceUnitsTest, MinimalSchemaTest, TestSuggestSpellingConverter, TestBlendedInfixSuggestions, ConnectionManagerTest, SortByFunctionTest, TestWordDelimiterFilterFactory, TestPivotHelperCode, TestMissingGroups, CollectionStateFormat2Test, DOMUtilTest, CircularListTest, SpellPossibilityIteratorTest, SSLMigrationTest, CachingDirectoryFactoryTest, TestDFRSimilarityFactory, TestPartialUpdateDeduplication, DistanceFunctionTest, TestStressVersions, TestEmbeddedSolrServerConstructors, DocumentBuilderTest, TestQuerySenderNoQuery, TestFastOutputStream, TestCloudSchemaless, OutOfBoxZkACLAndCredentialsProvidersTest, TestQueryTypes, TestCustomDocTransformer, DocValuesMissingTest, AsyncMigrateRouteKeyTest, OverseerTaskQueueTest, TestTrie, TestFieldCollectionResource, AssignTest, TestHashPartitioner, CollectionsAPIDistributedZkTest, TestConfigSetImmutable, TestSimpleQParserPlugin, DistributedQueueTest, TestHighFrequencyDictionaryFactory, TestPKIAuthenticationPlugin, TestCustomSort, HttpPartitionTest]
   [junit4] Completed [158/539] on J1 in 171.80s, 1 test, 1 failure <<< FAILURES!

[...truncated 1203 lines...]
BUILD FAILED
/x1/jenkins/jenkins-slave/workspace/Lucene-Solr-Tests-5.x-Java7/build.xml:785: The following error occurred while executing this line:
/x1/jenkins/jenkins-slave/workspace/Lucene-Solr-Tests-5.x-Java7/build.xml:729: The following error occurred while executing this line:
/x1/jenkins/jenkins-slave/workspace/Lucene-Solr-Tests-5.x-Java7/build.xml:59: The following error occurred while executing this line:
/x1/jenkins/jenkins-slave/workspace/Lucene-Solr-Tests-5.x-Java7/solr/build.xml:233: The following error occurred while executing this line:
/x1/jenkins/jenkins-slave/workspace/Lucene-Solr-Tests-5.x-Java7/solr/common-build.xml:526: The following error occurred while executing this line:
/x1/jenkins/jenkins-slave/workspace/Lucene-Solr-Tests-5.x-Java7/lucene/common-build.xml:1452: The following error occurred while executing this line:
/x1/jenkins/jenkins-slave/workspace/Lucene-Solr-Tests-5.x-Java7/lucene/common-build.xml:1006: There were test failures: 539 suites (7 ignored), 2128 tests, 1 failure, 46 ignored (34 assumptions) [seed: CFCD65694B24B9AA]

Total time: 58 minutes 16 seconds
Build step 'Invoke Ant' marked build as failure
Archiving artifacts
Recording test results
Email was triggered for: Failure - Any
Sending email for trigger: Failure - Any



Mime
View raw message