lucene-dev mailing list archives

Site index · List index
Message view « Date » · « Thread »
Top « Date » · « Thread »
From Policeman Jenkins Server <jenk...@thetaphi.de>
Subject [JENKINS] Lucene-Solr-trunk-Windows (32bit/jdk1.8.0_60) - Build # 5352 - Failure!
Date Wed, 21 Oct 2015 20:50:34 GMT
Build: http://jenkins.thetaphi.de/job/Lucene-Solr-trunk-Windows/5352/
Java: 32bit/jdk1.8.0_60 -server -XX:+UseParallelGC

1 tests failed.
FAILED:  org.apache.lucene.util.bkd.TestBKD.testWithExceptions

Error Message:
files=[tmp963754152.bkd]

Stack Trace:
java.lang.AssertionError: files=[tmp963754152.bkd]
	at __randomizedtesting.SeedInfo.seed([C93AA19730F14CB1:6B693DEBBF7F034B]:0)
	at org.junit.Assert.fail(Assert.java:93)
	at org.junit.Assert.assertTrue(Assert.java:43)
	at org.apache.lucene.util.bkd.TestBKD.testWithExceptions(TestBKD.java:399)
	at sun.reflect.NativeMethodAccessorImpl.invoke0(Native Method)
	at sun.reflect.NativeMethodAccessorImpl.invoke(NativeMethodAccessorImpl.java:62)
	at sun.reflect.DelegatingMethodAccessorImpl.invoke(DelegatingMethodAccessorImpl.java:43)
	at java.lang.reflect.Method.invoke(Method.java:497)
	at com.carrotsearch.randomizedtesting.RandomizedRunner.invoke(RandomizedRunner.java:1665)
	at com.carrotsearch.randomizedtesting.RandomizedRunner$8.evaluate(RandomizedRunner.java:864)
	at com.carrotsearch.randomizedtesting.RandomizedRunner$9.evaluate(RandomizedRunner.java:900)
	at com.carrotsearch.randomizedtesting.RandomizedRunner$10.evaluate(RandomizedRunner.java:914)
	at org.apache.lucene.util.TestRuleSetupTeardownChained$1.evaluate(TestRuleSetupTeardownChained.java:50)
	at org.apache.lucene.util.AbstractBeforeAfterRule$1.evaluate(AbstractBeforeAfterRule.java:46)
	at org.apache.lucene.util.TestRuleThreadAndTestName$1.evaluate(TestRuleThreadAndTestName.java:49)
	at org.apache.lucene.util.TestRuleIgnoreAfterMaxFailures$1.evaluate(TestRuleIgnoreAfterMaxFailures.java:65)
	at org.apache.lucene.util.TestRuleMarkFailure$1.evaluate(TestRuleMarkFailure.java:48)
	at com.carrotsearch.randomizedtesting.rules.StatementAdapter.evaluate(StatementAdapter.java:36)
	at com.carrotsearch.randomizedtesting.ThreadLeakControl$StatementRunner.run(ThreadLeakControl.java:367)
	at com.carrotsearch.randomizedtesting.ThreadLeakControl.forkTimeoutingTask(ThreadLeakControl.java:809)
	at com.carrotsearch.randomizedtesting.ThreadLeakControl$3.evaluate(ThreadLeakControl.java:460)
	at com.carrotsearch.randomizedtesting.RandomizedRunner.runSingleTest(RandomizedRunner.java:873)
	at com.carrotsearch.randomizedtesting.RandomizedRunner$5.evaluate(RandomizedRunner.java:775)
	at com.carrotsearch.randomizedtesting.RandomizedRunner$6.evaluate(RandomizedRunner.java:809)
	at com.carrotsearch.randomizedtesting.RandomizedRunner$7.evaluate(RandomizedRunner.java:820)
	at org.apache.lucene.util.AbstractBeforeAfterRule$1.evaluate(AbstractBeforeAfterRule.java:46)
	at com.carrotsearch.randomizedtesting.rules.StatementAdapter.evaluate(StatementAdapter.java:36)
	at org.apache.lucene.util.TestRuleStoreClassName$1.evaluate(TestRuleStoreClassName.java:42)
	at com.carrotsearch.randomizedtesting.rules.NoShadowingOrOverridesOnMethodsRule$1.evaluate(NoShadowingOrOverridesOnMethodsRule.java:39)
	at com.carrotsearch.randomizedtesting.rules.NoShadowingOrOverridesOnMethodsRule$1.evaluate(NoShadowingOrOverridesOnMethodsRule.java:39)
	at com.carrotsearch.randomizedtesting.rules.StatementAdapter.evaluate(StatementAdapter.java:36)
	at com.carrotsearch.randomizedtesting.rules.StatementAdapter.evaluate(StatementAdapter.java:36)
	at com.carrotsearch.randomizedtesting.rules.StatementAdapter.evaluate(StatementAdapter.java:36)
	at org.apache.lucene.util.TestRuleAssertionsRequired$1.evaluate(TestRuleAssertionsRequired.java:54)
	at org.apache.lucene.util.TestRuleMarkFailure$1.evaluate(TestRuleMarkFailure.java:48)
	at org.apache.lucene.util.TestRuleIgnoreAfterMaxFailures$1.evaluate(TestRuleIgnoreAfterMaxFailures.java:65)
	at org.apache.lucene.util.TestRuleIgnoreTestSuites$1.evaluate(TestRuleIgnoreTestSuites.java:55)
	at com.carrotsearch.randomizedtesting.rules.StatementAdapter.evaluate(StatementAdapter.java:36)
	at com.carrotsearch.randomizedtesting.ThreadLeakControl$StatementRunner.run(ThreadLeakControl.java:367)
	at java.lang.Thread.run(Thread.java:745)
	Suppressed: java.lang.RuntimeException: MockDirectoryWrapper: cannot close: there are still
open files: {tmp963754152.bkd=1}
		at org.apache.lucene.store.MockDirectoryWrapper.close(MockDirectoryWrapper.java:764)
		at org.apache.lucene.util.bkd.TestBKD.testWithExceptions(TestBKD.java:400)
		... 36 more
	Caused by: java.lang.RuntimeException: unclosed IndexOutput: tmp963754152.bkd
		at org.apache.lucene.store.MockDirectoryWrapper.addFileHandle(MockDirectoryWrapper.java:652)
		at org.apache.lucene.store.MockDirectoryWrapper.createTempOutput(MockDirectoryWrapper.java:624)
		at org.apache.lucene.store.TrackingDirectoryWrapper.createTempOutput(TrackingDirectoryWrapper.java:51)
		at org.apache.lucene.util.bkd.OfflinePointWriter.<init>(OfflinePointWriter.java:39)
		at org.apache.lucene.util.bkd.BKDWriter.switchToOffline(BKDWriter.java:180)
		at org.apache.lucene.util.bkd.BKDWriter.add(BKDWriter.java:199)
		at org.apache.lucene.util.bkd.TestBKD.verify(TestBKD.java:564)
		at org.apache.lucene.util.bkd.TestBKD.testWithExceptions(TestBKD.java:383)
		... 36 more




Build Log:
[...truncated 1792 lines...]
   [junit4] Suite: org.apache.lucene.util.bkd.TestBKD
   [junit4]   1> DIR: MockDirectoryWrapper(RAMDirectory@187aeb3 lockFactory=org.apache.lucene.store.SingleInstanceLockFactory@1c6fd3e)
   [junit4]   1> DIR: MockDirectoryWrapper(RAMDirectory@52bc1c lockFactory=org.apache.lucene.store.SingleInstanceLockFactory@78065)
   [junit4]   1> DIR: MockDirectoryWrapper(RAMDirectory@9bf764 lockFactory=org.apache.lucene.store.SingleInstanceLockFactory@2b503a)
   [junit4] IGNOR/A 0.00s J0 | TestBKD.testRandomBinaryBig
   [junit4]    > Assumption #1: 'nightly' test group is disabled (@Nightly())
   [junit4]   1> DIR: MockDirectoryWrapper(RAMDirectory@1d79e75 lockFactory=org.apache.lucene.store.SingleInstanceLockFactory@11c9e4e)
   [junit4]   1> DIR: MockDirectoryWrapper(RAMDirectory@1b4e0bc lockFactory=org.apache.lucene.store.SingleInstanceLockFactory@d7e36a)
   [junit4]   1> DIR: MockDirectoryWrapper(RAMDirectory@1f6390 lockFactory=org.apache.lucene.store.SingleInstanceLockFactory@1fa1c8a)
   [junit4]   1> DIR: MockDirectoryWrapper(RAMDirectory@1928f70 lockFactory=org.apache.lucene.store.SingleInstanceLockFactory@73cf44)
   [junit4]   1> DIR: MockDirectoryWrapper(RAMDirectory@1231a30 lockFactory=org.apache.lucene.store.SingleInstanceLockFactory@ed77c2)
   [junit4]   1> DIR: MockDirectoryWrapper(RAMDirectory@15096a1 lockFactory=org.apache.lucene.store.SingleInstanceLockFactory@1f9e970)
   [junit4]   2> NOTE: reproduce with: ant test  -Dtestcase=TestBKD -Dtests.method=testWithExceptions
-Dtests.seed=C93AA19730F14CB1 -Dtests.slow=true -Dtests.locale=no_NO_NY -Dtests.timezone=Pacific/Nauru
-Dtests.asserts=true -Dtests.file.encoding=ISO-8859-1
   [junit4] FAILURE 0.03s J0 | TestBKD.testWithExceptions <<<
   [junit4]    > Throwable #1: java.lang.AssertionError: files=[tmp963754152.bkd]
   [junit4]    > 	at __randomizedtesting.SeedInfo.seed([C93AA19730F14CB1:6B693DEBBF7F034B]:0)
   [junit4]    > 	at org.apache.lucene.util.bkd.TestBKD.testWithExceptions(TestBKD.java:399)
   [junit4]    > 	at java.lang.Thread.run(Thread.java:745)
   [junit4]    > 	Suppressed: java.lang.RuntimeException: MockDirectoryWrapper: cannot
close: there are still open files: {tmp963754152.bkd=1}
   [junit4]    > 		at org.apache.lucene.store.MockDirectoryWrapper.close(MockDirectoryWrapper.java:764)
   [junit4]    > 		at org.apache.lucene.util.bkd.TestBKD.testWithExceptions(TestBKD.java:400)
   [junit4]    > 		... 36 more
   [junit4]    > 	Caused by: java.lang.RuntimeException: unclosed IndexOutput: tmp963754152.bkd
   [junit4]    > 		at org.apache.lucene.store.MockDirectoryWrapper.addFileHandle(MockDirectoryWrapper.java:652)
   [junit4]    > 		at org.apache.lucene.store.MockDirectoryWrapper.createTempOutput(MockDirectoryWrapper.java:624)
   [junit4]    > 		at org.apache.lucene.store.TrackingDirectoryWrapper.createTempOutput(TrackingDirectoryWrapper.java:51)
   [junit4]    > 		at org.apache.lucene.util.bkd.OfflinePointWriter.<init>(OfflinePointWriter.java:39)
   [junit4]    > 		at org.apache.lucene.util.bkd.BKDWriter.switchToOffline(BKDWriter.java:180)
   [junit4]    > 		at org.apache.lucene.util.bkd.BKDWriter.add(BKDWriter.java:199)
   [junit4]    > 		at org.apache.lucene.util.bkd.TestBKD.verify(TestBKD.java:564)
   [junit4]    > 		at org.apache.lucene.util.bkd.TestBKD.testWithExceptions(TestBKD.java:383)
   [junit4]    > 		... 36 more
   [junit4]   2> NOTE: leaving temporary files on disk at: C:\Users\JenkinsSlave\workspace\Lucene-Solr-trunk-Windows\lucene\build\core\test\J0\temp\lucene.util.bkd.TestBKD_C93AA19730F14CB1-001
   [junit4]   2> NOTE: test params are: codec=Asserting(Lucene53): {}, docValues:{}, sim=ClassicSimilarity,
locale=no_NO_NY, timezone=Pacific/Nauru
   [junit4]   2> NOTE: Windows 7 6.1 x86/Oracle Corporation 1.8.0_60 (32-bit)/cpus=3,threads=1,free=85527928,total=271056896
   [junit4]   2> NOTE: All tests run in this JVM: [TestFilterLeafReader, TestSegmentReader,
TestApproximationSearchEquivalence, TestBagOfPositions, TestShardSearching, TestFieldReuse,
TestIndexWriterForceMerge, TestSegmentTermEnum, TestSimpleSearchEquivalence, TestIndexWriterThreadsToSegments,
TestTermsEnum, TestSynonymQuery, TestFieldValueQuery, TestTermScorer, Test2BPagedBytes, TestInfoStream,
TestLucene50DocValuesFormat, TestRamUsageEstimator, TestIndexWriter, TestRAMDirectory, TestScorerPerf,
Test2BBinaryDocValues, TestSingleInstanceLockFactory, TestParallelCompositeReader, TestMultiValuedNumericRangeQuery,
TestDocIdSetBuilder, TestAutomatonQueryUnicode, TestParallelTermEnum, TestRollingUpdates,
TestConcurrentMergeScheduler, Test2BPostingsBytes, TestCollectionUtil, TestTimSorter, TestDisjunctionMaxQuery,
TestNearSpansOrdered, TestCodecHoldsOpenFiles, TestConstantScoreQuery, TestMutableValues,
TestField, TestIndexWriterMerging, Test2BNumericDocValues, TestFixedBitDocIdSet, TestNot,
TestSegmentTermDocs, TestDocsAndPositions, TestMathUtil, TestIsCurrent, TestBoolean2, TestBooleanQuery,
TestDirectory, TestManyFields, TestSpanTermQuery, TestLucene50SegmentInfoFormat, TestComplexExplanations,
TestFlushByRamOrCountsPolicy, TestPostingsOffsets, TestPagedBytes, TestSpanContainQuery, TestFilterSpans,
TestMultiLevelSkipList, TestStressNRT, TestLazyProxSkipping, TestInPlaceMergeSorter, TestOperations,
TestNGramPhraseQuery, TestWindowsMMap, TestControlledRealTimeReopenThread, TestIndexCommit,
TestPerFieldPostingsFormat, TestNRTReaderCleanup, Test2BTerms, TestBagOfPostings, TestFlex,
TestNIOFSDirectory, TestNeverDelete, TestSparseFixedBitDocIdSet, TestBlockPostingsFormat3,
TestNorms, TestPhrasePrefixQuery, TestSloppyMath, TestSimpleExplanationsOfNonMatches, TestBytesRef,
TestNamedSPILoader, TestVersion, TestSmallFloat, TestIndexWriterDelete, TestCrashCausesCorruptIndex,
TestSegmentInfos, TestCachingWrapperQuery, TestWeakIdentityMap, TestSimpleExplanations, TestLucene50StoredFieldsFormat,
TestPrefixInBooleanQuery, TestExternalCodecs, TestSameTokenSamePosition, TestQueryRescorer,
TestDuelingCodecs, TestAllFilesHaveCodecHeader, TestIndexWriterDeleteByQuery, TestSpanNotQuery,
TestPerFieldDocValuesFormat, TestIndexWriterReader, TestFSTs, TestBytesStore, TestIndexWriterWithThreads,
TestAddIndexes, TestIndexWriterExceptions, TestBasics, TestNRTThreads, TestIndexWriterCommit,
TestDirectoryReaderReopen, TestTimeLimitingCollector, TestTopDocsMerge, TestStressIndexing,
TestMinimize, TestSnapshotDeletionPolicy, TestNRTReaderWithThreads, TestBufferedIndexInput,
TestDirectoryReader, TestRegexpRandom2, TestFastDecompressionMode, TestTransactions, TestMultiDocValues,
TestToken, TestDocValuesIndexing, TestSimilarityBase, TestDeterminizeLexicon, TestIndexWriterOnDiskFull,
TestTransactionRollback, TestUTF32ToUTF8, TestTermVectorsWriter, TestCodecs, TestParallelLeafReader,
TestBytesRefHash, TestSloppyPhraseQuery2, TestForceMergeForever, TestOmitTf, TestMultiFields,
TestDocumentWriter, TestLiveFieldValues, TestWildcard, TestSimilarity2, TestRegexpQuery, TestPerSegmentDeletes,
TestTopDocsCollector, TestUniqueTermCount, TestSortRandom, TestDocument, TestSumDocFreq, TestIndexableField,
TestDocValuesScoring, TestWildcardRandom, TestRegexpRandom, TestCheckIndex, TestPayloadsOnVectors,
TestSpanMultiTermQueryWrapper, TestSizeBoundedForceMerge, TestIndexFileDeleter, TestCompiledAutomaton,
TestSubScorerFreqs, TestMultiTermQueryRewrites, TestSimilarity, TestRollingBuffer, TestSearch,
TestFilterIterator, Test2BPostings, TestAttributeSource, TestRecyclingByteBlockAllocator,
TestSpanFirstQuery, TestNoMergeScheduler, TestAssertions, TestRollback, Test4GBStoredFields,
TestDocBoost, TestSimpleAttributeImpl, Test2BPositions, TestPositiveScoresOnlyCollector, TestByteArrayDataInput,
TestReusableStringReader, TestGrowableByteArrayDataOutput, TestDocInverterPerFieldErrorInfo,
TestDocValues, TestDuelingCodecsAtNight, TestExceedMaxTermLength, TestExitableDirectoryReader,
TestFilterDirectoryReader, TestIndexReaderClose, TestIndexWriterExceptions2, TestIndexWriterMaxDocs,
TestIndexWriterOutOfMemory, TestLogMergePolicy, TestMaxPosition, TestMergeRateLimiter, TestMixedDocValuesUpdates,
TestReadOnlyIndex, TestReaderWrapperDVTypeCheck, TestBlendedTermQuery, TestIndexSearcher,
TestMatchNoDocsQuery, TestMultiset, TestNeedsScores, TestQueryCachingPolicy, TestSortRescorer,
TestSortedNumericSortField, TestSortedSetSelector, TestSortedSetSortField, TestSpanBoostQuery,
TestSpanOrQuery, TestSpansEnum, TestFilterDirectory, TestNativeFSLockFactory, TestSleepingLockWrapper,
TestBytesRefArray, TestFrequencyTrackingRingBuffer, TestIntroSorter, TestMergedIterator, TestBKD]
   [junit4] Completed [399/399] on J0 in 2.63s, 11 tests, 1 failure, 1 skipped <<<
FAILURES!

[...truncated 10 lines...]
BUILD FAILED
C:\Users\JenkinsSlave\workspace\Lucene-Solr-trunk-Windows\build.xml:775: The following error
occurred while executing this line:
C:\Users\JenkinsSlave\workspace\Lucene-Solr-trunk-Windows\build.xml:719: The following error
occurred while executing this line:
C:\Users\JenkinsSlave\workspace\Lucene-Solr-trunk-Windows\build.xml:59: The following error
occurred while executing this line:
C:\Users\JenkinsSlave\workspace\Lucene-Solr-trunk-Windows\lucene\build.xml:50: The following
error occurred while executing this line:
C:\Users\JenkinsSlave\workspace\Lucene-Solr-trunk-Windows\lucene\common-build.xml:1432: The
following error occurred while executing this line:
C:\Users\JenkinsSlave\workspace\Lucene-Solr-trunk-Windows\lucene\common-build.xml:987: There
were test failures: 399 suites (1 ignored), 3238 tests, 1 failure, 60 ignored (56 assumptions)
[seed: C93AA19730F14CB1]

Total time: 5 minutes 29 seconds
Build step 'Invoke Ant' marked build as failure
Archiving artifacts
[WARNINGS] Skipping publisher since build result is FAILURE
Recording test results
Email was triggered for: Failure - Any
Sending email for trigger: Failure - Any



Mime
View raw message