lucene-dev mailing list archives

Site index · List index
Message view « Date » · « Thread »
Top « Date » · « Thread »
From Policeman Jenkins Server <jenk...@thetaphi.de>
Subject [JENKINS] Lucene-Solr-trunk-Linux (64bit/jdk1.8.0_60) - Build # 14384 - Still Failing!
Date Fri, 02 Oct 2015 21:24:12 GMT
Build: http://jenkins.thetaphi.de/job/Lucene-Solr-trunk-Linux/14384/
Java: 64bit/jdk1.8.0_60 -XX:-UseCompressedOops -XX:+UseConcMarkSweepGC

1 tests failed.
FAILED:  org.apache.solr.handler.TestSQLHandler.doTest

Error Message:
--> http://127.0.0.1:58687/_qxs/collection1:java.util.concurrent.ExecutionException: java.io.IOException: --> http://127.0.0.1:36616/_qxs/collection1/: An exception has occurred on the server, refer to server log for details.

Stack Trace:
java.io.IOException: --> http://127.0.0.1:58687/_qxs/collection1:java.util.concurrent.ExecutionException: java.io.IOException: --> http://127.0.0.1:36616/_qxs/collection1/: An exception has occurred on the server, refer to server log for details.
	at __randomizedtesting.SeedInfo.seed([CB2E2824C5796AD4:6C6A9080A8C2796D]:0)
	at org.apache.solr.client.solrj.io.stream.SolrStream.read(SolrStream.java:178)
	at org.apache.solr.handler.TestSQLHandler.getTuples(TestSQLHandler.java:1317)
	at org.apache.solr.handler.TestSQLHandler.testBasicSelect(TestSQLHandler.java:232)
	at org.apache.solr.handler.TestSQLHandler.doTest(TestSQLHandler.java:96)
	at sun.reflect.NativeMethodAccessorImpl.invoke0(Native Method)
	at sun.reflect.NativeMethodAccessorImpl.invoke(NativeMethodAccessorImpl.java:62)
	at sun.reflect.DelegatingMethodAccessorImpl.invoke(DelegatingMethodAccessorImpl.java:43)
	at java.lang.reflect.Method.invoke(Method.java:497)
	at com.carrotsearch.randomizedtesting.RandomizedRunner.invoke(RandomizedRunner.java:1665)
	at com.carrotsearch.randomizedtesting.RandomizedRunner$8.evaluate(RandomizedRunner.java:864)
	at com.carrotsearch.randomizedtesting.RandomizedRunner$9.evaluate(RandomizedRunner.java:900)
	at com.carrotsearch.randomizedtesting.RandomizedRunner$10.evaluate(RandomizedRunner.java:914)
	at org.apache.solr.BaseDistributedSearchTestCase$ShardsRepeatRule$ShardsFixedStatement.callStatement(BaseDistributedSearchTestCase.java:963)
	at org.apache.solr.BaseDistributedSearchTestCase$ShardsRepeatRule$ShardsStatement.evaluate(BaseDistributedSearchTestCase.java:938)
	at com.carrotsearch.randomizedtesting.rules.SystemPropertiesRestoreRule$1.evaluate(SystemPropertiesRestoreRule.java:57)
	at org.apache.lucene.util.TestRuleSetupTeardownChained$1.evaluate(TestRuleSetupTeardownChained.java:50)
	at org.apache.lucene.util.AbstractBeforeAfterRule$1.evaluate(AbstractBeforeAfterRule.java:46)
	at org.apache.lucene.util.TestRuleThreadAndTestName$1.evaluate(TestRuleThreadAndTestName.java:49)
	at org.apache.lucene.util.TestRuleIgnoreAfterMaxFailures$1.evaluate(TestRuleIgnoreAfterMaxFailures.java:65)
	at org.apache.lucene.util.TestRuleMarkFailure$1.evaluate(TestRuleMarkFailure.java:48)
	at com.carrotsearch.randomizedtesting.rules.StatementAdapter.evaluate(StatementAdapter.java:36)
	at com.carrotsearch.randomizedtesting.ThreadLeakControl$StatementRunner.run(ThreadLeakControl.java:367)
	at com.carrotsearch.randomizedtesting.ThreadLeakControl.forkTimeoutingTask(ThreadLeakControl.java:809)
	at com.carrotsearch.randomizedtesting.ThreadLeakControl$3.evaluate(ThreadLeakControl.java:460)
	at com.carrotsearch.randomizedtesting.RandomizedRunner.runSingleTest(RandomizedRunner.java:873)
	at com.carrotsearch.randomizedtesting.RandomizedRunner$5.evaluate(RandomizedRunner.java:775)
	at com.carrotsearch.randomizedtesting.RandomizedRunner$6.evaluate(RandomizedRunner.java:809)
	at com.carrotsearch.randomizedtesting.RandomizedRunner$7.evaluate(RandomizedRunner.java:820)
	at com.carrotsearch.randomizedtesting.rules.StatementAdapter.evaluate(StatementAdapter.java:36)
	at com.carrotsearch.randomizedtesting.rules.SystemPropertiesRestoreRule$1.evaluate(SystemPropertiesRestoreRule.java:57)
	at org.apache.lucene.util.AbstractBeforeAfterRule$1.evaluate(AbstractBeforeAfterRule.java:46)
	at com.carrotsearch.randomizedtesting.rules.StatementAdapter.evaluate(StatementAdapter.java:36)
	at org.apache.lucene.util.TestRuleStoreClassName$1.evaluate(TestRuleStoreClassName.java:42)
	at com.carrotsearch.randomizedtesting.rules.NoShadowingOrOverridesOnMethodsRule$1.evaluate(NoShadowingOrOverridesOnMethodsRule.java:39)
	at com.carrotsearch.randomizedtesting.rules.NoShadowingOrOverridesOnMethodsRule$1.evaluate(NoShadowingOrOverridesOnMethodsRule.java:39)
	at com.carrotsearch.randomizedtesting.rules.StatementAdapter.evaluate(StatementAdapter.java:36)
	at com.carrotsearch.randomizedtesting.rules.StatementAdapter.evaluate(StatementAdapter.java:36)
	at com.carrotsearch.randomizedtesting.rules.StatementAdapter.evaluate(StatementAdapter.java:36)
	at org.apache.lucene.util.TestRuleAssertionsRequired$1.evaluate(TestRuleAssertionsRequired.java:54)
	at org.apache.lucene.util.TestRuleMarkFailure$1.evaluate(TestRuleMarkFailure.java:48)
	at org.apache.lucene.util.TestRuleIgnoreAfterMaxFailures$1.evaluate(TestRuleIgnoreAfterMaxFailures.java:65)
	at org.apache.lucene.util.TestRuleIgnoreTestSuites$1.evaluate(TestRuleIgnoreTestSuites.java:55)
	at com.carrotsearch.randomizedtesting.rules.StatementAdapter.evaluate(StatementAdapter.java:36)
	at com.carrotsearch.randomizedtesting.ThreadLeakControl$StatementRunner.run(ThreadLeakControl.java:367)
	at java.lang.Thread.run(Thread.java:745)




Build Log:
[...truncated 10568 lines...]
   [junit4] Suite: org.apache.solr.handler.TestSQLHandler
   [junit4]   2> Creating dataDir: /home/jenkins/workspace/Lucene-Solr-trunk-Linux/solr/build/solr-core/test/J0/temp/solr.handler.TestSQLHandler_CB2E2824C5796AD4-001/init-core-data-001
   [junit4]   2> 1483454 INFO  (SUITE-TestSQLHandler-seed#[CB2E2824C5796AD4]-worker) [    ] o.a.s.SolrTestCaseJ4 Randomized ssl (false) and clientAuth (false)
   [junit4]   2> 1483454 INFO  (SUITE-TestSQLHandler-seed#[CB2E2824C5796AD4]-worker) [    ] o.a.s.BaseDistributedSearchTestCase Setting hostContext system property: /_qxs/
   [junit4]   2> 1483456 INFO  (TEST-TestSQLHandler.doTest-seed#[CB2E2824C5796AD4]) [    ] o.a.s.c.ZkTestServer STARTING ZK TEST SERVER
   [junit4]   2> 1483456 INFO  (Thread-3540) [    ] o.a.s.c.ZkTestServer client port:0.0.0.0/0.0.0.0:0
   [junit4]   2> 1483456 INFO  (Thread-3540) [    ] o.a.s.c.ZkTestServer Starting server
   [junit4]   2> 1483556 INFO  (TEST-TestSQLHandler.doTest-seed#[CB2E2824C5796AD4]) [    ] o.a.s.c.ZkTestServer start zk server on port:53133
   [junit4]   2> 1483556 INFO  (TEST-TestSQLHandler.doTest-seed#[CB2E2824C5796AD4]) [    ] o.a.s.c.c.SolrZkClient Using default ZkCredentialsProvider
   [junit4]   2> 1483556 INFO  (TEST-TestSQLHandler.doTest-seed#[CB2E2824C5796AD4]) [    ] o.a.s.c.c.ConnectionManager Waiting for client to connect to ZooKeeper
   [junit4]   2> 1483558 INFO  (zkCallback-1144-thread-1) [    ] o.a.s.c.c.ConnectionManager Watcher org.apache.solr.common.cloud.ConnectionManager@3ad54319 name:ZooKeeperConnection Watcher:127.0.0.1:53133 got event WatchedEvent state:SyncConnected type:None path:null path:null type:None
   [junit4]   2> 1483558 INFO  (TEST-TestSQLHandler.doTest-seed#[CB2E2824C5796AD4]) [    ] o.a.s.c.c.ConnectionManager Client is connected to ZooKeeper
   [junit4]   2> 1483558 INFO  (TEST-TestSQLHandler.doTest-seed#[CB2E2824C5796AD4]) [    ] o.a.s.c.c.SolrZkClient Using default ZkACLProvider
   [junit4]   2> 1483558 INFO  (TEST-TestSQLHandler.doTest-seed#[CB2E2824C5796AD4]) [    ] o.a.s.c.c.SolrZkClient makePath: /solr
   [junit4]   2> 1483559 INFO  (TEST-TestSQLHandler.doTest-seed#[CB2E2824C5796AD4]) [    ] o.a.s.c.c.SolrZkClient Using default ZkCredentialsProvider
   [junit4]   2> 1483560 INFO  (TEST-TestSQLHandler.doTest-seed#[CB2E2824C5796AD4]) [    ] o.a.s.c.c.ConnectionManager Waiting for client to connect to ZooKeeper
   [junit4]   2> 1483560 INFO  (zkCallback-1145-thread-1) [    ] o.a.s.c.c.ConnectionManager Watcher org.apache.solr.common.cloud.ConnectionManager@44010f00 name:ZooKeeperConnection Watcher:127.0.0.1:53133/solr got event WatchedEvent state:SyncConnected type:None path:null path:null type:None
   [junit4]   2> 1483560 INFO  (TEST-TestSQLHandler.doTest-seed#[CB2E2824C5796AD4]) [    ] o.a.s.c.c.ConnectionManager Client is connected to ZooKeeper
   [junit4]   2> 1483560 INFO  (TEST-TestSQLHandler.doTest-seed#[CB2E2824C5796AD4]) [    ] o.a.s.c.c.SolrZkClient Using default ZkACLProvider
   [junit4]   2> 1483560 INFO  (TEST-TestSQLHandler.doTest-seed#[CB2E2824C5796AD4]) [    ] o.a.s.c.c.SolrZkClient makePath: /collections/collection1
   [junit4]   2> 1483561 INFO  (TEST-TestSQLHandler.doTest-seed#[CB2E2824C5796AD4]) [    ] o.a.s.c.c.SolrZkClient makePath: /collections/collection1/shards
   [junit4]   2> 1483562 INFO  (TEST-TestSQLHandler.doTest-seed#[CB2E2824C5796AD4]) [    ] o.a.s.c.c.SolrZkClient makePath: /collections/control_collection
   [junit4]   2> 1483562 INFO  (TEST-TestSQLHandler.doTest-seed#[CB2E2824C5796AD4]) [    ] o.a.s.c.c.SolrZkClient makePath: /collections/control_collection/shards
   [junit4]   2> 1483563 INFO  (TEST-TestSQLHandler.doTest-seed#[CB2E2824C5796AD4]) [    ] o.a.s.c.AbstractZkTestCase put /home/jenkins/workspace/Lucene-Solr-trunk-Linux/solr/core/src/test-files/solr/collection1/conf/solrconfig-sql.xml to /configs/conf1/solrconfig.xml
   [junit4]   2> 1483563 INFO  (TEST-TestSQLHandler.doTest-seed#[CB2E2824C5796AD4]) [    ] o.a.s.c.c.SolrZkClient makePath: /configs/conf1/solrconfig.xml
   [junit4]   2> 1483563 INFO  (TEST-TestSQLHandler.doTest-seed#[CB2E2824C5796AD4]) [    ] o.a.s.c.AbstractZkTestCase put /home/jenkins/workspace/Lucene-Solr-trunk-Linux/solr/core/src/test-files/solr/collection1/conf/schema-sql.xml to /configs/conf1/schema.xml
   [junit4]   2> 1483563 INFO  (TEST-TestSQLHandler.doTest-seed#[CB2E2824C5796AD4]) [    ] o.a.s.c.c.SolrZkClient makePath: /configs/conf1/schema.xml
   [junit4]   2> 1483564 INFO  (TEST-TestSQLHandler.doTest-seed#[CB2E2824C5796AD4]) [    ] o.a.s.c.AbstractZkTestCase put /home/jenkins/workspace/Lucene-Solr-trunk-Linux/solr/core/src/test-files/solr/collection1/conf/solrconfig.snippet.randomindexconfig.xml to /configs/conf1/solrconfig.snippet.randomindexconfig.xml
   [junit4]   2> 1483564 INFO  (TEST-TestSQLHandler.doTest-seed#[CB2E2824C5796AD4]) [    ] o.a.s.c.c.SolrZkClient makePath: /configs/conf1/solrconfig.snippet.randomindexconfig.xml
   [junit4]   2> 1483565 INFO  (TEST-TestSQLHandler.doTest-seed#[CB2E2824C5796AD4]) [    ] o.a.s.c.AbstractZkTestCase put /home/jenkins/workspace/Lucene-Solr-trunk-Linux/solr/core/src/test-files/solr/collection1/conf/stopwords.txt to /configs/conf1/stopwords.txt
   [junit4]   2> 1483565 INFO  (TEST-TestSQLHandler.doTest-seed#[CB2E2824C5796AD4]) [    ] o.a.s.c.c.SolrZkClient makePath: /configs/conf1/stopwords.txt
   [junit4]   2> 1483565 INFO  (TEST-TestSQLHandler.doTest-seed#[CB2E2824C5796AD4]) [    ] o.a.s.c.AbstractZkTestCase put /home/jenkins/workspace/Lucene-Solr-trunk-Linux/solr/core/src/test-files/solr/collection1/conf/protwords.txt to /configs/conf1/protwords.txt
   [junit4]   2> 1483565 INFO  (TEST-TestSQLHandler.doTest-seed#[CB2E2824C5796AD4]) [    ] o.a.s.c.c.SolrZkClient makePath: /configs/conf1/protwords.txt
   [junit4]   2> 1483566 INFO  (TEST-TestSQLHandler.doTest-seed#[CB2E2824C5796AD4]) [    ] o.a.s.c.AbstractZkTestCase put /home/jenkins/workspace/Lucene-Solr-trunk-Linux/solr/core/src/test-files/solr/collection1/conf/currency.xml to /configs/conf1/currency.xml
   [junit4]   2> 1483566 INFO  (TEST-TestSQLHandler.doTest-seed#[CB2E2824C5796AD4]) [    ] o.a.s.c.c.SolrZkClient makePath: /configs/conf1/currency.xml
   [junit4]   2> 1483566 INFO  (TEST-TestSQLHandler.doTest-seed#[CB2E2824C5796AD4]) [    ] o.a.s.c.AbstractZkTestCase put /home/jenkins/workspace/Lucene-Solr-trunk-Linux/solr/core/src/test-files/solr/collection1/conf/enumsConfig.xml to /configs/conf1/enumsConfig.xml
   [junit4]   2> 1483566 INFO  (TEST-TestSQLHandler.doTest-seed#[CB2E2824C5796AD4]) [    ] o.a.s.c.c.SolrZkClient makePath: /configs/conf1/enumsConfig.xml
   [junit4]   2> 1483567 INFO  (TEST-TestSQLHandler.doTest-seed#[CB2E2824C5796AD4]) [    ] o.a.s.c.AbstractZkTestCase put /home/jenkins/workspace/Lucene-Solr-trunk-Linux/solr/core/src/test-files/solr/collection1/conf/open-exchange-rates.json to /configs/conf1/open-exchange-rates.json
   [junit4]   2> 1483567 INFO  (TEST-TestSQLHandler.doTest-seed#[CB2E2824C5796AD4]) [    ] o.a.s.c.c.SolrZkClient makePath: /configs/conf1/open-exchange-rates.json
   [junit4]   2> 1483567 INFO  (TEST-TestSQLHandler.doTest-seed#[CB2E2824C5796AD4]) [    ] o.a.s.c.AbstractZkTestCase put /home/jenkins/workspace/Lucene-Solr-trunk-Linux/solr/core/src/test-files/solr/collection1/conf/mapping-ISOLatin1Accent.txt to /configs/conf1/mapping-ISOLatin1Accent.txt
   [junit4]   2> 1483568 INFO  (TEST-TestSQLHandler.doTest-seed#[CB2E2824C5796AD4]) [    ] o.a.s.c.c.SolrZkClient makePath: /configs/conf1/mapping-ISOLatin1Accent.txt
   [junit4]   2> 1483568 INFO  (TEST-TestSQLHandler.doTest-seed#[CB2E2824C5796AD4]) [    ] o.a.s.c.AbstractZkTestCase put /home/jenkins/workspace/Lucene-Solr-trunk-Linux/solr/core/src/test-files/solr/collection1/conf/old_synonyms.txt to /configs/conf1/old_synonyms.txt
   [junit4]   2> 1483568 INFO  (TEST-TestSQLHandler.doTest-seed#[CB2E2824C5796AD4]) [    ] o.a.s.c.c.SolrZkClient makePath: /configs/conf1/old_synonyms.txt
   [junit4]   2> 1483568 INFO  (TEST-TestSQLHandler.doTest-seed#[CB2E2824C5796AD4]) [    ] o.a.s.c.AbstractZkTestCase put /home/jenkins/workspace/Lucene-Solr-trunk-Linux/solr/core/src/test-files/solr/collection1/conf/synonyms.txt to /configs/conf1/synonyms.txt
   [junit4]   2> 1483569 INFO  (TEST-TestSQLHandler.doTest-seed#[CB2E2824C5796AD4]) [    ] o.a.s.c.c.SolrZkClient makePath: /configs/conf1/synonyms.txt
   [junit4]   2> 1483614 INFO  (TEST-TestSQLHandler.doTest-seed#[CB2E2824C5796AD4]) [    ] o.a.s.SolrTestCaseJ4 Writing core.properties file to /home/jenkins/workspace/Lucene-Solr-trunk-Linux/solr/build/solr-core/test/J0/temp/solr.handler.TestSQLHandler_CB2E2824C5796AD4-001/control-001/cores/collection1
   [junit4]   2> 1483615 INFO  (TEST-TestSQLHandler.doTest-seed#[CB2E2824C5796AD4]) [    ] o.e.j.s.Server jetty-9.2.13.v20150730
   [junit4]   2> 1483616 INFO  (TEST-TestSQLHandler.doTest-seed#[CB2E2824C5796AD4]) [    ] o.e.j.s.h.ContextHandler Started o.e.j.s.ServletContextHandler@50d34fd3{/_qxs,null,AVAILABLE}
   [junit4]   2> 1483622 INFO  (TEST-TestSQLHandler.doTest-seed#[CB2E2824C5796AD4]) [    ] o.e.j.s.ServerConnector Started ServerConnector@652543b5{HTTP/1.1}{127.0.0.1:๕๖๓๕๐}
   [junit4]   2> 1483622 INFO  (TEST-TestSQLHandler.doTest-seed#[CB2E2824C5796AD4]) [    ] o.e.j.s.Server Started @๑๔๘๕๕๓๗ms
   [junit4]   2> 1483622 INFO  (TEST-TestSQLHandler.doTest-seed#[CB2E2824C5796AD4]) [    ] o.a.s.c.s.e.JettySolrRunner Jetty properties: {solr.data.dir=/home/jenkins/workspace/Lucene-Solr-trunk-Linux/solr/build/solr-core/test/J0/temp/solr.handler.TestSQLHandler_CB2E2824C5796AD4-001/tempDir-001/control/data, hostContext=/_qxs, hostPort=56350, coreRootDirectory=/home/jenkins/workspace/Lucene-Solr-trunk-Linux/solr/build/solr-core/test/J0/../../../../../../../../../home/jenkins/workspace/Lucene-Solr-trunk-Linux/solr/build/solr-core/test/J0/temp/solr.handler.TestSQLHandler_CB2E2824C5796AD4-001/control-001/cores}
   [junit4]   2> 1483622 INFO  (TEST-TestSQLHandler.doTest-seed#[CB2E2824C5796AD4]) [    ] o.a.s.s.SolrDispatchFilter SolrDispatchFilter.init(): sun.misc.Launcher$AppClassLoader@4e0e2f2a
   [junit4]   2> 1483622 INFO  (TEST-TestSQLHandler.doTest-seed#[CB2E2824C5796AD4]) [    ] o.a.s.c.SolrResourceLoader new SolrResourceLoader for directory: '/home/jenkins/workspace/Lucene-Solr-trunk-Linux/solr/build/solr-core/test/J0/../../../../../../../../../home/jenkins/workspace/Lucene-Solr-trunk-Linux/solr/build/solr-core/test/J0/temp/solr.handler.TestSQLHandler_CB2E2824C5796AD4-001/control-001/'
   [junit4]   2> 1483630 INFO  (TEST-TestSQLHandler.doTest-seed#[CB2E2824C5796AD4]) [    ] o.a.s.c.c.SolrZkClient Using default ZkCredentialsProvider
   [junit4]   2> 1483630 INFO  (TEST-TestSQLHandler.doTest-seed#[CB2E2824C5796AD4]) [    ] o.a.s.c.c.ConnectionManager Waiting for client to connect to ZooKeeper
   [junit4]   2> 1483631 INFO  (zkCallback-1146-thread-1) [    ] o.a.s.c.c.ConnectionManager Watcher org.apache.solr.common.cloud.ConnectionManager@7a1eec00 name:ZooKeeperConnection Watcher:127.0.0.1:53133/solr got event WatchedEvent state:SyncConnected type:None path:null path:null type:None
   [junit4]   2> 1483631 INFO  (TEST-TestSQLHandler.doTest-seed#[CB2E2824C5796AD4]) [    ] o.a.s.c.c.ConnectionManager Client is connected to ZooKeeper
   [junit4]   2> 1483631 INFO  (TEST-TestSQLHandler.doTest-seed#[CB2E2824C5796AD4]) [    ] o.a.s.c.c.SolrZkClient Using default ZkACLProvider
   [junit4]   2> 1483631 INFO  (TEST-TestSQLHandler.doTest-seed#[CB2E2824C5796AD4]) [    ] o.a.s.s.SolrDispatchFilter Loading solr.xml from SolrHome (not found in ZooKeeper)
   [junit4]   2> 1483631 INFO  (TEST-TestSQLHandler.doTest-seed#[CB2E2824C5796AD4]) [    ] o.a.s.c.SolrXmlConfig Loading container configuration from /home/jenkins/workspace/Lucene-Solr-trunk-Linux/solr/build/solr-core/test/J0/../../../../../../../../../home/jenkins/workspace/Lucene-Solr-trunk-Linux/solr/build/solr-core/test/J0/temp/solr.handler.TestSQLHandler_CB2E2824C5796AD4-001/control-001/solr.xml
   [junit4]   2> 1483635 INFO  (TEST-TestSQLHandler.doTest-seed#[CB2E2824C5796AD4]) [    ] o.a.s.c.CoresLocator Config-defined core root directory: /home/jenkins/workspace/Lucene-Solr-trunk-Linux/solr/build/solr-core/test/J0/../../../../../../../../../home/jenkins/workspace/Lucene-Solr-trunk-Linux/solr/build/solr-core/test/J0/temp/solr.handler.TestSQLHandler_CB2E2824C5796AD4-001/control-001/cores
   [junit4]   2> 1483635 INFO  (TEST-TestSQLHandler.doTest-seed#[CB2E2824C5796AD4]) [    ] o.a.s.c.CoreContainer New CoreContainer 285429466
   [junit4]   2> 1483635 INFO  (TEST-TestSQLHandler.doTest-seed#[CB2E2824C5796AD4]) [    ] o.a.s.c.CoreContainer Loading cores into CoreContainer [instanceDir=/home/jenkins/workspace/Lucene-Solr-trunk-Linux/solr/build/solr-core/test/J0/../../../../../../../../../home/jenkins/workspace/Lucene-Solr-trunk-Linux/solr/build/solr-core/test/J0/temp/solr.handler.TestSQLHandler_CB2E2824C5796AD4-001/control-001/]
   [junit4]   2> 1483635 INFO  (TEST-TestSQLHandler.doTest-seed#[CB2E2824C5796AD4]) [    ] o.a.s.c.CoreContainer loading shared library: /home/jenkins/workspace/Lucene-Solr-trunk-Linux/solr/build/solr-core/test/J0/../../../../../../../../../home/jenkins/workspace/Lucene-Solr-trunk-Linux/solr/build/solr-core/test/J0/temp/solr.handler.TestSQLHandler_CB2E2824C5796AD4-001/control-001/lib
   [junit4]   2> 1483635 WARN  (TEST-TestSQLHandler.doTest-seed#[CB2E2824C5796AD4]) [    ] o.a.s.c.SolrResourceLoader Can't find (or read) directory to add to classloader: lib (resolved as: /home/jenkins/workspace/Lucene-Solr-trunk-Linux/solr/build/solr-core/test/J0/../../../../../../../../../home/jenkins/workspace/Lucene-Solr-trunk-Linux/solr/build/solr-core/test/J0/temp/solr.handler.TestSQLHandler_CB2E2824C5796AD4-001/control-001/lib).
   [junit4]   2> 1483639 INFO  (TEST-TestSQLHandler.doTest-seed#[CB2E2824C5796AD4]) [    ] o.a.s.h.c.HttpShardHandlerFactory created with socketTimeout : 90000,urlScheme : ,connTimeout : 15000,maxConnectionsPerHost : 20,maxConnections : 10000,corePoolSize : 0,maximumPoolSize : 2147483647,maxThreadIdleTime : 5,sizeOfQueue : -1,fairnessPolicy : false,useRetries : false,
   [junit4]   2> 1483640 INFO  (TEST-TestSQLHandler.doTest-seed#[CB2E2824C5796AD4]) [    ] o.a.s.u.UpdateShardHandler Creating UpdateShardHandler HTTP client with params: socketTimeout=340000&connTimeout=45000&retry=true
   [junit4]   2> 1483640 INFO  (TEST-TestSQLHandler.doTest-seed#[CB2E2824C5796AD4]) [    ] o.a.s.l.LogWatcher SLF4J impl is org.slf4j.impl.Log4jLoggerFactory
   [junit4]   2> 1483640 INFO  (TEST-TestSQLHandler.doTest-seed#[CB2E2824C5796AD4]) [    ] o.a.s.l.LogWatcher Registering Log Listener [Log4j (org.slf4j.impl.Log4jLoggerFactory)]
   [junit4]   2> 1483640 INFO  (TEST-TestSQLHandler.doTest-seed#[CB2E2824C5796AD4]) [    ] o.a.s.c.ZkContainer Zookeeper client=127.0.0.1:53133/solr
   [junit4]   2> 1483640 INFO  (TEST-TestSQLHandler.doTest-seed#[CB2E2824C5796AD4]) [    ] o.a.s.c.ZkController zkHost includes chroot
   [junit4]   2> 1483640 INFO  (TEST-TestSQLHandler.doTest-seed#[CB2E2824C5796AD4]) [    ] o.a.s.c.c.SolrZkClient Using default ZkCredentialsProvider
   [junit4]   2> 1483640 INFO  (TEST-TestSQLHandler.doTest-seed#[CB2E2824C5796AD4]) [    ] o.a.s.c.c.ConnectionManager Waiting for client to connect to ZooKeeper
   [junit4]   2> 1483641 INFO  (zkCallback-1148-thread-1) [    ] o.a.s.c.c.ConnectionManager Watcher org.apache.solr.common.cloud.ConnectionManager@21ddf568 name:ZooKeeperConnection Watcher:127.0.0.1:53133 got event WatchedEvent state:SyncConnected type:None path:null path:null type:None
   [junit4]   2> 1483641 INFO  (TEST-TestSQLHandler.doTest-seed#[CB2E2824C5796AD4]) [    ] o.a.s.c.c.ConnectionManager Client is connected to ZooKeeper
   [junit4]   2> 1483641 INFO  (TEST-TestSQLHandler.doTest-seed#[CB2E2824C5796AD4]) [    ] o.a.s.c.c.SolrZkClient Using default ZkACLProvider
   [junit4]   2> 1483642 INFO  (TEST-TestSQLHandler.doTest-seed#[CB2E2824C5796AD4]) [n:127.0.0.1:56350__qxs    ] o.a.s.c.c.ConnectionManager Waiting for client to connect to ZooKeeper
   [junit4]   2> 1483642 INFO  (zkCallback-1149-thread-1-processing-n:127.0.0.1:56350__qxs) [n:127.0.0.1:56350__qxs    ] o.a.s.c.c.ConnectionManager Watcher org.apache.solr.common.cloud.ConnectionManager@2e2e08eb name:ZooKeeperConnection Watcher:127.0.0.1:53133/solr got event WatchedEvent state:SyncConnected type:None path:null path:null type:None
   [junit4]   2> 1483642 INFO  (TEST-TestSQLHandler.doTest-seed#[CB2E2824C5796AD4]) [n:127.0.0.1:56350__qxs    ] o.a.s.c.c.ConnectionManager Client is connected to ZooKeeper
   [junit4]   2> 1483643 INFO  (TEST-TestSQLHandler.doTest-seed#[CB2E2824C5796AD4]) [n:127.0.0.1:56350__qxs    ] o.a.s.c.c.SolrZkClient makePath: /overseer/queue
   [junit4]   2> 1483643 INFO  (TEST-TestSQLHandler.doTest-seed#[CB2E2824C5796AD4]) [n:127.0.0.1:56350__qxs    ] o.a.s.c.c.SolrZkClient makePath: /overseer/collection-queue-work
   [junit4]   2> 1483644 INFO  (TEST-TestSQLHandler.doTest-seed#[CB2E2824C5796AD4]) [n:127.0.0.1:56350__qxs    ] o.a.s.c.c.SolrZkClient makePath: /overseer/collection-map-running
   [junit4]   2> 1483645 INFO  (TEST-TestSQLHandler.doTest-seed#[CB2E2824C5796AD4]) [n:127.0.0.1:56350__qxs    ] o.a.s.c.c.SolrZkClient makePath: /overseer/collection-map-completed
   [junit4]   2> 1483645 INFO  (TEST-TestSQLHandler.doTest-seed#[CB2E2824C5796AD4]) [n:127.0.0.1:56350__qxs    ] o.a.s.c.c.SolrZkClient makePath: /overseer/collection-map-failure
   [junit4]   2> 1483646 INFO  (TEST-TestSQLHandler.doTest-seed#[CB2E2824C5796AD4]) [n:127.0.0.1:56350__qxs    ] o.a.s.c.c.SolrZkClient makePath: /live_nodes
   [junit4]   2> 1483646 INFO  (TEST-TestSQLHandler.doTest-seed#[CB2E2824C5796AD4]) [n:127.0.0.1:56350__qxs    ] o.a.s.c.c.SolrZkClient makePath: /aliases.json
   [junit4]   2> 1483646 INFO  (TEST-TestSQLHandler.doTest-seed#[CB2E2824C5796AD4]) [n:127.0.0.1:56350__qxs    ] o.a.s.c.c.SolrZkClient makePath: /clusterstate.json
   [junit4]   2> 1483647 INFO  (TEST-TestSQLHandler.doTest-seed#[CB2E2824C5796AD4]) [n:127.0.0.1:56350__qxs    ] o.a.s.c.c.SolrZkClient makePath: /security.json
   [junit4]   2> 1483647 INFO  (TEST-TestSQLHandler.doTest-seed#[CB2E2824C5796AD4]) [n:127.0.0.1:56350__qxs    ] o.a.s.c.ZkController Register node as live in ZooKeeper:/live_nodes/127.0.0.1:56350__qxs
   [junit4]   2> 1483647 INFO  (TEST-TestSQLHandler.doTest-seed#[CB2E2824C5796AD4]) [n:127.0.0.1:56350__qxs    ] o.a.s.c.c.SolrZkClient makePath: /live_nodes/127.0.0.1:56350__qxs
   [junit4]   2> 1483647 INFO  (TEST-TestSQLHandler.doTest-seed#[CB2E2824C5796AD4]) [n:127.0.0.1:56350__qxs    ] o.a.s.c.c.SolrZkClient makePath: /overseer_elect
   [junit4]   2> 1483648 INFO  (TEST-TestSQLHandler.doTest-seed#[CB2E2824C5796AD4]) [n:127.0.0.1:56350__qxs    ] o.a.s.c.c.SolrZkClient makePath: /overseer_elect/election
   [junit4]   2> 1483648 INFO  (TEST-TestSQLHandler.doTest-seed#[CB2E2824C5796AD4]) [n:127.0.0.1:56350__qxs    ] o.a.s.c.Overseer Overseer (id=null) closing
   [junit4]   2> 1483648 INFO  (TEST-TestSQLHandler.doTest-seed#[CB2E2824C5796AD4]) [n:127.0.0.1:56350__qxs    ] o.a.s.c.LeaderElector Joined leadership election with path: /overseer_elect/election/94622244494508036-127.0.0.1:56350__qxs-n_0000000000
   [junit4]   2> 1483648 INFO  (TEST-TestSQLHandler.doTest-seed#[CB2E2824C5796AD4]) [n:127.0.0.1:56350__qxs    ] o.a.s.c.OverseerElectionContext I am going to be the leader 127.0.0.1:56350__qxs
   [junit4]   2> 1483648 INFO  (TEST-TestSQLHandler.doTest-seed#[CB2E2824C5796AD4]) [n:127.0.0.1:56350__qxs    ] o.a.s.c.c.SolrZkClient makePath: /overseer_elect/leader
   [junit4]   2> 1483649 INFO  (TEST-TestSQLHandler.doTest-seed#[CB2E2824C5796AD4]) [n:127.0.0.1:56350__qxs    ] o.a.s.c.Overseer Overseer (id=94622244494508036-127.0.0.1:56350__qxs-n_0000000000) starting
   [junit4]   2> 1483649 INFO  (TEST-TestSQLHandler.doTest-seed#[CB2E2824C5796AD4]) [n:127.0.0.1:56350__qxs    ] o.a.s.c.c.SolrZkClient makePath: /overseer/queue-work
   [junit4]   2> 1483651 INFO  (TEST-TestSQLHandler.doTest-seed#[CB2E2824C5796AD4]) [n:127.0.0.1:56350__qxs    ] o.a.s.c.OverseerAutoReplicaFailoverThread Starting OverseerAutoReplicaFailoverThread autoReplicaFailoverWorkLoopDelay=10000 autoReplicaFailoverWaitAfterExpiration=30000 autoReplicaFailoverBadNodeExpiration=60000
   [junit4]   2> 1483651 INFO  (TEST-TestSQLHandler.doTest-seed#[CB2E2824C5796AD4]) [n:127.0.0.1:56350__qxs    ] o.a.s.c.c.ZkStateReader Updating cluster state from ZooKeeper... 
   [junit4]   2> 1483651 INFO  (OverseerCollectionConfigSetProcessor-94622244494508036-127.0.0.1:56350__qxs-n_0000000000) [n:127.0.0.1:56350__qxs    ] o.a.s.c.OverseerTaskProcessor Process current queue of overseer operations
   [junit4]   2> 1483651 INFO  (OverseerStateUpdate-94622244494508036-127.0.0.1:56350__qxs-n_0000000000) [n:127.0.0.1:56350__qxs    ] o.a.s.c.Overseer Starting to work on the main queue
   [junit4]   2> 1483666 INFO  (TEST-TestSQLHandler.doTest-seed#[CB2E2824C5796AD4]) [n:127.0.0.1:56350__qxs    ] o.a.s.c.CoreContainer Security conf doesn't exist. Skipping setup for authorization module.
   [junit4]   2> 1483666 INFO  (TEST-TestSQLHandler.doTest-seed#[CB2E2824C5796AD4]) [n:127.0.0.1:56350__qxs    ] o.a.s.c.CoreContainer No authentication plugin used.
   [junit4]   2> 1483666 INFO  (TEST-TestSQLHandler.doTest-seed#[CB2E2824C5796AD4]) [n:127.0.0.1:56350__qxs    ] o.a.s.c.CoresLocator Looking for core definitions underneath /home/jenkins/workspace/Lucene-Solr-trunk-Linux/solr/build/solr-core/test/J0/../../../../../../../../../home/jenkins/workspace/Lucene-Solr-trunk-Linux/solr/build/solr-core/test/J0/temp/solr.handler.TestSQLHandler_CB2E2824C5796AD4-001/control-001/cores
   [junit4]   2> 1483667 INFO  (TEST-TestSQLHandler.doTest-seed#[CB2E2824C5796AD4]) [n:127.0.0.1:56350__qxs    ] o.a.s.c.SolrCore Created CoreDescriptor: {name=collection1, config=solrconfig.xml, transient=false, schema=schema.xml, loadOnStartup=true, configSetProperties=configsetprops.json, instanceDir=/home/jenkins/workspace/Lucene-Solr-trunk-Linux/solr/build/solr-core/test/J0/../../../../../../../../../home/jenkins/workspace/Lucene-Solr-trunk-Linux/solr/build/solr-core/test/J0/temp/solr.handler.TestSQLHandler_CB2E2824C5796AD4-001/control-001/cores/collection1, collection=control_collection, absoluteInstDir=/home/jenkins/workspace/Lucene-Solr-trunk-Linux/solr/build/solr-core/test/J0/../../../../../../../../../home/jenkins/workspace/Lucene-Solr-trunk-Linux/solr/build/solr-core/test/J0/temp/solr.handler.TestSQLHandler_CB2E2824C5796AD4-001/control-001/cores/collection1/, coreNodeName=, dataDir=data/, shard=}
   [junit4]   2> 1483667 INFO  (TEST-TestSQLHandler.doTest-seed#[CB2E2824C5796AD4]) [n:127.0.0.1:56350__qxs    ] o.a.s.c.CoresLocator Found core collection1 in /home/jenkins/workspace/Lucene-Solr-trunk-Linux/solr/build/solr-core/test/J0/../../../../../../../../../home/jenkins/workspace/Lucene-Solr-trunk-Linux/solr/build/solr-core/test/J0/temp/solr.handler.TestSQLHandler_CB2E2824C5796AD4-001/control-001/cores/collection1/
   [junit4]   2> 1483667 INFO  (TEST-TestSQLHandler.doTest-seed#[CB2E2824C5796AD4]) [n:127.0.0.1:56350__qxs    ] o.a.s.c.CoresLocator Found 1 core definitions
   [junit4]   2> 1483667 INFO  (TEST-TestSQLHandler.doTest-seed#[CB2E2824C5796AD4]) [n:127.0.0.1:56350__qxs    ] o.a.s.s.SolrDispatchFilter user.dir=/home/jenkins/workspace/Lucene-Solr-trunk-Linux/solr/build/solr-core/test/J0
   [junit4]   2> 1483667 INFO  (TEST-TestSQLHandler.doTest-seed#[CB2E2824C5796AD4]) [n:127.0.0.1:56350__qxs    ] o.a.s.s.SolrDispatchFilter SolrDispatchFilter.init() done
   [junit4]   2> 1483667 INFO  (coreLoadExecutor-4012-thread-1-processing-n:127.0.0.1:56350__qxs) [n:127.0.0.1:56350__qxs c:control_collection   x:collection1] o.a.s.c.ZkController publishing state=down
   [junit4]   2> 1483667 INFO  (coreLoadExecutor-4012-thread-1-processing-n:127.0.0.1:56350__qxs) [n:127.0.0.1:56350__qxs c:control_collection   x:collection1] o.a.s.c.ZkController numShards not found on descriptor - reading it from system property
   [junit4]   2> 1483668 INFO  (OverseerStateUpdate-94622244494508036-127.0.0.1:56350__qxs-n_0000000000) [n:127.0.0.1:56350__qxs    ] o.a.s.c.Overseer processMessage: queueSize: 1, message = {
   [junit4]   2>   "core":"collection1",
   [junit4]   2>   "roles":null,
   [junit4]   2>   "base_url":"http://127.0.0.1:56350/_qxs",
   [junit4]   2>   "node_name":"127.0.0.1:56350__qxs",
   [junit4]   2>   "numShards":"1",
   [junit4]   2>   "state":"down",
   [junit4]   2>   "shard":null,
   [junit4]   2>   "collection":"control_collection",
   [junit4]   2>   "operation":"state"} current state version: 0
   [junit4]   2> 1483668 INFO  (coreLoadExecutor-4012-thread-1-processing-n:127.0.0.1:56350__qxs) [n:127.0.0.1:56350__qxs c:control_collection   x:collection1] o.a.s.c.ZkController look for our core node name
   [junit4]   2> 1483668 INFO  (OverseerStateUpdate-94622244494508036-127.0.0.1:56350__qxs-n_0000000000) [n:127.0.0.1:56350__qxs    ] o.a.s.c.o.ReplicaMutator Update state numShards=1 message={
   [junit4]   2>   "core":"collection1",
   [junit4]   2>   "roles":null,
   [junit4]   2>   "base_url":"http://127.0.0.1:56350/_qxs",
   [junit4]   2>   "node_name":"127.0.0.1:56350__qxs",
   [junit4]   2>   "numShards":"1",
   [junit4]   2>   "state":"down",
   [junit4]   2>   "shard":null,
   [junit4]   2>   "collection":"control_collection",
   [junit4]   2>   "operation":"state"}
   [junit4]   2> 1483668 INFO  (OverseerStateUpdate-94622244494508036-127.0.0.1:56350__qxs-n_0000000000) [n:127.0.0.1:56350__qxs    ] o.a.s.c.o.ClusterStateMutator building a new cName: control_collection
   [junit4]   2> 1483668 INFO  (OverseerStateUpdate-94622244494508036-127.0.0.1:56350__qxs-n_0000000000) [n:127.0.0.1:56350__qxs    ] o.a.s.c.o.ReplicaMutator Assigning new node to shard shard=shard1
   [junit4]   2> 1483669 INFO  (zkCallback-1149-thread-1-processing-n:127.0.0.1:56350__qxs) [n:127.0.0.1:56350__qxs    ] o.a.s.c.c.ZkStateReader A cluster state change: WatchedEvent state:SyncConnected type:NodeDataChanged path:/clusterstate.json, has occurred - updating... (live nodes size: 1)
   [junit4]   2> 1484668 INFO  (coreLoadExecutor-4012-thread-1-processing-n:127.0.0.1:56350__qxs) [n:127.0.0.1:56350__qxs c:control_collection   x:collection1] o.a.s.c.ZkController waiting to find shard id in clusterstate for collection1
   [junit4]   2> 1484668 INFO  (coreLoadExecutor-4012-thread-1-processing-n:127.0.0.1:56350__qxs) [n:127.0.0.1:56350__qxs c:control_collection   x:collection1] o.a.s.c.ZkController Check for collection zkNode:control_collection
   [junit4]   2> 1484669 INFO  (coreLoadExecutor-4012-thread-1-processing-n:127.0.0.1:56350__qxs) [n:127.0.0.1:56350__qxs c:control_collection   x:collection1] o.a.s.c.ZkController Collection zkNode exists
   [junit4]   2> 1484669 INFO  (coreLoadExecutor-4012-thread-1-processing-n:127.0.0.1:56350__qxs) [n:127.0.0.1:56350__qxs c:control_collection   x:collection1] o.a.s.c.c.ZkStateReader Load collection config from:/collections/control_collection
   [junit4]   2> 1484669 INFO  (coreLoadExecutor-4012-thread-1-processing-n:127.0.0.1:56350__qxs) [n:127.0.0.1:56350__qxs c:control_collection   x:collection1] o.a.s.c.c.ZkStateReader path=/collections/control_collection configName=conf1 specified config exists in ZooKeeper
   [junit4]   2> 1484669 INFO  (coreLoadExecutor-4012-thread-1-processing-n:127.0.0.1:56350__qxs) [n:127.0.0.1:56350__qxs c:control_collection   x:collection1] o.a.s.c.SolrResourceLoader new SolrResourceLoader for directory: '/home/jenkins/workspace/Lucene-Solr-trunk-Linux/solr/build/solr-core/test/J0/../../../../../../../../../home/jenkins/workspace/Lucene-Solr-trunk-Linux/solr/build/solr-core/test/J0/temp/solr.handler.TestSQLHandler_CB2E2824C5796AD4-001/control-001/cores/collection1/'
   [junit4]   2> 1484676 INFO  (coreLoadExecutor-4012-thread-1-processing-n:127.0.0.1:56350__qxs) [n:127.0.0.1:56350__qxs c:control_collection   x:collection1] o.a.s.c.Config loaded config solrconfig.xml with version 0 
   [junit4]   2> 1484678 INFO  (coreLoadExecutor-4012-thread-1-processing-n:127.0.0.1:56350__qxs) [n:127.0.0.1:56350__qxs c:control_collection   x:collection1] o.a.s.c.SolrConfig current version of requestparams : -1
   [junit4]   2> 1484680 INFO  (coreLoadExecutor-4012-thread-1-processing-n:127.0.0.1:56350__qxs) [n:127.0.0.1:56350__qxs c:control_collection   x:collection1] o.a.s.c.SolrConfig Using Lucene MatchVersion: 6.0.0
   [junit4]   2> 1484685 INFO  (coreLoadExecutor-4012-thread-1-processing-n:127.0.0.1:56350__qxs) [n:127.0.0.1:56350__qxs c:control_collection   x:collection1] o.a.s.c.Config Loaded SolrConfig: solrconfig.xml
   [junit4]   2> 1484685 INFO  (coreLoadExecutor-4012-thread-1-processing-n:127.0.0.1:56350__qxs) [n:127.0.0.1:56350__qxs c:control_collection   x:collection1] o.a.s.s.IndexSchema Reading Solr Schema from /configs/conf1/schema.xml
   [junit4]   2> 1484688 INFO  (coreLoadExecutor-4012-thread-1-processing-n:127.0.0.1:56350__qxs) [n:127.0.0.1:56350__qxs c:control_collection   x:collection1] o.a.s.s.IndexSchema [collection1] Schema name=test
   [junit4]   2> 1484742 INFO  (coreLoadExecutor-4012-thread-1-processing-n:127.0.0.1:56350__qxs) [n:127.0.0.1:56350__qxs c:control_collection   x:collection1] o.a.s.s.IndexSchema default search field in schema is text
   [junit4]   2> 1484743 INFO  (coreLoadExecutor-4012-thread-1-processing-n:127.0.0.1:56350__qxs) [n:127.0.0.1:56350__qxs c:control_collection   x:collection1] o.a.s.s.IndexSchema unique key field: id
   [junit4]   2> 1484743 WARN  (coreLoadExecutor-4012-thread-1-processing-n:127.0.0.1:56350__qxs) [n:127.0.0.1:56350__qxs c:control_collection   x:collection1] o.a.s.s.IndexSchema Field lowerfilt1and2 is not multivalued and destination for multiple copyFields (2)
   [junit4]   2> 1484743 WARN  (coreLoadExecutor-4012-thread-1-processing-n:127.0.0.1:56350__qxs) [n:127.0.0.1:56350__qxs c:control_collection   x:collection1] o.a.s.s.IndexSchema Field text is not multivalued and destination for multiple copyFields (3)
   [junit4]   2> 1484744 INFO  (coreLoadExecutor-4012-thread-1-processing-n:127.0.0.1:56350__qxs) [n:127.0.0.1:56350__qxs c:control_collection   x:collection1] o.a.s.c.ConfigSetProperties Did not find ConfigSet properties, assuming default properties: Can't find resource 'configsetprops.json' in classpath or '/configs/conf1', cwd=/home/jenkins/workspace/Lucene-Solr-trunk-Linux/solr/build/solr-core/test/J0
   [junit4]   2> 1484744 INFO  (coreLoadExecutor-4012-thread-1-processing-n:127.0.0.1:56350__qxs) [n:127.0.0.1:56350__qxs c:control_collection   x:collection1] o.a.s.c.CoreContainer Creating SolrCore 'collection1' using configuration from collection control_collection
   [junit4]   2> 1484744 INFO  (coreLoadExecutor-4012-thread-1-processing-n:127.0.0.1:56350__qxs) [n:127.0.0.1:56350__qxs c:control_collection s:shard1 r:core_node1 x:collection1] o.a.s.c.SolrCore org.apache.solr.core.MockDirectoryFactory
   [junit4]   2> 1484745 INFO  (coreLoadExecutor-4012-thread-1-processing-n:127.0.0.1:56350__qxs) [n:127.0.0.1:56350__qxs c:control_collection s:shard1 r:core_node1 x:collection1] o.a.s.c.SolrCore [[collection1] ] Opening new SolrCore at [/home/jenkins/workspace/Lucene-Solr-trunk-Linux/solr/build/solr-core/test/J0/../../../../../../../../../home/jenkins/workspace/Lucene-Solr-trunk-Linux/solr/build/solr-core/test/J0/temp/solr.handler.TestSQLHandler_CB2E2824C5796AD4-001/control-001/cores/collection1/], dataDir=[null]
   [junit4]   2> 1484745 INFO  (coreLoadExecutor-4012-thread-1-processing-n:127.0.0.1:56350__qxs) [n:127.0.0.1:56350__qxs c:control_collection s:shard1 r:core_node1 x:collection1] o.a.s.c.SolrCore JMX monitoring not detected for core: collection1
   [junit4]   2> 1484745 INFO  (coreLoadExecutor-4012-thread-1-processing-n:127.0.0.1:56350__qxs) [n:127.0.0.1:56350__qxs c:control_collection s:shard1 r:core_node1 x:collection1] o.a.s.c.CachingDirectoryFactory return new directory for /home/jenkins/workspace/Lucene-Solr-trunk-Linux/solr/build/solr-core/test/J0/../../../../../../../../../home/jenkins/workspace/Lucene-Solr-trunk-Linux/solr/build/solr-core/test/J0/temp/solr.handler.TestSQLHandler_CB2E2824C5796AD4-001/control-001/cores/collection1/data
   [junit4]   2> 1484745 INFO  (coreLoadExecutor-4012-thread-1-processing-n:127.0.0.1:56350__qxs) [n:127.0.0.1:56350__qxs c:control_collection s:shard1 r:core_node1 x:collection1] o.a.s.c.SolrCore New index directory detected: old=null new=/home/jenkins/workspace/Lucene-Solr-trunk-Linux/solr/build/solr-core/test/J0/../../../../../../../../../home/jenkins/workspace/Lucene-Solr-trunk-Linux/solr/build/solr-core/test/J0/temp/solr.handler.TestSQLHandler_CB2E2824C5796AD4-001/control-001/cores/collection1/data/index/
   [junit4]   2> 1484745 WARN  (coreLoadExecutor-4012-thread-1-processing-n:127.0.0.1:56350__qxs) [n:127.0.0.1:56350__qxs c:control_collection s:shard1 r:core_node1 x:collection1] o.a.s.c.SolrCore [collection1] Solr index directory '/home/jenkins/workspace/Lucene-Solr-trunk-Linux/solr/build/solr-core/test/J0/../../../../../../../../../home/jenkins/workspace/Lucene-Solr-trunk-Linux/solr/build/solr-core/test/J0/temp/solr.handler.TestSQLHandler_CB2E2824C5796AD4-001/control-001/cores/collection1/data/index' doesn't exist. Creating new index...
   [junit4]   2> 1484745 INFO  (coreLoadExecutor-4012-thread-1-processing-n:127.0.0.1:56350__qxs) [n:127.0.0.1:56350__qxs c:control_collection s:shard1 r:core_node1 x:collection1] o.a.s.c.CachingDirectoryFactory return new directory for /home/jenkins/workspace/Lucene-Solr-trunk-Linux/solr/build/solr-core/test/J0/../../../../../../../../../home/jenkins/workspace/Lucene-Solr-trunk-Linux/solr/build/solr-core/test/J0/temp/solr.handler.TestSQLHandler_CB2E2824C5796AD4-001/control-001/cores/collection1/data/index
   [junit4]   2> 1484746 INFO  (coreLoadExecutor-4012-thread-1-processing-n:127.0.0.1:56350__qxs) [n:127.0.0.1:56350__qxs c:control_collection s:shard1 r:core_node1 x:collection1] o.a.s.c.SolrCore SolrDeletionPolicy.onCommit: commits: num=1
   [junit4]   2> 	commit{dir=MockDirectoryWrapper(RAMDirectory@54102abc lockFactory=org.apache.lucene.store.SingleInstanceLockFactory@53952697),segFN=segments_1,generation=1}
   [junit4]   2> 1484746 INFO  (coreLoadExecutor-4012-thread-1-processing-n:127.0.0.1:56350__qxs) [n:127.0.0.1:56350__qxs c:control_collection s:shard1 r:core_node1 x:collection1] o.a.s.c.SolrCore newest commit generation = 1
   [junit4]   2> 1484746 INFO  (OldIndexDirectoryCleanupThreadForCore-collection1) [n:127.0.0.1:56350__qxs c:control_collection s:shard1 r:core_node1 x:collection1] o.a.s.c.SolrCore Looking for old index directories to cleanup for core collection1 in /home/jenkins/workspace/Lucene-Solr-trunk-Linux/solr/build/solr-core/test/J0/../../../../../../../../../home/jenkins/workspace/Lucene-Solr-trunk-Linux/solr/build/solr-core/test/J0/temp/solr.handler.TestSQLHandler_CB2E2824C5796AD4-001/control-001/cores/collection1/data/
   [junit4]   2> 1484746 WARN  (OldIndexDirectoryCleanupThreadForCore-collection1) [n:127.0.0.1:56350__qxs c:control_collection s:shard1 r:core_node1 x:collection1] o.a.s.c.DirectoryFactory /home/jenkins/workspace/Lucene-Solr-trunk-Linux/solr/build/solr-core/test/J0/../../../../../../../../../home/jenkins/workspace/Lucene-Solr-trunk-Linux/solr/build/solr-core/test/J0/temp/solr.handler.TestSQLHandler_CB2E2824C5796AD4-001/control-001/cores/collection1/data/ does not point to a valid data directory; skipping clean-up of old index directories.
   [junit4]   2> 1484747 INFO  (coreLoadExecutor-4012-thread-1-processing-n:127.0.0.1:56350__qxs) [n:127.0.0.1:56350__qxs c:control_collection s:shard1 r:core_node1 x:collection1] o.a.s.c.SolrCore no updateRequestProcessorChain defined as default, creating implicit default
   [junit4]   2> 1484748 INFO  (coreLoadExecutor-4012-thread-1-processing-n:127.0.0.1:56350__qxs) [n:127.0.0.1:56350__qxs c:control_collection s:shard1 r:core_node1 x:collection1] o.a.s.h.l.XMLLoader xsltCacheLifetimeSeconds=60
   [junit4]   2> 1484748 INFO  (coreLoadExecutor-4012-thread-1-processing-n:127.0.0.1:56350__qxs) [n:127.0.0.1:56350__qxs c:control_collection s:shard1 r:core_node1 x:collection1] o.a.s.h.l.XMLLoader xsltCacheLifetimeSeconds=60
   [junit4]   2> 1484749 INFO  (coreLoadExecutor-4012-thread-1-processing-n:127.0.0.1:56350__qxs) [n:127.0.0.1:56350__qxs c:control_collection s:shard1 r:core_node1 x:collection1] o.a.s.h.l.XMLLoader xsltCacheLifetimeSeconds=60
   [junit4]   2> 1484749 INFO  (coreLoadExecutor-4012-thread-1-processing-n:127.0.0.1:56350__qxs) [n:127.0.0.1:56350__qxs c:control_collection s:shard1 r:core_node1 x:collection1] o.a.s.h.l.XMLLoader xsltCacheLifetimeSeconds=60
   [junit4]   2> 1484750 INFO  (coreLoadExecutor-4012-thread-1-processing-n:127.0.0.1:56350__qxs) [n:127.0.0.1:56350__qxs c:control_collection s:shard1 r:core_node1 x:collection1] o.a.s.c.PluginBag requestHandler : '/replication' created with startup=lazy 
   [junit4]   2> 1484755 WARN  (coreLoadExecutor-4012-thread-1-processing-n:127.0.0.1:56350__qxs) [n:127.0.0.1:56350__qxs c:control_collection s:shard1 r:core_node1 x:collection1] o.a.s.c.SolrResourceLoader Solr loaded a deprecated plugin/analysis class [org.apache.solr.handler.admin.AdminHandlers]. Please consult documentation how to replace it accordingly.
   [junit4]   2> 1484755 WARN  (coreLoadExecutor-4012-thread-1-processing-n:127.0.0.1:56350__qxs) [n:127.0.0.1:56350__qxs c:control_collection s:shard1 r:core_node1 x:collection1] o.a.s.c.SolrResourceLoader Solr loaded a deprecated plugin/analysis class [org.apache.solr.handler.admin.AdminHandlers]. Please consult documentation how to replace it accordingly.
   [junit4]   2> 1484755 INFO  (coreLoadExecutor-4012-thread-1-processing-n:127.0.0.1:56350__qxs) [n:127.0.0.1:56350__qxs c:control_collection s:shard1 r:core_node1 x:collection1] o.a.s.c.RequestHandlers Registered paths: /admin/mbeans,standard,,/update/json/docs,/admin/luke,/export,/get,/admin/properties,/update/json,/admin/threads,/update/csv,/sql,/admin/segments,/admin/system,/replication,/config,/stream,/schema,/admin/plugins,/admin/logging,/admin,/admin/ping,/update,/admin/file
   [junit4]   2> 1484756 INFO  (coreLoadExecutor-4012-thread-1-processing-n:127.0.0.1:56350__qxs) [n:127.0.0.1:56350__qxs c:control_collection s:shard1 r:core_node1 x:collection1] o.a.s.c.SolrCore Using default statsCache cache: org.apache.solr.search.stats.LocalStatsCache
   [junit4]   2> 1484756 INFO  (coreLoadExecutor-4012-thread-1-processing-n:127.0.0.1:56350__qxs) [n:127.0.0.1:56350__qxs c:control_collection s:shard1 r:core_node1 x:collection1] o.a.s.u.UpdateHandler Using UpdateLog implementation: org.apache.solr.update.UpdateLog
   [junit4]   2> 1484756 INFO  (coreLoadExecutor-4012-thread-1-processing-n:127.0.0.1:56350__qxs) [n:127.0.0.1:56350__qxs c:control_collection s:shard1 r:core_node1 x:collection1] o.a.s.u.UpdateLog Initializing UpdateLog: dataDir= defaultSyncLevel=FLUSH numRecordsToKeep=100 maxNumLogsToKeep=10 numVersionBuckets=65536
   [junit4]   2> 1484757 INFO  (coreLoadExecutor-4012-thread-1-processing-n:127.0.0.1:56350__qxs) [n:127.0.0.1:56350__qxs c:control_collection s:shard1 r:core_node1 x:collection1] o.a.s.c.SolrCore Hard AutoCommit: disabled
   [junit4]   2> 1484757 INFO  (coreLoadExecutor-4012-thread-1-processing-n:127.0.0.1:56350__qxs) [n:127.0.0.1:56350__qxs c:control_collection s:shard1 r:core_node1 x:collection1] o.a.s.c.SolrCore Soft AutoCommit: disabled
   [junit4]   2> 1484757 INFO  (coreLoadExecutor-4012-thread-1-processing-n:127.0.0.1:56350__qxs) [n:127.0.0.1:56350__qxs c:control_collection s:shard1 r:core_node1 x:collection1] o.a.s.c.SolrCore SolrDeletionPolicy.onInit: commits: num=1
   [junit4]   2> 	commit{dir=MockDirectoryWrapper(RAMDirectory@54102abc lockFactory=org.apache.lucene.store.SingleInstanceLockFactory@53952697),segFN=segments_1,generation=1}
   [junit4]   2> 1484757 INFO  (coreLoadExecutor-4012-thread-1-processing-n:127.0.0.1:56350__qxs) [n:127.0.0.1:56350__qxs c:control_collection s:shard1 r:core_node1 x:collection1] o.a.s.c.SolrCore newest commit generation = 1
   [junit4]   2> 1484757 INFO  (coreLoadExecutor-4012-thread-1-processing-n:127.0.0.1:56350__qxs) [n:127.0.0.1:56350__qxs c:control_collection s:shard1 r:core_node1 x:collection1] o.a.s.s.SolrIndexSearcher Opening Searcher@25a26982[collection1] main
   [junit4]   2> 1484757 INFO  (coreLoadExecutor-4012-thread-1-processing-n:127.0.0.1:56350__qxs) [n:127.0.0.1:56350__qxs c:control_collection s:shard1 r:core_node1 x:collection1] o.a.s.c.c.ZkStateReader Load collection config from:/collections/control_collection
   [junit4]   2> 1484757 INFO  (coreLoadExecutor-4012-thread-1-processing-n:127.0.0.1:56350__qxs) [n:127.0.0.1:56350__qxs c:control_collection s:shard1 r:core_node1 x:collection1] o.a.s.c.c.ZkStateReader path=/collections/control_collection configName=conf1 specified config exists in ZooKeeper
   [junit4]   2> 1484758 INFO  (coreLoadExecutor-4012-thread-1-processing-n:127.0.0.1:56350__qxs) [n:127.0.0.1:56350__qxs c:control_collection s:shard1 r:core_node1 x:collection1] o.a.s.r.ManagedResourceStorage Setting up ZooKeeper-based storage for the RestManager with znodeBase: /configs/conf1
   [junit4]   2> 1484758 INFO  (coreLoadExecutor-4012-thread-1-processing-n:127.0.0.1:56350__qxs) [n:127.0.0.1:56350__qxs c:control_collection s:shard1 r:core_node1 x:collection1] o.a.s.r.ManagedResourceStorage Configured ZooKeeperStorageIO with znodeBase: /configs/conf1
   [junit4]   2> 1484758 INFO  (coreLoadExecutor-4012-thread-1-processing-n:127.0.0.1:56350__qxs) [n:127.0.0.1:56350__qxs c:control_collection s:shard1 r:core_node1 x:collection1] o.a.s.r.RestManager Initializing RestManager with initArgs: {}
   [junit4]   2> 1484758 INFO  (coreLoadExecutor-4012-thread-1-processing-n:127.0.0.1:56350__qxs) [n:127.0.0.1:56350__qxs c:control_collection s:shard1 r:core_node1 x:collection1] o.a.s.r.ManagedResourceStorage Reading _rest_managed.json using ZooKeeperStorageIO:path=/configs/conf1
   [junit4]   2> 1484758 INFO  (coreLoadExecutor-4012-thread-1-processing-n:127.0.0.1:56350__qxs) [n:127.0.0.1:56350__qxs c:control_collection s:shard1 r:core_node1 x:collection1] o.a.s.r.ManagedResourceStorage No data found for znode /configs/conf1/_rest_managed.json
   [junit4]   2> 1484758 INFO  (coreLoadExecutor-4012-thread-1-processing-n:127.0.0.1:56350__qxs) [n:127.0.0.1:56350__qxs c:control_collection s:shard1 r:core_node1 x:collection1] o.a.s.r.ManagedResourceStorage Loaded null at path _rest_managed.json using ZooKeeperStorageIO:path=/configs/conf1
   [junit4]   2> 1484758 INFO  (coreLoadExecutor-4012-thread-1-processing-n:127.0.0.1:56350__qxs) [n:127.0.0.1:56350__qxs c:control_collection s:shard1 r:core_node1 x:collection1] o.a.s.r.RestManager Initializing 0 registered ManagedResources
   [junit4]   2> 1484759 WARN  (coreLoadExecutor-4012-thread-1-processing-n:127.0.0.1:56350__qxs) [n:127.0.0.1:56350__qxs c:control_collection s:shard1 r:core_node1 x:collection1] o.a.s.h.a.AdminHandlers <requestHandler name="/admin/" 
   [junit4]   2>  class="solr.admin.AdminHandlers" /> is deprecated . It is not required anymore
   [junit4]   2> 1484759 INFO  (searcherExecutor-4013-thread-1-processing-n:127.0.0.1:56350__qxs x:collection1 s:shard1 c:control_collection r:core_node1) [n:127.0.0.1:56350__qxs c:control_collection s:shard1 r:core_node1 x:collection1] o.a.s.c.SolrCore [collection1] Registered new searcher Searcher@25a26982[collection1] main{ExitableDirectoryReader(UninvertingDirectoryReader())}
   [junit4]   2> 1484759 INFO  (coreLoadExecutor-4012-thread-1-processing-n:127.0.0.1:56350__qxs) [n:127.0.0.1:56350__qxs c:control_collection s:shard1 r:core_node1 x:collection1] o.a.s.u.UpdateLog Looking up max value of version field to seed version buckets
   [junit4]   2> 1484759 INFO  (coreLoadExecutor-4012-thread-1-processing-n:127.0.0.1:56350__qxs) [n:127.0.0.1:56350__qxs c:control_collection s:shard1 r:core_node1 x:collection1] o.a.s.u.VersionInfo Refreshing highest value of _version_ for 65536 version buckets from index
   [junit4]   2> 1484759 INFO  (coreLoadExecutor-4012-thread-1-processing-n:127.0.0.1:56350__qxs) [n:127.0.0.1:56350__qxs c:control_collection s:shard1 r:core_node1 x:collection1] o.a.s.u.VersionInfo No terms found for _version_, cannot seed version bucket highest value from index
   [junit4]   2> 1484759 INFO  (coreLoadExecutor-4012-thread-1-processing-n:127.0.0.1:56350__qxs) [n:127.0.0.1:56350__qxs c:control_collection s:shard1 r:core_node1 x:collection1] o.a.s.u.UpdateLog Could not find max version in index or recent updates, using new clock 1513955913277374464
   [junit4]   2> 1484762 INFO  (coreLoadExecutor-4012-thread-1-processing-n:127.0.0.1:56350__qxs) [n:127.0.0.1:56350__qxs c:control_collection s:shard1 r:core_node1 x:collection1] o.a.s.u.UpdateLog Took 3.0ms to seed version buckets with highest version 1513955913277374464
   [junit4]   2> 1484763 INFO  (coreLoadExecutor-4012-thread-1-processing-n:127.0.0.1:56350__qxs) [n:127.0.0.1:56350__qxs c:control_collection s:shard1 r:core_node1 x:collection1] o.a.s.c.ZkController watch zkdir /configs/conf1
   [junit4]   2> 1484763 INFO  (coreLoadExecutor-4012-thread-1-processing-n:127.0.0.1:56350__qxs) [n:127.0.0.1:56350__qxs c:control_collection s:shard1 r:core_node1 x:collection1] o.a.s.c.CoreContainer registering core: collection1
   [junit4]   2> 1484763 INFO  (coreZkRegister-4006-thread-1-processing-n:127.0.0.1:56350__qxs x:collection1 s:shard1 c:control_collection r:core_node1) [n:127.0.0.1:56350__qxs c:control_collection s:shard1 r:core_node1 x:collection1] o.a.s.c.ZkController Register replica - core:collection1 address:http://127.0.0.1:56350/_qxs collection:control_collection shard:shard1
   [junit4]   2> 1484763 INFO  (coreZkRegister-4006-thread-1-processing-n:127.0.0.1:56350__qxs x:collection1 s:shard1 c:control_collection r:core_node1) [n:127.0.0.1:56350__qxs c:control_collection s:shard1 r:core_node1 x:collection1] o.a.s.c.c.SolrZkClient makePath: /collections/control_collection/leader_elect/shard1/election
   [junit4]   2> 1484765 INFO  (coreZkRegister-4006-thread-1-processing-n:127.0.0.1:56350__qxs x:collection1 s:shard1 c:control_collection r:core_node1) [n:127.0.0.1:56350__qxs c:control_collection s:shard1 r:core_node1 x:collection1] o.a.s.c.LeaderElector Joined leadership election with path: /collections/control_collection/leader_elect/shard1/election/94622244494508036-core_node1-n_0000000000
   [junit4]   2> 1484765 INFO  (coreZkRegister-4006-thread-1-processing-n:127.0.0.1:56350__qxs x:collection1 s:shard1 c:control_collection r:core_node1) [n:127.0.0.1:56350__qxs c:control_collection s:shard1 r:core_node1 x:collection1] o.a.s.c.ShardLeaderElectionContext Running the leader process for shard shard1
   [junit4]   2> 1484766 INFO  (coreZkRegister-4006-thread-1-processing-n:127.0.0.1:56350__qxs x:collection1 s:shard1 c:control_collection r:core_node1) [n:127.0.0.1:56350__qxs c:control_collection s:shard1 r:core_node1 x:collection1] o.a.s.c.ShardLeaderElectionContext Enough replicas found to continue.
   [junit4]   2> 1484766 INFO  (coreZkRegister-4006-thread-1-processing-n:127.0.0.1:56350__qxs x:collection1 s:shard1 c:control_collection r:core_node1) [n:127.0.0.1:56350__qxs c:control_collection s:shard1 r:core_node1 x:collection1] o.a.s.c.ShardLeaderElectionContext I may be the new leader - try and sync
   [junit4]   2> 1484766 INFO  (coreZkRegister-4006-thread-1-processing-n:127.0.0.1:56350__qxs x:collection1 s:shard1 c:control_collection r:core_node1) [n:127.0.0.1:56350__qxs c:control_collection s:shard1 r:core_node1 x:collection1] o.a.s.c.SyncStrategy Sync replicas to http://127.0.0.1:56350/_qxs/collection1/
   [junit4]   2> 1484766 INFO  (OverseerStateUpdate-94622244494508036-127.0.0.1:56350__qxs-n_0000000000) [n:127.0.0.1:56350__qxs    ] o.a.s.c.Overseer processMessage: queueSize: 1, message = {
   [junit4]   2>   "operation":"leader",
   [junit4]   2>   "shard":"shard1",
   [junit4]   2>   "collection":"control_collection"} current state version: 1
   [junit4]   2> 1484766 INFO  (coreZkRegister-4006-thread-1-processing-n:127.0.0.1:56350__qxs x:collection1 s:shard1 c:control_collection r:core_node1) [n:127.0.0.1:56350__qxs c:control_collection s:shard1 r:core_node1 x:collection1] o.a.s.c.SyncStrategy Sync Success - now sync replicas to me
   [junit4]   2> 1484766 INFO  (coreZkRegister-4006-thread-1-processing-n:127.0.0.1:56350__qxs x:collection1 s:shard1 c:control_collection r:core_node1) [n:127.0.0.1:56350__qxs c:control_collection s:shard1 r:core_node1 x:collection1] o.a.s.c.SyncStrategy http://127.0.0.1:56350/_qxs/collection1/ has no replicas
   [junit4]   2> 1484766 INFO  (coreZkRegister-4006-thread-1-processing-n:127.0.0.1:56350__qxs x:collection1 s:shard1 c:control_collection r:core_node1) [n:127.0.0.1:56350__qxs c:control_collection s:shard1 r:core_node1 x:collection1] o.a.s.c.ShardLeaderElectionContext I am the new leader: http://127.0.0.1:56350/_qxs/collection1/ shard1
   [junit4]   2> 1484766 INFO  (coreZkRegister-4006-thread-1-processing-n:127.0.0.1:56350__qxs x:collection1 s:shard1 c:control_collection r:core_node1) [n:127.0.0.1:56350__qxs c:control_collection s:shard1 r:core_node1 x:collection1] o.a.s.c.c.SolrZkClient makePath: /collections/control_collection/leaders/shard1
   [junit4]   2> 1484767 INFO  (coreZkRegister-4006-thread-1-processing-n:127.0.0.1:56350__qxs x:collection1 s:shard1 c:control_collection r:core_node1) [n:127.0.0.1:56350__qxs c:control_collection s:shard1 r:core_node1 x:collection1] o.a.s.c.ShardLeaderElectionContextBase Creating leader registration node
   [junit4]   2> 1484768 INFO  (OverseerStateUpdate-94622244494508036-127.0.0.1:56350__qxs-n_0000000000) [n:127.0.0.1:56350__qxs    ] o.a.s.c.Overseer processMessage: queueSize: 1, message = {
   [junit4]   2>   "operation":"leader",
   [junit4]   2>   "shard":"shard1",
   [junit4]   2>   "collection":"control_collection",
   [junit4]   2>   "base_url":"http://127.0.0.1:56350/_qxs",
   [junit4]   2>   "core":"collection1",
   [junit4]   2>   "state":"active"} current state version: 1
   [junit4]   2> 1484869 INFO  (zkCallback-1149-thread-1-processing-n:127.0.0.1:56350__qxs) [n:127.0.0.1:56350__qxs    ] o.a.s.c.c.ZkStateReader A cluster state change: WatchedEvent state:SyncConnected type:NodeDataChanged path:/clusterstate.json, has occurred - updating... (live nodes size: 1)
   [junit4]   2> 1484918 INFO  (coreZkRegister-4006-thread-1-processing-n:127.0.0.1:56350__qxs x:collection1 s:shard1 c:control_collection r:core_node1) [n:127.0.0.1:56350__qxs c:control_collection s:shard1 r:core_node1 x:collection1] o.a.s.c.ZkController We are http://127.0.0.1:56350/_qxs/collection1/ and leader is http://127.0.0.1:56350/_qxs/collection1/
   [junit4]   2> 1484918 INFO  (coreZkRegister-4006-thread-1-processing-n:127.0.0.1:56350__qxs x:collection1 s:shard1 c:control_collection r:core_node1) [n:127.0.0.1:56350__qxs c:control_collection s:shard1 r:core_node1 x:collection1] o.a.s.c.ZkController No LogReplay needed for core=collection1 baseURL=http://127.0.0.1:56350/_qxs
   [junit4]   2> 1484918 INFO  (coreZkRegister-4006-thread-1-processing-n:127.0.0.1:56350__qxs x:collection1 s:shard1 c:control_collection r:core_node1) [n:127.0.0.1:56350__qxs c:control_collection s:shard1 r:core_node1 x:collection1] o.a.s.c.ZkController I am the leader, no recovery necessary
   [junit4]   2> 1484918 INFO  (coreZkRegister-4006-thread-1-processing-n:127.0.0.1:56350__qxs x:collection1 s:shard1 c:control_collection r:core_node1) [n:127.0.0.1:56350__qxs c:control_collection s:shard1 r:core_node1 x:collection1] o.a.s.c.ZkController publishing state=active
   [junit4]   2> 1484918 INFO  (coreZkRegister-4006-thread-1-processing-n:127.0.0.1:56350__qxs x:collection1 s:shard1 c:control_collection r:core_node1) [n:127.0.0.1:56350__qxs c:control_collection s:shard1 r:core_node1 x:collection1] o.a.s.c.ZkController numShards not found on descriptor - reading it from system property
   [junit4]   2> 1484919 INFO  (OverseerStateUpdate-94622244494508036-127.0.0.1:56350__qxs-n_0000000000) [n:127.0.0.1:56350__qxs    ] o.a.s.c.Overseer processMessage: queueSize: 1, message = {
   [junit4]   2>   "core":"collection1",
   [junit4]   2>   "core_node_name":"core_node1",
   [junit4]   2>   "roles":null,
   [junit4]   2>   "base_url":"http://127.0.0.1:56350/_qxs",
   [junit4]   2>   "node_name":"127.0.0.1:56350__qxs",
   [junit4]   2>   "numShards":"1",
   [junit4]   2>   "state":"active",
   [junit4]   2>   "shard":"shard1",
   [junit4]   2>   "collection":"control_collection",
   [junit4]   2>   "operation":"state"} current state version: 2
   [junit4]   2> 1484919 INFO  (OverseerStateUpdate-94622244494508036-127.0.0.1:56350__qxs-n_0000000000) [n:127.0.0.1:56350__qxs    ] o.a.s.c.o.ReplicaMutator Update state numShards=1 message={
   [junit4]   2>   "core":"collection1",
   [junit4]   2>   "core_node_name":"core_node1",
   [junit4]   2>   "roles":null,
   [junit4]   2>   "base_url":"http://127.0.0.1:56350/_qxs",
   [junit4]   2>   "node_name":"127.0.0.1:56350__qxs",
   [junit4]   2>   "numShards":"1",
   [junit4]   2>   "state":"active",
   [junit4]   2>   "shard":"shard1",
   [junit4]   2>   "collection":"control_collection",
   [junit4]   2>   "operation":"state"}
   [junit4]   2> 1485020 INFO  (zkCallback-1149-thread-1-processing-n:127.0.0.1:56350__qxs) [n:127.0.0.1:56350__qxs    ] o.a.s.c.c.ZkStateReader A cluster state change: WatchedEvent state:SyncConnected type:NodeDataChanged path:/clusterstate.json, has occurred - updating... (live nodes size: 1)
   [junit4]   2> 1485168 INFO  (TEST-TestSQLHandler.doTest-seed#[CB2E2824C5796AD4]) [    ] o.a.s.c.c.SolrZkClient Using default ZkCredentialsProvider
   [junit4]   2> 1485169 INFO  (TEST-TestSQLHandler.doTest-seed#[CB2E2824C5796AD4]) [    ] o.a.s.c.c.ConnectionManager Waiting for client to connect to ZooKeeper
   [junit4]   2> 1485169 INFO  (zkCallback-1151-thread-1) [    ] o.a.s.c.c.ConnectionManager Watcher org.apache.solr.common.cloud.ConnectionManager@4d4296db name:ZooKeeperConnection Watcher:127.0.0.1:53133/solr got event WatchedEvent state:SyncConnected type:None path:null path:null type:None
   [junit4]   2> 1485170 INFO  (TEST-TestSQLHandler.doTest-seed#[CB2E2824C5796AD4]) [    ] o.a.s.c.c.ConnectionManager Client is connected to ZooKeeper
   [junit4]   2> 1485170 INFO  (TEST-TestSQLHandler.doTest-seed#[CB2E2824C5796AD4]) [    ] o.a.s.c.c.SolrZkClient Using default ZkACLProvider
   [junit4]   2> 1485170 INFO  (TEST-TestSQLHandler.doTest-seed#[CB2E2824C5796AD4]) [    ] o.a.s.c.c.ZkStateReader Updating cluster state from ZooKeeper... 
   [junit4]   2> 1485171 INFO  (TEST-TestSQLHandler.doTest-seed#[CB2E2824C5796AD4]) [    ] o.a.s.c.ChaosMonkey monkey: init - expire sessions:false cause connection loss:false
   [junit4]   2> 1485171 INFO  (TEST-TestSQLHandler.doTest-seed#[CB2E2824C5796AD4]) [    ] o.a.s.c.AbstractFullDistribZkTestBase Creating collection1 with stateFormat=2
   [junit4]   2> 1485171 INFO  (TEST-TestSQLHandler.doTest-seed#[CB2E2824C5796AD4]) [    ] o.a.s.c.c.SolrZkClient Using default ZkCredentialsProvider
   [junit4]   2> 1485171 INFO  (TEST-TestSQLHandler.doTest-seed#[CB2E2824C5796AD4]) [    ] o.a.s.c.c.ConnectionManager Waiting for client to connect to ZooKeeper
   [junit4]   2> 1485171 INFO  (zkCallback-1152-thread-1) [    ] o.a.s.c.c.ConnectionManager Watcher org.apache.solr.common.cloud.ConnectionManager@45d301c5 name:ZooKeeperConnection Watcher:127.0.0.1:53133/solr got event WatchedEvent state:SyncConnected type:None path:null path:null type:None
   [junit4]   2> 1485171 INFO  (TEST-TestSQLHandler.doTest-seed#[CB2E2824C5796AD4]) [    ] o.a.s.c.c.ConnectionManager Client is connected to ZooKeeper
   [junit4]   2> 1485171 INFO  (TEST-TestSQLHandler.doTest-seed#[CB2E2824C5796AD4]) [    ] o.a.s.c.c.SolrZkClient Using default ZkACLProvider
   [junit4]   2> 1485172 INFO  (OverseerStateUpdate-94622244494508036-127.0.0.1:56350__qxs-n_0000000000) [n:127.0.0.1:56350__qxs    ] o.a.s.c.Overseer processMessage: queueSize: 1, message = {
   [junit4]   2>   "operation":"create",
   [junit4]   2>   "name":"collection1",
   [junit4]   2>   "numShards":"2",
   [junit4]   2>   "stateFormat":"2"} current state version: 3
   [junit4]   2> 1485172 INFO  (OverseerStateUpdate-94622244494508036-127.0.0.1:56350__qxs-n_0000000000) [n:127.0.0.1:56350__qxs    ] o.a.s.c.o.ClusterStateMutator building a new cName: collection1
   [junit4]   2> 1485217 INFO  (TEST-TestSQLHandler.doTest-seed#[CB2E2824C5796AD4]) [    ] o.a.s.SolrTestCaseJ4 Writing core.properties file to /home/jenkins/workspace/Lucene-Solr-trunk-Linux/solr/build/solr-core/test/J0/temp/solr.handler.TestSQLHandler_CB2E2824C5796AD4-001/shard-1-001/cores/collection1
   [junit4]   2> 1485218 INFO  (TEST-TestSQLHandler.doTest-seed#[CB2E2824C5796AD4]) [    ] o.a.s.c.AbstractFullDistribZkTestBase create jetty 1 in directory /home/jenkins/workspace/Lucene-Solr-trunk-Linux/solr/build/solr-core/test/J0/temp/solr.handler.TestSQLHandler_CB2E2824C5796AD4-001/shard-1-001
   [junit4]   2> 1485218 INFO  (TEST-TestSQLHandler.doTest-seed#[CB2E2824C5796AD4]) [    ] o.e.j.s.Server jetty-9.2.13.v20150730
   [junit4]   2> 1485219 INFO  (TEST-TestSQLHandler.doTest-seed#[CB2E2824C5796AD4]) [    ] o.e.j.s.h.ContextHandler Started o.e.j.s.ServletContextHandler@318293e1{/_qxs,null,AVAILABLE}
   [junit4]   2> 1485219 INFO  (TEST-TestSQLHandler.doTest-seed#[CB2E2824C5796AD4]) [    ] o.e.j.s.ServerConnector Started ServerConnector@23721180{HTTP/1.1}{127.0.0.1:๕๘๖๘๗}
   [junit4]   2> 1485219 INFO  (TEST-TestSQLHandler.doTest-seed#[CB2E2824C5796AD4]) [    ] o.e.j.s.Server Started @๑๔๘๗๑๓๕ms
   [junit4]   2> 1485219 INFO  (TEST-TestSQLHandler.doTest-seed#[CB2E2824C5796AD4]) [    ] o.a.s.c.s.e.JettySolrRunner Jetty properties: {solr.data.dir=/home/jenkins/workspace/Lucene-Solr-trunk-Linux/solr/build/solr-core/test/J0/temp/solr.handler.TestSQLHandler_CB2E2824C5796AD4-001/tempDir-001/jetty1, solrconfig=solrconfig.xml, hostContext=/_qxs, hostPort=58687, coreRootDirectory=/home/jenkins/workspace/Lucene-Solr-trunk-Linux/solr/build/solr-core/test/J0/../../../../../../../../../home/jenkins/workspace/Lucene-Solr-trunk-Linux/solr/build/solr-core/test/J0/temp/solr.handler.TestSQLHandler_CB2E2824C5796AD4-001/shard-1-001/cores}
   [junit4]   2> 1485220 INFO  (TEST-TestSQLHandler.doTest-seed#[CB2E2824C5796AD4]) [    ] o.a.s.s.SolrDispatchFilter SolrDispatchFilter.init(): sun.misc.Launcher$AppClassLoader@4e0e2f2a
   [junit4]   2> 1485220 INFO  (TEST-TestSQLHandler.doTest-seed#[CB2E2824C5796AD4]) [    ] o.a.s.c.SolrResourceLoader new SolrResourceLoader for directory: '/home/jenkins/workspace/Lucene-Solr-trunk-Linux/solr/build/solr-core/test/J0/../../../../../../../../../home/jenkins/workspace/Lucene-Solr-trunk-Linux/solr/build/solr-core/test/J0/temp/solr.handler.TestSQLHandler_CB2E2824C5796AD4-001/shard-1-001/'
   [junit4]   2> 1485228 INFO  (TEST-TestSQLHandler.doTest-seed#[CB2E2824C5796AD4]) [    ] o.a.s.c.c.SolrZkClient Using default ZkCredentialsProvider
   [junit4]   2> 1485228 INFO  (TEST-TestSQLHandler.doTest-seed#[CB2E2824C5796AD4]) [    ] o.a.s.c.c.ConnectionManager Waiting for client to connect to ZooKeeper
   [junit4]   2> 1485229 INFO  (zkCallback-1153-thread-1) [    ] o.a.s.c.c.ConnectionManager Watcher org.apache.solr.common.cloud.ConnectionManager@75ff3ff8 name:ZooKeeperConnection Watcher:127.0.0.1:53133/solr got event WatchedEvent state:SyncConnected type:None path:null path:null type:None
   [junit4]   2> 1485229 INFO  (TEST-TestSQLHandler.doTest-seed#[CB2E2824C5796AD4]) [    ] o.a.s.c.c.ConnectionManager Client is connected to ZooKeeper
   [junit4]   2> 1485229 INFO  (TEST-TestSQLHandler.doTest-seed#[CB2E2824C5796AD4]) [    ] o.a.s.c.c.SolrZkClient Using default ZkACLProvider
   [junit4]   2> 1485230 INFO  (TEST-TestSQLHandler.doTest-seed#[CB2E2824C5796AD4]) [    ] o.a.s.s.SolrDispatchFilter Loading solr.xml from SolrHome (not found in ZooKeeper)
   [junit4]   2> 1485230 INFO  (TEST-TestSQLHandler.doTest-seed#[CB2E2824C5796AD4]) [    ] o.a.s.c.SolrXmlConfig Loading container configuration from /home/jenkins/workspace/Lucene-Solr-trunk-Linux/solr/build/solr-core/test/J0/../../../../../../../../../home/jenkins/workspace/Lucene-Solr-trunk-Linux/solr/build/solr-core/test/J0/temp/solr.handler.TestSQLHandler_CB2E2824C5796AD4-001/shard-1-001/solr.xml
   [junit4]   2> 1485233 INFO  (TEST-TestSQLHandler.doTest-seed#[CB2E2824C5796AD4]) [    ] o.a.s.c.CoresLocator Config-defined core root directory: /home/jenkins/workspace/Lucene-Solr-trunk-Linux/solr/build/solr-core/test/J0/../../../../../../../../../home/jenkins/workspace/Lucene-Solr-trunk-Linux/solr/build/solr-core/test/J0/temp/solr.handler.TestSQLHandler_CB2E2824C5796AD4-001/shard-1-001/cores
   [junit4]   2> 1485233 INFO  (TEST-TestSQLHandler.doTest-seed#[CB2E2824C5796AD4]) [    ] o.a.s.c.CoreContainer New CoreContainer 708778990
   [junit4]   2> 1485233 INFO  (TEST-TestSQLHandler.doTest-seed#[CB2E2824C5796AD4]) [    ] o.a.s.c.CoreContainer Loading cores into CoreContainer [instanceDir=/home/jenkins/workspace/Lucene-Solr-trunk-Linux/solr/build/solr-core/test/J0/../../../../../../../../../home/jenkins/workspace/Lucene-Solr-trunk-Linux/solr/build/solr-core/test/J0/temp/solr.handler.TestSQLHandler_CB2E2824C5796AD4-001/shard-1-001/]
   [junit4]   2> 1485233 INFO  (TEST-TestSQLHandler.doTest-seed#[CB2E2824C5796AD4]) [    ] o.a.s.c.CoreContainer loading shared library: /home/jenkins/workspace/Lucene-Solr-trunk-Linux/solr/build/solr-core/test/J0/../../../../../../../../../home/jenkins/workspace/Lucene-Solr-trunk-Linux/solr/build/solr-core/test/J0/temp/solr.handler.TestSQLHandler_CB2E2824C5796AD4-001/shard-1-001/lib
   [junit4]   2> 1485233 WARN  (TEST-TestSQLHandler.doTest-seed#[CB2E2824C5796AD4]) [    ] o.a.s.c.SolrResourceLoader Can't find (or read) directory to add to classloader: lib (resolved as: /home/jenkins/workspace/Lucene-Solr-trunk-Linux/solr/build/solr-core/test/J0/../../../../../../../../../home/jenkins/workspace/Lucene-Solr-trunk-Linux/solr/build/solr-core/test/J0/temp/solr.handler.TestSQLHandler_CB2E2824C5796AD4-001/shard-1-001/lib).
   [junit4]   2> 1485237 INFO  (TEST-TestSQLHandler.doTest-seed#[CB2E2824C5796AD4]) [    ] o.a.s.h.c.HttpShardHandlerFactory created with socketTimeout : 90000,urlScheme : ,connTimeout : 15000,maxConnectionsPerHost : 20,maxConnections : 10000,corePoolSize : 0,maximumPoolSize : 2147483647,maxThreadIdleTime : 5,sizeOfQueue : -1,fairnessPolicy : false,useRetries : false,
   [junit4]   2> 1485237 INFO  (TEST-TestSQLHandler.doTest-seed#[CB2E2824C5796AD4]) [    ] o.a.s.u.UpdateShardHandler Creating UpdateShardHandler HTTP client with params: socketTimeout=340000&connTimeout=45000&retry=true
   [junit4]   2> 1485238 INFO  (TEST-TestSQLHandler.doTest-seed#[CB2E2824C5796AD4]) [    ] o.a.s.l.LogWatcher SLF4J impl is org.slf4j.impl.Log4jLoggerFactory
   [junit4]   2> 1485238 INFO  (TEST-TestSQLHandler.doTest-seed#[CB2E2824C5796AD4]) [    ] o.a.s.l.LogWatcher Registering Log Listener [Log4j (org.slf4j.impl.Log4jLoggerFactory)]
   [junit4]   2> 1485238 INFO  (TEST-TestSQLHandler.doTest-seed#[CB2E2824C5796AD4]) [    ] o.a.s.c.ZkContainer Zookeeper client=127.0.0.1:53133/solr
   [junit4]   2> 1485238 INFO  (TEST-TestSQLHandler.doTest-seed#[CB2E2824C5796AD4]) [    ] o.a.s.c.ZkController zkHost includes chroot
   [junit4]   2> 1485238 INFO  (TEST-TestSQLHandler.doTest-seed#[CB2E2824C5796AD4]) [    ] o.a.s.c.c.SolrZkClient Using default ZkCredentialsProvider
   [junit4]   2> 1485238 INFO  (TEST-TestSQLHandler.doTest-seed#[CB2E2824C5796AD4]) [    ] o.a.s.c.c.ConnectionManager Waiting for client to connect to ZooKeeper
   [junit4]   2> 1485239 INFO  (zkCallback-1155-thread-1) [    ] o.a.s.c.c.ConnectionManager Watcher org.apache.solr.common.cloud.ConnectionManager@67dd0f80 name:ZooKeeperConnection Watcher:127.0.0.1:53133 got event WatchedEvent state:SyncConnected type:None path:null path:null type:None
   [junit4]   2> 1485239 INFO  (TEST-TestSQLHandler.doTest-seed#[CB2E2824C5796AD4]) [    ] o.a.s.c.c.ConnectionManager Client is connected to ZooKeeper
   [junit4]   2> 1485239 INFO  (TEST-TestSQLHandler.doTest-seed#[CB2E2824C5796AD4]) [    ] o.a.s.c.c.SolrZkClient Using default ZkACLProvider
   [junit4]   2> 1485239 INFO  (TEST-TestSQLHandler.doTest-seed#[CB2E2824C5796AD4]) [n:127.0.0.1:58687__qxs    ] o.a.s.c.c.ConnectionManager Waiting for client to connect to ZooKeeper
   [junit4]   2> 1485240 INFO  (zkCallback-1156-thread-1-processing-n:127.0.0.1:58687__qxs) [n:127.0.0.1:58687__qxs    ] o.a.s.c.c.ConnectionManager Watcher org.apache.solr.common.cloud.ConnectionManager@78aca44a name:ZooKeeperConnection Watcher:127.0.0.1:53133/solr got event WatchedEvent state:SyncConnected type:None path:null path:null type:None
   [junit4]   2> 1485240 INFO  (TEST-TestSQLHandler.doTest-seed#[CB2E2824C5796AD4]) [n:127.0.0.1:58687__qxs    ] o.a.s.c.c.ConnectionManager Client is connected to ZooKeeper
   [junit4]   2> 1485242 INFO  (TEST-TestSQLHandler.doTest-seed#[CB2E2824C5796AD4]) [n:127.0.0.1:58687__qxs    ] o.a.s.c.c.ZkStateReader Updating cluster state from ZooKeeper... 
   [junit4]   2> 1485274 INFO  (OverseerStateUpdate-94622244494508036-127.0.0.1:56350__qxs-n_0000000000) [n:127.0.0.1:56350__qxs    ] o.a.s.c.o.ZkStateWriter going to create_collection /collections/collection1/state.json
   [junit4]   2> 1486244 INFO  (TEST-TestSQLHandler.doTest-seed#[CB2E2824C5796AD4]) [n:127.0.0.1:58687__qxs    ] o.a.s.c.ZkController Register node as live in ZooKeeper:/live_nodes/127.0.0.1:58687__qxs
   [junit4]   2> 1486244 INFO  (TEST-TestSQLHandler.doTest-seed#[CB2E2824C5796AD4]) [n:127.0.0.1:58687__qxs    ] o.a.s.c.c.SolrZkClient makePath: /live_nodes/127.0.0.1:58687__qxs
   [junit4]   2> 1486245 INFO  (zkCallback-1149-thread-2-processing-n:127.0.0.1:56350__qxs) [n:127.0.0.1:56350__qxs    ] o.a.s.c.c.ZkStateReader A live node change: WatchedEvent state:SyncConnected type:NodeChildrenChanged path:/live_nodes, has occurred - updating... (live nodes size: 1)
   [junit4]   2> 1486245 INFO  (zkCallback-1151-thread-1) [    ] o.a.s.c.c.ZkStateReader A live node change: WatchedEvent state:SyncConnected type:NodeChildrenChanged path:/live_nodes, has occurred - updating... (live nodes size: 1)
   [junit4]   2> 1486245 INFO  (zkCallback-1156-thread-1-processing-n:127.0.0.1:58687__qxs) [n:127.0.0.1:58687__qxs    ] o.a.s.c.c.ZkStateReader A live node change: WatchedEvent state:SyncConnected type:NodeChildrenChanged path:/live_nodes, has occurred - updating... (live nodes size: 1)
   [junit4]   2> 1486246 INFO  (TEST-TestSQLHandler.doTest-seed#[CB2E2824C5796AD4]) [n:127.0.0.1:58687__qxs    ] o.a.s.c.Overseer Overseer (id=null) closing
   [junit4]   2> 1486246 INFO  (TEST-TestSQLHandler.doTest-seed#[CB2E2824C5796AD4]) [n:127.0.0.1:58687__qxs    ] o.a.s.c.LeaderElector Joined leadership election with path: /overseer_elect/election/94622244494508041-127.0.0.1:58687__qxs-n_0000000001
   [junit4]   2> 1486246 INFO  (TEST-TestSQLHandler.doTest-seed#[CB2E2824C5796AD4]) [n:127.0.0.1:58687__qxs    ] o.a.s.c.LeaderElector Watching path /overseer_elect/election/94622244494508036-127.0.0.1:56350__qxs-n_0000000000 to know if I could be the leader
   [junit4]   2> 1486258 INFO  (TEST-TestSQLHandler.doTest-seed#[CB2E2824C5796AD4]) [n:127.0.0.1:58687__qxs    ] o.a.s.c.CoreContainer Security conf doesn't exist. Skipping setup for authorization module.
   [junit4]   2> 1486258 INFO  (TEST-TestSQLHandler.doTest-seed#[CB2E2824C5796AD4]) [n:127.0.0.1:58687__qxs    ] o.a.s.c.CoreContainer No authentication plugin used.
   [junit4]   2> 1486258 INFO  (TEST-TestSQLHandler.doTest-seed#[CB2E2824C5796AD4]) [n:127.0.0.1:58687__qxs    ] o.a.s.c.CoresLocator Looking for core definitions underneath /home/jenkins/workspace/Lucene-Solr-trunk-Linux/solr/build/solr-core/test/J0/../../../../../../../../../home/jenkins/workspace/Lucene-Solr-trunk-Linux/solr/build/solr-core/test/J0/temp/solr.handler.TestSQLHandler_CB2E2824C5796AD4-001/shard-1-001/cores
   [junit4]   2> 1486258 INFO  (TEST-TestSQLHandler.doTest-seed#[CB2E2824C5796AD4]) [n:127.0.0.1:58687__qxs    ] o.a.s.c.SolrCore Created CoreDescriptor: {name=collection1, config=solrconfig.xml, transient=false, schema=schema.xml, loadOnStartup=true, configSetProperties=configsetprops.json, instanceDir=/home/jenkins/workspace/Lucene-Solr-trunk-Linux/solr/build/solr-core/test/J0/../../../../../../../../../home/jenkins/workspace/Lucene-Solr-trunk-Linux/solr/build/solr-core/test/J0/temp/solr.handler.TestSQLHandler_CB2E2824C5796AD4-001/shard-1-001/cores/collection1, collection=collection1, absoluteInstDir=/home/jenkins/workspace/Lucene-Solr-trunk-Linux/solr/build/solr-core/test/J0/../../../../../../../../../home/jenkins/workspace/Lucene-Solr-trunk-Linux/solr/build/solr-core/test/J0/temp/solr.handler.TestSQLHandler_CB2E2824C5796AD4-001/shard-1-001/cores/collection1/, coreNodeName=, dataDir=data/, shard=}
   [junit4]   2> 1486258 INFO  (TEST-TestSQLHandler.doTest-seed#[CB2E2824C5796AD4]) [n:127.0.0.1:58687__qxs    ] o.a.s.c.CoresLocator Found core collection1 in /home/jenkins/workspace/Lucene-Solr-trunk-Linux/solr/build/solr-core/test/J0/../../../../../../../../../home/jenkins/workspace/Lucene-Solr-trunk-Linux/solr/build/solr-core/test/J0/temp/solr.handler.TestSQLHandler_CB2E2824C5796AD4-001/shard-1-001/cores/collection1/
   [junit4]   2> 1486258 INFO  (TEST-TestSQLHandler.doTest-seed#[CB2E2824C5796AD4]) [n:127.0.0.1:58687__qxs    ] o.a.s.c.CoresLocator Found 1 core definitions
   [junit4]   2> 1486259 INFO  (TEST-TestSQLHandler.doTest-seed#[CB2E2824C5796AD4]) [n:127.0.0.1:58687__qxs    ] o.a.s.s.SolrDispatchFilter user.dir=/home/jenkins/workspace/Lucene-Solr-trunk-Linux/solr/build/solr-core/test/J0
   [junit4]   2> 1486259 INFO  (TEST-TestSQLHandler.doTest-seed#[CB2E2824C5796AD4]) [n:127.0.0.1:58687__qxs    ] o.a.s.s.SolrDispatchFilter SolrDispatchFilter.init() done
   [junit4]   2> 1486259 INFO  (coreLoadExecutor-4022-thread-1-processing-n:127.0.0.1:58687__qxs) [n:127.0.0.1:58687__qxs c:collection1   x:collection1] o.a.s.c.ZkController publishing state=down
   [junit4]   2> 1486259 INFO  (coreLoadExecutor-4022-thread-1-processing-n:127.0.0.1:58687__qxs) [n:127.0.0.1:58687__qxs c:collection1   x:collection1] o.a.s.c.ZkController numShards not found on descriptor - reading it from system property
   [junit4]   2> 1486260 INFO  (coreLoadExecutor-4022-thread-1-processing-n:127.0.0.1:58687__qxs) [n:127.0.0.1:58687__qxs c:collection1   x:collection1] o.a.s.c.ZkController Registering watch for collection collection1
   [junit4]   2> 1486260 INFO  (coreLoadExecutor-4022-thread-1-processing-n:127.0.0.1:58687__qxs) [n:127.0.0.1:58687__qxs c:collection1   x:collection1] o.a.s.c.c.ZkStateReader addZkWatch collection1
   [junit4]   2> 1486260 INFO  (OverseerStateUpdate-94622244494508036-127.0.0.1:56350__qxs-n_0000000000) [n:127.0.0.1:56350__qxs    ] o.a.s.c.Overseer processMessage: queueSize: 1, message = {
   [junit4]   2>   "core":"collection1",
   [junit4]   2>   "roles":null,
   [junit4]   2>   "base_url":"http://127.0.0.1:58687/_qxs",
   [junit4]   2>   "node_name":"127.0.0.1:58687__qxs",
   [junit4]   2>   "numShards":"2",
   [junit4]   2>   "state":"down",
   [junit4]   2>   "shard":null,
   [junit4]   2>   "collection":"collection1",
   [junit4]   2>   "operation":"state"} current state version: 3
   [junit4]   2> 1486260 INFO  (coreLoadExecutor-4022-thread-1-processing-n:127.0.0.1:58687__qxs) [n:127.0.0.1:58687__qxs c:collection1   x:collection1] o.a.s.c.c.ZkStateReader Add data for collection1 ver 0 
   [junit4]   2> 1486260 INFO  (coreLoadExecutor-4022-thread-1-processing-n:127.0.0.1:58687__qxs) [n:127.0.0.1:58687__qxs c:collection1   x:collection1] o.a.s.c.ZkController look for our core node name
   [junit4]   2> 1486260 INFO  (OverseerStateUpdate-94622244494508036-127.0.0.1:56350__qxs-n_0000000000) [n:127.0.0.1:56350__qxs    ] o.a.s.c.o.ReplicaMutator Update state numShards=2 message={
   [junit4]   2>   "core":"collection1",
   [junit4]   2>   "roles":null,
   [junit4]   2>   "base_url":"http://127.0.0.1:58687/_qxs",
   [junit4]   2>   "node_name":"127.0.0.1:58687__qxs",
   [junit4]   2>   "numShards":"2",
   [junit4]   2>   "state":"down",
   [junit4]   2>   "shard":null,
   [junit4]   2>   "collection":"collection1",
   [junit4]   2>   "operation":"state"}
   [junit4]   2> 1486260 INFO  (OverseerStateUpdate-94622244494508036-127.0.0.1:56350__qxs-n_0000000000) [n:127.0.0.1:56350__qxs    ] o.a.s.c.o.ReplicaMutator Collection already exists with numShards=2
   [junit4]   2> 1486260 INFO  (OverseerStateUpdate-94622244494508036-127.0.0.1:56350__qxs-n_0000000000) [n:127.0.0.1:56350__qxs    ] o.a.s.c.o.ReplicaMutator Assigning new node to shard shard=shard2
   [junit4]   2> 1486361 INFO  (OverseerStateUpdate-94622244494508036-127.0.0.1:56350__qxs-n_0000000000) [n:127.0.0.1:56350__qxs    ] o.a.s.c.o.ZkStateWriter going to update_collection /collections/collection1/state.json version: 0
   [junit4]   2> 1486362 INFO  (zkCallback-1156-thread-1-processing-n:127.0.0.1:58687__qxs) [n:127.0.0.1:58687__qxs    ] o.a.s.c.c.ZkStateReader A cluster state change: WatchedEvent state:SyncConnected type:NodeDataChanged path:/collections/collection1/state.json for collection collection1 has occurred - updating... (live nodes size: 2)
   [junit4]   2> 1486362 INFO  (zkCallback-1156-thread-1-processing-n:127.0.0.1:58687__qxs) [n:127.0.0.1:58687__qxs    ] o.a.s.c.c.ZkStateReader Updating data for collection1 from 0 to 1 
   [junit4]   2> 1487260 INFO  (coreLoadExecutor-4022-thread-1-processing-n:127.0.0.1:58687__qxs) [n:127.0.0.1:58687__qxs c:collection1   x:collection1] o.a.s.c.ZkController waiting to find shard id in clusterstate for collection1
   [junit4]   2> 1487260 INFO  (coreLoadExecutor-4022-thread-1-processing-n:127.0.0.1:58687__qxs) [n:127.0.0.1:58687__qxs c:collection1   x:collection1] o.a.s.c.ZkController Check for collection zkNode:collection1
   [junit4]   2> 1487260 INFO  (coreLoadExecutor-4022-thread-1-processing-n:127.0.0.1:58687__qxs) [n:127.0.0.1:58687__qxs c:collection1   x:collection1] o.a.s.c.ZkController Collection zkNode exists
   [junit4]   2> 1487261 INFO  (coreLoadExecutor-4022-thread-1-processing-n:127.0.0.1:58687__qxs) [n:127.0.0.1:58687__qxs c:collection1   x:collection1] o.a.s.c.c.ZkStateReader Load collection config from:/collections/collection1
   [junit4]   2> 1487261 INFO  (coreLoadExecutor-4022-thread-1-processing-n:127.0.0.1:58687__qxs) [n:127.0.0.1:58687__qxs c:collection1   x:collection1] o.a.s.c.c.ZkStateReader path=/collections/collection1 configName=conf1 specified config exists in ZooKeeper
   [junit4]   2> 1487261 INFO  (coreLoadExecutor-4022-thread-1-processing-n:127.0.0.1:58687__qxs) [n:127.0.0.1:58687__qxs c:collection1   x:collection1] o.a.s.c.SolrResourceLoader new SolrResourceLoader for directory: '/home/jenkins/workspace/Lucene-Solr-trunk-Linux/solr/build/solr-core/test/J0/../../../../../../../../../home/jenkins/workspace/Lucene-Solr-trunk-Linux/solr/build/solr-core/test/J0/temp/solr.handler.TestSQLHandler_CB2E2824C5796AD4-001/shard-1-001/cores/collection1/'
   [junit4]   2> 1487267 INFO  (coreLoadExecutor-4022-thread-1-processing-n:127.0.0.1:58687__qxs) [n:127.0.0.1:58687__qxs c:collection1   x:collection1] o.a.s.c.Config loaded config solrconfig.xml with version 0 
   [junit4]   2> 1487269 INFO  (coreLoadExecutor-4022-thread-1-processing-n:127.0.0.1:58687__qxs) [n:127.0.0.1:58687__qxs c:collection1   x:collection1] o.a.s.c.SolrConfig current version of requestparams : -1
   [junit4]   2> 1487272 INFO  (coreLoadExecutor-4022-thread-1-processing-n:127.0.0.1:58687__qxs) [n:127.0.0.1:58687__qxs c:collection1   x:collection1] o.a.s.c.SolrConfig Using Lucene MatchVersion: 6.0.0
   [junit4]   2> 1487282 INFO  (coreLoadExecutor-4022-thread-1-processing-n:127.0.0.1:58687__qxs) [n:127.0.0.1:58687__qxs c:collection1   x:collection1] o.a.s.c.Config Loaded SolrConfig: solrconfig.xml
   [junit4]   2> 1487283 INFO  (coreLoadExecutor-4022-thread-1-processing-n:127.0.0.1:58687__qxs) [n:127.0.0.1:58687__qxs c:collection1   x:collection1] o.a.s.s.IndexSchema Reading Solr Schema from /configs/conf1/schema.xml
   [junit4]   2> 1487285 INFO  (coreLoadExecutor-4022-thread-1-processing-n:127.0.0.1:58687__qxs) [n:127.0.0.1:58687__qxs c:collection1   x:collection1] o.a.s.s.IndexSchema [collection1] Schema name=test
   [junit4]   2> 1487335 INFO  (coreLoadExecutor-4022-thread-1-processing-n:127.0.0.1:58687__qxs) [n:127.0.0.1:58687__qxs c:collection1   x:collection1] o.a.s.s.IndexSchema default search field in schema is text
   [junit4]   2> 1487335 INFO  (coreLoadExecutor-4022-thread-1-processing-n:127.0.0.1:58687__qxs) [n:127.0.0.1:58687__qxs c:collection1   x:collection1] o.a.s.s.IndexSchema unique key field: id
   [junit4]   2> 1487336 WARN  (coreLoadExecutor-4022-thread-1-processing-n:127.0.0.1:58687__qxs) [n:127.0.0.1:58687__qxs c:collection1   x:collection1] o.a.s.s.IndexSchema Field lowerfilt1and2 is not multivalued and destination for multiple copyFields (2)
   [junit4]   2> 1487336 WARN  (coreLoadExecutor-4022-thread-1-processing-n:127.0.0.1:58687__qxs) [n:127.0.0.1:58687__qxs c:collection1   x:collection1] o.a.s.s.IndexSchema Field text is not multivalued and destination for multiple copyFields (3)
   [junit4]   2> 1487337 INFO  (coreLoadExecutor-4022-thread-1-processing-n:127.0.0.1:58687__qxs) [n:127.0.0.1:58687__qxs c:collection1   x:collection1] o.a.s.c.ConfigSetProperties Did not find ConfigSet properties, assuming default properties: Can't find resource 'configsetprops.json' in classpath or '/configs/conf1', cwd=/home/jenkins/workspace/Lucene-Solr-trunk-Linux/solr/build/solr-core/test/J0
   [junit4]   2> 1487337 INFO  (coreLoadExecutor-4022-thread-1-processing-n:127.0.0.1:58687__qxs) [n:127.0.0.1:58687__qxs c:collection1   x:collection1] o.a.s.c.CoreContainer Creating SolrCore 'collection1' using configuration from collection collection1
   [junit4]   2> 1487337 INFO  (coreLoadExecutor-4022-thread-1-processing-n:127.0.0.1:58687__qxs) [n:127.0.0.1:58687__qxs c:collection1 s:shard2 r:core_node1 x:collection1] o.a.s.c.SolrCore org.apache.solr.core.MockDirectoryFactory
   [junit4]   2> 1487337 INFO  (coreLoadExecutor-4022-thread-1-processing-n:127.0.0.1:58687__qxs) [n:127.0.0.1:58687__qxs c:collection1 s:shard2 r:core_node1 x:collection1] o.a.s.c.SolrCore [[collection1] ] Opening new SolrCore at [/home/jenkins/workspace/Lucene-Solr-trunk-Linux/solr/build/solr-core/test/J0/../../../../../../../../../home/jenkins/workspace/Lucene-Solr-trunk-Linux/solr/build/solr-core/test/J0/temp/solr.handler.TestSQLHandler_CB2E2824C5796AD4-001/shard-1-001/cores/collection1/], dataDir=[null]
   [junit4]   2> 1487337 INFO  (coreLoadExecutor-4022-thread-1-processing-n:127.0.0.1:58687__qxs) [n:127.0.0.1:58687__qxs c:collection1 s:shard2 r:core_node1 x:collection1] o.a.s.c.SolrCore JMX monitoring not detected for core: collection1
   [junit4]   2> 1487338 INFO  (coreLoadExecutor-4022-thread-1-processing-n:127.0.0.1:58687__qxs) [n:127.0.0.1:58687__qxs c:collection1 s:shard2 r:core_node1 x:collection1] o.a.s.c.CachingDirectoryFactory return new directory for /home/jenkins/workspace/Lucene-Solr-trunk-Linux/solr/build/solr-core/test/J0/../../../../../../../../../home/jenkins/workspace/Lucene-Solr-trunk-Linux/solr/build/solr-core/test/J0/temp/solr.handler.TestSQLHandler_CB2E2824C5796AD4-001/shard-1-001/cores/collection1/data
   [junit4]   2> 1487338 INFO  (coreLoadExecutor-4022-thread-1-processing-n:127.0.0.1:58687__qxs) [n:127.0.0.1:58687__qxs c:collection1 s:shard2 r:core_node1 x:collection1] o.a.s.c.SolrCore New index directory detected: old=null new=/home/jenkins/workspace/Lucene-Solr-trunk-Linux/solr/build/solr-core/test/J0/../../../../../../../../../home/jenkins/workspace/Lucene-Solr-trunk-Linux/solr/build/solr-core/test/J0/temp/solr.handler.TestSQLHandler_CB2E2824C5796AD4-001/shard-1-001/cores/collection1/data/index/
   [junit4]   2> 1487338 WARN  (coreLoadExecutor-4022-thread-1-processing-n:127.0.0.1:58687__qxs) [n:127.0.0.1:58687__qxs c:collection1 s:shard2 r:core_node1 x:collection1] o.a.s.c.SolrCore [collection1] Solr index directory '/home/jenkins/workspace/Lucene-Solr-trunk-Linux/solr/build/solr-core/test/J0/../../../../../../../../../home/jenkins/workspace/Lucene-Solr-trunk-Linux/solr/build/solr-core/test/J0/temp/solr.handler.TestSQLHandler_CB2E2824C5796AD4-001/shard-1-001/cores/collection1/data/index' doesn't exist. Creating new index...
   [junit4]   2> 1487338 INFO  (coreLoadExecutor-4022-thread-1-processing-n:127.0.0.1:58687__qxs) [n:127.0.0.1:58687__qxs c:collection1 s:shard2 r:core_node1 x:collection1] o.a.s.c.CachingDirectoryFactory return new directory for /home/jenkins/workspace/Lucene-Solr-trunk-Linux/solr/build/solr-core/test/J0/../../../../../../../../../home/jenkins/workspace/Lucene-Solr-trunk-Linux/solr/build/solr-core/test/J0/temp/solr.handler.TestSQLHandler_CB2E2824C5796AD4-001/shard-1-001/cores/collection1/data/index
   [junit4]   2> 1487338 INFO  (coreLoadExecutor-4022-thread-1-processing-n:127.0.0.1:58687__qxs) [n:127.0.0.1:58687__qxs c:collection1 s:shard2 r:core_node1 x:collection1] o.a.s.c.SolrCore SolrDeletionPolicy.onCommit: commits: num=1
   [junit4]   2> 	commit{dir=MockDirectoryWrapper(RAMDirectory@6914190d lockFactory=org.apache.lucene.store.SingleInstanceLockFactory@22b341a9),segFN=segments_1,generation=1}
   [junit4]   2> 1487338 INFO  (coreLoadExecutor-4022-thread-1-processing-n:127.0.0.1:58687__qxs) [n:127.0.0.1:58687__qxs c:collection1 s:shard2 r:core_node1 x:collection1] o.a.s.c.SolrCore newest commit generation = 1
   [junit4]   2> 1487339 INFO  (OldIndexDirectoryCleanupThreadForCore-collection1) [n:127.0.0.1:58687__qxs c:collection1 s:shard2 r:core_node1 x:collection1] o.a.s.c.SolrCore Looking for old index directories to cleanup for core collection1 in /home/jenkins/workspace/Lucene-Solr-trunk-Linux/solr/build/solr-core/test/J0/../../../../../../../../../home/jenkins/workspace/Lucene-Solr-trunk-Linux/solr/build/solr-core/test/J0/temp/solr.handler.TestSQLHandler_CB2E2824C5796AD4-001/shard-1-001/cores/collection1/data/
   [junit4]   2> 1487339 WARN  (OldIndexDirectoryCleanupThreadForCore-collection1) [n:127.0.0.1:58687__qxs c:collection1 s:shard2 r:core_node1 x:collection1] o.a.s.c.DirectoryFactory /home/jenkins/workspace/Lucene-Solr-trunk-Linux/solr/build/solr-core/test/J0/../../../../../../../../../home/jenkins/workspace/Lucene-Solr-trunk-Linux/solr/build/solr-core/test/J0/temp/solr.handler.TestSQLHandler_CB2E2824C5796AD4-001/shard-1-001/cores/collection1/data/ does not point to a valid data directory; skipping clean-up of old index directories.
   [junit4]   2> 1487340 INFO  (coreLoadExecutor-4022-thread-1-processing-n:127.0.0.1:58687__qxs) [n:127.0.0.1:58687__qxs c:collection1 s:shard2 r:core_node1 x:collection1] o.a.s.c.SolrCore no updateRequestProcessorChain defined as default, creating implicit default
   [junit4]   2> 1487341 INFO  (coreLoadExecutor-4022-thread-1-processing-n:127.0.0.1:58687__qxs) [n:127.0.0.1:58687__qxs c:collection1 s:shard2 r:core_node1 x:collection1] o.a.s.h.l.XMLLoader xsltCacheLifetimeSeconds=60
   [junit4]   2> 1487341 INFO  (coreLoadExecutor-4022-thread-1-processing-n:127.0.0.1:58687__qxs) [n:127.0.0.1:58687__qxs c:collection1 s:shard2 r:core_node1 x:collection1] o.a.s.h.l.XMLLoader xsltCacheLifetimeSeconds=60
   [junit4]   2> 1487342 INFO  (coreLoadExecutor-4022-thread-1-processing-n:127.0.0.1:58687__qxs) [n:127.0.0.1:58687__qxs c:collection1 s:shard2 r:core_node1 x:collection1] o.a.s.h.l.XMLLoader xsltCacheLifetimeSeconds=60
   [junit4]   2> 1487342 INFO  (coreLoadExecutor-4022-thread-1-processing-n:127.0.0.1:58687__qxs) [n:127.0.0.1:58687__qxs c:collection1 s:shard2 r:core_node1 x:collection1] o.a.s.h.l.XMLLoader xsltCacheLifetimeSeconds=60
   [junit4]   2> 1487342 INFO  (coreLoadExecutor-4022-thread-1-processing-n:127.0.0.1:58687__qxs) [n:127.0.0.1:58687__qxs c:collection1 s:shard2 r:core_node1 x:collection1] o.a.s.c.PluginBag requestHandler : '/replication' created with startup=lazy 
   [junit4]   2> 1487343 WARN  (coreLoadExecutor-4022-thread-1-processing-n:127.0.0.1:58687__qxs) [n:127.0.0.1:58687__qxs c:collection1 s:shard2 r:core_node1 x:collection1] o.a.s.c.SolrResourceLoader Solr loaded a deprecated plugin/analysis class [org.apache.solr.handler.admin.AdminHandlers]. Please consult documentation how to replace it accordingly.
   [junit4]   2> 1487343 WARN  (coreLoadExecutor-4022-thread-1-processing-n:127.0.0.1:58687__qxs) [n:127.0.0.1:58687__qxs c:collection1 s:shard2 r:core_node1 x:collection1] o.a.s.c.SolrResourceLoader Solr loaded a deprecated plugin/analysis class [org.apache.solr.handler.admin.AdminHandlers]. Please consult documentation how to replace it accordingly.
   [junit4

[...truncated too long message...]

data/index [CachedDir<<refCount=0;path=/home/jenkins/workspace/Lucene-Solr-trunk-Linux/solr/build/solr-core/test/J0/../../../../../../../../../home/jenkins/workspace/Lucene-Solr-trunk-Linux/solr/build/solr-core/test/J0/temp/solr.handler.TestSQLHandler_CB2E2824C5796AD4-001/shard-4-001/cores/collection1/data/index;done=false>>]
   [junit4]   2> 1505144 INFO  (zkCallback-1169-thread-2-processing-n:127.0.0.1:36616__qxs) [n:127.0.0.1:36616__qxs c:collection1 s:shard1 r:core_node4 x:collection1] o.a.s.c.CachingDirectoryFactory Closing directory: /home/jenkins/workspace/Lucene-Solr-trunk-Linux/solr/build/solr-core/test/J0/../../../../../../../../../home/jenkins/workspace/Lucene-Solr-trunk-Linux/solr/build/solr-core/test/J0/temp/solr.handler.TestSQLHandler_CB2E2824C5796AD4-001/shard-4-001/cores/collection1/data/index
   [junit4]   2> 1505144 INFO  (zkCallback-1169-thread-2-processing-n:127.0.0.1:36616__qxs) [n:127.0.0.1:36616__qxs c:collection1 s:shard1 r:core_node4 x:collection1] o.a.s.c.CachingDirectoryFactory looking to close /home/jenkins/workspace/Lucene-Solr-trunk-Linux/solr/build/solr-core/test/J0/../../../../../../../../../home/jenkins/workspace/Lucene-Solr-trunk-Linux/solr/build/solr-core/test/J0/temp/solr.handler.TestSQLHandler_CB2E2824C5796AD4-001/shard-4-001/cores/collection1/data [CachedDir<<refCount=0;path=/home/jenkins/workspace/Lucene-Solr-trunk-Linux/solr/build/solr-core/test/J0/../../../../../../../../../home/jenkins/workspace/Lucene-Solr-trunk-Linux/solr/build/solr-core/test/J0/temp/solr.handler.TestSQLHandler_CB2E2824C5796AD4-001/shard-4-001/cores/collection1/data;done=false>>]
   [junit4]   2> 1505144 INFO  (zkCallback-1169-thread-2-processing-n:127.0.0.1:36616__qxs) [n:127.0.0.1:36616__qxs c:collection1 s:shard1 r:core_node4 x:collection1] o.a.s.c.CachingDirectoryFactory Closing directory: /home/jenkins/workspace/Lucene-Solr-trunk-Linux/solr/build/solr-core/test/J0/../../../../../../../../../home/jenkins/workspace/Lucene-Solr-trunk-Linux/solr/build/solr-core/test/J0/temp/solr.handler.TestSQLHandler_CB2E2824C5796AD4-001/shard-4-001/cores/collection1/data
   [junit4]   2> 1505145 INFO  (TEST-TestSQLHandler.doTest-seed#[CB2E2824C5796AD4]) [    ] o.e.j.s.ServerConnector Stopped ServerConnector@78132249{HTTP/1.1}{127.0.0.1:๐}
   [junit4]   2> 1505145 INFO  (TEST-TestSQLHandler.doTest-seed#[CB2E2824C5796AD4]) [    ] o.e.j.s.h.ContextHandler Stopped o.e.j.s.ServletContextHandler@709a6280{/_qxs,null,UNAVAILABLE}
   [junit4]   2> 1505146 INFO  (TEST-TestSQLHandler.doTest-seed#[CB2E2824C5796AD4]) [n:127.0.0.1:36616__qxs c:collection1 s:shard1 r:core_node4 x:collection1] o.a.s.c.ZkTestServer connecting to 127.0.0.1:53133 53133
   [junit4]   2> 1505169 INFO  (Thread-3540) [    ] o.a.s.c.ZkTestServer connecting to 127.0.0.1:53133 53133
   [junit4]   2> 1505169 WARN  (Thread-3540) [    ] o.a.s.c.ZkTestServer Watch limit violations: 
   [junit4]   2> Maximum concurrent create/delete watches above limit:
   [junit4]   2> 
   [junit4]   2> 	7	/solr/aliases.json
   [junit4]   2> 	5	/solr/security.json
   [junit4]   2> 	5	/solr/configs/conf1
   [junit4]   2> 
   [junit4]   2> Maximum concurrent data watches above limit:
   [junit4]   2> 
   [junit4]   2> 	7	/solr/clusterstate.json
   [junit4]   2> 	4	/solr/collections/collection1/state.json
   [junit4]   2> 
   [junit4]   2> Maximum concurrent children watches above limit:
   [junit4]   2> 
   [junit4]   2> 	7	/solr/live_nodes
   [junit4]   2> 	7	/solr/collections
   [junit4]   2> 	3	/solr/overseer/collection-queue-work
   [junit4]   2> 	2	/solr/overseer/queue
   [junit4]   2> 	2	/solr/overseer/queue-work
   [junit4]   2> 
   [junit4]   2> NOTE: reproduce with: ant test  -Dtestcase=TestSQLHandler -Dtests.method=doTest -Dtests.seed=CB2E2824C5796AD4 -Dtests.multiplier=3 -Dtests.slow=true -Dtests.locale=th_TH_TH_#u-nu-thai -Dtests.timezone=US/Hawaii -Dtests.asserts=true -Dtests.file.encoding=UTF-8
   [junit4] ERROR   21.7s J0 | TestSQLHandler.doTest <<<
   [junit4]    > Throwable #1: java.io.IOException: --> http://127.0.0.1:58687/_qxs/collection1:java.util.concurrent.ExecutionException: java.io.IOException: --> http://127.0.0.1:36616/_qxs/collection1/: An exception has occurred on the server, refer to server log for details.
   [junit4]    > 	at __randomizedtesting.SeedInfo.seed([CB2E2824C5796AD4:6C6A9080A8C2796D]:0)
   [junit4]    > 	at org.apache.solr.client.solrj.io.stream.SolrStream.read(SolrStream.java:178)
   [junit4]    > 	at org.apache.solr.handler.TestSQLHandler.getTuples(TestSQLHandler.java:1317)
   [junit4]    > 	at org.apache.solr.handler.TestSQLHandler.testBasicSelect(TestSQLHandler.java:232)
   [junit4]    > 	at org.apache.solr.handler.TestSQLHandler.doTest(TestSQLHandler.java:96)
   [junit4]    > 	at org.apache.solr.BaseDistributedSearchTestCase$ShardsRepeatRule$ShardsFixedStatement.callStatement(BaseDistributedSearchTestCase.java:963)
   [junit4]    > 	at org.apache.solr.BaseDistributedSearchTestCase$ShardsRepeatRule$ShardsStatement.evaluate(BaseDistributedSearchTestCase.java:938)
   [junit4]    > 	at java.lang.Thread.run(Thread.java:745)
   [junit4]   2> 1505176 INFO  (SUITE-TestSQLHandler-seed#[CB2E2824C5796AD4]-worker) [n:127.0.0.1:36616__qxs c:collection1 s:shard1 r:core_node4 x:collection1] o.a.s.SolrTestCaseJ4 ###deleteCore
   [junit4]   2> NOTE: leaving temporary files on disk at: /home/jenkins/workspace/Lucene-Solr-trunk-Linux/solr/build/solr-core/test/J0/temp/solr.handler.TestSQLHandler_CB2E2824C5796AD4-001
   [junit4]   2> Oct 02, 2015 9:21:31 PM com.carrotsearch.randomizedtesting.ThreadLeakControl checkThreadLeaks
   [junit4]   2> WARNING: Will linger awaiting termination of 2 leaked thread(s).
   [junit4]   2> NOTE: test params are: codec=CheapBastard, sim=ClassicSimilarity, locale=th_TH_TH_#u-nu-thai, timezone=US/Hawaii
   [junit4]   2> NOTE: Linux 3.19.0-28-generic amd64/Oracle Corporation 1.8.0_60 (64-bit)/cpus=12,threads=1,free=181735144,total=518979584
   [junit4]   2> NOTE: All tests run in this JVM: [TimeZoneUtilsTest, ConnectionManagerTest, TestRecoveryHdfs, TestHdfsUpdateLog, PingRequestHandlerTest, TestMergePolicyConfig, CdcrReplicationHandlerTest, AliasIntegrationTest, TestHighlightDedupGrouping, TestComplexPhraseQParserPlugin, DisMaxRequestHandlerTest, TestNonDefinedSimilarityFactory, DistributedMLTComponentTest, TestSolr4Spatial, TestRandomMergePolicy, TestSimpleQParserPlugin, TestFaceting, TestCloudInspectUtil, ReplicationFactorTest, TestBinaryField, TestIBSimilarityFactory, BaseCdcrDistributedZkTest, SolrTestCaseJ4Test, TestIntervalFaceting, CdcrReplicationDistributedZkTest, TestCloudSchemaless, DeleteLastCustomShardedReplicaTest, HLLUtilTest, FileBasedSpellCheckerTest, DocumentAnalysisRequestHandlerTest, TestEmbeddedSolrServerConstructors, TestCSVLoader, ResponseLogComponentTest, SyncSliceTest, StandardRequestHandlerTest, BasicDistributedZkTest, SaslZkACLProviderTest, AnalysisAfterCoreReloadTest, TestFunctionQuery, TestNoOpRegenerator, TestInfoStreamLogging, PeerSyncTest, LeaderInitiatedRecoveryOnCommitTest, CurrencyFieldOpenExchangeTest, HdfsUnloadDistributedZkTest, SynonymTokenizerTest, RollingRestartTest, RequiredFieldsTest, TestDistributedSearch, TestLazyCores, ResourceLoaderTest, TestJoin, HighlighterMaxOffsetTest, DeleteShardTest, TestSolrJ, DistribJoinFromCollectionTest, TestExceedMaxTermLength, TestInitParams, IndexSchemaTest, BasicZkTest, TestLMDirichletSimilarityFactory, TestFoldingMultitermQuery, RemoteQueryErrorTest, TestSchemaSimilarityResource, TestTrackingShardHandlerFactory, XsltUpdateRequestHandlerTest, QueryEqualityTest, LeaderElectionIntegrationTest, CopyFieldTest, SpellingQueryConverterTest, TestSolrQueryParserDefaultOperatorResource, SmileWriterTest, TestPKIAuthenticationPlugin, TestDocSet, BlockDirectoryTest, OutOfBoxZkACLAndCredentialsProvidersTest, TestPseudoReturnFields, TestRangeQuery, TestSimpleTrackingShardHandler, DateFieldTest, TestRealTimeGet, RankQueryTest, QueryElevationComponentTest, TestStandardQParsers, HdfsChaosMonkeySafeLeaderTest, CursorPagingTest, DistributedSuggestComponentTest, TestSortingResponseWriter, TestLuceneMatchVersion, SolrRequestParserTest, OpenCloseCoreStressTest, ShardRoutingTest, ClusterStateUpdateTest, TestRandomFaceting, TestZkChroot, TestRandomDVFaceting, DistributedSpellCheckComponentTest, TermVectorComponentDistributedTest, DistributedTermsComponentTest, SolrCoreTest, ConvertedLegacyTest, TestFiltering, DistributedIntervalFacetingTest, CdcrRequestHandlerTest, CollectionsAPIAsyncDistributedZkTest, DeleteReplicaTest, DistributedVersionInfoTest, OverseerCollectionConfigSetProcessorTest, OverseerRolesTest, OverseerTaskQueueTest, ShardSplitTest, TestSQLHandler]
   [junit4] Completed [456/546] on J0 in 22.74s, 1 test, 1 error <<< FAILURES!

[...truncated 283 lines...]
BUILD FAILED
/home/jenkins/workspace/Lucene-Solr-trunk-Linux/build.xml:775: The following error occurred while executing this line:
/home/jenkins/workspace/Lucene-Solr-trunk-Linux/build.xml:719: The following error occurred while executing this line:
/home/jenkins/workspace/Lucene-Solr-trunk-Linux/build.xml:59: The following error occurred while executing this line:
/home/jenkins/workspace/Lucene-Solr-trunk-Linux/solr/build.xml:233: The following error occurred while executing this line:
/home/jenkins/workspace/Lucene-Solr-trunk-Linux/solr/common-build.xml:516: The following error occurred while executing this line:
/home/jenkins/workspace/Lucene-Solr-trunk-Linux/lucene/common-build.xml:1432: The following error occurred while executing this line:
/home/jenkins/workspace/Lucene-Solr-trunk-Linux/lucene/common-build.xml:987: There were test failures: 546 suites (8 ignored), 2145 tests, 1 error, 71 ignored (35 assumptions) [seed: CB2E2824C5796AD4]

Total time: 47 minutes 0 seconds
Build step 'Invoke Ant' marked build as failure
Archiving artifacts
[WARNINGS] Skipping publisher since build result is FAILURE
Recording test results
Email was triggered for: Failure - Any
Sending email for trigger: Failure - Any



Mime
View raw message