lucene-dev mailing list archives

Site index · List index
Message view « Date » · « Thread »
Top « Date » · « Thread »
From Policeman Jenkins Server <jenk...@thetaphi.de>
Subject [JENKINS] Lucene-Solr-5.x-Linux (32bit/jdk1.8.0_60) - Build # 14186 - Failure!
Date Sat, 10 Oct 2015 05:43:19 GMT
Build: http://jenkins.thetaphi.de/job/Lucene-Solr-5.x-Linux/14186/
Java: 32bit/jdk1.8.0_60 -client -XX:+UseParallelGC

1 tests failed.
FAILED:  org.apache.solr.cloud.SolrCloudExampleTest.testLoadDocsIntoGettingStartedCollection

Error Message:
Delete action failed!

Stack Trace:
java.lang.AssertionError: Delete action failed!
	at __randomizedtesting.SeedInfo.seed([75BBE60B308B435:14388C0F82670D93]:0)
	at org.junit.Assert.fail(Assert.java:93)
	at org.junit.Assert.assertTrue(Assert.java:43)
	at org.apache.solr.cloud.SolrCloudExampleTest.doTestDeleteAction(SolrCloudExampleTest.java:169)
	at org.apache.solr.cloud.SolrCloudExampleTest.testLoadDocsIntoGettingStartedCollection(SolrCloudExampleTest.java:145)
	at sun.reflect.NativeMethodAccessorImpl.invoke0(Native Method)
	at sun.reflect.NativeMethodAccessorImpl.invoke(NativeMethodAccessorImpl.java:62)
	at sun.reflect.DelegatingMethodAccessorImpl.invoke(DelegatingMethodAccessorImpl.java:43)
	at java.lang.reflect.Method.invoke(Method.java:497)
	at com.carrotsearch.randomizedtesting.RandomizedRunner.invoke(RandomizedRunner.java:1665)
	at com.carrotsearch.randomizedtesting.RandomizedRunner$8.evaluate(RandomizedRunner.java:864)
	at com.carrotsearch.randomizedtesting.RandomizedRunner$9.evaluate(RandomizedRunner.java:900)
	at com.carrotsearch.randomizedtesting.RandomizedRunner$10.evaluate(RandomizedRunner.java:914)
	at org.apache.solr.BaseDistributedSearchTestCase$ShardsRepeatRule$ShardsFixedStatement.callStatement(BaseDistributedSearchTestCase.java:963)
	at org.apache.solr.BaseDistributedSearchTestCase$ShardsRepeatRule$ShardsStatement.evaluate(BaseDistributedSearchTestCase.java:938)
	at com.carrotsearch.randomizedtesting.rules.SystemPropertiesRestoreRule$1.evaluate(SystemPropertiesRestoreRule.java:57)
	at org.apache.lucene.util.TestRuleSetupTeardownChained$1.evaluate(TestRuleSetupTeardownChained.java:50)
	at org.apache.lucene.util.AbstractBeforeAfterRule$1.evaluate(AbstractBeforeAfterRule.java:46)
	at org.apache.lucene.util.TestRuleThreadAndTestName$1.evaluate(TestRuleThreadAndTestName.java:49)
	at org.apache.lucene.util.TestRuleIgnoreAfterMaxFailures$1.evaluate(TestRuleIgnoreAfterMaxFailures.java:65)
	at org.apache.lucene.util.TestRuleMarkFailure$1.evaluate(TestRuleMarkFailure.java:48)
	at com.carrotsearch.randomizedtesting.rules.StatementAdapter.evaluate(StatementAdapter.java:36)
	at com.carrotsearch.randomizedtesting.ThreadLeakControl$StatementRunner.run(ThreadLeakControl.java:367)
	at com.carrotsearch.randomizedtesting.ThreadLeakControl.forkTimeoutingTask(ThreadLeakControl.java:809)
	at com.carrotsearch.randomizedtesting.ThreadLeakControl$3.evaluate(ThreadLeakControl.java:460)
	at com.carrotsearch.randomizedtesting.RandomizedRunner.runSingleTest(RandomizedRunner.java:873)
	at com.carrotsearch.randomizedtesting.RandomizedRunner$5.evaluate(RandomizedRunner.java:775)
	at com.carrotsearch.randomizedtesting.RandomizedRunner$6.evaluate(RandomizedRunner.java:809)
	at com.carrotsearch.randomizedtesting.RandomizedRunner$7.evaluate(RandomizedRunner.java:820)
	at com.carrotsearch.randomizedtesting.rules.StatementAdapter.evaluate(StatementAdapter.java:36)
	at com.carrotsearch.randomizedtesting.rules.SystemPropertiesRestoreRule$1.evaluate(SystemPropertiesRestoreRule.java:57)
	at org.apache.lucene.util.AbstractBeforeAfterRule$1.evaluate(AbstractBeforeAfterRule.java:46)
	at com.carrotsearch.randomizedtesting.rules.StatementAdapter.evaluate(StatementAdapter.java:36)
	at org.apache.lucene.util.TestRuleStoreClassName$1.evaluate(TestRuleStoreClassName.java:42)
	at com.carrotsearch.randomizedtesting.rules.NoShadowingOrOverridesOnMethodsRule$1.evaluate(NoShadowingOrOverridesOnMethodsRule.java:39)
	at com.carrotsearch.randomizedtesting.rules.NoShadowingOrOverridesOnMethodsRule$1.evaluate(NoShadowingOrOverridesOnMethodsRule.java:39)
	at com.carrotsearch.randomizedtesting.rules.StatementAdapter.evaluate(StatementAdapter.java:36)
	at com.carrotsearch.randomizedtesting.rules.StatementAdapter.evaluate(StatementAdapter.java:36)
	at com.carrotsearch.randomizedtesting.rules.StatementAdapter.evaluate(StatementAdapter.java:36)
	at org.apache.lucene.util.TestRuleAssertionsRequired$1.evaluate(TestRuleAssertionsRequired.java:54)
	at org.apache.lucene.util.TestRuleMarkFailure$1.evaluate(TestRuleMarkFailure.java:48)
	at org.apache.lucene.util.TestRuleIgnoreAfterMaxFailures$1.evaluate(TestRuleIgnoreAfterMaxFailures.java:65)
	at org.apache.lucene.util.TestRuleIgnoreTestSuites$1.evaluate(TestRuleIgnoreTestSuites.java:55)
	at com.carrotsearch.randomizedtesting.rules.StatementAdapter.evaluate(StatementAdapter.java:36)
	at com.carrotsearch.randomizedtesting.ThreadLeakControl$StatementRunner.run(ThreadLeakControl.java:367)
	at java.lang.Thread.run(Thread.java:745)




Build Log:
[...truncated 10159 lines...]
   [junit4] Suite: org.apache.solr.cloud.SolrCloudExampleTest
   [junit4]   2> Creating dataDir: /home/jenkins/workspace/Lucene-Solr-5.x-Linux/solr/build/solr-core/test/J0/temp/solr.cloud.SolrCloudExampleTest_75BBE60B308B435-001/init-core-data-001
   [junit4]   2> 321471 INFO  (SUITE-SolrCloudExampleTest-seed#[75BBE60B308B435]-worker) [    ] o.a.s.SolrTestCaseJ4 Randomized ssl (false) and clientAuth (false)
   [junit4]   2> 321472 INFO  (SUITE-SolrCloudExampleTest-seed#[75BBE60B308B435]-worker) [    ] o.a.s.BaseDistributedSearchTestCase Setting hostContext system property: /_od/
   [junit4]   2> 321473 INFO  (TEST-SolrCloudExampleTest.testLoadDocsIntoGettingStartedCollection-seed#[75BBE60B308B435]) [    ] o.a.s.c.ZkTestServer STARTING ZK TEST SERVER
   [junit4]   2> 321473 INFO  (Thread-953) [    ] o.a.s.c.ZkTestServer client port:0.0.0.0/0.0.0.0:0
   [junit4]   2> 321473 INFO  (Thread-953) [    ] o.a.s.c.ZkTestServer Starting server
   [junit4]   2> 321573 INFO  (TEST-SolrCloudExampleTest.testLoadDocsIntoGettingStartedCollection-seed#[75BBE60B308B435]) [    ] o.a.s.c.ZkTestServer start zk server on port:48949
   [junit4]   2> 321574 INFO  (TEST-SolrCloudExampleTest.testLoadDocsIntoGettingStartedCollection-seed#[75BBE60B308B435]) [    ] o.a.s.c.c.SolrZkClient Using default ZkCredentialsProvider
   [junit4]   2> 321574 INFO  (TEST-SolrCloudExampleTest.testLoadDocsIntoGettingStartedCollection-seed#[75BBE60B308B435]) [    ] o.a.s.c.c.ConnectionManager Waiting for client to connect to ZooKeeper
   [junit4]   2> 321577 INFO  (zkCallback-229-thread-1) [    ] o.a.s.c.c.ConnectionManager Watcher org.apache.solr.common.cloud.ConnectionManager@1cea8d0 name:ZooKeeperConnection Watcher:127.0.0.1:48949 got event WatchedEvent state:SyncConnected type:None path:null path:null type:None
   [junit4]   2> 321577 INFO  (TEST-SolrCloudExampleTest.testLoadDocsIntoGettingStartedCollection-seed#[75BBE60B308B435]) [    ] o.a.s.c.c.ConnectionManager Client is connected to ZooKeeper
   [junit4]   2> 321577 INFO  (TEST-SolrCloudExampleTest.testLoadDocsIntoGettingStartedCollection-seed#[75BBE60B308B435]) [    ] o.a.s.c.c.SolrZkClient Using default ZkACLProvider
   [junit4]   2> 321577 INFO  (TEST-SolrCloudExampleTest.testLoadDocsIntoGettingStartedCollection-seed#[75BBE60B308B435]) [    ] o.a.s.c.c.SolrZkClient makePath: /solr
   [junit4]   2> 321580 INFO  (TEST-SolrCloudExampleTest.testLoadDocsIntoGettingStartedCollection-seed#[75BBE60B308B435]) [    ] o.a.s.c.c.SolrZkClient Using default ZkCredentialsProvider
   [junit4]   2> 321580 INFO  (TEST-SolrCloudExampleTest.testLoadDocsIntoGettingStartedCollection-seed#[75BBE60B308B435]) [    ] o.a.s.c.c.ConnectionManager Waiting for client to connect to ZooKeeper
   [junit4]   2> 321581 INFO  (zkCallback-230-thread-1) [    ] o.a.s.c.c.ConnectionManager Watcher org.apache.solr.common.cloud.ConnectionManager@849ddf name:ZooKeeperConnection Watcher:127.0.0.1:48949/solr got event WatchedEvent state:SyncConnected type:None path:null path:null type:None
   [junit4]   2> 321581 INFO  (TEST-SolrCloudExampleTest.testLoadDocsIntoGettingStartedCollection-seed#[75BBE60B308B435]) [    ] o.a.s.c.c.ConnectionManager Client is connected to ZooKeeper
   [junit4]   2> 321582 INFO  (TEST-SolrCloudExampleTest.testLoadDocsIntoGettingStartedCollection-seed#[75BBE60B308B435]) [    ] o.a.s.c.c.SolrZkClient Using default ZkACLProvider
   [junit4]   2> 321582 INFO  (TEST-SolrCloudExampleTest.testLoadDocsIntoGettingStartedCollection-seed#[75BBE60B308B435]) [    ] o.a.s.c.c.SolrZkClient makePath: /collections/collection1
   [junit4]   2> 321584 INFO  (TEST-SolrCloudExampleTest.testLoadDocsIntoGettingStartedCollection-seed#[75BBE60B308B435]) [    ] o.a.s.c.c.SolrZkClient makePath: /collections/collection1/shards
   [junit4]   2> 321586 INFO  (TEST-SolrCloudExampleTest.testLoadDocsIntoGettingStartedCollection-seed#[75BBE60B308B435]) [    ] o.a.s.c.c.SolrZkClient makePath: /collections/control_collection
   [junit4]   2> 321588 INFO  (TEST-SolrCloudExampleTest.testLoadDocsIntoGettingStartedCollection-seed#[75BBE60B308B435]) [    ] o.a.s.c.c.SolrZkClient makePath: /collections/control_collection/shards
   [junit4]   2> 321589 INFO  (TEST-SolrCloudExampleTest.testLoadDocsIntoGettingStartedCollection-seed#[75BBE60B308B435]) [    ] o.a.s.c.AbstractZkTestCase put /home/jenkins/workspace/Lucene-Solr-5.x-Linux/solr/core/src/test-files/solr/collection1/conf/solrconfig-tlog.xml to /configs/conf1/solrconfig.xml
   [junit4]   2> 321590 INFO  (TEST-SolrCloudExampleTest.testLoadDocsIntoGettingStartedCollection-seed#[75BBE60B308B435]) [    ] o.a.s.c.c.SolrZkClient makePath: /configs/conf1/solrconfig.xml
   [junit4]   2> 321592 INFO  (TEST-SolrCloudExampleTest.testLoadDocsIntoGettingStartedCollection-seed#[75BBE60B308B435]) [    ] o.a.s.c.AbstractZkTestCase put /home/jenkins/workspace/Lucene-Solr-5.x-Linux/solr/core/src/test-files/solr/collection1/conf/schema.xml to /configs/conf1/schema.xml
   [junit4]   2> 321592 INFO  (TEST-SolrCloudExampleTest.testLoadDocsIntoGettingStartedCollection-seed#[75BBE60B308B435]) [    ] o.a.s.c.c.SolrZkClient makePath: /configs/conf1/schema.xml
   [junit4]   2> 321594 INFO  (TEST-SolrCloudExampleTest.testLoadDocsIntoGettingStartedCollection-seed#[75BBE60B308B435]) [    ] o.a.s.c.AbstractZkTestCase put /home/jenkins/workspace/Lucene-Solr-5.x-Linux/solr/core/src/test-files/solr/collection1/conf/solrconfig.snippet.randomindexconfig.xml to /configs/conf1/solrconfig.snippet.randomindexconfig.xml
   [junit4]   2> 321594 INFO  (TEST-SolrCloudExampleTest.testLoadDocsIntoGettingStartedCollection-seed#[75BBE60B308B435]) [    ] o.a.s.c.c.SolrZkClient makePath: /configs/conf1/solrconfig.snippet.randomindexconfig.xml
   [junit4]   2> 321596 INFO  (TEST-SolrCloudExampleTest.testLoadDocsIntoGettingStartedCollection-seed#[75BBE60B308B435]) [    ] o.a.s.c.AbstractZkTestCase put /home/jenkins/workspace/Lucene-Solr-5.x-Linux/solr/core/src/test-files/solr/collection1/conf/stopwords.txt to /configs/conf1/stopwords.txt
   [junit4]   2> 321596 INFO  (TEST-SolrCloudExampleTest.testLoadDocsIntoGettingStartedCollection-seed#[75BBE60B308B435]) [    ] o.a.s.c.c.SolrZkClient makePath: /configs/conf1/stopwords.txt
   [junit4]   2> 321597 INFO  (TEST-SolrCloudExampleTest.testLoadDocsIntoGettingStartedCollection-seed#[75BBE60B308B435]) [    ] o.a.s.c.AbstractZkTestCase put /home/jenkins/workspace/Lucene-Solr-5.x-Linux/solr/core/src/test-files/solr/collection1/conf/protwords.txt to /configs/conf1/protwords.txt
   [junit4]   2> 321597 INFO  (TEST-SolrCloudExampleTest.testLoadDocsIntoGettingStartedCollection-seed#[75BBE60B308B435]) [    ] o.a.s.c.c.SolrZkClient makePath: /configs/conf1/protwords.txt
   [junit4]   2> 321599 INFO  (TEST-SolrCloudExampleTest.testLoadDocsIntoGettingStartedCollection-seed#[75BBE60B308B435]) [    ] o.a.s.c.AbstractZkTestCase put /home/jenkins/workspace/Lucene-Solr-5.x-Linux/solr/core/src/test-files/solr/collection1/conf/currency.xml to /configs/conf1/currency.xml
   [junit4]   2> 321600 INFO  (TEST-SolrCloudExampleTest.testLoadDocsIntoGettingStartedCollection-seed#[75BBE60B308B435]) [    ] o.a.s.c.c.SolrZkClient makePath: /configs/conf1/currency.xml
   [junit4]   2> 321601 INFO  (TEST-SolrCloudExampleTest.testLoadDocsIntoGettingStartedCollection-seed#[75BBE60B308B435]) [    ] o.a.s.c.AbstractZkTestCase put /home/jenkins/workspace/Lucene-Solr-5.x-Linux/solr/core/src/test-files/solr/collection1/conf/enumsConfig.xml to /configs/conf1/enumsConfig.xml
   [junit4]   2> 321601 INFO  (TEST-SolrCloudExampleTest.testLoadDocsIntoGettingStartedCollection-seed#[75BBE60B308B435]) [    ] o.a.s.c.c.SolrZkClient makePath: /configs/conf1/enumsConfig.xml
   [junit4]   2> 321603 INFO  (TEST-SolrCloudExampleTest.testLoadDocsIntoGettingStartedCollection-seed#[75BBE60B308B435]) [    ] o.a.s.c.AbstractZkTestCase put /home/jenkins/workspace/Lucene-Solr-5.x-Linux/solr/core/src/test-files/solr/collection1/conf/open-exchange-rates.json to /configs/conf1/open-exchange-rates.json
   [junit4]   2> 321603 INFO  (TEST-SolrCloudExampleTest.testLoadDocsIntoGettingStartedCollection-seed#[75BBE60B308B435]) [    ] o.a.s.c.c.SolrZkClient makePath: /configs/conf1/open-exchange-rates.json
   [junit4]   2> 321604 INFO  (TEST-SolrCloudExampleTest.testLoadDocsIntoGettingStartedCollection-seed#[75BBE60B308B435]) [    ] o.a.s.c.AbstractZkTestCase put /home/jenkins/workspace/Lucene-Solr-5.x-Linux/solr/core/src/test-files/solr/collection1/conf/mapping-ISOLatin1Accent.txt to /configs/conf1/mapping-ISOLatin1Accent.txt
   [junit4]   2> 321604 INFO  (TEST-SolrCloudExampleTest.testLoadDocsIntoGettingStartedCollection-seed#[75BBE60B308B435]) [    ] o.a.s.c.c.SolrZkClient makePath: /configs/conf1/mapping-ISOLatin1Accent.txt
   [junit4]   2> 321606 INFO  (TEST-SolrCloudExampleTest.testLoadDocsIntoGettingStartedCollection-seed#[75BBE60B308B435]) [    ] o.a.s.c.AbstractZkTestCase put /home/jenkins/workspace/Lucene-Solr-5.x-Linux/solr/core/src/test-files/solr/collection1/conf/old_synonyms.txt to /configs/conf1/old_synonyms.txt
   [junit4]   2> 321606 INFO  (TEST-SolrCloudExampleTest.testLoadDocsIntoGettingStartedCollection-seed#[75BBE60B308B435]) [    ] o.a.s.c.c.SolrZkClient makePath: /configs/conf1/old_synonyms.txt
   [junit4]   2> 321607 INFO  (TEST-SolrCloudExampleTest.testLoadDocsIntoGettingStartedCollection-seed#[75BBE60B308B435]) [    ] o.a.s.c.AbstractZkTestCase put /home/jenkins/workspace/Lucene-Solr-5.x-Linux/solr/core/src/test-files/solr/collection1/conf/synonyms.txt to /configs/conf1/synonyms.txt
   [junit4]   2> 321607 INFO  (TEST-SolrCloudExampleTest.testLoadDocsIntoGettingStartedCollection-seed#[75BBE60B308B435]) [    ] o.a.s.c.c.SolrZkClient makePath: /configs/conf1/synonyms.txt
   [junit4]   2> 321684 INFO  (TEST-SolrCloudExampleTest.testLoadDocsIntoGettingStartedCollection-seed#[75BBE60B308B435]) [    ] o.a.s.SolrTestCaseJ4 Writing core.properties file to /home/jenkins/workspace/Lucene-Solr-5.x-Linux/solr/build/solr-core/test/J0/temp/solr.cloud.SolrCloudExampleTest_75BBE60B308B435-001/control-001/cores/collection1
   [junit4]   2> 321685 INFO  (TEST-SolrCloudExampleTest.testLoadDocsIntoGettingStartedCollection-seed#[75BBE60B308B435]) [    ] o.e.j.s.Server jetty-9.2.13.v20150730
   [junit4]   2> 321686 INFO  (TEST-SolrCloudExampleTest.testLoadDocsIntoGettingStartedCollection-seed#[75BBE60B308B435]) [    ] o.e.j.s.h.ContextHandler Started o.e.j.s.ServletContextHandler@18640f1{/_od,null,AVAILABLE}
   [junit4]   2> 321689 INFO  (TEST-SolrCloudExampleTest.testLoadDocsIntoGettingStartedCollection-seed#[75BBE60B308B435]) [    ] o.e.j.s.ServerConnector Started ServerConnector@1e31d0{HTTP/1.1}{127.0.0.1:51577}
   [junit4]   2> 321689 INFO  (TEST-SolrCloudExampleTest.testLoadDocsIntoGettingStartedCollection-seed#[75BBE60B308B435]) [    ] o.e.j.s.Server Started @323026ms
   [junit4]   2> 321689 INFO  (TEST-SolrCloudExampleTest.testLoadDocsIntoGettingStartedCollection-seed#[75BBE60B308B435]) [    ] o.a.s.c.s.e.JettySolrRunner Jetty properties: {solr.data.dir=/home/jenkins/workspace/Lucene-Solr-5.x-Linux/solr/build/solr-core/test/J0/temp/solr.cloud.SolrCloudExampleTest_75BBE60B308B435-001/tempDir-001/control/data, hostContext=/_od, hostPort=51577, coreRootDirectory=/home/jenkins/workspace/Lucene-Solr-5.x-Linux/solr/build/solr-core/test/J0/temp/solr.cloud.SolrCloudExampleTest_75BBE60B308B435-001/control-001/cores}
   [junit4]   2> 321690 INFO  (TEST-SolrCloudExampleTest.testLoadDocsIntoGettingStartedCollection-seed#[75BBE60B308B435]) [    ] o.a.s.s.SolrDispatchFilter SolrDispatchFilter.init(): sun.misc.Launcher$AppClassLoader@e2f2a
   [junit4]   2> 321690 INFO  (TEST-SolrCloudExampleTest.testLoadDocsIntoGettingStartedCollection-seed#[75BBE60B308B435]) [    ] o.a.s.c.SolrResourceLoader new SolrResourceLoader for directory: '/home/jenkins/workspace/Lucene-Solr-5.x-Linux/solr/build/solr-core/test/J0/temp/solr.cloud.SolrCloudExampleTest_75BBE60B308B435-001/control-001/'
   [junit4]   2> 321690 INFO  (TEST-SolrCloudExampleTest.testLoadDocsIntoGettingStartedCollection-seed#[75BBE60B308B435]) [    ] o.a.s.c.SolrResourceLoader JNDI not configured for solr (NoInitialContextEx)
   [junit4]   2> 321690 INFO  (TEST-SolrCloudExampleTest.testLoadDocsIntoGettingStartedCollection-seed#[75BBE60B308B435]) [    ] o.a.s.c.SolrResourceLoader solr home defaulted to 'solr/' (could not find system property or JNDI)
   [junit4]   2> 321715 INFO  (TEST-SolrCloudExampleTest.testLoadDocsIntoGettingStartedCollection-seed#[75BBE60B308B435]) [    ] o.a.s.c.c.SolrZkClient Using default ZkCredentialsProvider
   [junit4]   2> 321715 INFO  (TEST-SolrCloudExampleTest.testLoadDocsIntoGettingStartedCollection-seed#[75BBE60B308B435]) [    ] o.a.s.c.c.ConnectionManager Waiting for client to connect to ZooKeeper
   [junit4]   2> 321717 INFO  (zkCallback-231-thread-1) [    ] o.a.s.c.c.ConnectionManager Watcher org.apache.solr.common.cloud.ConnectionManager@837159 name:ZooKeeperConnection Watcher:127.0.0.1:48949/solr got event WatchedEvent state:SyncConnected type:None path:null path:null type:None
   [junit4]   2> 321717 INFO  (TEST-SolrCloudExampleTest.testLoadDocsIntoGettingStartedCollection-seed#[75BBE60B308B435]) [    ] o.a.s.c.c.ConnectionManager Client is connected to ZooKeeper
   [junit4]   2> 321717 INFO  (TEST-SolrCloudExampleTest.testLoadDocsIntoGettingStartedCollection-seed#[75BBE60B308B435]) [    ] o.a.s.c.c.SolrZkClient Using default ZkACLProvider
   [junit4]   2> 321719 INFO  (TEST-SolrCloudExampleTest.testLoadDocsIntoGettingStartedCollection-seed#[75BBE60B308B435]) [    ] o.a.s.s.SolrDispatchFilter Loading solr.xml from SolrHome (not found in ZooKeeper)
   [junit4]   2> 321719 INFO  (TEST-SolrCloudExampleTest.testLoadDocsIntoGettingStartedCollection-seed#[75BBE60B308B435]) [    ] o.a.s.c.SolrXmlConfig Loading container configuration from /home/jenkins/workspace/Lucene-Solr-5.x-Linux/solr/build/solr-core/test/J0/temp/solr.cloud.SolrCloudExampleTest_75BBE60B308B435-001/control-001/solr.xml
   [junit4]   2> 321727 INFO  (TEST-SolrCloudExampleTest.testLoadDocsIntoGettingStartedCollection-seed#[75BBE60B308B435]) [    ] o.a.s.c.CoresLocator Config-defined core root directory: /home/jenkins/workspace/Lucene-Solr-5.x-Linux/solr/build/solr-core/test/J0/temp/solr.cloud.SolrCloudExampleTest_75BBE60B308B435-001/control-001/cores
   [junit4]   2> 321727 INFO  (TEST-SolrCloudExampleTest.testLoadDocsIntoGettingStartedCollection-seed#[75BBE60B308B435]) [    ] o.a.s.c.CoreContainer New CoreContainer 27004434
   [junit4]   2> 321727 INFO  (TEST-SolrCloudExampleTest.testLoadDocsIntoGettingStartedCollection-seed#[75BBE60B308B435]) [    ] o.a.s.c.CoreContainer Loading cores into CoreContainer [instanceDir=/home/jenkins/workspace/Lucene-Solr-5.x-Linux/solr/build/solr-core/test/J0/temp/solr.cloud.SolrCloudExampleTest_75BBE60B308B435-001/control-001/]
   [junit4]   2> 321727 INFO  (TEST-SolrCloudExampleTest.testLoadDocsIntoGettingStartedCollection-seed#[75BBE60B308B435]) [    ] o.a.s.c.CoreContainer loading shared library: /home/jenkins/workspace/Lucene-Solr-5.x-Linux/solr/build/solr-core/test/J0/temp/solr.cloud.SolrCloudExampleTest_75BBE60B308B435-001/control-001/lib
   [junit4]   2> 321727 WARN  (TEST-SolrCloudExampleTest.testLoadDocsIntoGettingStartedCollection-seed#[75BBE60B308B435]) [    ] o.a.s.c.SolrResourceLoader Can't find (or read) directory to add to classloader: lib (resolved as: /home/jenkins/workspace/Lucene-Solr-5.x-Linux/solr/build/solr-core/test/J0/temp/solr.cloud.SolrCloudExampleTest_75BBE60B308B435-001/control-001/lib).
   [junit4]   2> 321738 INFO  (TEST-SolrCloudExampleTest.testLoadDocsIntoGettingStartedCollection-seed#[75BBE60B308B435]) [    ] o.a.s.h.c.HttpShardHandlerFactory created with socketTimeout : 90000,urlScheme : ,connTimeout : 15000,maxConnectionsPerHost : 20,maxConnections : 10000,corePoolSize : 0,maximumPoolSize : 2147483647,maxThreadIdleTime : 5,sizeOfQueue : -1,fairnessPolicy : false,useRetries : false,
   [junit4]   2> 321740 INFO  (TEST-SolrCloudExampleTest.testLoadDocsIntoGettingStartedCollection-seed#[75BBE60B308B435]) [    ] o.a.s.u.UpdateShardHandler Creating UpdateShardHandler HTTP client with params: socketTimeout=340000&connTimeout=45000&retry=true
   [junit4]   2> 321740 INFO  (TEST-SolrCloudExampleTest.testLoadDocsIntoGettingStartedCollection-seed#[75BBE60B308B435]) [    ] o.a.s.l.LogWatcher SLF4J impl is org.slf4j.impl.Log4jLoggerFactory
   [junit4]   2> 321740 INFO  (TEST-SolrCloudExampleTest.testLoadDocsIntoGettingStartedCollection-seed#[75BBE60B308B435]) [    ] o.a.s.l.LogWatcher Registering Log Listener [Log4j (org.slf4j.impl.Log4jLoggerFactory)]
   [junit4]   2> 321740 INFO  (TEST-SolrCloudExampleTest.testLoadDocsIntoGettingStartedCollection-seed#[75BBE60B308B435]) [    ] o.a.s.c.ZkContainer Zookeeper client=127.0.0.1:48949/solr
   [junit4]   2> 321741 INFO  (TEST-SolrCloudExampleTest.testLoadDocsIntoGettingStartedCollection-seed#[75BBE60B308B435]) [    ] o.a.s.c.ZkController zkHost includes chroot
   [junit4]   2> 321741 INFO  (TEST-SolrCloudExampleTest.testLoadDocsIntoGettingStartedCollection-seed#[75BBE60B308B435]) [    ] o.a.s.c.c.SolrZkClient Using default ZkCredentialsProvider
   [junit4]   2> 321741 INFO  (TEST-SolrCloudExampleTest.testLoadDocsIntoGettingStartedCollection-seed#[75BBE60B308B435]) [    ] o.a.s.c.c.ConnectionManager Waiting for client to connect to ZooKeeper
   [junit4]   2> 321743 INFO  (zkCallback-233-thread-1) [    ] o.a.s.c.c.ConnectionManager Watcher org.apache.solr.common.cloud.ConnectionManager@9efeb8 name:ZooKeeperConnection Watcher:127.0.0.1:48949 got event WatchedEvent state:SyncConnected type:None path:null path:null type:None
   [junit4]   2> 321743 INFO  (TEST-SolrCloudExampleTest.testLoadDocsIntoGettingStartedCollection-seed#[75BBE60B308B435]) [    ] o.a.s.c.c.ConnectionManager Client is connected to ZooKeeper
   [junit4]   2> 321744 INFO  (TEST-SolrCloudExampleTest.testLoadDocsIntoGettingStartedCollection-seed#[75BBE60B308B435]) [    ] o.a.s.c.c.SolrZkClient Using default ZkACLProvider
   [junit4]   2> 321745 INFO  (TEST-SolrCloudExampleTest.testLoadDocsIntoGettingStartedCollection-seed#[75BBE60B308B435]) [n:127.0.0.1:51577__od    ] o.a.s.c.c.ConnectionManager Waiting for client to connect to ZooKeeper
   [junit4]   2> 321746 INFO  (zkCallback-234-thread-1-processing-n:127.0.0.1:51577__od) [n:127.0.0.1:51577__od    ] o.a.s.c.c.ConnectionManager Watcher org.apache.solr.common.cloud.ConnectionManager@1c5b3c name:ZooKeeperConnection Watcher:127.0.0.1:48949/solr got event WatchedEvent state:SyncConnected type:None path:null path:null type:None
   [junit4]   2> 321746 INFO  (TEST-SolrCloudExampleTest.testLoadDocsIntoGettingStartedCollection-seed#[75BBE60B308B435]) [n:127.0.0.1:51577__od    ] o.a.s.c.c.ConnectionManager Client is connected to ZooKeeper
   [junit4]   2> 321747 INFO  (TEST-SolrCloudExampleTest.testLoadDocsIntoGettingStartedCollection-seed#[75BBE60B308B435]) [n:127.0.0.1:51577__od    ] o.a.s.c.c.SolrZkClient makePath: /overseer/queue
   [junit4]   2> 321749 INFO  (TEST-SolrCloudExampleTest.testLoadDocsIntoGettingStartedCollection-seed#[75BBE60B308B435]) [n:127.0.0.1:51577__od    ] o.a.s.c.c.SolrZkClient makePath: /overseer/collection-queue-work
   [junit4]   2> 321751 INFO  (TEST-SolrCloudExampleTest.testLoadDocsIntoGettingStartedCollection-seed#[75BBE60B308B435]) [n:127.0.0.1:51577__od    ] o.a.s.c.c.SolrZkClient makePath: /overseer/collection-map-running
   [junit4]   2> 321753 INFO  (TEST-SolrCloudExampleTest.testLoadDocsIntoGettingStartedCollection-seed#[75BBE60B308B435]) [n:127.0.0.1:51577__od    ] o.a.s.c.c.SolrZkClient makePath: /overseer/collection-map-completed
   [junit4]   2> 321755 INFO  (TEST-SolrCloudExampleTest.testLoadDocsIntoGettingStartedCollection-seed#[75BBE60B308B435]) [n:127.0.0.1:51577__od    ] o.a.s.c.c.SolrZkClient makePath: /overseer/collection-map-failure
   [junit4]   2> 321757 INFO  (TEST-SolrCloudExampleTest.testLoadDocsIntoGettingStartedCollection-seed#[75BBE60B308B435]) [n:127.0.0.1:51577__od    ] o.a.s.c.c.SolrZkClient makePath: /live_nodes
   [junit4]   2> 321758 INFO  (TEST-SolrCloudExampleTest.testLoadDocsIntoGettingStartedCollection-seed#[75BBE60B308B435]) [n:127.0.0.1:51577__od    ] o.a.s.c.c.SolrZkClient makePath: /aliases.json
   [junit4]   2> 321759 INFO  (TEST-SolrCloudExampleTest.testLoadDocsIntoGettingStartedCollection-seed#[75BBE60B308B435]) [n:127.0.0.1:51577__od    ] o.a.s.c.c.SolrZkClient makePath: /clusterstate.json
   [junit4]   2> 321760 INFO  (TEST-SolrCloudExampleTest.testLoadDocsIntoGettingStartedCollection-seed#[75BBE60B308B435]) [n:127.0.0.1:51577__od    ] o.a.s.c.c.SolrZkClient makePath: /security.json
   [junit4]   2> 321761 INFO  (TEST-SolrCloudExampleTest.testLoadDocsIntoGettingStartedCollection-seed#[75BBE60B308B435]) [n:127.0.0.1:51577__od    ] o.a.s.c.ZkController Register node as live in ZooKeeper:/live_nodes/127.0.0.1:51577__od
   [junit4]   2> 321761 INFO  (TEST-SolrCloudExampleTest.testLoadDocsIntoGettingStartedCollection-seed#[75BBE60B308B435]) [n:127.0.0.1:51577__od    ] o.a.s.c.c.SolrZkClient makePath: /live_nodes/127.0.0.1:51577__od
   [junit4]   2> 321762 INFO  (TEST-SolrCloudExampleTest.testLoadDocsIntoGettingStartedCollection-seed#[75BBE60B308B435]) [n:127.0.0.1:51577__od    ] o.a.s.c.c.SolrZkClient makePath: /overseer_elect
   [junit4]   2> 321763 INFO  (TEST-SolrCloudExampleTest.testLoadDocsIntoGettingStartedCollection-seed#[75BBE60B308B435]) [n:127.0.0.1:51577__od    ] o.a.s.c.c.SolrZkClient makePath: /overseer_elect/election
   [junit4]   2> 321764 INFO  (TEST-SolrCloudExampleTest.testLoadDocsIntoGettingStartedCollection-seed#[75BBE60B308B435]) [n:127.0.0.1:51577__od    ] o.a.s.c.Overseer Overseer (id=null) closing
   [junit4]   2> 321765 INFO  (TEST-SolrCloudExampleTest.testLoadDocsIntoGettingStartedCollection-seed#[75BBE60B308B435]) [n:127.0.0.1:51577__od    ] o.a.s.c.LeaderElector Joined leadership election with path: /overseer_elect/election/94663756411699204-127.0.0.1:51577__od-n_0000000000
   [junit4]   2> 321765 INFO  (TEST-SolrCloudExampleTest.testLoadDocsIntoGettingStartedCollection-seed#[75BBE60B308B435]) [n:127.0.0.1:51577__od    ] o.a.s.c.OverseerElectionContext I am going to be the leader 127.0.0.1:51577__od
   [junit4]   2> 321765 INFO  (TEST-SolrCloudExampleTest.testLoadDocsIntoGettingStartedCollection-seed#[75BBE60B308B435]) [n:127.0.0.1:51577__od    ] o.a.s.c.c.SolrZkClient makePath: /overseer_elect/leader
   [junit4]   2> 321767 INFO  (TEST-SolrCloudExampleTest.testLoadDocsIntoGettingStartedCollection-seed#[75BBE60B308B435]) [n:127.0.0.1:51577__od    ] o.a.s.c.Overseer Overseer (id=94663756411699204-127.0.0.1:51577__od-n_0000000000) starting
   [junit4]   2> 321768 INFO  (TEST-SolrCloudExampleTest.testLoadDocsIntoGettingStartedCollection-seed#[75BBE60B308B435]) [n:127.0.0.1:51577__od    ] o.a.s.c.c.SolrZkClient makePath: /overseer/queue-work
   [junit4]   2> 321773 INFO  (TEST-SolrCloudExampleTest.testLoadDocsIntoGettingStartedCollection-seed#[75BBE60B308B435]) [n:127.0.0.1:51577__od    ] o.a.s.c.OverseerAutoReplicaFailoverThread Starting OverseerAutoReplicaFailoverThread autoReplicaFailoverWorkLoopDelay=10000 autoReplicaFailoverWaitAfterExpiration=30000 autoReplicaFailoverBadNodeExpiration=60000
   [junit4]   2> 321774 INFO  (OverseerCollectionConfigSetProcessor-94663756411699204-127.0.0.1:51577__od-n_0000000000) [n:127.0.0.1:51577__od    ] o.a.s.c.OverseerTaskProcessor Process current queue of overseer operations
   [junit4]   2> 321774 INFO  (TEST-SolrCloudExampleTest.testLoadDocsIntoGettingStartedCollection-seed#[75BBE60B308B435]) [n:127.0.0.1:51577__od    ] o.a.s.c.c.ZkStateReader Updating cluster state from ZooKeeper... 
   [junit4]   2> 321774 INFO  (OverseerStateUpdate-94663756411699204-127.0.0.1:51577__od-n_0000000000) [n:127.0.0.1:51577__od    ] o.a.s.c.Overseer Starting to work on the main queue
   [junit4]   2> 321806 INFO  (TEST-SolrCloudExampleTest.testLoadDocsIntoGettingStartedCollection-seed#[75BBE60B308B435]) [n:127.0.0.1:51577__od    ] o.a.s.c.CoreContainer Security conf doesn't exist. Skipping setup for authorization module.
   [junit4]   2> 321806 INFO  (TEST-SolrCloudExampleTest.testLoadDocsIntoGettingStartedCollection-seed#[75BBE60B308B435]) [n:127.0.0.1:51577__od    ] o.a.s.c.CoreContainer No authentication plugin used.
   [junit4]   2> 321806 INFO  (TEST-SolrCloudExampleTest.testLoadDocsIntoGettingStartedCollection-seed#[75BBE60B308B435]) [n:127.0.0.1:51577__od    ] o.a.s.c.CoresLocator Looking for core definitions underneath /home/jenkins/workspace/Lucene-Solr-5.x-Linux/solr/build/solr-core/test/J0/temp/solr.cloud.SolrCloudExampleTest_75BBE60B308B435-001/control-001/cores
   [junit4]   2> 321807 INFO  (TEST-SolrCloudExampleTest.testLoadDocsIntoGettingStartedCollection-seed#[75BBE60B308B435]) [n:127.0.0.1:51577__od    ] o.a.s.c.SolrCore Created CoreDescriptor: {name=collection1, config=solrconfig.xml, transient=false, schema=schema.xml, loadOnStartup=true, configSetProperties=configsetprops.json, instanceDir=/home/jenkins/workspace/Lucene-Solr-5.x-Linux/solr/build/solr-core/test/J0/temp/solr.cloud.SolrCloudExampleTest_75BBE60B308B435-001/control-001/cores/collection1, collection=control_collection, absoluteInstDir=/home/jenkins/workspace/Lucene-Solr-5.x-Linux/solr/build/solr-core/test/J0/temp/solr.cloud.SolrCloudExampleTest_75BBE60B308B435-001/control-001/cores/collection1/, coreNodeName=, dataDir=data/, shard=}
   [junit4]   2> 321807 INFO  (TEST-SolrCloudExampleTest.testLoadDocsIntoGettingStartedCollection-seed#[75BBE60B308B435]) [n:127.0.0.1:51577__od    ] o.a.s.c.CoresLocator Found core collection1 in /home/jenkins/workspace/Lucene-Solr-5.x-Linux/solr/build/solr-core/test/J0/temp/solr.cloud.SolrCloudExampleTest_75BBE60B308B435-001/control-001/cores/collection1/
   [junit4]   2> 321808 INFO  (TEST-SolrCloudExampleTest.testLoadDocsIntoGettingStartedCollection-seed#[75BBE60B308B435]) [n:127.0.0.1:51577__od    ] o.a.s.c.CoresLocator Found 1 core definitions
   [junit4]   2> 321808 INFO  (TEST-SolrCloudExampleTest.testLoadDocsIntoGettingStartedCollection-seed#[75BBE60B308B435]) [n:127.0.0.1:51577__od    ] o.a.s.s.SolrDispatchFilter user.dir=/home/jenkins/workspace/Lucene-Solr-5.x-Linux/solr/build/solr-core/test/J0
   [junit4]   2> 321808 INFO  (TEST-SolrCloudExampleTest.testLoadDocsIntoGettingStartedCollection-seed#[75BBE60B308B435]) [n:127.0.0.1:51577__od    ] o.a.s.s.SolrDispatchFilter SolrDispatchFilter.init() done
   [junit4]   2> 321808 INFO  (coreLoadExecutor-1044-thread-1-processing-n:127.0.0.1:51577__od) [n:127.0.0.1:51577__od c:control_collection   x:collection1] o.a.s.c.ZkController publishing state=down
   [junit4]   2> 321808 INFO  (coreLoadExecutor-1044-thread-1-processing-n:127.0.0.1:51577__od) [n:127.0.0.1:51577__od c:control_collection   x:collection1] o.a.s.c.ZkController numShards not found on descriptor - reading it from system property
   [junit4]   2> 321810 INFO  (OverseerStateUpdate-94663756411699204-127.0.0.1:51577__od-n_0000000000) [n:127.0.0.1:51577__od    ] o.a.s.c.Overseer processMessage: queueSize: 1, message = {
   [junit4]   2>   "core":"collection1",
   [junit4]   2>   "roles":null,
   [junit4]   2>   "base_url":"http://127.0.0.1:51577/_od",
   [junit4]   2>   "node_name":"127.0.0.1:51577__od",
   [junit4]   2>   "numShards":"1",
   [junit4]   2>   "state":"down",
   [junit4]   2>   "shard":null,
   [junit4]   2>   "collection":"control_collection",
   [junit4]   2>   "operation":"state"} current state version: 0
   [junit4]   2> 321810 INFO  (coreLoadExecutor-1044-thread-1-processing-n:127.0.0.1:51577__od) [n:127.0.0.1:51577__od c:control_collection   x:collection1] o.a.s.c.ZkController look for our core node name
   [junit4]   2> 321810 INFO  (OverseerStateUpdate-94663756411699204-127.0.0.1:51577__od-n_0000000000) [n:127.0.0.1:51577__od    ] o.a.s.c.o.ReplicaMutator Update state numShards=1 message={
   [junit4]   2>   "core":"collection1",
   [junit4]   2>   "roles":null,
   [junit4]   2>   "base_url":"http://127.0.0.1:51577/_od",
   [junit4]   2>   "node_name":"127.0.0.1:51577__od",
   [junit4]   2>   "numShards":"1",
   [junit4]   2>   "state":"down",
   [junit4]   2>   "shard":null,
   [junit4]   2>   "collection":"control_collection",
   [junit4]   2>   "operation":"state"}
   [junit4]   2> 321811 INFO  (OverseerStateUpdate-94663756411699204-127.0.0.1:51577__od-n_0000000000) [n:127.0.0.1:51577__od    ] o.a.s.c.o.ClusterStateMutator building a new cName: control_collection
   [junit4]   2> 321811 INFO  (OverseerStateUpdate-94663756411699204-127.0.0.1:51577__od-n_0000000000) [n:127.0.0.1:51577__od    ] o.a.s.c.o.ReplicaMutator Assigning new node to shard shard=shard1
   [junit4]   2> 321812 INFO  (zkCallback-234-thread-1-processing-n:127.0.0.1:51577__od) [n:127.0.0.1:51577__od    ] o.a.s.c.c.ZkStateReader A cluster state change: WatchedEvent state:SyncConnected type:NodeDataChanged path:/clusterstate.json, has occurred - updating... (live nodes size: 1)
   [junit4]   2> 322811 INFO  (coreLoadExecutor-1044-thread-1-processing-n:127.0.0.1:51577__od) [n:127.0.0.1:51577__od c:control_collection   x:collection1] o.a.s.c.ZkController waiting to find shard id in clusterstate for collection1
   [junit4]   2> 322811 INFO  (coreLoadExecutor-1044-thread-1-processing-n:127.0.0.1:51577__od) [n:127.0.0.1:51577__od c:control_collection   x:collection1] o.a.s.c.ZkController Check for collection zkNode:control_collection
   [junit4]   2> 322811 INFO  (coreLoadExecutor-1044-thread-1-processing-n:127.0.0.1:51577__od) [n:127.0.0.1:51577__od c:control_collection   x:collection1] o.a.s.c.ZkController Collection zkNode exists
   [junit4]   2> 322811 INFO  (coreLoadExecutor-1044-thread-1-processing-n:127.0.0.1:51577__od) [n:127.0.0.1:51577__od c:control_collection   x:collection1] o.a.s.c.c.ZkStateReader Load collection config from:/collections/control_collection
   [junit4]   2> 322812 INFO  (coreLoadExecutor-1044-thread-1-processing-n:127.0.0.1:51577__od) [n:127.0.0.1:51577__od c:control_collection   x:collection1] o.a.s.c.c.ZkStateReader path=/collections/control_collection configName=conf1 specified config exists in ZooKeeper
   [junit4]   2> 322812 INFO  (coreLoadExecutor-1044-thread-1-processing-n:127.0.0.1:51577__od) [n:127.0.0.1:51577__od c:control_collection   x:collection1] o.a.s.c.SolrResourceLoader new SolrResourceLoader for directory: '/home/jenkins/workspace/Lucene-Solr-5.x-Linux/solr/build/solr-core/test/J0/temp/solr.cloud.SolrCloudExampleTest_75BBE60B308B435-001/control-001/cores/collection1/'
   [junit4]   2> 322812 INFO  (coreLoadExecutor-1044-thread-1-processing-n:127.0.0.1:51577__od) [n:127.0.0.1:51577__od c:control_collection   x:collection1] o.a.s.c.SolrResourceLoader JNDI not configured for solr (NoInitialContextEx)
   [junit4]   2> 322812 INFO  (coreLoadExecutor-1044-thread-1-processing-n:127.0.0.1:51577__od) [n:127.0.0.1:51577__od c:control_collection   x:collection1] o.a.s.c.SolrResourceLoader solr home defaulted to 'solr/' (could not find system property or JNDI)
   [junit4]   2> 322831 INFO  (coreLoadExecutor-1044-thread-1-processing-n:127.0.0.1:51577__od) [n:127.0.0.1:51577__od c:control_collection   x:collection1] o.a.s.c.Config loaded config solrconfig.xml with version 0 
   [junit4]   2> 322835 INFO  (coreLoadExecutor-1044-thread-1-processing-n:127.0.0.1:51577__od) [n:127.0.0.1:51577__od c:control_collection   x:collection1] o.a.s.c.SolrConfig current version of requestparams : -1
   [junit4]   2> 322839 INFO  (coreLoadExecutor-1044-thread-1-processing-n:127.0.0.1:51577__od) [n:127.0.0.1:51577__od c:control_collection   x:collection1] o.a.s.c.SolrConfig Using Lucene MatchVersion: 5.4.0
   [junit4]   2> 322851 INFO  (coreLoadExecutor-1044-thread-1-processing-n:127.0.0.1:51577__od) [n:127.0.0.1:51577__od c:control_collection   x:collection1] o.a.s.c.Config Loaded SolrConfig: solrconfig.xml
   [junit4]   2> 322851 INFO  (coreLoadExecutor-1044-thread-1-processing-n:127.0.0.1:51577__od) [n:127.0.0.1:51577__od c:control_collection   x:collection1] o.a.s.s.IndexSchema Reading Solr Schema from /configs/conf1/schema.xml
   [junit4]   2> 322857 INFO  (coreLoadExecutor-1044-thread-1-processing-n:127.0.0.1:51577__od) [n:127.0.0.1:51577__od c:control_collection   x:collection1] o.a.s.s.IndexSchema [collection1] Schema name=test
   [junit4]   2> 322938 INFO  (coreLoadExecutor-1044-thread-1-processing-n:127.0.0.1:51577__od) [n:127.0.0.1:51577__od c:control_collection   x:collection1] o.a.s.s.OpenExchangeRatesOrgProvider Initialized with rates=open-exchange-rates.json, refreshInterval=1440.
   [junit4]   2> 322943 INFO  (coreLoadExecutor-1044-thread-1-processing-n:127.0.0.1:51577__od) [n:127.0.0.1:51577__od c:control_collection   x:collection1] o.a.s.s.IndexSchema default search field in schema is text
   [junit4]   2> 322944 INFO  (coreLoadExecutor-1044-thread-1-processing-n:127.0.0.1:51577__od) [n:127.0.0.1:51577__od c:control_collection   x:collection1] o.a.s.s.IndexSchema unique key field: id
   [junit4]   2> 322952 INFO  (coreLoadExecutor-1044-thread-1-processing-n:127.0.0.1:51577__od) [n:127.0.0.1:51577__od c:control_collection   x:collection1] o.a.s.s.FileExchangeRateProvider Reloading exchange rates from file currency.xml
   [junit4]   2> 322954 INFO  (coreLoadExecutor-1044-thread-1-processing-n:127.0.0.1:51577__od) [n:127.0.0.1:51577__od c:control_collection   x:collection1] o.a.s.s.FileExchangeRateProvider Reloading exchange rates from file currency.xml
   [junit4]   2> 322956 INFO  (coreLoadExecutor-1044-thread-1-processing-n:127.0.0.1:51577__od) [n:127.0.0.1:51577__od c:control_collection   x:collection1] o.a.s.s.OpenExchangeRatesOrgProvider Reloading exchange rates from open-exchange-rates.json
   [junit4]   2> 322957 WARN  (coreLoadExecutor-1044-thread-1-processing-n:127.0.0.1:51577__od) [n:127.0.0.1:51577__od c:control_collection   x:collection1] o.a.s.s.OpenExchangeRatesOrgProvider Unknown key IMPORTANT NOTE
   [junit4]   2> 322957 WARN  (coreLoadExecutor-1044-thread-1-processing-n:127.0.0.1:51577__od) [n:127.0.0.1:51577__od c:control_collection   x:collection1] o.a.s.s.OpenExchangeRatesOrgProvider Expected key, got STRING
   [junit4]   2> 322957 INFO  (coreLoadExecutor-1044-thread-1-processing-n:127.0.0.1:51577__od) [n:127.0.0.1:51577__od c:control_collection   x:collection1] o.a.s.s.OpenExchangeRatesOrgProvider Reloading exchange rates from open-exchange-rates.json
   [junit4]   2> 322958 WARN  (coreLoadExecutor-1044-thread-1-processing-n:127.0.0.1:51577__od) [n:127.0.0.1:51577__od c:control_collection   x:collection1] o.a.s.s.OpenExchangeRatesOrgProvider Unknown key IMPORTANT NOTE
   [junit4]   2> 322958 WARN  (coreLoadExecutor-1044-thread-1-processing-n:127.0.0.1:51577__od) [n:127.0.0.1:51577__od c:control_collection   x:collection1] o.a.s.s.OpenExchangeRatesOrgProvider Expected key, got STRING
   [junit4]   2> 322959 INFO  (coreLoadExecutor-1044-thread-1-processing-n:127.0.0.1:51577__od) [n:127.0.0.1:51577__od c:control_collection   x:collection1] o.a.s.c.ConfigSetProperties Did not find ConfigSet properties, assuming default properties: Can't find resource 'configsetprops.json' in classpath or '/configs/conf1', cwd=/home/jenkins/workspace/Lucene-Solr-5.x-Linux/solr/build/solr-core/test/J0
   [junit4]   2> 322959 INFO  (coreLoadExecutor-1044-thread-1-processing-n:127.0.0.1:51577__od) [n:127.0.0.1:51577__od c:control_collection   x:collection1] o.a.s.c.CoreContainer Creating SolrCore 'collection1' using configuration from collection control_collection
   [junit4]   2> 322959 INFO  (coreLoadExecutor-1044-thread-1-processing-n:127.0.0.1:51577__od) [n:127.0.0.1:51577__od c:control_collection s:shard1 r:core_node1 x:collection1] o.a.s.c.SolrCore org.apache.solr.core.MockDirectoryFactory
   [junit4]   2> 322959 INFO  (coreLoadExecutor-1044-thread-1-processing-n:127.0.0.1:51577__od) [n:127.0.0.1:51577__od c:control_collection s:shard1 r:core_node1 x:collection1] o.a.s.c.SolrCore [[collection1] ] Opening new SolrCore at [/home/jenkins/workspace/Lucene-Solr-5.x-Linux/solr/build/solr-core/test/J0/temp/solr.cloud.SolrCloudExampleTest_75BBE60B308B435-001/control-001/cores/collection1/], dataDir=[null]
   [junit4]   2> 322959 INFO  (coreLoadExecutor-1044-thread-1-processing-n:127.0.0.1:51577__od) [n:127.0.0.1:51577__od c:control_collection s:shard1 r:core_node1 x:collection1] o.a.s.c.JmxMonitoredMap JMX monitoring is enabled. Adding Solr mbeans to JMX Server: com.sun.jmx.mbeanserver.JmxMBeanServer@3224d9
   [junit4]   2> 322960 INFO  (coreLoadExecutor-1044-thread-1-processing-n:127.0.0.1:51577__od) [n:127.0.0.1:51577__od c:control_collection s:shard1 r:core_node1 x:collection1] o.a.s.c.CachingDirectoryFactory return new directory for /home/jenkins/workspace/Lucene-Solr-5.x-Linux/solr/build/solr-core/test/J0/temp/solr.cloud.SolrCloudExampleTest_75BBE60B308B435-001/control-001/cores/collection1/data
   [junit4]   2> 322960 INFO  (coreLoadExecutor-1044-thread-1-processing-n:127.0.0.1:51577__od) [n:127.0.0.1:51577__od c:control_collection s:shard1 r:core_node1 x:collection1] o.a.s.c.SolrCore New index directory detected: old=null new=/home/jenkins/workspace/Lucene-Solr-5.x-Linux/solr/build/solr-core/test/J0/temp/solr.cloud.SolrCloudExampleTest_75BBE60B308B435-001/control-001/cores/collection1/data/index/
   [junit4]   2> 322960 WARN  (coreLoadExecutor-1044-thread-1-processing-n:127.0.0.1:51577__od) [n:127.0.0.1:51577__od c:control_collection s:shard1 r:core_node1 x:collection1] o.a.s.c.SolrCore [collection1] Solr index directory '/home/jenkins/workspace/Lucene-Solr-5.x-Linux/solr/build/solr-core/test/J0/temp/solr.cloud.SolrCloudExampleTest_75BBE60B308B435-001/control-001/cores/collection1/data/index' doesn't exist. Creating new index...
   [junit4]   2> 322961 INFO  (coreLoadExecutor-1044-thread-1-processing-n:127.0.0.1:51577__od) [n:127.0.0.1:51577__od c:control_collection s:shard1 r:core_node1 x:collection1] o.a.s.c.CachingDirectoryFactory return new directory for /home/jenkins/workspace/Lucene-Solr-5.x-Linux/solr/build/solr-core/test/J0/temp/solr.cloud.SolrCloudExampleTest_75BBE60B308B435-001/control-001/cores/collection1/data/index
   [junit4]   2> 322961 INFO  (coreLoadExecutor-1044-thread-1-processing-n:127.0.0.1:51577__od) [n:127.0.0.1:51577__od c:control_collection s:shard1 r:core_node1 x:collection1] o.a.s.u.RandomMergePolicy RandomMergePolicy wrapping class org.apache.lucene.index.TieredMergePolicy: [TieredMergePolicy: maxMergeAtOnce=35, maxMergeAtOnceExplicit=22, maxMergedSegmentMB=44.80078125, floorSegmentMB=0.685546875, forceMergeDeletesPctAllowed=15.055803891829568, segmentsPerTier=19.0, maxCFSSegmentSizeMB=8.796093022207999E12, noCFSRatio=0.0
   [junit4]   2> 322961 INFO  (coreLoadExecutor-1044-thread-1-processing-n:127.0.0.1:51577__od) [n:127.0.0.1:51577__od c:control_collection s:shard1 r:core_node1 x:collection1] o.a.s.c.SolrCore SolrDeletionPolicy.onCommit: commits: num=1
   [junit4]   2> 	commit{dir=MockDirectoryWrapper(RAMDirectory@481007 lockFactory=org.apache.lucene.store.SingleInstanceLockFactory@152ae6b),segFN=segments_1,generation=1}
   [junit4]   2> 322961 INFO  (coreLoadExecutor-1044-thread-1-processing-n:127.0.0.1:51577__od) [n:127.0.0.1:51577__od c:control_collection s:shard1 r:core_node1 x:collection1] o.a.s.c.SolrCore newest commit generation = 1
   [junit4]   2> 322962 INFO  (OldIndexDirectoryCleanupThreadForCore-collection1) [n:127.0.0.1:51577__od c:control_collection s:shard1 r:core_node1 x:collection1] o.a.s.c.SolrCore Looking for old index directories to cleanup for core collection1 in /home/jenkins/workspace/Lucene-Solr-5.x-Linux/solr/build/solr-core/test/J0/temp/solr.cloud.SolrCloudExampleTest_75BBE60B308B435-001/control-001/cores/collection1/data/
   [junit4]   2> 322962 WARN  (OldIndexDirectoryCleanupThreadForCore-collection1) [n:127.0.0.1:51577__od c:control_collection s:shard1 r:core_node1 x:collection1] o.a.s.c.DirectoryFactory /home/jenkins/workspace/Lucene-Solr-5.x-Linux/solr/build/solr-core/test/J0/temp/solr.cloud.SolrCloudExampleTest_75BBE60B308B435-001/control-001/cores/collection1/data/ does not point to a valid data directory; skipping clean-up of old index directories.
   [junit4]   2> 322968 INFO  (coreLoadExecutor-1044-thread-1-processing-n:127.0.0.1:51577__od) [n:127.0.0.1:51577__od c:control_collection s:shard1 r:core_node1 x:collection1] o.a.s.u.p.UpdateRequestProcessorChain creating updateRequestProcessorChain "nodistrib"
   [junit4]   2> 322968 INFO  (coreLoadExecutor-1044-thread-1-processing-n:127.0.0.1:51577__od) [n:127.0.0.1:51577__od c:control_collection s:shard1 r:core_node1 x:collection1] o.a.s.u.p.UpdateRequestProcessorChain creating updateRequestProcessorChain "dedupe"
   [junit4]   2> 322968 INFO  (coreLoadExecutor-1044-thread-1-processing-n:127.0.0.1:51577__od) [n:127.0.0.1:51577__od c:control_collection s:shard1 r:core_node1 x:collection1] o.a.s.u.p.UpdateRequestProcessorChain inserting DistributedUpdateProcessorFactory into updateRequestProcessorChain "dedupe"
   [junit4]   2> 322968 INFO  (coreLoadExecutor-1044-thread-1-processing-n:127.0.0.1:51577__od) [n:127.0.0.1:51577__od c:control_collection s:shard1 r:core_node1 x:collection1] o.a.s.u.p.UpdateRequestProcessorChain creating updateRequestProcessorChain "stored_sig"
   [junit4]   2> 322969 INFO  (coreLoadExecutor-1044-thread-1-processing-n:127.0.0.1:51577__od) [n:127.0.0.1:51577__od c:control_collection s:shard1 r:core_node1 x:collection1] o.a.s.u.p.UpdateRequestProcessorChain inserting DistributedUpdateProcessorFactory into updateRequestProcessorChain "stored_sig"
   [junit4]   2> 322969 INFO  (coreLoadExecutor-1044-thread-1-processing-n:127.0.0.1:51577__od) [n:127.0.0.1:51577__od c:control_collection s:shard1 r:core_node1 x:collection1] o.a.s.u.p.UpdateRequestProcessorChain creating updateRequestProcessorChain "distrib-dup-test-chain-explicit"
   [junit4]   2> 322969 INFO  (coreLoadExecutor-1044-thread-1-processing-n:127.0.0.1:51577__od) [n:127.0.0.1:51577__od c:control_collection s:shard1 r:core_node1 x:collection1] o.a.s.u.p.UpdateRequestProcessorChain creating updateRequestProcessorChain "distrib-dup-test-chain-implicit"
   [junit4]   2> 322969 INFO  (coreLoadExecutor-1044-thread-1-processing-n:127.0.0.1:51577__od) [n:127.0.0.1:51577__od c:control_collection s:shard1 r:core_node1 x:collection1] o.a.s.u.p.UpdateRequestProcessorChain inserting DistributedUpdateProcessorFactory into updateRequestProcessorChain "distrib-dup-test-chain-implicit"
   [junit4]   2> 322969 INFO  (coreLoadExecutor-1044-thread-1-processing-n:127.0.0.1:51577__od) [n:127.0.0.1:51577__od c:control_collection s:shard1 r:core_node1 x:collection1] o.a.s.c.SolrCore no updateRequestProcessorChain defined as default, creating implicit default
   [junit4]   2> 322971 INFO  (coreLoadExecutor-1044-thread-1-processing-n:127.0.0.1:51577__od) [n:127.0.0.1:51577__od c:control_collection s:shard1 r:core_node1 x:collection1] o.a.s.h.l.XMLLoader xsltCacheLifetimeSeconds=60
   [junit4]   2> 322972 INFO  (coreLoadExecutor-1044-thread-1-processing-n:127.0.0.1:51577__od) [n:127.0.0.1:51577__od c:control_collection s:shard1 r:core_node1 x:collection1] o.a.s.h.l.XMLLoader xsltCacheLifetimeSeconds=60
   [junit4]   2> 322973 INFO  (coreLoadExecutor-1044-thread-1-processing-n:127.0.0.1:51577__od) [n:127.0.0.1:51577__od c:control_collection s:shard1 r:core_node1 x:collection1] o.a.s.h.l.XMLLoader xsltCacheLifetimeSeconds=60
   [junit4]   2> 322973 INFO  (coreLoadExecutor-1044-thread-1-processing-n:127.0.0.1:51577__od) [n:127.0.0.1:51577__od c:control_collection s:shard1 r:core_node1 x:collection1] o.a.s.h.l.XMLLoader xsltCacheLifetimeSeconds=60
   [junit4]   2> 322978 INFO  (coreLoadExecutor-1044-thread-1-processing-n:127.0.0.1:51577__od) [n:127.0.0.1:51577__od c:control_collection s:shard1 r:core_node1 x:collection1] o.a.s.c.RequestHandlers Registered paths: /admin/mbeans,standard,/update/csv,/update/json/docs,/admin/luke,/admin/segments,/get,/admin/system,/replication,/admin/properties,/config,/schema,/admin/plugins,/admin/logging,/update/json,/admin/threads,/admin/ping,/update,/admin/file
   [junit4]   2> 322979 INFO  (coreLoadExecutor-1044-thread-1-processing-n:127.0.0.1:51577__od) [n:127.0.0.1:51577__od c:control_collection s:shard1 r:core_node1 x:collection1] o.a.s.c.SolrCore Using default statsCache cache: org.apache.solr.search.stats.LocalStatsCache
   [junit4]   2> 322979 INFO  (coreLoadExecutor-1044-thread-1-processing-n:127.0.0.1:51577__od) [n:127.0.0.1:51577__od c:control_collection s:shard1 r:core_node1 x:collection1] o.a.s.u.UpdateHandler Using UpdateLog implementation: org.apache.solr.update.UpdateLog
   [junit4]   2> 322979 INFO  (coreLoadExecutor-1044-thread-1-processing-n:127.0.0.1:51577__od) [n:127.0.0.1:51577__od c:control_collection s:shard1 r:core_node1 x:collection1] o.a.s.u.UpdateLog Initializing UpdateLog: dataDir= defaultSyncLevel=FLUSH numRecordsToKeep=100 maxNumLogsToKeep=10 numVersionBuckets=65536
   [junit4]   2> 322980 INFO  (coreLoadExecutor-1044-thread-1-processing-n:127.0.0.1:51577__od) [n:127.0.0.1:51577__od c:control_collection s:shard1 r:core_node1 x:collection1] o.a.s.c.SolrCore Hard AutoCommit: disabled
   [junit4]   2> 322980 INFO  (coreLoadExecutor-1044-thread-1-processing-n:127.0.0.1:51577__od) [n:127.0.0.1:51577__od c:control_collection s:shard1 r:core_node1 x:collection1] o.a.s.c.SolrCore Soft AutoCommit: disabled
   [junit4]   2> 322980 INFO  (coreLoadExecutor-1044-thread-1-processing-n:127.0.0.1:51577__od) [n:127.0.0.1:51577__od c:control_collection s:shard1 r:core_node1 x:collection1] o.a.s.u.RandomMergePolicy RandomMergePolicy wrapping class org.apache.lucene.index.TieredMergePolicy: [TieredMergePolicy: maxMergeAtOnce=14, maxMergeAtOnceExplicit=33, maxMergedSegmentMB=1.98046875, floorSegmentMB=0.267578125, forceMergeDeletesPctAllowed=8.163430696372403, segmentsPerTier=29.0, maxCFSSegmentSizeMB=8.796093022207999E12, noCFSRatio=0.12817610052211137
   [junit4]   2> 322980 INFO  (coreLoadExecutor-1044-thread-1-processing-n:127.0.0.1:51577__od) [n:127.0.0.1:51577__od c:control_collection s:shard1 r:core_node1 x:collection1] o.a.s.c.SolrCore SolrDeletionPolicy.onInit: commits: num=1
   [junit4]   2> 	commit{dir=MockDirectoryWrapper(RAMDirectory@481007 lockFactory=org.apache.lucene.store.SingleInstanceLockFactory@152ae6b),segFN=segments_1,generation=1}
   [junit4]   2> 322980 INFO  (coreLoadExecutor-1044-thread-1-processing-n:127.0.0.1:51577__od) [n:127.0.0.1:51577__od c:control_collection s:shard1 r:core_node1 x:collection1] o.a.s.c.SolrCore newest commit generation = 1
   [junit4]   2> 322980 INFO  (coreLoadExecutor-1044-thread-1-processing-n:127.0.0.1:51577__od) [n:127.0.0.1:51577__od c:control_collection s:shard1 r:core_node1 x:collection1] o.a.s.s.SolrIndexSearcher Opening Searcher@16e1771[collection1] main
   [junit4]   2> 322981 INFO  (coreLoadExecutor-1044-thread-1-processing-n:127.0.0.1:51577__od) [n:127.0.0.1:51577__od c:control_collection s:shard1 r:core_node1 x:collection1] o.a.s.c.c.ZkStateReader Load collection config from:/collections/control_collection
   [junit4]   2> 322981 INFO  (coreLoadExecutor-1044-thread-1-processing-n:127.0.0.1:51577__od) [n:127.0.0.1:51577__od c:control_collection s:shard1 r:core_node1 x:collection1] o.a.s.c.c.ZkStateReader path=/collections/control_collection configName=conf1 specified config exists in ZooKeeper
   [junit4]   2> 322981 INFO  (coreLoadExecutor-1044-thread-1-processing-n:127.0.0.1:51577__od) [n:127.0.0.1:51577__od c:control_collection s:shard1 r:core_node1 x:collection1] o.a.s.r.ManagedResourceStorage Setting up ZooKeeper-based storage for the RestManager with znodeBase: /configs/conf1
   [junit4]   2> 322981 INFO  (coreLoadExecutor-1044-thread-1-processing-n:127.0.0.1:51577__od) [n:127.0.0.1:51577__od c:control_collection s:shard1 r:core_node1 x:collection1] o.a.s.r.ManagedResourceStorage Configured ZooKeeperStorageIO with znodeBase: /configs/conf1
   [junit4]   2> 322982 INFO  (coreLoadExecutor-1044-thread-1-processing-n:127.0.0.1:51577__od) [n:127.0.0.1:51577__od c:control_collection s:shard1 r:core_node1 x:collection1] o.a.s.r.RestManager Initializing RestManager with initArgs: {}
   [junit4]   2> 322982 INFO  (coreLoadExecutor-1044-thread-1-processing-n:127.0.0.1:51577__od) [n:127.0.0.1:51577__od c:control_collection s:shard1 r:core_node1 x:collection1] o.a.s.r.ManagedResourceStorage Reading _rest_managed.json using ZooKeeperStorageIO:path=/configs/conf1
   [junit4]   2> 322982 INFO  (coreLoadExecutor-1044-thread-1-processing-n:127.0.0.1:51577__od) [n:127.0.0.1:51577__od c:control_collection s:shard1 r:core_node1 x:collection1] o.a.s.r.ManagedResourceStorage No data found for znode /configs/conf1/_rest_managed.json
   [junit4]   2> 322982 INFO  (coreLoadExecutor-1044-thread-1-processing-n:127.0.0.1:51577__od) [n:127.0.0.1:51577__od c:control_collection s:shard1 r:core_node1 x:collection1] o.a.s.r.ManagedResourceStorage Loaded null at path _rest_managed.json using ZooKeeperStorageIO:path=/configs/conf1
   [junit4]   2> 322982 INFO  (coreLoadExecutor-1044-thread-1-processing-n:127.0.0.1:51577__od) [n:127.0.0.1:51577__od c:control_collection s:shard1 r:core_node1 x:collection1] o.a.s.r.RestManager Initializing 0 registered ManagedResources
   [junit4]   2> 322982 INFO  (coreLoadExecutor-1044-thread-1-processing-n:127.0.0.1:51577__od) [n:127.0.0.1:51577__od c:control_collection s:shard1 r:core_node1 x:collection1] o.a.s.h.ReplicationHandler Commits will be reserved for  10000
   [junit4]   2> 322983 INFO  (searcherExecutor-1045-thread-1-processing-n:127.0.0.1:51577__od x:collection1 s:shard1 c:control_collection r:core_node1) [n:127.0.0.1:51577__od c:control_collection s:shard1 r:core_node1 x:collection1] o.a.s.c.SolrCore [collection1] Registered new searcher Searcher@16e1771[collection1] main{ExitableDirectoryReader(UninvertingDirectoryReader())}
   [junit4]   2> 322983 INFO  (coreLoadExecutor-1044-thread-1-processing-n:127.0.0.1:51577__od) [n:127.0.0.1:51577__od c:control_collection s:shard1 r:core_node1 x:collection1] o.a.s.u.UpdateLog Looking up max value of version field to seed version buckets
   [junit4]   2> 322983 INFO  (coreLoadExecutor-1044-thread-1-processing-n:127.0.0.1:51577__od) [n:127.0.0.1:51577__od c:control_collection s:shard1 r:core_node1 x:collection1] o.a.s.u.VersionInfo Refreshing highest value of _version_ for 65536 version buckets from index
   [junit4]   2> 322983 INFO  (coreLoadExecutor-1044-thread-1-processing-n:127.0.0.1:51577__od) [n:127.0.0.1:51577__od c:control_collection s:shard1 r:core_node1 x:collection1] o.a.s.u.VersionInfo No terms found for _version_, cannot seed version bucket highest value from index
   [junit4]   2> 322983 INFO  (coreLoadExecutor-1044-thread-1-processing-n:127.0.0.1:51577__od) [n:127.0.0.1:51577__od c:control_collection s:shard1 r:core_node1 x:collection1] o.a.s.u.UpdateLog Could not find max version in index or recent updates, using new clock 1514620104169488384
   [junit4]   2> 322985 INFO  (coreLoadExecutor-1044-thread-1-processing-n:127.0.0.1:51577__od) [n:127.0.0.1:51577__od c:control_collection s:shard1 r:core_node1 x:collection1] o.a.s.u.UpdateLog Took 1.0ms to seed version buckets with highest version 1514620104169488384
   [junit4]   2> 322985 INFO  (coreLoadExecutor-1044-thread-1-processing-n:127.0.0.1:51577__od) [n:127.0.0.1:51577__od c:control_collection s:shard1 r:core_node1 x:collection1] o.a.s.c.ZkController watch zkdir /configs/conf1
   [junit4]   2> 322985 INFO  (coreLoadExecutor-1044-thread-1-processing-n:127.0.0.1:51577__od) [n:127.0.0.1:51577__od c:control_collection s:shard1 r:core_node1 x:collection1] o.a.s.c.CoreContainer registering core: collection1
   [junit4]   2> 322985 INFO  (coreZkRegister-1038-thread-1-processing-n:127.0.0.1:51577__od x:collection1 s:shard1 c:control_collection r:core_node1) [n:127.0.0.1:51577__od c:control_collection s:shard1 r:core_node1 x:collection1] o.a.s.c.ZkController Register replica - core:collection1 address:http://127.0.0.1:51577/_od collection:control_collection shard:shard1
   [junit4]   2> 322986 INFO  (coreZkRegister-1038-thread-1-processing-n:127.0.0.1:51577__od x:collection1 s:shard1 c:control_collection r:core_node1) [n:127.0.0.1:51577__od c:control_collection s:shard1 r:core_node1 x:collection1] o.a.s.c.c.SolrZkClient makePath: /collections/control_collection/leader_elect/shard1/election
   [junit4]   2> 322989 INFO  (coreZkRegister-1038-thread-1-processing-n:127.0.0.1:51577__od x:collection1 s:shard1 c:control_collection r:core_node1) [n:127.0.0.1:51577__od c:control_collection s:shard1 r:core_node1 x:collection1] o.a.s.c.LeaderElector Joined leadership election with path: /collections/control_collection/leader_elect/shard1/election/94663756411699204-core_node1-n_0000000000
   [junit4]   2> 322989 INFO  (coreZkRegister-1038-thread-1-processing-n:127.0.0.1:51577__od x:collection1 s:shard1 c:control_collection r:core_node1) [n:127.0.0.1:51577__od c:control_collection s:shard1 r:core_node1 x:collection1] o.a.s.c.ShardLeaderElectionContext Running the leader process for shard shard1
   [junit4]   2> 322990 INFO  (coreZkRegister-1038-thread-1-processing-n:127.0.0.1:51577__od x:collection1 s:shard1 c:control_collection r:core_node1) [n:127.0.0.1:51577__od c:control_collection s:shard1 r:core_node1 x:collection1] o.a.s.c.ShardLeaderElectionContext Enough replicas found to continue.
   [junit4]   2> 322990 INFO  (coreZkRegister-1038-thread-1-processing-n:127.0.0.1:51577__od x:collection1 s:shard1 c:control_collection r:core_node1) [n:127.0.0.1:51577__od c:control_collection s:shard1 r:core_node1 x:collection1] o.a.s.c.ShardLeaderElectionContext I may be the new leader - try and sync
   [junit4]   2> 322990 INFO  (coreZkRegister-1038-thread-1-processing-n:127.0.0.1:51577__od x:collection1 s:shard1 c:control_collection r:core_node1) [n:127.0.0.1:51577__od c:control_collection s:shard1 r:core_node1 x:collection1] o.a.s.c.SyncStrategy Sync replicas to http://127.0.0.1:51577/_od/collection1/
   [junit4]   2> 322991 INFO  (coreZkRegister-1038-thread-1-processing-n:127.0.0.1:51577__od x:collection1 s:shard1 c:control_collection r:core_node1) [n:127.0.0.1:51577__od c:control_collection s:shard1 r:core_node1 x:collection1] o.a.s.c.SyncStrategy Sync Success - now sync replicas to me
   [junit4]   2> 322991 INFO  (coreZkRegister-1038-thread-1-processing-n:127.0.0.1:51577__od x:collection1 s:shard1 c:control_collection r:core_node1) [n:127.0.0.1:51577__od c:control_collection s:shard1 r:core_node1 x:collection1] o.a.s.c.SyncStrategy http://127.0.0.1:51577/_od/collection1/ has no replicas
   [junit4]   2> 322991 INFO  (coreZkRegister-1038-thread-1-processing-n:127.0.0.1:51577__od x:collection1 s:shard1 c:control_collection r:core_node1) [n:127.0.0.1:51577__od c:control_collection s:shard1 r:core_node1 x:collection1] o.a.s.c.ShardLeaderElectionContext I am the new leader: http://127.0.0.1:51577/_od/collection1/ shard1
   [junit4]   2> 322991 INFO  (OverseerStateUpdate-94663756411699204-127.0.0.1:51577__od-n_0000000000) [n:127.0.0.1:51577__od    ] o.a.s.c.Overseer processMessage: queueSize: 1, message = {
   [junit4]   2>   "operation":"leader",
   [junit4]   2>   "shard":"shard1",
   [junit4]   2>   "collection":"control_collection"} current state version: 1
   [junit4]   2> 322991 INFO  (coreZkRegister-1038-thread-1-processing-n:127.0.0.1:51577__od x:collection1 s:shard1 c:control_collection r:core_node1) [n:127.0.0.1:51577__od c:control_collection s:shard1 r:core_node1 x:collection1] o.a.s.c.c.SolrZkClient makePath: /collections/control_collection/leaders/shard1
   [junit4]   2> 322993 INFO  (coreZkRegister-1038-thread-1-processing-n:127.0.0.1:51577__od x:collection1 s:shard1 c:control_collection r:core_node1) [n:127.0.0.1:51577__od c:control_collection s:shard1 r:core_node1 x:collection1] o.a.s.c.ShardLeaderElectionContextBase Creating leader registration node
   [junit4]   2> 322995 INFO  (OverseerStateUpdate-94663756411699204-127.0.0.1:51577__od-n_0000000000) [n:127.0.0.1:51577__od    ] o.a.s.c.Overseer processMessage: queueSize: 1, message = {
   [junit4]   2>   "operation":"leader",
   [junit4]   2>   "shard":"shard1",
   [junit4]   2>   "collection":"control_collection",
   [junit4]   2>   "base_url":"http://127.0.0.1:51577/_od",
   [junit4]   2>   "core":"collection1",
   [junit4]   2>   "state":"active"} current state version: 1
   [junit4]   2> 323097 INFO  (zkCallback-234-thread-1-processing-n:127.0.0.1:51577__od) [n:127.0.0.1:51577__od    ] o.a.s.c.c.ZkStateReader A cluster state change: WatchedEvent state:SyncConnected type:NodeDataChanged path:/clusterstate.json, has occurred - updating... (live nodes size: 1)
   [junit4]   2> 323145 INFO  (coreZkRegister-1038-thread-1-processing-n:127.0.0.1:51577__od x:collection1 s:shard1 c:control_collection r:core_node1) [n:127.0.0.1:51577__od c:control_collection s:shard1 r:core_node1 x:collection1] o.a.s.c.ZkController We are http://127.0.0.1:51577/_od/collection1/ and leader is http://127.0.0.1:51577/_od/collection1/
   [junit4]   2> 323146 INFO  (coreZkRegister-1038-thread-1-processing-n:127.0.0.1:51577__od x:collection1 s:shard1 c:control_collection r:core_node1) [n:127.0.0.1:51577__od c:control_collection s:shard1 r:core_node1 x:collection1] o.a.s.c.ZkController No LogReplay needed for core=collection1 baseURL=http://127.0.0.1:51577/_od
   [junit4]   2> 323146 INFO  (coreZkRegister-1038-thread-1-processing-n:127.0.0.1:51577__od x:collection1 s:shard1 c:control_collection r:core_node1) [n:127.0.0.1:51577__od c:control_collection s:shard1 r:core_node1 x:collection1] o.a.s.c.ZkController I am the leader, no recovery necessary
   [junit4]   2> 323146 INFO  (coreZkRegister-1038-thread-1-processing-n:127.0.0.1:51577__od x:collection1 s:shard1 c:control_collection r:core_node1) [n:127.0.0.1:51577__od c:control_collection s:shard1 r:core_node1 x:collection1] o.a.s.c.ZkController publishing state=active
   [junit4]   2> 323146 INFO  (coreZkRegister-1038-thread-1-processing-n:127.0.0.1:51577__od x:collection1 s:shard1 c:control_collection r:core_node1) [n:127.0.0.1:51577__od c:control_collection s:shard1 r:core_node1 x:collection1] o.a.s.c.ZkController numShards not found on descriptor - reading it from system property
   [junit4]   2> 323147 INFO  (OverseerStateUpdate-94663756411699204-127.0.0.1:51577__od-n_0000000000) [n:127.0.0.1:51577__od    ] o.a.s.c.Overseer processMessage: queueSize: 1, message = {
   [junit4]   2>   "core":"collection1",
   [junit4]   2>   "core_node_name":"core_node1",
   [junit4]   2>   "roles":null,
   [junit4]   2>   "base_url":"http://127.0.0.1:51577/_od",
   [junit4]   2>   "node_name":"127.0.0.1:51577__od",
   [junit4]   2>   "numShards":"1",
   [junit4]   2>   "state":"active",
   [junit4]   2>   "shard":"shard1",
   [junit4]   2>   "collection":"control_collection",
   [junit4]   2>   "operation":"state"} current state version: 2
   [junit4]   2> 323148 INFO  (OverseerStateUpdate-94663756411699204-127.0.0.1:51577__od-n_0000000000) [n:127.0.0.1:51577__od    ] o.a.s.c.o.ReplicaMutator Update state numShards=1 message={
   [junit4]   2>   "core":"collection1",
   [junit4]   2>   "core_node_name":"core_node1",
   [junit4]   2>   "roles":null,
   [junit4]   2>   "base_url":"http://127.0.0.1:51577/_od",
   [junit4]   2>   "node_name":"127.0.0.1:51577__od",
   [junit4]   2>   "numShards":"1",
   [junit4]   2>   "state":"active",
   [junit4]   2>   "shard":"shard1",
   [junit4]   2>   "collection":"control_collection",
   [junit4]   2>   "operation":"state"}
   [junit4]   2> 323250 INFO  (zkCallback-234-thread-1-processing-n:127.0.0.1:51577__od) [n:127.0.0.1:51577__od    ] o.a.s.c.c.ZkStateReader A cluster state change: WatchedEvent state:SyncConnected type:NodeDataChanged path:/clusterstate.json, has occurred - updating... (live nodes size: 1)
   [junit4]   2> 323310 INFO  (TEST-SolrCloudExampleTest.testLoadDocsIntoGettingStartedCollection-seed#[75BBE60B308B435]) [    ] o.a.s.c.c.SolrZkClient Using default ZkCredentialsProvider
   [junit4]   2> 323310 INFO  (TEST-SolrCloudExampleTest.testLoadDocsIntoGettingStartedCollection-seed#[75BBE60B308B435]) [    ] o.a.s.c.c.ConnectionManager Waiting for client to connect to ZooKeeper
   [junit4]   2> 323312 INFO  (zkCallback-236-thread-1) [    ] o.a.s.c.c.ConnectionManager Watcher org.apache.solr.common.cloud.ConnectionManager@1f0ce70 name:ZooKeeperConnection Watcher:127.0.0.1:48949/solr got event WatchedEvent state:SyncConnected type:None path:null path:null type:None
   [junit4]   2> 323312 INFO  (TEST-SolrCloudExampleTest.testLoadDocsIntoGettingStartedCollection-seed#[75BBE60B308B435]) [    ] o.a.s.c.c.ConnectionManager Client is connected to ZooKeeper
   [junit4]   2> 323312 INFO  (TEST-SolrCloudExampleTest.testLoadDocsIntoGettingStartedCollection-seed#[75BBE60B308B435]) [    ] o.a.s.c.c.SolrZkClient Using default ZkACLProvider
   [junit4]   2> 323312 INFO  (TEST-SolrCloudExampleTest.testLoadDocsIntoGettingStartedCollection-seed#[75BBE60B308B435]) [    ] o.a.s.c.c.ZkStateReader Updating cluster state from ZooKeeper... 
   [junit4]   2> 323314 INFO  (TEST-SolrCloudExampleTest.testLoadDocsIntoGettingStartedCollection-seed#[75BBE60B308B435]) [    ] o.a.s.c.ChaosMonkey monkey: init - expire sessions:false cause connection loss:false
   [junit4]   2> 323382 INFO  (TEST-SolrCloudExampleTest.testLoadDocsIntoGettingStartedCollection-seed#[75BBE60B308B435]) [    ] o.a.s.SolrTestCaseJ4 Writing core.properties file to /home/jenkins/workspace/Lucene-Solr-5.x-Linux/solr/build/solr-core/test/J0/temp/solr.cloud.SolrCloudExampleTest_75BBE60B308B435-001/shard-1-001/cores/collection1
   [junit4]   2> 323383 INFO  (TEST-SolrCloudExampleTest.testLoadDocsIntoGettingStartedCollection-seed#[75BBE60B308B435]) [    ] o.a.s.c.AbstractFullDistribZkTestBase create jetty 1 in directory /home/jenkins/workspace/Lucene-Solr-5.x-Linux/solr/build/solr-core/test/J0/temp/solr.cloud.SolrCloudExampleTest_75BBE60B308B435-001/shard-1-001
   [junit4]   2> 323384 INFO  (TEST-SolrCloudExampleTest.testLoadDocsIntoGettingStartedCollection-seed#[75BBE60B308B435]) [    ] o.e.j.s.Server jetty-9.2.13.v20150730
   [junit4]   2> 323385 INFO  (TEST-SolrCloudExampleTest.testLoadDocsIntoGettingStartedCollection-seed#[75BBE60B308B435]) [    ] o.e.j.s.h.ContextHandler Started o.e.j.s.ServletContextHandler@2895ed{/_od,null,AVAILABLE}
   [junit4]   2> 323385 INFO  (TEST-SolrCloudExampleTest.testLoadDocsIntoGettingStartedCollection-seed#[75BBE60B308B435]) [    ] o.e.j.s.ServerConnector Started ServerConnector@cffd3e{HTTP/1.1}{127.0.0.1:54266}
   [junit4]   2> 323385 INFO  (TEST-SolrCloudExampleTest.testLoadDocsIntoGettingStartedCollection-seed#[75BBE60B308B435]) [    ] o.e.j.s.Server Started @324722ms
   [junit4]   2> 323385 INFO  (TEST-SolrCloudExampleTest.testLoadDocsIntoGettingStartedCollection-seed#[75BBE60B308B435]) [    ] o.a.s.c.s.e.JettySolrRunner Jetty properties: {solr.data.dir=/home/jenkins/workspace/Lucene-Solr-5.x-Linux/solr/build/solr-core/test/J0/temp/solr.cloud.SolrCloudExampleTest_75BBE60B308B435-001/tempDir-001/jetty1, solrconfig=solrconfig.xml, hostContext=/_od, hostPort=54266, coreRootDirectory=/home/jenkins/workspace/Lucene-Solr-5.x-Linux/solr/build/solr-core/test/J0/temp/solr.cloud.SolrCloudExampleTest_75BBE60B308B435-001/shard-1-001/cores}
   [junit4]   2> 323386 INFO  (TEST-SolrCloudExampleTest.testLoadDocsIntoGettingStartedCollection-seed#[75BBE60B308B435]) [    ] o.a.s.s.SolrDispatchFilter SolrDispatchFilter.init(): sun.misc.Launcher$AppClassLoader@e2f2a
   [junit4]   2> 323386 INFO  (TEST-SolrCloudExampleTest.testLoadDocsIntoGettingStartedCollection-seed#[75BBE60B308B435]) [    ] o.a.s.c.SolrResourceLoader new SolrResourceLoader for directory: '/home/jenkins/workspace/Lucene-Solr-5.x-Linux/solr/build/solr-core/test/J0/temp/solr.cloud.SolrCloudExampleTest_75BBE60B308B435-001/shard-1-001/'
   [junit4]   2> 323386 INFO  (TEST-SolrCloudExampleTest.testLoadDocsIntoGettingStartedCollection-seed#[75BBE60B308B435]) [    ] o.a.s.c.SolrResourceLoader JNDI not configured for solr (NoInitialContextEx)
   [junit4]   2> 323386 INFO  (TEST-SolrCloudExampleTest.testLoadDocsIntoGettingStartedCollection-seed#[75BBE60B308B435]) [    ] o.a.s.c.SolrResourceLoader solr home defaulted to 'solr/' (could not find system property or JNDI)
   [junit4]   2> 323400 INFO  (TEST-SolrCloudExampleTest.testLoadDocsIntoGettingStartedCollection-seed#[75BBE60B308B435]) [    ] o.a.s.c.c.SolrZkClient Using default ZkCredentialsProvider
   [junit4]   2> 323401 INFO  (TEST-SolrCloudExampleTest.testLoadDocsIntoGettingStartedCollection-seed#[75BBE60B308B435]) [    ] o.a.s.c.c.ConnectionManager Waiting for client to connect to ZooKeeper
   [junit4]   2> 323402 INFO  (zkCallback-237-thread-1) [    ] o.a.s.c.c.ConnectionManager Watcher org.apache.solr.common.cloud.ConnectionManager@104c83c name:ZooKeeperConnection Watcher:127.0.0.1:48949/solr got event WatchedEvent state:SyncConnected type:None path:null path:null type:None
   [junit4]   2> 323402 INFO  (TEST-SolrCloudExampleTest.testLoadDocsIntoGettingStartedCollection-seed#[75BBE60B308B435]) [    ] o.a.s.c.c.ConnectionManager Client is connected to ZooKeeper
   [junit4]   2> 323403 INFO  (TEST-SolrCloudExampleTest.testLoadDocsIntoGettingStartedCollection-seed#[75BBE60B308B435]) [    ] o.a.s.c.c.SolrZkClient Using default ZkACLProvider
   [junit4]   2> 323404 INFO  (TEST-SolrCloudExampleTest.testLoadDocsIntoGettingStartedCollection-seed#[75BBE60B308B435]) [    ] o.a.s.s.SolrDispatchFilter Loading solr.xml from SolrHome (not found in ZooKeeper)
   [junit4]   2> 323404 INFO  (TEST-SolrCloudExampleTest.testLoadDocsIntoGettingStartedCollection-seed#[75BBE60B308B435]) [    ] o.a.s.c.SolrXmlConfig Loading container configuration from /home/jenkins/workspace/Lucene-Solr-5.x-Linux/solr/build/solr-core/test/J0/temp/solr.cloud.SolrCloudExampleTest_75BBE60B308B435-001/shard-1-001/solr.xml
   [junit4]   2> 323408 INFO  (TEST-SolrCloudExampleTest.testLoadDocsIntoGettingStartedCollection-seed#[75BBE60B308B435]) [    ] o.a.s.c.CoresLocator Config-defined core root directory: /home/jenkins/workspace/Lucene-Solr-5.x-Linux/solr/build/solr-core/test/J0/temp/solr.cloud.SolrCloudExampleTest_75BBE60B308B435-001/shard-1-001/cores
   [junit4]   2> 323408 INFO  (TEST-SolrCloudExampleTest.testLoadDocsIntoGettingStartedCollection-seed#[75BBE60B308B435]) [    ] o.a.s.c.CoreContainer New CoreContainer 21914909
   [junit4]   2> 323408 INFO  (TEST-SolrCloudExampleTest.testLoadDocsIntoGettingStartedCollection-seed#[75BBE60B308B435]) [    ] o.a.s.c.CoreContainer Loading cores into CoreContainer [instanceDir=/home/jenkins/workspace/Lucene-Solr-5.x-Linux/solr/build/solr-core/test/J0/temp/solr.cloud.SolrCloudExampleTest_75BBE60B308B435-001/shard-1-001/]
   [junit4]   2> 323408 INFO  (TEST-SolrCloudExampleTest.testLoadDocsIntoGettingStartedCollection-seed#[75BBE60B308B435]) [    ] o.a.s.c.CoreContainer loading shared library: /home/jenkins/workspace/Lucene-Solr-5.x-Linux/solr/build/solr-core/test/J0/temp/solr.cloud.SolrCloudExampleTest_75BBE60B308B435-001/shard-1-001/lib
   [junit4]   2> 323408 WARN  (TEST-SolrCloudExampleTest.testLoadDocsIntoGettingStartedCollection-seed#[75BBE60B308B435]) [    ] o.a.s.c.SolrResourceLoader Can't find (or read) directory to add to classloader: lib (resolved as: /home/jenkins/workspace/Lucene-Solr-5.x-Linux/solr/build/solr-core/test/J0/temp/solr.cloud.SolrCloudExampleTest_75BBE60B308B435-001/shard-1-001/lib).
   [junit4]   2> 323415 INFO  (TEST-SolrCloudExampleTest.testLoadDocsIntoGettingStartedCollection-seed#[75BBE60B308B435]) [    ] o.a.s.h.c.HttpShardHandlerFactory created with socketTimeout : 90000,urlScheme : ,connTimeout : 15000,maxConnectionsPerHost : 20,maxConnections : 10000,corePoolSize : 0,maximumPoolSize : 2147483647,maxThreadIdleTime : 5,sizeOfQueue : -1,fairnessPolicy : false,useRetries : false,
   [junit4]   2> 323416 INFO  (TEST-SolrCloudExampleTest.testLoadDocsIntoGettingStartedCollection-seed#[75BBE60B308B435]) [    ] o.a.s.u.UpdateShardHandler Creating UpdateShardHandler HTTP client with params: socketTimeout=340000&connTimeout=45000&retry=true
   [junit4]   2> 323416 INFO  (TEST-SolrCloudExampleTest.testLoadDocsIntoGettingStartedCollection-seed#[75BBE60B308B435]) [    ] o.a.s.l.LogWatcher SLF4J impl is org.slf4j.impl.Log4jLoggerFactory
   [junit4]   2> 323416 INFO  (TEST-SolrCloudExampleTest.testLoadDocsIntoGettingStartedCollection-seed#[75BBE60B308B435]) [    ] o.a.s.l.LogWatcher Registering Log Listener [Log4j (org.slf4j.impl.Log4jLoggerFactory)]
   [junit4]   2> 323416 INFO  (TEST-SolrCloudExampleTest.testLoadDocsIntoGettingStartedCollection-seed#[75BBE60B308B435]) [    ] o.a.s.c.ZkContainer Zookeeper client=127.0.0.1:48949/solr
   [junit4]   2> 323416 INFO  (TEST-SolrCloudExampleTest.testLoadDocsIntoGettingStartedCollection-seed#[75BBE60B308B435]) [    ] o.a.s.c.ZkController zkHost includes chroot
   [junit4]   2> 323416 INFO  (TEST-SolrCloudExampleTest.testLoadDocsIntoGettingStartedCollection-seed#[75BBE60B308B435]) [    ] o.a.s.c.c.SolrZkClient Using default ZkCredentialsProvider
   [junit4]   2> 323416 INFO  (TEST-SolrCloudExampleTest.testLoadDocsIntoGettingStartedCollection-seed#[75BBE60B308B435]) [    ] o.a.s.c.c.ConnectionManager Waiting for client to connect to ZooKeeper
   [junit4]   2> 323418 INFO  (zkCallback-239-thread-1) [    ] o.a.s.c.c.ConnectionManager Watcher org.apache.solr.common.cloud.ConnectionManager@970ac7 name:ZooKeeperConnection Watcher:127.0.0.1:48949 got event WatchedEvent state:SyncConnected type:None path:null path:null type:None
   [junit4]   2> 323418 INFO  (TEST-SolrCloudExampleTest.testLoadDocsIntoGettingStartedCollection-seed#[75BBE60B308B435]) [    ] o.a.s.c.c.ConnectionManager Client is connected to ZooKeeper
   [junit4]   2> 323418 INFO  (TEST-SolrCloudExampleTest.testLoadDocsIntoGettingStartedCollection-seed#[75BBE60B308B435]) [    ] o.a.s.c.c.SolrZkClient Using default ZkACLProvider
   [junit4]   2> 323420 INFO  (TEST-SolrCloudExampleTest.testLoadDocsIntoGettingStartedCollection-seed#[75BBE60B308B435]) [n:127.0.0.1:54266__od    ] o.a.s.c.c.ConnectionManager Waiting for client to connect to ZooKeeper
   [junit4]   2> 323421 INFO  (zkCallback-240-thread-1-processing-n:127.0.0.1:54266__od) [n:127.0.0.1:54266__od    ] o.a.s.c.c.ConnectionManager Watcher org.apache.solr.common.cloud.ConnectionManager@cf0abb name:ZooKeeperConnection Watcher:127.0.0.1:48949/solr got event WatchedEvent state:SyncConnected type:None path:null path:null type:None
   [junit4]   2> 323421 INFO  (TEST-SolrCloudExampleTest.testLoadDocsIntoGettingStartedCollection-seed#[75BBE60B308B435]) [n:127.0.0.1:54266__od    ] o.a.s.c.c.ConnectionManager Client is connected to ZooKeeper
   [junit4]   2> 323425 INFO  (TEST-SolrCloudExampleTest.testLoadDocsIntoGettingStartedCollection-seed#[75BBE60B308B435]) [n:127.0.0.1:54266__od    ] o.a.s.c.c.ZkStateReader Updating cluster state from ZooKeeper... 
   [junit4]   2> 324428 INFO  (TEST-SolrCloudExampleTest.testLoadDocsIntoGettingStartedCollection-seed#[75BBE60B308B435]) [n:127.0.0.1:54266__od    ] o.a.s.c.ZkController Register node as live in ZooKeeper:/live_nodes/127.0.0.1:54266__od
   [junit4]   2> 324429 INFO  (TEST-SolrCloudExampleTest.testLoadDocsIntoGettingStartedCollection-seed#[75BBE60B308B435]) [n:127.0.0.1:54266__od    ] o.a.s.c.c.SolrZkClient makePath: /live_nodes/127.0.0.1:54266__od
   [junit4]   2> 324429 INFO  (zkCallback-240-thread-1-processing-n:127.0.0.1:54266__od) [n:127.0.0.1:54266__od    ] o.a.s.c.c.ZkStateReader A live node change: WatchedEvent state:SyncConnected type:NodeChildrenChanged path:/live_nodes, has occurred - updating... (live nodes size: 1)
   [junit4]   2> 324429 INFO  (zkCallback-236-thread-1) [    ] o.a.s.c.c.ZkStateReader A live node change: WatchedEvent state:SyncConnected type:NodeChildrenChanged path:/live_nodes, has occurred - updating... (live nodes size: 1)
   [junit4]   2> 324430 INFO  (zkCallback-234-thread-1-processing-n:127.0.0.1:51577__od) [n:127.0.0.1:51577__od    ] o.a.s.c.c.ZkStateReader A live node change: WatchedEvent state:SyncConnected type:NodeChildrenChanged path:/live_nodes, has occurred - updating... (live nodes size: 1)
   [junit4]   2> 324431 INFO  (TEST-SolrCloudExampleTest.testLoadDocsIntoGettingStartedCollection-seed#[75BBE60B308B435]) [n:127.0.0.1:54266__od    ] o.a.s.c.Overseer Overseer (id=null) closing
   [junit4]   2> 324431 INFO  (TEST-SolrCloudExampleTest.testLoadDocsIntoGettingStartedCollection-seed#[75BBE60B308B435]) [n:127.0.0.1:54266__od    ] o.a.s.c.LeaderElector Joined leadership election with path: /overseer_elect/election/94663756411699208-127.0.0.1:54266__od-n_0000000001
   [junit4]   2> 324432 INFO  (TEST-SolrCloudExampleTest.testLoadDocsIntoGettingStartedCollection-seed#[75BBE60B308B435]) [n:127.0.0.1:54266__od    ] o.a.s.c.LeaderElector Watching path /overseer_elect/election/94663756411699204-127.0.0.1:51577__od-n_0000000000 to know if I could be the leader
   [junit4]   2> 324454 INFO  (TEST-SolrCloudExampleTest.testLoadDocsIntoGettingStartedCollection-seed#[75BBE60B308B435]) [n:127.0.0.1:54266__od    ] o.a.s.c.CoreContainer Security conf doesn't exist. Skipping setup for authorization module.
   [junit4]   2> 324454 INFO  (TEST-SolrCloudExampleTest.testLoadDocsIntoGettingStartedCollection-seed#[75BBE60B308B435]) [n:127.0.0.1:54266__od    ] o.a.s.c.CoreContainer No authentication plugin used.
   [junit4]   2> 324455 INFO  (TEST-SolrCloudExampleTest.testLoadDocsIntoGettingStartedCollection-seed#[75BBE60B308B435]) [n:127.0.0.1:54266__od    ] o.a.s.c.CoresLocator Looking for core definitions underneath /home/jenkins/workspace/Lucene-Solr-5.x-Linux/solr/build/solr-core/test/J0/temp/solr.cloud.SolrCloudExampleTest_75BBE60B308B435-001/shard-1-001/cores
   [junit4]   2> 324455 INFO  (TEST-SolrCloudExampleTest.testLoadDocsIntoGettingStartedCollection-seed#[75BBE60B308B435]) [n:127.0.0.1:54266__od    ] o.a.s.c.SolrCore Created CoreDescriptor: {name=collection1, config=solrconfig.xml, transient=false, schema=schema.xml, loadOnStartup=true, configSetProperties=configsetprops.json, instanceDir=/home/jenkins/workspace/Lucene-Solr-5.x-Linux/solr/build/solr-core/test/J0/temp/solr.cloud.SolrCloudExampleTest_75BBE60B308B435-001/shard-1-001/cores/collection1, collection=collection1, absoluteInstDir=/home/jenkins/workspace/Lucene-Solr-5.x-Linux/solr/build/solr-core/test/J0/temp/solr.cloud.SolrCloudExampleTest_75BBE60B308B435-001/shard-1-001/cores/collection1/, coreNodeName=, dataDir=data/, shard=}
   [junit4]   2> 324455 INFO  (TEST-SolrCloudExampleTest.testLoadDocsIntoGettingStartedCollection-seed#[75BBE60B308B435]) [n:127.0.0.1:54266__od    ] o.a.s.c.CoresLocator Found core collection1 in /home/jenkins/workspace/Lucene-Solr-5.x-Linux/solr/build/solr-core/test/J0/temp/solr.cloud.SolrCloudExampleTest_75BBE60B308B435-001/shard-1-001/cores/collection1/
   [junit4]   2> 324455 INFO  (TEST-SolrCloudExampleTest.testLoadDocsIntoGettingStartedCollection-seed#[75BBE60B308B435]) [n:127.0.0.1:54266__od    ] o.a.s.c.CoresLocator Found 1 core definitions
   [junit4]   2> 324456 INFO  (TEST-SolrCloudExampleTest.testLoadDocsIntoGettingStartedCollection-seed#[75BBE60B308B435]) [n:127.0.0.1:54266__od    ] o.a.s.s.SolrDispatchFilter user.dir=/home/jenkins/workspace/Lucene-Solr-5.x-Linux/solr/build/solr-core/test/J0
   [junit4]   2> 324456 INFO  (TEST-SolrCloudExampleTest.testLoadDocsIntoGettingStartedCollection-seed#[75BBE60B308B435]) [n:127.0.0.1:54266__od    ] o.a.s.s.SolrDispatchFilter SolrDispatchFilter.init() done
   [junit4]   2> 324456 INFO  (coreLoadExecutor-1055-thread-1-processing-n:127.0.0.1:54266__od) [n:127.0.0.1:54266__od c:collection1   x:collection1] o.a.s.c.ZkController publishing state=down
   [junit4]   2> 324456 INFO  (coreLoadExecutor-1055-thread-1-processing-n:127.0.0.1:54266__od) [n:127.0.0.1:54266__od c:collection1   x:collection1] o.a.s.c.ZkController numShards not found on descriptor - reading it from system property
   [junit4]   2> 324457 INFO  (coreLoadExecutor-1055-thread-1-processing-n:127.0.0.1:54266__od) [n:127.0.0.1:54266__od c:collection1   x:collection1] o.a.s.c.ZkController look for our core node name
   [junit4]   2> 324458 INFO  (OverseerStateUpdate-94663756411699204-127.0.0.1:51577__od-n_0000000000) [n:127.0.0.1:51577__od    ] o.a.s.c.Overseer processMessage: queueSize: 1, message = {
   [junit4]   2>   "core":"collection1",
   [junit4]   2>   "roles":null,
   [junit4]   2>   "base_url":"http://127.0.0.1:54266/_od",
   [junit4]   2>   "node_name":"127.0.0.1:54266__od",
   [junit4]   2>   "numShards":"2",
   [junit4]   2>   "state":"down",
   [junit4]   2>   "shard":null,
   [junit4]   2>   "collection":"collection1",
   [junit4]   2>   "operation":"state"} current state version: 3
   [junit4]   2> 324458 INFO  (OverseerStateUpdate-94663756411699204-127.0.0.1:51577__od-n_0000000000) [n:127.0.0.1:51577__od    ] o.a.s.c.o.ReplicaMutator Update state numShards=2 message={
   [junit4]   2>   "core":"collection1",
   [junit4]   2>   "roles":null,
   [junit4]   2>   "base_url":"http://127.0.0.1:54266/_od",
   [junit4]   2>   "node_name":"127.0.0.1:54266__od",
   [junit4]   2>   "numShards":"2",
   [junit4]   2>   "state":"down",
   [junit4]   2>   "shard":null,
   [junit4]   2>   "collection":"collection1",
   [junit4]   2>   "operation":"state"}
   [junit4]   2> 324458 INFO  (OverseerStateUpdate-94663756411699204-127.0.0.1:51577__od-n_0000000000) [n:127.0.0.1:51577__od    ] o.a.s.c.o.ClusterStateMutator building a new cName: collection1
   [junit4]   2> 324458 INFO  (OverseerStateUpdate-94663756411699204-127.0.0.1:51577__od-n_0000000000) [n:127.0.0.1:51577__od    ] o.a.s.c.o.ReplicaMutator Assigning new node to shard shard=shard2
   [junit4]   2> 324560 INFO  (zkCallback-240-thread-1-processing-n:127.0.0.1:54266__od) [n:127.0.0.1:54266__od    ] o.a.s.c.c.ZkStateReader A cluster state change: WatchedEvent state:SyncConnected type:NodeDataChanged path:/clusterstate.json, has occurred - updating... (live nodes size: 2)
   [junit4]   2> 324560 INFO  (zkCallback-236-thread-1) [    ] o.a.s.c.c.ZkStateReader A cluster state change: WatchedEvent state:SyncConnected type:NodeDataChanged path:/clusterstate.json, has occurred - updating... (live nodes size: 2)
   [junit4]   2> 324560 INFO  (zkCallback-234-thread-1-processing-n:127.0.0.1:51577__od) [n:127.0.0.1:51577__od    ] o.a.s.c.c.ZkStateReader A cluster state change: WatchedEvent state:SyncConnected type:NodeDataChanged path:/clusterstate.json, has occurred - updating... (live nodes size: 2)
   [junit4]   2> 325458 INFO  (coreLoadExecutor-1055-thread-1-processing-n:127.0.0.1:54266__od) [n:127.0.0.1:54266__od c:collection1   x:collection1] o.a.s.c.ZkController waiting to find shard id in clusterstate for collection1
   [junit4]   2> 325458 INFO  (coreLoadExecutor-1055-thread-1-processing-n:127.0.0.1:54266__od) [n:127.0.0.1:54266__od c:collection1   x:collection1] o.a.s.c.ZkController Check for collection zkNode:collection1
   [junit4]   2> 325458 INFO  (coreLoadExecutor-1055-thread-1-processing-n:127.0.0.1:54266__od) [n:127.0.0.1:54266__od c:collection1   x:collection1] o.a.s.c.ZkController Collection zkNode exists
   [junit4]   2> 325458 INFO  (coreLoadExecutor-1055-thread-1-processing-n:127.0.0.1:54266__od) [n:127.0.0.1:54266__od c:collection1   x:collection1] o.a.s.c.c.ZkStateReader Load collection config from:/collections/collection1
   [junit4]   2> 325459 INFO  (coreLoadExecutor-1055-thread-1-processing-n:127.0.0.1:54266__od) [n:127.0.0.1:54266__od c:collection1   x:collection1] o.a.s.c.c.ZkStateReader path=/collections/collection1 configName=conf1 specified config exists in ZooKeeper
   [junit4]   2> 325459 INFO  (coreLoadExecutor-1055-thread-1-processing-n:127.0.0.1:54266__od) [n:127.0.0.1:54266__od c:collection1   x:collection1] o.a.s.c.SolrResourceLoader new SolrResourceLoader for directory: '/home/jenkins/workspace/Lucene-Solr-5.x-Linux/solr/build/solr-core/test/J0/temp/solr.cloud.SolrCloudExampleTest_75BBE60B308B435-001/shard-1-001/cores/collection1/'
   [junit4]   2> 325459 INFO  (coreLoadExecutor-1055-thread-1-processing-n:127.0.0.1:54266__od) [n:127.0.0.1:54266__od c:collection1   x:collection1] o.a.s.c.SolrResourceLoader JNDI not configured for solr (NoInitialContextEx)
   [junit4]   2> 325459 INFO  (coreLoadExecutor-1055-thread-1-processing-n:127.0.0.1:54266__od) [n:127.0.0.1:54266__od c:collection1   x:collection1] o.a.s.c.SolrResourceLoader solr home defaulted to 'solr/' (could not find system property or JNDI)
   [junit4]   2> 325481 INFO  (coreLoadExecutor-1055-thread-1-processing-n:127.0.0.1:54266__od) [n:127.0.0.1:54266__od c:collection1   x:collection1] o.a.s.c.Config loaded config solrconfig.xml with version 0 
   [junit4]   2> 325488 INFO  (coreLoadExecutor-1055-thread-1-processing-n:127.0.0.1:54266__od) [n:127.0.0.1:54266__od c:collection1   x:collection1] o.a.s.c.SolrConfig current version of requestparams : -1
   [junit4]   2> 325493 INFO  (coreLoadExecutor-1055-thread-1-processing-n:127.0.0.1:54266__od) [n:127.0.0.1:54266__od c:collection1   x:collection1] o.a.s.c.SolrConfig Using Lucene MatchVersion: 5.4.0
   [junit4]   2> 325505 INFO  (coreLoadExecutor-1055-thread-1-processing-n:127.0.0.1:54266__od) [n:127.0.0.1:54266__od c:collection1   x:collection1] o.a.s.c.Config Loaded SolrConfig: solrconfig.xml
   [junit4]   2> 325506 INFO  (coreLoadExecutor-1055-thread-1-processing-n:127.0.0.1:54266__od) [n:127.0.0.1:54266__od c:collection1   x:collection1] o.a.s.s.IndexSchema Reading Solr Schema from /configs/conf1/schema.xml
   [junit4]   2> 325515 INFO  (coreLoadExecutor-1055-thread-1-processing-n:127.0.0.1:54266__od) [n:127.0.0.1:54266__od c:collection1   x:collection1] o.a.s.s.IndexSchema [collection1] Schema name=test
   [junit4]   2> 325902 INFO  (coreLoadExecutor-1055-thread-1-processing-n:127.0.0.1:54266__od) [n:127.0.0.1:54266__od c:collection1   x:collection1] o.a.s.s.OpenExchangeRatesOrgProvider Initialized with rates=open-exchange-rates.json, refreshInterval=1440.
   [junit4]   2> 325908 INFO  (coreLoadExecutor-1055-thread-1-processing-n:127.0.0.1:54266__od) [n:127.0.0.1:54266__od c:collection1   x:collection1] o.a.s.s.IndexSchema default search field in schema is text
   [junit4]   2> 325909 INFO  (coreLoadExecutor-1055-thread-1-processing-n:127.0.0.1:54266__od) [n:127.0.0.1:54266__od c:collection1   x:collection1] o.a.s.s.IndexSchema unique key field: id
   [junit4]   2> 325918 INFO  (coreLoadExecutor-1055-thread-1-processing-n:127.0.0.1:54266__od) [n:127.0.0.1:54266__od c:collection1   x:collection1] o.a.s.s.FileExchangeRateProvider Reloading exchange rates from file currency.xml
   [junit4]   2> 325920 INFO  (coreLoadExecutor-1055-thread-1-processing-n:127.0.0.1:54266__od) [n:127.0.0.1:54266__od c:collection1   x:collection1] o.a.s.s.FileExchangeRateProvider Reloading exchange rates from file currency.xml
   [junit4]   2> 325922 INFO  (coreLoadExecutor-1055-thread-1-processing-n:127.0.0.1:54266__od) [n:127.0.0.1:54266__od c:collection1   x:collection1] o.a.s.s.OpenExchangeRatesOrgProvider Reloading exchange rates from open-exchange-rates.json
   [junit4]   2> 325923 WARN  (coreLoadExecutor-1055-thread-1-processing-n:127.0.0.1:54266__od) [n:127.0.0.1:54266__od c:collection1   x:collection1] o.a.s.s.OpenExchangeRatesOrgProvider Unknown key IMPORTANT NOTE
   [junit4]   2> 325923 WARN  (coreLoadExecutor-1055-thread-1-processing-n:127.0.0.1:54266__od) [n:127.0.0.1:54266__od c:collection1   x:collection1] o.a.s.s.OpenExchangeRatesOrgProvider Expected key, got STRING
   [junit4]   2> 325923 INFO  (coreLoadExecutor-1055-thread-1-processing-n:127.0.0.1:54266__od) [n:127.0.0.1:54266__od c:collection1   x:collection1] o.a.s.s.OpenExchangeRatesOrgProvider Reloading exchange rates from open-exchange-rates.json
   [junit4]   2> 325924 WARN  (coreLoadExecutor-1055-thread-1-processing-n:127.0.0.1:54266__od) [n:127.0.0.1:54266__od c:collection1   x:collection1] o.a.s.s.OpenExchangeRatesOrgProvider Unknown key IMPORTANT NOTE
   [junit4]   2> 325924 WARN  (coreLoadExecutor-1055-thread-1-processing-n:127.0.0.1:54266__od) [n:127.0.0.1:54266__od c:collection1   x:collection1] o.a.s.s.OpenExchangeRatesOrgProvider Expected key, got STRING
   [junit4]   2> 325925 INFO  (coreLoadExecutor-1055-thread-1-processing-n:127.0.0.1:54266__od) [n:127.0.0.1:54266__od c:collection1   x:collection1] o.a.s.c.ConfigSetProperties Did not find ConfigSet properties, assuming default properties: Can't find resource 'configsetprops.json' in classpath or '/configs/conf1', cwd=/home/jenkins/workspace/Lucene-Solr-5.x-Linux/solr/build/solr-core/test/J0
   [junit4]   2> 325925 INFO  (coreLoadExecutor-1055-thread-1-processing-n:127.0.0.1:54266__od) [n:127.0.0.1:54266__od c:collection1   x:collection1] o.a.s.c.CoreContainer Creating SolrCore 'collection1' using configuration from collection collection1
   [junit4]   2> 325925 INFO  (coreLoadExecutor-1055-thread-1-processing-n:127.0.0.1:54266__od) [n:127.0.0.1:54266__od c:collection1 s:shard2 r:core_node1 x:collection1] o.a.s.c.SolrCore org.apache.solr.core.MockDirectoryFactory
   [junit4]   2> 325925 INFO  (coreLoadExecutor-1055-thread-1-processing-n:127.0.0.1:54266__od) [n:127.0.0.1:54266__od c:collection1

[...truncated too long message...]

e4 x:collection1] o.a.s.c.CachingDirectoryFactory Closing directory: /home/jenkins/workspace/Lucene-Solr-5.x-Linux/solr/build/solr-core/test/J0/temp/solr.cloud.SolrCloudExampleTest_75BBE60B308B435-001/shard-4-001/cores/collection1/data
   [junit4]   2> 364589 INFO  (zkCallback-253-thread-2-processing-n:127.0.0.1:47072__od) [n:127.0.0.1:47072__od c:collection1 s:shard1 r:core_node4 x:collection1] o.a.s.c.ShardLeaderElectionContextBase No version found for ephemeral leader parent node, won't remove previous leader registration.
   [junit4]   2> 364589 INFO  (zkCallback-253-thread-2-processing-n:127.0.0.1:47072__od) [n:127.0.0.1:47072__od c:collection1 s:shard1 r:core_node4 x:collection1] o.a.s.c.ElectionContext Canceling election /collections/collection1/leader_elect/shard1/election/94663756411699217-core_node4-n_0000000001
   [junit4]   2> 364589 WARN  (zkCallback-253-thread-2-processing-n:127.0.0.1:47072__od) [n:127.0.0.1:47072__od c:collection1 s:shard1 r:core_node4 x:collection1] o.a.s.c.LeaderElector 
   [junit4]   2> org.apache.zookeeper.KeeperException$SessionExpiredException: KeeperErrorCode = Session expired for /collections/collection1/leader_elect/shard1/election/94663756411699217-core_node4-n_0000000001
   [junit4]   2> 	at org.apache.zookeeper.KeeperException.create(KeeperException.java:127)
   [junit4]   2> 	at org.apache.zookeeper.KeeperException.create(KeeperException.java:51)
   [junit4]   2> 	at org.apache.zookeeper.ZooKeeper.delete(ZooKeeper.java:873)
   [junit4]   2> 	at org.apache.solr.common.cloud.SolrZkClient$2.execute(SolrZkClient.java:244)
   [junit4]   2> 	at org.apache.solr.common.cloud.SolrZkClient$2.execute(SolrZkClient.java:241)
   [junit4]   2> 	at org.apache.solr.common.cloud.ZkCmdExecutor.retryOperation(ZkCmdExecutor.java:61)
   [junit4]   2> 	at org.apache.solr.common.cloud.SolrZkClient.delete(SolrZkClient.java:241)
   [junit4]   2> 	at org.apache.solr.cloud.ElectionContext.cancelElection(ElectionContext.java:85)
   [junit4]   2> 	at org.apache.solr.cloud.ShardLeaderElectionContextBase.cancelElection(ElectionContext.java:166)
   [junit4]   2> 	at org.apache.solr.cloud.ShardLeaderElectionContext.cancelElection(ElectionContext.java:268)
   [junit4]   2> 	at org.apache.solr.cloud.ShardLeaderElectionContext.runLeaderProcess(ElectionContext.java:450)
   [junit4]   2> 	at org.apache.solr.cloud.LeaderElector.runIamLeaderProcess(LeaderElector.java:197)
   [junit4]   2> 	at org.apache.solr.cloud.LeaderElector.checkIfIamLeader(LeaderElector.java:157)
   [junit4]   2> 	at org.apache.solr.cloud.LeaderElector.access$200(LeaderElector.java:58)
   [junit4]   2> 	at org.apache.solr.cloud.LeaderElector$ElectionWatcher.process(LeaderElector.java:388)
   [junit4]   2> 	at org.apache.solr.common.cloud.SolrZkClient$3$1.run(SolrZkClient.java:264)
   [junit4]   2> 	at java.util.concurrent.Executors$RunnableAdapter.call(Executors.java:511)
   [junit4]   2> 	at java.util.concurrent.FutureTask.run(FutureTask.java:266)
   [junit4]   2> 	at org.apache.solr.common.util.ExecutorUtil$MDCAwareThreadPoolExecutor$1.run(ExecutorUtil.java:231)
   [junit4]   2> 	at java.util.concurrent.ThreadPoolExecutor.runWorker(ThreadPoolExecutor.java:1142)
   [junit4]   2> 	at java.util.concurrent.ThreadPoolExecutor$Worker.run(ThreadPoolExecutor.java:617)
   [junit4]   2> 	at java.lang.Thread.run(Thread.java:745)
   [junit4]   2> 364590 INFO  (TEST-SolrCloudExampleTest.testLoadDocsIntoGettingStartedCollection-seed#[75BBE60B308B435]) [    ] o.e.j.s.ServerConnector Stopped ServerConnector@2b6b89{HTTP/1.1}{127.0.0.1:0}
   [junit4]   2> 364591 INFO  (TEST-SolrCloudExampleTest.testLoadDocsIntoGettingStartedCollection-seed#[75BBE60B308B435]) [    ] o.e.j.s.h.ContextHandler Stopped o.e.j.s.ServletContextHandler@478b27{/_od,null,UNAVAILABLE}
   [junit4]   2> 364592 INFO  (TEST-SolrCloudExampleTest.testLoadDocsIntoGettingStartedCollection-seed#[75BBE60B308B435]) [n:127.0.0.1:47072__od c:collection1 s:shard1 r:core_node4 x:collection1] o.a.s.c.ZkTestServer connecting to 127.0.0.1:48949 48949
   [junit4]   2> 364663 INFO  (Thread-953) [    ] o.a.s.c.ZkTestServer connecting to 127.0.0.1:48949 48949
   [junit4]   2> 364663 WARN  (Thread-953) [    ] o.a.s.c.ZkTestServer Watch limit violations: 
   [junit4]   2> Maximum concurrent create/delete watches above limit:
   [junit4]   2> 
   [junit4]   2> 	9	/solr/aliases.json
   [junit4]   2> 	9	/solr/configs/gettingstarted/managed-schema
   [junit4]   2> 	9	/solr/configs/gettingstarted
   [junit4]   2> 	5	/solr/security.json
   [junit4]   2> 	5	/solr/configs/conf1
   [junit4]   2> 
   [junit4]   2> Maximum concurrent data watches above limit:
   [junit4]   2> 
   [junit4]   2> 	9	/solr/clusterstate.json
   [junit4]   2> 	4	/solr/collections/gettingstarted/state.json
   [junit4]   2> 
   [junit4]   2> Maximum concurrent children watches above limit:
   [junit4]   2> 
   [junit4]   2> 	9	/solr/live_nodes
   [junit4]   2> 	9	/solr/collections
   [junit4]   2> 	4	/solr/overseer/queue
   [junit4]   2> 	4	/solr/overseer/collection-queue-work
   [junit4]   2> 	2	/solr/overseer/queue-work
   [junit4]   2> 
   [junit4]   2> NOTE: reproduce with: ant test  -Dtestcase=SolrCloudExampleTest -Dtests.method=testLoadDocsIntoGettingStartedCollection -Dtests.seed=75BBE60B308B435 -Dtests.multiplier=3 -Dtests.slow=true -Dtests.locale=el_CY -Dtests.timezone=Asia/Almaty -Dtests.asserts=true -Dtests.file.encoding=UTF-8
   [junit4] FAILURE 43.2s J0 | SolrCloudExampleTest.testLoadDocsIntoGettingStartedCollection <<<
   [junit4]    > Throwable #1: java.lang.AssertionError: Delete action failed!
   [junit4]    > 	at __randomizedtesting.SeedInfo.seed([75BBE60B308B435:14388C0F82670D93]:0)
   [junit4]    > 	at org.apache.solr.cloud.SolrCloudExampleTest.doTestDeleteAction(SolrCloudExampleTest.java:169)
   [junit4]    > 	at org.apache.solr.cloud.SolrCloudExampleTest.testLoadDocsIntoGettingStartedCollection(SolrCloudExampleTest.java:145)
   [junit4]    > 	at org.apache.solr.BaseDistributedSearchTestCase$ShardsRepeatRule$ShardsFixedStatement.callStatement(BaseDistributedSearchTestCase.java:963)
   [junit4]    > 	at org.apache.solr.BaseDistributedSearchTestCase$ShardsRepeatRule$ShardsStatement.evaluate(BaseDistributedSearchTestCase.java:938)
   [junit4]    > 	at java.lang.Thread.run(Thread.java:745)
   [junit4]   2> 364672 INFO  (SUITE-SolrCloudExampleTest-seed#[75BBE60B308B435]-worker) [n:127.0.0.1:47072__od c:collection1 s:shard1 r:core_node4 x:collection1] o.a.s.SolrTestCaseJ4 ###deleteCore
   [junit4]   2> NOTE: leaving temporary files on disk at: /home/jenkins/workspace/Lucene-Solr-5.x-Linux/solr/build/solr-core/test/J0/temp/solr.cloud.SolrCloudExampleTest_75BBE60B308B435-001
   [junit4]   2> Oct 10, 2015 5:18:54 AM com.carrotsearch.randomizedtesting.ThreadLeakControl checkThreadLeaks
   [junit4]   2> WARNING: Will linger awaiting termination of 1 leaked thread(s).
   [junit4]   2> NOTE: test params are: codec=Asserting(Lucene53): {}, docValues:{}, sim=RandomSimilarityProvider(queryNorm=false,coord=no): {}, locale=el_CY, timezone=Asia/Almaty
   [junit4]   2> NOTE: Linux 3.19.0-30-generic i386/Oracle Corporation 1.8.0_60 (32-bit)/cpus=12,threads=1,free=187367216,total=278921216
   [junit4]   2> NOTE: All tests run in this JVM: [TestFieldResource, TestSortingResponseWriter, TestLuceneMatchVersion, PathHierarchyTokenizerFactoryTest, BadCopyFieldTest, HdfsThreadLeakTest, TestFaceting, DateMathParserTest, TestCloudManagedSchema, TestJoin, TestStandardQParsers, IndexSchemaRuntimeFieldTest, TestDocSet, TestAuthorizationFramework, IndexSchemaTest, TestSolrDynamicMBean, OpenExchangeRatesOrgProviderTest, DistributedFacetPivotSmallTest, AsyncCallRequestStatusResponseTest, TestDistributedSearch, DocumentAnalysisRequestHandlerTest, QueryElevationComponentTest, SolrXmlInZkTest, TestSolr4Spatial2, DefaultValueUpdateProcessorTest, AnalysisAfterCoreReloadTest, TestManagedSynonymFilterFactory, BigEndianAscendingWordDeserializerTest, TestExpandComponent, TestValueSourceCache, QueryResultKeyTest, TestRealTimeGet, TestLeaderInitiatedRecoveryThread, FileUtilsTest, TestRangeQuery, TestConfigSetProperties, CurrencyFieldOpenExchangeTest, ResponseLogComponentTest, JSONWriterTest, TestLMDirichletSimilarityFactory, TestRTimerTree, HdfsBasicDistributedZk2Test, BasicZkTest, SOLR749Test, TestDocBasedVersionConstraints, TestCollapseQParserPlugin, SegmentsInfoRequestHandlerTest, TestFieldCollectionResource, DistributedQueryComponentOptimizationTest, DistributedFacetPivotWhiteBoxTest, TestDistributedMissingSort, JsonLoaderTest, TestPseudoReturnFields, OverseerCollectionConfigSetProcessorTest, TestFunctionQuery, TestCustomDocTransformer, SolrCloudExampleTest]
   [junit4] Completed [165/540] on J0 in 44.23s, 1 test, 1 failure <<< FAILURES!

[...truncated 1177 lines...]
BUILD FAILED
/home/jenkins/workspace/Lucene-Solr-5.x-Linux/build.xml:785: The following error occurred while executing this line:
/home/jenkins/workspace/Lucene-Solr-5.x-Linux/build.xml:729: The following error occurred while executing this line:
/home/jenkins/workspace/Lucene-Solr-5.x-Linux/build.xml:59: The following error occurred while executing this line:
/home/jenkins/workspace/Lucene-Solr-5.x-Linux/solr/build.xml:233: The following error occurred while executing this line:
/home/jenkins/workspace/Lucene-Solr-5.x-Linux/solr/common-build.xml:526: The following error occurred while executing this line:
/home/jenkins/workspace/Lucene-Solr-5.x-Linux/lucene/common-build.xml:1452: The following error occurred while executing this line:
/home/jenkins/workspace/Lucene-Solr-5.x-Linux/lucene/common-build.xml:1006: There were test failures: 540 suites (7 ignored), 2131 tests, 1 failure, 71 ignored (35 assumptions) [seed: 75BBE60B308B435]

Total time: 52 minutes 51 seconds
Build step 'Invoke Ant' marked build as failure
Archiving artifacts
[WARNINGS] Skipping publisher since build result is FAILURE
Recording test results
Email was triggered for: Failure - Any
Sending email for trigger: Failure - Any



Mime
View raw message