lucene-dev mailing list archives

Site index · List index
Message view « Date » · « Thread »
Top « Date » · « Thread »
From Policeman Jenkins Server <jenk...@thetaphi.de>
Subject [JENKINS] Lucene-Solr-trunk-MacOSX (64bit/jdk1.8.0) - Build # 2777 - Failure!
Date Mon, 05 Oct 2015 06:58:55 GMT
Build: http://jenkins.thetaphi.de/job/Lucene-Solr-trunk-MacOSX/2777/
Java: 64bit/jdk1.8.0 -XX:-UseCompressedOops -XX:+UseG1GC

1 tests failed.
FAILED:  org.apache.solr.core.TestDynamicLoading.testDynamicLoading

Error Message:
Could not get expected value  'X val changed' for path 'x' full output: {   "responseHeader":{     "status":0,     "QTime":0},   "params":{"wt":"json"},   "context":{     "webapp":"/a_",     "path":"/test1",     "httpMethod":"GET"},   "class":"org.apache.solr.core.BlobStoreTestRequestHandler",   "x":"X val"}

Stack Trace:
java.lang.AssertionError: Could not get expected value  'X val changed' for path 'x' full output: {
  "responseHeader":{
    "status":0,
    "QTime":0},
  "params":{"wt":"json"},
  "context":{
    "webapp":"/a_",
    "path":"/test1",
    "httpMethod":"GET"},
  "class":"org.apache.solr.core.BlobStoreTestRequestHandler",
  "x":"X val"}
	at __randomizedtesting.SeedInfo.seed([204D5D95BF66CB57:F80070C248BB6EF7]:0)
	at org.junit.Assert.fail(Assert.java:93)
	at org.junit.Assert.assertTrue(Assert.java:43)
	at org.apache.solr.core.TestSolrConfigHandler.testForResponseElement(TestSolrConfigHandler.java:441)
	at org.apache.solr.core.TestDynamicLoading.testDynamicLoading(TestDynamicLoading.java:260)
	at sun.reflect.NativeMethodAccessorImpl.invoke0(Native Method)
	at sun.reflect.NativeMethodAccessorImpl.invoke(NativeMethodAccessorImpl.java:62)
	at sun.reflect.DelegatingMethodAccessorImpl.invoke(DelegatingMethodAccessorImpl.java:43)
	at java.lang.reflect.Method.invoke(Method.java:497)
	at com.carrotsearch.randomizedtesting.RandomizedRunner.invoke(RandomizedRunner.java:1665)
	at com.carrotsearch.randomizedtesting.RandomizedRunner$8.evaluate(RandomizedRunner.java:864)
	at com.carrotsearch.randomizedtesting.RandomizedRunner$9.evaluate(RandomizedRunner.java:900)
	at com.carrotsearch.randomizedtesting.RandomizedRunner$10.evaluate(RandomizedRunner.java:914)
	at org.apache.solr.BaseDistributedSearchTestCase$ShardsRepeatRule$ShardsFixedStatement.callStatement(BaseDistributedSearchTestCase.java:963)
	at org.apache.solr.BaseDistributedSearchTestCase$ShardsRepeatRule$ShardsStatement.evaluate(BaseDistributedSearchTestCase.java:938)
	at com.carrotsearch.randomizedtesting.rules.SystemPropertiesRestoreRule$1.evaluate(SystemPropertiesRestoreRule.java:57)
	at org.apache.lucene.util.TestRuleSetupTeardownChained$1.evaluate(TestRuleSetupTeardownChained.java:50)
	at org.apache.lucene.util.AbstractBeforeAfterRule$1.evaluate(AbstractBeforeAfterRule.java:46)
	at org.apache.lucene.util.TestRuleThreadAndTestName$1.evaluate(TestRuleThreadAndTestName.java:49)
	at org.apache.lucene.util.TestRuleIgnoreAfterMaxFailures$1.evaluate(TestRuleIgnoreAfterMaxFailures.java:65)
	at org.apache.lucene.util.TestRuleMarkFailure$1.evaluate(TestRuleMarkFailure.java:48)
	at com.carrotsearch.randomizedtesting.rules.StatementAdapter.evaluate(StatementAdapter.java:36)
	at com.carrotsearch.randomizedtesting.ThreadLeakControl$StatementRunner.run(ThreadLeakControl.java:367)
	at com.carrotsearch.randomizedtesting.ThreadLeakControl.forkTimeoutingTask(ThreadLeakControl.java:809)
	at com.carrotsearch.randomizedtesting.ThreadLeakControl$3.evaluate(ThreadLeakControl.java:460)
	at com.carrotsearch.randomizedtesting.RandomizedRunner.runSingleTest(RandomizedRunner.java:873)
	at com.carrotsearch.randomizedtesting.RandomizedRunner$5.evaluate(RandomizedRunner.java:775)
	at com.carrotsearch.randomizedtesting.RandomizedRunner$6.evaluate(RandomizedRunner.java:809)
	at com.carrotsearch.randomizedtesting.RandomizedRunner$7.evaluate(RandomizedRunner.java:820)
	at com.carrotsearch.randomizedtesting.rules.StatementAdapter.evaluate(StatementAdapter.java:36)
	at com.carrotsearch.randomizedtesting.rules.SystemPropertiesRestoreRule$1.evaluate(SystemPropertiesRestoreRule.java:57)
	at org.apache.lucene.util.AbstractBeforeAfterRule$1.evaluate(AbstractBeforeAfterRule.java:46)
	at com.carrotsearch.randomizedtesting.rules.StatementAdapter.evaluate(StatementAdapter.java:36)
	at org.apache.lucene.util.TestRuleStoreClassName$1.evaluate(TestRuleStoreClassName.java:42)
	at com.carrotsearch.randomizedtesting.rules.NoShadowingOrOverridesOnMethodsRule$1.evaluate(NoShadowingOrOverridesOnMethodsRule.java:39)
	at com.carrotsearch.randomizedtesting.rules.NoShadowingOrOverridesOnMethodsRule$1.evaluate(NoShadowingOrOverridesOnMethodsRule.java:39)
	at com.carrotsearch.randomizedtesting.rules.StatementAdapter.evaluate(StatementAdapter.java:36)
	at com.carrotsearch.randomizedtesting.rules.StatementAdapter.evaluate(StatementAdapter.java:36)
	at com.carrotsearch.randomizedtesting.rules.StatementAdapter.evaluate(StatementAdapter.java:36)
	at org.apache.lucene.util.TestRuleAssertionsRequired$1.evaluate(TestRuleAssertionsRequired.java:54)
	at org.apache.lucene.util.TestRuleMarkFailure$1.evaluate(TestRuleMarkFailure.java:48)
	at org.apache.lucene.util.TestRuleIgnoreAfterMaxFailures$1.evaluate(TestRuleIgnoreAfterMaxFailures.java:65)
	at org.apache.lucene.util.TestRuleIgnoreTestSuites$1.evaluate(TestRuleIgnoreTestSuites.java:55)
	at com.carrotsearch.randomizedtesting.rules.StatementAdapter.evaluate(StatementAdapter.java:36)
	at com.carrotsearch.randomizedtesting.ThreadLeakControl$StatementRunner.run(ThreadLeakControl.java:367)
	at java.lang.Thread.run(Thread.java:745)




Build Log:
[...truncated 10674 lines...]
   [junit4] Suite: org.apache.solr.core.TestDynamicLoading
   [junit4]   2> Creating dataDir: /Users/jenkins/workspace/Lucene-Solr-trunk-MacOSX/solr/build/solr-core/test/J1/temp/solr.core.TestDynamicLoading_204D5D95BF66CB57-001/init-core-data-001
   [junit4]   2> 2546976 INFO  (SUITE-TestDynamicLoading-seed#[204D5D95BF66CB57]-worker) [    ] o.a.s.SolrTestCaseJ4 Randomized ssl (false) and clientAuth (false)
   [junit4]   2> 2546976 INFO  (SUITE-TestDynamicLoading-seed#[204D5D95BF66CB57]-worker) [    ] o.a.s.BaseDistributedSearchTestCase Setting hostContext system property: /a_/
   [junit4]   2> 2546978 INFO  (TEST-TestDynamicLoading.testDynamicLoading-seed#[204D5D95BF66CB57]) [    ] o.a.s.c.ZkTestServer STARTING ZK TEST SERVER
   [junit4]   2> 2546979 INFO  (Thread-6033) [    ] o.a.s.c.ZkTestServer client port:0.0.0.0/0.0.0.0:0
   [junit4]   2> 2546979 INFO  (Thread-6033) [    ] o.a.s.c.ZkTestServer Starting server
   [junit4]   2> 2547080 INFO  (TEST-TestDynamicLoading.testDynamicLoading-seed#[204D5D95BF66CB57]) [    ] o.a.s.c.ZkTestServer start zk server on port:57405
   [junit4]   2> 2547080 INFO  (TEST-TestDynamicLoading.testDynamicLoading-seed#[204D5D95BF66CB57]) [    ] o.a.s.c.c.SolrZkClient Using default ZkCredentialsProvider
   [junit4]   2> 2547081 INFO  (TEST-TestDynamicLoading.testDynamicLoading-seed#[204D5D95BF66CB57]) [    ] o.a.s.c.c.ConnectionManager Waiting for client to connect to ZooKeeper
   [junit4]   2> 2547085 INFO  (zkCallback-2713-thread-1) [    ] o.a.s.c.c.ConnectionManager Watcher org.apache.solr.common.cloud.ConnectionManager@52f6dda2 name:ZooKeeperConnection Watcher:127.0.0.1:57405 got event WatchedEvent state:SyncConnected type:None path:null path:null type:None
   [junit4]   2> 2547085 INFO  (TEST-TestDynamicLoading.testDynamicLoading-seed#[204D5D95BF66CB57]) [    ] o.a.s.c.c.ConnectionManager Client is connected to ZooKeeper
   [junit4]   2> 2547085 INFO  (TEST-TestDynamicLoading.testDynamicLoading-seed#[204D5D95BF66CB57]) [    ] o.a.s.c.c.SolrZkClient Using default ZkACLProvider
   [junit4]   2> 2547085 INFO  (TEST-TestDynamicLoading.testDynamicLoading-seed#[204D5D95BF66CB57]) [    ] o.a.s.c.c.SolrZkClient makePath: /solr
   [junit4]   2> 2547090 INFO  (TEST-TestDynamicLoading.testDynamicLoading-seed#[204D5D95BF66CB57]) [    ] o.a.s.c.c.SolrZkClient Using default ZkCredentialsProvider
   [junit4]   2> 2547091 INFO  (TEST-TestDynamicLoading.testDynamicLoading-seed#[204D5D95BF66CB57]) [    ] o.a.s.c.c.ConnectionManager Waiting for client to connect to ZooKeeper
   [junit4]   2> 2547092 INFO  (zkCallback-2714-thread-1) [    ] o.a.s.c.c.ConnectionManager Watcher org.apache.solr.common.cloud.ConnectionManager@7f3b7696 name:ZooKeeperConnection Watcher:127.0.0.1:57405/solr got event WatchedEvent state:SyncConnected type:None path:null path:null type:None
   [junit4]   2> 2547092 INFO  (TEST-TestDynamicLoading.testDynamicLoading-seed#[204D5D95BF66CB57]) [    ] o.a.s.c.c.ConnectionManager Client is connected to ZooKeeper
   [junit4]   2> 2547093 INFO  (TEST-TestDynamicLoading.testDynamicLoading-seed#[204D5D95BF66CB57]) [    ] o.a.s.c.c.SolrZkClient Using default ZkACLProvider
   [junit4]   2> 2547093 INFO  (TEST-TestDynamicLoading.testDynamicLoading-seed#[204D5D95BF66CB57]) [    ] o.a.s.c.c.SolrZkClient makePath: /collections/collection1
   [junit4]   2> 2547096 INFO  (TEST-TestDynamicLoading.testDynamicLoading-seed#[204D5D95BF66CB57]) [    ] o.a.s.c.c.SolrZkClient makePath: /collections/collection1/shards
   [junit4]   2> 2547099 INFO  (TEST-TestDynamicLoading.testDynamicLoading-seed#[204D5D95BF66CB57]) [    ] o.a.s.c.c.SolrZkClient makePath: /collections/control_collection
   [junit4]   2> 2547102 INFO  (TEST-TestDynamicLoading.testDynamicLoading-seed#[204D5D95BF66CB57]) [    ] o.a.s.c.c.SolrZkClient makePath: /collections/control_collection/shards
   [junit4]   2> 2547105 INFO  (TEST-TestDynamicLoading.testDynamicLoading-seed#[204D5D95BF66CB57]) [    ] o.a.s.c.AbstractZkTestCase put /Users/jenkins/workspace/Lucene-Solr-trunk-MacOSX/solr/core/src/test-files/solr/collection1/conf/solrconfig-tlog.xml to /configs/conf1/solrconfig.xml
   [junit4]   2> 2547105 INFO  (TEST-TestDynamicLoading.testDynamicLoading-seed#[204D5D95BF66CB57]) [    ] o.a.s.c.c.SolrZkClient makePath: /configs/conf1/solrconfig.xml
   [junit4]   2> 2547130 INFO  (TEST-TestDynamicLoading.testDynamicLoading-seed#[204D5D95BF66CB57]) [    ] o.a.s.c.AbstractZkTestCase put /Users/jenkins/workspace/Lucene-Solr-trunk-MacOSX/solr/core/src/test-files/solr/collection1/conf/schema.xml to /configs/conf1/schema.xml
   [junit4]   2> 2547130 INFO  (TEST-TestDynamicLoading.testDynamicLoading-seed#[204D5D95BF66CB57]) [    ] o.a.s.c.c.SolrZkClient makePath: /configs/conf1/schema.xml
   [junit4]   2> 2547133 INFO  (TEST-TestDynamicLoading.testDynamicLoading-seed#[204D5D95BF66CB57]) [    ] o.a.s.c.AbstractZkTestCase put /Users/jenkins/workspace/Lucene-Solr-trunk-MacOSX/solr/core/src/test-files/solr/collection1/conf/solrconfig.snippet.randomindexconfig.xml to /configs/conf1/solrconfig.snippet.randomindexconfig.xml
   [junit4]   2> 2547134 INFO  (TEST-TestDynamicLoading.testDynamicLoading-seed#[204D5D95BF66CB57]) [    ] o.a.s.c.c.SolrZkClient makePath: /configs/conf1/solrconfig.snippet.randomindexconfig.xml
   [junit4]   2> 2547136 INFO  (TEST-TestDynamicLoading.testDynamicLoading-seed#[204D5D95BF66CB57]) [    ] o.a.s.c.AbstractZkTestCase put /Users/jenkins/workspace/Lucene-Solr-trunk-MacOSX/solr/core/src/test-files/solr/collection1/conf/stopwords.txt to /configs/conf1/stopwords.txt
   [junit4]   2> 2547137 INFO  (TEST-TestDynamicLoading.testDynamicLoading-seed#[204D5D95BF66CB57]) [    ] o.a.s.c.c.SolrZkClient makePath: /configs/conf1/stopwords.txt
   [junit4]   2> 2547139 INFO  (TEST-TestDynamicLoading.testDynamicLoading-seed#[204D5D95BF66CB57]) [    ] o.a.s.c.AbstractZkTestCase put /Users/jenkins/workspace/Lucene-Solr-trunk-MacOSX/solr/core/src/test-files/solr/collection1/conf/protwords.txt to /configs/conf1/protwords.txt
   [junit4]   2> 2547140 INFO  (TEST-TestDynamicLoading.testDynamicLoading-seed#[204D5D95BF66CB57]) [    ] o.a.s.c.c.SolrZkClient makePath: /configs/conf1/protwords.txt
   [junit4]   2> 2547142 INFO  (TEST-TestDynamicLoading.testDynamicLoading-seed#[204D5D95BF66CB57]) [    ] o.a.s.c.AbstractZkTestCase put /Users/jenkins/workspace/Lucene-Solr-trunk-MacOSX/solr/core/src/test-files/solr/collection1/conf/currency.xml to /configs/conf1/currency.xml
   [junit4]   2> 2547143 INFO  (TEST-TestDynamicLoading.testDynamicLoading-seed#[204D5D95BF66CB57]) [    ] o.a.s.c.c.SolrZkClient makePath: /configs/conf1/currency.xml
   [junit4]   2> 2547145 INFO  (TEST-TestDynamicLoading.testDynamicLoading-seed#[204D5D95BF66CB57]) [    ] o.a.s.c.AbstractZkTestCase put /Users/jenkins/workspace/Lucene-Solr-trunk-MacOSX/solr/core/src/test-files/solr/collection1/conf/enumsConfig.xml to /configs/conf1/enumsConfig.xml
   [junit4]   2> 2547146 INFO  (TEST-TestDynamicLoading.testDynamicLoading-seed#[204D5D95BF66CB57]) [    ] o.a.s.c.c.SolrZkClient makePath: /configs/conf1/enumsConfig.xml
   [junit4]   2> 2547149 INFO  (TEST-TestDynamicLoading.testDynamicLoading-seed#[204D5D95BF66CB57]) [    ] o.a.s.c.AbstractZkTestCase put /Users/jenkins/workspace/Lucene-Solr-trunk-MacOSX/solr/core/src/test-files/solr/collection1/conf/open-exchange-rates.json to /configs/conf1/open-exchange-rates.json
   [junit4]   2> 2547149 INFO  (TEST-TestDynamicLoading.testDynamicLoading-seed#[204D5D95BF66CB57]) [    ] o.a.s.c.c.SolrZkClient makePath: /configs/conf1/open-exchange-rates.json
   [junit4]   2> 2547152 INFO  (TEST-TestDynamicLoading.testDynamicLoading-seed#[204D5D95BF66CB57]) [    ] o.a.s.c.AbstractZkTestCase put /Users/jenkins/workspace/Lucene-Solr-trunk-MacOSX/solr/core/src/test-files/solr/collection1/conf/mapping-ISOLatin1Accent.txt to /configs/conf1/mapping-ISOLatin1Accent.txt
   [junit4]   2> 2547153 INFO  (TEST-TestDynamicLoading.testDynamicLoading-seed#[204D5D95BF66CB57]) [    ] o.a.s.c.c.SolrZkClient makePath: /configs/conf1/mapping-ISOLatin1Accent.txt
   [junit4]   2> 2547156 INFO  (TEST-TestDynamicLoading.testDynamicLoading-seed#[204D5D95BF66CB57]) [    ] o.a.s.c.AbstractZkTestCase put /Users/jenkins/workspace/Lucene-Solr-trunk-MacOSX/solr/core/src/test-files/solr/collection1/conf/old_synonyms.txt to /configs/conf1/old_synonyms.txt
   [junit4]   2> 2547156 INFO  (TEST-TestDynamicLoading.testDynamicLoading-seed#[204D5D95BF66CB57]) [    ] o.a.s.c.c.SolrZkClient makePath: /configs/conf1/old_synonyms.txt
   [junit4]   2> 2547160 INFO  (TEST-TestDynamicLoading.testDynamicLoading-seed#[204D5D95BF66CB57]) [    ] o.a.s.c.AbstractZkTestCase put /Users/jenkins/workspace/Lucene-Solr-trunk-MacOSX/solr/core/src/test-files/solr/collection1/conf/synonyms.txt to /configs/conf1/synonyms.txt
   [junit4]   2> 2547160 INFO  (TEST-TestDynamicLoading.testDynamicLoading-seed#[204D5D95BF66CB57]) [    ] o.a.s.c.c.SolrZkClient makePath: /configs/conf1/synonyms.txt
   [junit4]   2> 2547392 INFO  (TEST-TestDynamicLoading.testDynamicLoading-seed#[204D5D95BF66CB57]) [    ] o.a.s.SolrTestCaseJ4 Writing core.properties file to /Users/jenkins/workspace/Lucene-Solr-trunk-MacOSX/solr/build/solr-core/test/J1/temp/solr.core.TestDynamicLoading_204D5D95BF66CB57-001/control-001/cores/collection1
   [junit4]   2> 2547394 INFO  (TEST-TestDynamicLoading.testDynamicLoading-seed#[204D5D95BF66CB57]) [    ] o.e.j.s.Server jetty-9.2.13.v20150730
   [junit4]   2> 2547396 INFO  (TEST-TestDynamicLoading.testDynamicLoading-seed#[204D5D95BF66CB57]) [    ] o.e.j.s.h.ContextHandler Started o.e.j.s.ServletContextHandler@41ee282b{/a_,null,AVAILABLE}
   [junit4]   2> 2547430 INFO  (TEST-TestDynamicLoading.testDynamicLoading-seed#[204D5D95BF66CB57]) [    ] o.e.j.s.ServerConnector Started ServerConnector@ec413c1{HTTP/1.1}{127.0.0.1:57409}
   [junit4]   2> 2547430 INFO  (TEST-TestDynamicLoading.testDynamicLoading-seed#[204D5D95BF66CB57]) [    ] o.e.j.s.Server Started @2551768ms
   [junit4]   2> 2547430 INFO  (TEST-TestDynamicLoading.testDynamicLoading-seed#[204D5D95BF66CB57]) [    ] o.a.s.c.s.e.JettySolrRunner Jetty properties: {solr.data.dir=/Users/jenkins/workspace/Lucene-Solr-trunk-MacOSX/solr/build/solr-core/test/J1/temp/solr.core.TestDynamicLoading_204D5D95BF66CB57-001/tempDir-001/control/data, hostContext=/a_, hostPort=57409, coreRootDirectory=/Users/jenkins/workspace/Lucene-Solr-trunk-MacOSX/solr/build/solr-core/test/J1/../../../../../../../../../Users/jenkins/workspace/Lucene-Solr-trunk-MacOSX/solr/build/solr-core/test/J1/temp/solr.core.TestDynamicLoading_204D5D95BF66CB57-001/control-001/cores}
   [junit4]   2> 2547430 INFO  (TEST-TestDynamicLoading.testDynamicLoading-seed#[204D5D95BF66CB57]) [    ] o.a.s.s.SolrDispatchFilter SolrDispatchFilter.init(): sun.misc.Launcher$AppClassLoader@74a14482
   [junit4]   2> 2547430 INFO  (TEST-TestDynamicLoading.testDynamicLoading-seed#[204D5D95BF66CB57]) [    ] o.a.s.c.SolrResourceLoader new SolrResourceLoader for directory: '/Users/jenkins/workspace/Lucene-Solr-trunk-MacOSX/solr/build/solr-core/test/J1/../../../../../../../../../Users/jenkins/workspace/Lucene-Solr-trunk-MacOSX/solr/build/solr-core/test/J1/temp/solr.core.TestDynamicLoading_204D5D95BF66CB57-001/control-001/'
   [junit4]   2> 2547449 INFO  (TEST-TestDynamicLoading.testDynamicLoading-seed#[204D5D95BF66CB57]) [    ] o.a.s.c.c.SolrZkClient Using default ZkCredentialsProvider
   [junit4]   2> 2547450 INFO  (TEST-TestDynamicLoading.testDynamicLoading-seed#[204D5D95BF66CB57]) [    ] o.a.s.c.c.ConnectionManager Waiting for client to connect to ZooKeeper
   [junit4]   2> 2547452 INFO  (zkCallback-2715-thread-1) [    ] o.a.s.c.c.ConnectionManager Watcher org.apache.solr.common.cloud.ConnectionManager@1b504c73 name:ZooKeeperConnection Watcher:127.0.0.1:57405/solr got event WatchedEvent state:SyncConnected type:None path:null path:null type:None
   [junit4]   2> 2547452 INFO  (TEST-TestDynamicLoading.testDynamicLoading-seed#[204D5D95BF66CB57]) [    ] o.a.s.c.c.ConnectionManager Client is connected to ZooKeeper
   [junit4]   2> 2547452 INFO  (TEST-TestDynamicLoading.testDynamicLoading-seed#[204D5D95BF66CB57]) [    ] o.a.s.c.c.SolrZkClient Using default ZkACLProvider
   [junit4]   2> 2547454 INFO  (TEST-TestDynamicLoading.testDynamicLoading-seed#[204D5D95BF66CB57]) [    ] o.a.s.s.SolrDispatchFilter Loading solr.xml from SolrHome (not found in ZooKeeper)
   [junit4]   2> 2547454 INFO  (TEST-TestDynamicLoading.testDynamicLoading-seed#[204D5D95BF66CB57]) [    ] o.a.s.c.SolrXmlConfig Loading container configuration from /Users/jenkins/workspace/Lucene-Solr-trunk-MacOSX/solr/build/solr-core/test/J1/../../../../../../../../../Users/jenkins/workspace/Lucene-Solr-trunk-MacOSX/solr/build/solr-core/test/J1/temp/solr.core.TestDynamicLoading_204D5D95BF66CB57-001/control-001/solr.xml
   [junit4]   2> 2547461 INFO  (TEST-TestDynamicLoading.testDynamicLoading-seed#[204D5D95BF66CB57]) [    ] o.a.s.c.CoresLocator Config-defined core root directory: /Users/jenkins/workspace/Lucene-Solr-trunk-MacOSX/solr/build/solr-core/test/J1/../../../../../../../../../Users/jenkins/workspace/Lucene-Solr-trunk-MacOSX/solr/build/solr-core/test/J1/temp/solr.core.TestDynamicLoading_204D5D95BF66CB57-001/control-001/cores
   [junit4]   2> 2547461 INFO  (TEST-TestDynamicLoading.testDynamicLoading-seed#[204D5D95BF66CB57]) [    ] o.a.s.c.CoreContainer New CoreContainer 199330617
   [junit4]   2> 2547461 INFO  (TEST-TestDynamicLoading.testDynamicLoading-seed#[204D5D95BF66CB57]) [    ] o.a.s.c.CoreContainer Loading cores into CoreContainer [instanceDir=/Users/jenkins/workspace/Lucene-Solr-trunk-MacOSX/solr/build/solr-core/test/J1/../../../../../../../../../Users/jenkins/workspace/Lucene-Solr-trunk-MacOSX/solr/build/solr-core/test/J1/temp/solr.core.TestDynamicLoading_204D5D95BF66CB57-001/control-001/]
   [junit4]   2> 2547461 INFO  (TEST-TestDynamicLoading.testDynamicLoading-seed#[204D5D95BF66CB57]) [    ] o.a.s.c.CoreContainer loading shared library: /Users/jenkins/workspace/Lucene-Solr-trunk-MacOSX/solr/build/solr-core/test/J1/../../../../../../../../../Users/jenkins/workspace/Lucene-Solr-trunk-MacOSX/solr/build/solr-core/test/J1/temp/solr.core.TestDynamicLoading_204D5D95BF66CB57-001/control-001/lib
   [junit4]   2> 2547461 WARN  (TEST-TestDynamicLoading.testDynamicLoading-seed#[204D5D95BF66CB57]) [    ] o.a.s.c.SolrResourceLoader Can't find (or read) directory to add to classloader: lib (resolved as: /Users/jenkins/workspace/Lucene-Solr-trunk-MacOSX/solr/build/solr-core/test/J1/../../../../../../../../../Users/jenkins/workspace/Lucene-Solr-trunk-MacOSX/solr/build/solr-core/test/J1/temp/solr.core.TestDynamicLoading_204D5D95BF66CB57-001/control-001/lib).
   [junit4]   2> 2547468 INFO  (TEST-TestDynamicLoading.testDynamicLoading-seed#[204D5D95BF66CB57]) [    ] o.a.s.h.c.HttpShardHandlerFactory created with socketTimeout : 90000,urlScheme : ,connTimeout : 15000,maxConnectionsPerHost : 20,maxConnections : 10000,corePoolSize : 0,maximumPoolSize : 2147483647,maxThreadIdleTime : 5,sizeOfQueue : -1,fairnessPolicy : false,useRetries : false,
   [junit4]   2> 2547470 INFO  (TEST-TestDynamicLoading.testDynamicLoading-seed#[204D5D95BF66CB57]) [    ] o.a.s.u.UpdateShardHandler Creating UpdateShardHandler HTTP client with params: socketTimeout=340000&connTimeout=45000&retry=true
   [junit4]   2> 2547471 INFO  (TEST-TestDynamicLoading.testDynamicLoading-seed#[204D5D95BF66CB57]) [    ] o.a.s.l.LogWatcher SLF4J impl is org.slf4j.impl.Log4jLoggerFactory
   [junit4]   2> 2547471 INFO  (TEST-TestDynamicLoading.testDynamicLoading-seed#[204D5D95BF66CB57]) [    ] o.a.s.l.LogWatcher Registering Log Listener [Log4j (org.slf4j.impl.Log4jLoggerFactory)]
   [junit4]   2> 2547471 INFO  (TEST-TestDynamicLoading.testDynamicLoading-seed#[204D5D95BF66CB57]) [    ] o.a.s.c.ZkContainer Zookeeper client=127.0.0.1:57405/solr
   [junit4]   2> 2547471 INFO  (TEST-TestDynamicLoading.testDynamicLoading-seed#[204D5D95BF66CB57]) [    ] o.a.s.c.ZkController zkHost includes chroot
   [junit4]   2> 2547471 INFO  (TEST-TestDynamicLoading.testDynamicLoading-seed#[204D5D95BF66CB57]) [    ] o.a.s.c.c.SolrZkClient Using default ZkCredentialsProvider
   [junit4]   2> 2547472 INFO  (TEST-TestDynamicLoading.testDynamicLoading-seed#[204D5D95BF66CB57]) [    ] o.a.s.c.c.ConnectionManager Waiting for client to connect to ZooKeeper
   [junit4]   2> 2547473 INFO  (zkCallback-2717-thread-1) [    ] o.a.s.c.c.ConnectionManager Watcher org.apache.solr.common.cloud.ConnectionManager@41b6dc13 name:ZooKeeperConnection Watcher:127.0.0.1:57405 got event WatchedEvent state:SyncConnected type:None path:null path:null type:None
   [junit4]   2> 2547473 INFO  (TEST-TestDynamicLoading.testDynamicLoading-seed#[204D5D95BF66CB57]) [    ] o.a.s.c.c.ConnectionManager Client is connected to ZooKeeper
   [junit4]   2> 2547474 INFO  (TEST-TestDynamicLoading.testDynamicLoading-seed#[204D5D95BF66CB57]) [    ] o.a.s.c.c.SolrZkClient Using default ZkACLProvider
   [junit4]   2> 2547476 INFO  (TEST-TestDynamicLoading.testDynamicLoading-seed#[204D5D95BF66CB57]) [n:127.0.0.1:57409_a_    ] o.a.s.c.c.ConnectionManager Waiting for client to connect to ZooKeeper
   [junit4]   2> 2547478 INFO  (zkCallback-2718-thread-1-processing-n:127.0.0.1:57409_a_) [n:127.0.0.1:57409_a_    ] o.a.s.c.c.ConnectionManager Watcher org.apache.solr.common.cloud.ConnectionManager@257b5db4 name:ZooKeeperConnection Watcher:127.0.0.1:57405/solr got event WatchedEvent state:SyncConnected type:None path:null path:null type:None
   [junit4]   2> 2547478 INFO  (TEST-TestDynamicLoading.testDynamicLoading-seed#[204D5D95BF66CB57]) [n:127.0.0.1:57409_a_    ] o.a.s.c.c.ConnectionManager Client is connected to ZooKeeper
   [junit4]   2> 2547480 INFO  (TEST-TestDynamicLoading.testDynamicLoading-seed#[204D5D95BF66CB57]) [n:127.0.0.1:57409_a_    ] o.a.s.c.c.SolrZkClient makePath: /overseer/queue
   [junit4]   2> 2547483 INFO  (TEST-TestDynamicLoading.testDynamicLoading-seed#[204D5D95BF66CB57]) [n:127.0.0.1:57409_a_    ] o.a.s.c.c.SolrZkClient makePath: /overseer/collection-queue-work
   [junit4]   2> 2547489 INFO  (TEST-TestDynamicLoading.testDynamicLoading-seed#[204D5D95BF66CB57]) [n:127.0.0.1:57409_a_    ] o.a.s.c.c.SolrZkClient makePath: /overseer/collection-map-running
   [junit4]   2> 2547493 INFO  (TEST-TestDynamicLoading.testDynamicLoading-seed#[204D5D95BF66CB57]) [n:127.0.0.1:57409_a_    ] o.a.s.c.c.SolrZkClient makePath: /overseer/collection-map-completed
   [junit4]   2> 2547497 INFO  (TEST-TestDynamicLoading.testDynamicLoading-seed#[204D5D95BF66CB57]) [n:127.0.0.1:57409_a_    ] o.a.s.c.c.SolrZkClient makePath: /overseer/collection-map-failure
   [junit4]   2> 2547501 INFO  (TEST-TestDynamicLoading.testDynamicLoading-seed#[204D5D95BF66CB57]) [n:127.0.0.1:57409_a_    ] o.a.s.c.c.SolrZkClient makePath: /live_nodes
   [junit4]   2> 2547503 INFO  (TEST-TestDynamicLoading.testDynamicLoading-seed#[204D5D95BF66CB57]) [n:127.0.0.1:57409_a_    ] o.a.s.c.c.SolrZkClient makePath: /aliases.json
   [junit4]   2> 2547506 INFO  (TEST-TestDynamicLoading.testDynamicLoading-seed#[204D5D95BF66CB57]) [n:127.0.0.1:57409_a_    ] o.a.s.c.c.SolrZkClient makePath: /clusterstate.json
   [junit4]   2> 2547509 INFO  (TEST-TestDynamicLoading.testDynamicLoading-seed#[204D5D95BF66CB57]) [n:127.0.0.1:57409_a_    ] o.a.s.c.c.SolrZkClient makePath: /security.json
   [junit4]   2> 2547510 INFO  (TEST-TestDynamicLoading.testDynamicLoading-seed#[204D5D95BF66CB57]) [n:127.0.0.1:57409_a_    ] o.a.s.c.ZkController Register node as live in ZooKeeper:/live_nodes/127.0.0.1:57409_a_
   [junit4]   2> 2547511 INFO  (TEST-TestDynamicLoading.testDynamicLoading-seed#[204D5D95BF66CB57]) [n:127.0.0.1:57409_a_    ] o.a.s.c.c.SolrZkClient makePath: /live_nodes/127.0.0.1:57409_a_
   [junit4]   2> 2547514 INFO  (TEST-TestDynamicLoading.testDynamicLoading-seed#[204D5D95BF66CB57]) [n:127.0.0.1:57409_a_    ] o.a.s.c.c.SolrZkClient makePath: /overseer_elect
   [junit4]   2> 2547517 INFO  (TEST-TestDynamicLoading.testDynamicLoading-seed#[204D5D95BF66CB57]) [n:127.0.0.1:57409_a_    ] o.a.s.c.c.SolrZkClient makePath: /overseer_elect/election
   [junit4]   2> 2547520 INFO  (TEST-TestDynamicLoading.testDynamicLoading-seed#[204D5D95BF66CB57]) [n:127.0.0.1:57409_a_    ] o.a.s.c.Overseer Overseer (id=null) closing
   [junit4]   2> 2547521 INFO  (TEST-TestDynamicLoading.testDynamicLoading-seed#[204D5D95BF66CB57]) [n:127.0.0.1:57409_a_    ] o.a.s.c.LeaderElector Joined leadership election with path: /overseer_elect/election/94635808280084484-127.0.0.1:57409_a_-n_0000000000
   [junit4]   2> 2547521 INFO  (TEST-TestDynamicLoading.testDynamicLoading-seed#[204D5D95BF66CB57]) [n:127.0.0.1:57409_a_    ] o.a.s.c.OverseerElectionContext I am going to be the leader 127.0.0.1:57409_a_
   [junit4]   2> 2547521 INFO  (TEST-TestDynamicLoading.testDynamicLoading-seed#[204D5D95BF66CB57]) [n:127.0.0.1:57409_a_    ] o.a.s.c.c.SolrZkClient makePath: /overseer_elect/leader
   [junit4]   2> 2547524 INFO  (TEST-TestDynamicLoading.testDynamicLoading-seed#[204D5D95BF66CB57]) [n:127.0.0.1:57409_a_    ] o.a.s.c.Overseer Overseer (id=94635808280084484-127.0.0.1:57409_a_-n_0000000000) starting
   [junit4]   2> 2547527 INFO  (TEST-TestDynamicLoading.testDynamicLoading-seed#[204D5D95BF66CB57]) [n:127.0.0.1:57409_a_    ] o.a.s.c.c.SolrZkClient makePath: /overseer/queue-work
   [junit4]   2> 2547539 INFO  (TEST-TestDynamicLoading.testDynamicLoading-seed#[204D5D95BF66CB57]) [n:127.0.0.1:57409_a_    ] o.a.s.c.OverseerAutoReplicaFailoverThread Starting OverseerAutoReplicaFailoverThread autoReplicaFailoverWorkLoopDelay=10000 autoReplicaFailoverWaitAfterExpiration=30000 autoReplicaFailoverBadNodeExpiration=60000
   [junit4]   2> 2547540 INFO  (OverseerCollectionConfigSetProcessor-94635808280084484-127.0.0.1:57409_a_-n_0000000000) [n:127.0.0.1:57409_a_    ] o.a.s.c.OverseerTaskProcessor Process current queue of overseer operations
   [junit4]   2> 2547540 INFO  (TEST-TestDynamicLoading.testDynamicLoading-seed#[204D5D95BF66CB57]) [n:127.0.0.1:57409_a_    ] o.a.s.c.c.ZkStateReader Updating cluster state from ZooKeeper... 
   [junit4]   2> 2547540 INFO  (OverseerStateUpdate-94635808280084484-127.0.0.1:57409_a_-n_0000000000) [n:127.0.0.1:57409_a_    ] o.a.s.c.Overseer Starting to work on the main queue
   [junit4]   2> 2547557 INFO  (TEST-TestDynamicLoading.testDynamicLoading-seed#[204D5D95BF66CB57]) [n:127.0.0.1:57409_a_    ] o.a.s.c.CoreContainer Security conf doesn't exist. Skipping setup for authorization module.
   [junit4]   2> 2547557 INFO  (TEST-TestDynamicLoading.testDynamicLoading-seed#[204D5D95BF66CB57]) [n:127.0.0.1:57409_a_    ] o.a.s.c.CoreContainer No authentication plugin used.
   [junit4]   2> 2547558 INFO  (TEST-TestDynamicLoading.testDynamicLoading-seed#[204D5D95BF66CB57]) [n:127.0.0.1:57409_a_    ] o.a.s.c.CoresLocator Looking for core definitions underneath /Users/jenkins/workspace/Lucene-Solr-trunk-MacOSX/solr/build/solr-core/test/J1/../../../../../../../../../Users/jenkins/workspace/Lucene-Solr-trunk-MacOSX/solr/build/solr-core/test/J1/temp/solr.core.TestDynamicLoading_204D5D95BF66CB57-001/control-001/cores
   [junit4]   2> 2547560 INFO  (TEST-TestDynamicLoading.testDynamicLoading-seed#[204D5D95BF66CB57]) [n:127.0.0.1:57409_a_    ] o.a.s.c.SolrCore Created CoreDescriptor: {name=collection1, config=solrconfig.xml, transient=false, schema=schema.xml, loadOnStartup=true, configSetProperties=configsetprops.json, instanceDir=/Users/jenkins/workspace/Lucene-Solr-trunk-MacOSX/solr/build/solr-core/test/J1/../../../../../../../../../Users/jenkins/workspace/Lucene-Solr-trunk-MacOSX/solr/build/solr-core/test/J1/temp/solr.core.TestDynamicLoading_204D5D95BF66CB57-001/control-001/cores/collection1, collection=control_collection, absoluteInstDir=/Users/jenkins/workspace/Lucene-Solr-trunk-MacOSX/solr/build/solr-core/test/J1/../../../../../../../../../Users/jenkins/workspace/Lucene-Solr-trunk-MacOSX/solr/build/solr-core/test/J1/temp/solr.core.TestDynamicLoading_204D5D95BF66CB57-001/control-001/cores/collection1/, coreNodeName=, dataDir=data/, shard=}
   [junit4]   2> 2547560 INFO  (TEST-TestDynamicLoading.testDynamicLoading-seed#[204D5D95BF66CB57]) [n:127.0.0.1:57409_a_    ] o.a.s.c.CoresLocator Found core collection1 in /Users/jenkins/workspace/Lucene-Solr-trunk-MacOSX/solr/build/solr-core/test/J1/../../../../../../../../../Users/jenkins/workspace/Lucene-Solr-trunk-MacOSX/solr/build/solr-core/test/J1/temp/solr.core.TestDynamicLoading_204D5D95BF66CB57-001/control-001/cores/collection1/
   [junit4]   2> 2547560 INFO  (TEST-TestDynamicLoading.testDynamicLoading-seed#[204D5D95BF66CB57]) [n:127.0.0.1:57409_a_    ] o.a.s.c.CoresLocator Found 1 core definitions
   [junit4]   2> 2547561 INFO  (TEST-TestDynamicLoading.testDynamicLoading-seed#[204D5D95BF66CB57]) [n:127.0.0.1:57409_a_    ] o.a.s.s.SolrDispatchFilter user.dir=/Users/jenkins/workspace/Lucene-Solr-trunk-MacOSX/solr/build/solr-core/test/J1
   [junit4]   2> 2547561 INFO  (TEST-TestDynamicLoading.testDynamicLoading-seed#[204D5D95BF66CB57]) [n:127.0.0.1:57409_a_    ] o.a.s.s.SolrDispatchFilter SolrDispatchFilter.init() done
   [junit4]   2> 2547562 INFO  (coreLoadExecutor-7595-thread-1-processing-n:127.0.0.1:57409_a_) [n:127.0.0.1:57409_a_ c:control_collection   x:collection1] o.a.s.c.ZkController publishing state=down
   [junit4]   2> 2547562 INFO  (coreLoadExecutor-7595-thread-1-processing-n:127.0.0.1:57409_a_) [n:127.0.0.1:57409_a_ c:control_collection   x:collection1] o.a.s.c.ZkController numShards not found on descriptor - reading it from system property
   [junit4]   2> 2547565 INFO  (OverseerStateUpdate-94635808280084484-127.0.0.1:57409_a_-n_0000000000) [n:127.0.0.1:57409_a_    ] o.a.s.c.Overseer processMessage: queueSize: 1, message = {
   [junit4]   2>   "core":"collection1",
   [junit4]   2>   "roles":null,
   [junit4]   2>   "base_url":"http://127.0.0.1:57409/a_",
   [junit4]   2>   "node_name":"127.0.0.1:57409_a_",
   [junit4]   2>   "numShards":"1",
   [junit4]   2>   "state":"down",
   [junit4]   2>   "shard":null,
   [junit4]   2>   "collection":"control_collection",
   [junit4]   2>   "operation":"state"} current state version: 0
   [junit4]   2> 2547565 INFO  (coreLoadExecutor-7595-thread-1-processing-n:127.0.0.1:57409_a_) [n:127.0.0.1:57409_a_ c:control_collection   x:collection1] o.a.s.c.ZkController look for our core node name
   [junit4]   2> 2547565 INFO  (OverseerStateUpdate-94635808280084484-127.0.0.1:57409_a_-n_0000000000) [n:127.0.0.1:57409_a_    ] o.a.s.c.o.ReplicaMutator Update state numShards=1 message={
   [junit4]   2>   "core":"collection1",
   [junit4]   2>   "roles":null,
   [junit4]   2>   "base_url":"http://127.0.0.1:57409/a_",
   [junit4]   2>   "node_name":"127.0.0.1:57409_a_",
   [junit4]   2>   "numShards":"1",
   [junit4]   2>   "state":"down",
   [junit4]   2>   "shard":null,
   [junit4]   2>   "collection":"control_collection",
   [junit4]   2>   "operation":"state"}
   [junit4]   2> 2547566 INFO  (OverseerStateUpdate-94635808280084484-127.0.0.1:57409_a_-n_0000000000) [n:127.0.0.1:57409_a_    ] o.a.s.c.o.ClusterStateMutator building a new cName: control_collection
   [junit4]   2> 2547567 INFO  (OverseerStateUpdate-94635808280084484-127.0.0.1:57409_a_-n_0000000000) [n:127.0.0.1:57409_a_    ] o.a.s.c.o.ReplicaMutator Assigning new node to shard shard=shard1
   [junit4]   2> 2547569 INFO  (zkCallback-2718-thread-1-processing-n:127.0.0.1:57409_a_) [n:127.0.0.1:57409_a_    ] o.a.s.c.c.ZkStateReader A cluster state change: WatchedEvent state:SyncConnected type:NodeDataChanged path:/clusterstate.json, has occurred - updating... (live nodes size: 1)
   [junit4]   2> 2548566 INFO  (coreLoadExecutor-7595-thread-1-processing-n:127.0.0.1:57409_a_) [n:127.0.0.1:57409_a_ c:control_collection   x:collection1] o.a.s.c.ZkController waiting to find shard id in clusterstate for collection1
   [junit4]   2> 2548566 INFO  (coreLoadExecutor-7595-thread-1-processing-n:127.0.0.1:57409_a_) [n:127.0.0.1:57409_a_ c:control_collection   x:collection1] o.a.s.c.ZkController Check for collection zkNode:control_collection
   [junit4]   2> 2548568 INFO  (coreLoadExecutor-7595-thread-1-processing-n:127.0.0.1:57409_a_) [n:127.0.0.1:57409_a_ c:control_collection   x:collection1] o.a.s.c.ZkController Collection zkNode exists
   [junit4]   2> 2548568 INFO  (coreLoadExecutor-7595-thread-1-processing-n:127.0.0.1:57409_a_) [n:127.0.0.1:57409_a_ c:control_collection   x:collection1] o.a.s.c.c.ZkStateReader Load collection config from:/collections/control_collection
   [junit4]   2> 2548570 INFO  (coreLoadExecutor-7595-thread-1-processing-n:127.0.0.1:57409_a_) [n:127.0.0.1:57409_a_ c:control_collection   x:collection1] o.a.s.c.c.ZkStateReader path=/collections/control_collection configName=conf1 specified config exists in ZooKeeper
   [junit4]   2> 2548570 INFO  (coreLoadExecutor-7595-thread-1-processing-n:127.0.0.1:57409_a_) [n:127.0.0.1:57409_a_ c:control_collection   x:collection1] o.a.s.c.SolrResourceLoader new SolrResourceLoader for directory: '/Users/jenkins/workspace/Lucene-Solr-trunk-MacOSX/solr/build/solr-core/test/J1/../../../../../../../../../Users/jenkins/workspace/Lucene-Solr-trunk-MacOSX/solr/build/solr-core/test/J1/temp/solr.core.TestDynamicLoading_204D5D95BF66CB57-001/control-001/cores/collection1/'
   [junit4]   2> 2548589 INFO  (coreLoadExecutor-7595-thread-1-processing-n:127.0.0.1:57409_a_) [n:127.0.0.1:57409_a_ c:control_collection   x:collection1] o.a.s.c.Config loaded config solrconfig.xml with version 0 
   [junit4]   2> 2548598 INFO  (coreLoadExecutor-7595-thread-1-processing-n:127.0.0.1:57409_a_) [n:127.0.0.1:57409_a_ c:control_collection   x:collection1] o.a.s.c.SolrConfig current version of requestparams : -1
   [junit4]   2> 2548602 INFO  (coreLoadExecutor-7595-thread-1-processing-n:127.0.0.1:57409_a_) [n:127.0.0.1:57409_a_ c:control_collection   x:collection1] o.a.s.c.SolrConfig Using Lucene MatchVersion: 6.0.0
   [junit4]   2> 2548613 INFO  (coreLoadExecutor-7595-thread-1-processing-n:127.0.0.1:57409_a_) [n:127.0.0.1:57409_a_ c:control_collection   x:collection1] o.a.s.c.Config Loaded SolrConfig: solrconfig.xml
   [junit4]   2> 2548614 INFO  (coreLoadExecutor-7595-thread-1-processing-n:127.0.0.1:57409_a_) [n:127.0.0.1:57409_a_ c:control_collection   x:collection1] o.a.s.s.IndexSchema Reading Solr Schema from /configs/conf1/schema.xml
   [junit4]   2> 2548620 INFO  (coreLoadExecutor-7595-thread-1-processing-n:127.0.0.1:57409_a_) [n:127.0.0.1:57409_a_ c:control_collection   x:collection1] o.a.s.s.IndexSchema [collection1] Schema name=test
   [junit4]   2> 2548724 INFO  (coreLoadExecutor-7595-thread-1-processing-n:127.0.0.1:57409_a_) [n:127.0.0.1:57409_a_ c:control_collection   x:collection1] o.a.s.s.OpenExchangeRatesOrgProvider Initialized with rates=open-exchange-rates.json, refreshInterval=1440.
   [junit4]   2> 2548730 INFO  (coreLoadExecutor-7595-thread-1-processing-n:127.0.0.1:57409_a_) [n:127.0.0.1:57409_a_ c:control_collection   x:collection1] o.a.s.s.IndexSchema default search field in schema is text
   [junit4]   2> 2548732 INFO  (coreLoadExecutor-7595-thread-1-processing-n:127.0.0.1:57409_a_) [n:127.0.0.1:57409_a_ c:control_collection   x:collection1] o.a.s.s.IndexSchema unique key field: id
   [junit4]   2> 2548746 INFO  (coreLoadExecutor-7595-thread-1-processing-n:127.0.0.1:57409_a_) [n:127.0.0.1:57409_a_ c:control_collection   x:collection1] o.a.s.s.FileExchangeRateProvider Reloading exchange rates from file currency.xml
   [junit4]   2> 2548749 INFO  (coreLoadExecutor-7595-thread-1-processing-n:127.0.0.1:57409_a_) [n:127.0.0.1:57409_a_ c:control_collection   x:collection1] o.a.s.s.FileExchangeRateProvider Reloading exchange rates from file currency.xml
   [junit4]   2> 2548751 INFO  (coreLoadExecutor-7595-thread-1-processing-n:127.0.0.1:57409_a_) [n:127.0.0.1:57409_a_ c:control_collection   x:collection1] o.a.s.s.OpenExchangeRatesOrgProvider Reloading exchange rates from open-exchange-rates.json
   [junit4]   2> 2548753 WARN  (coreLoadExecutor-7595-thread-1-processing-n:127.0.0.1:57409_a_) [n:127.0.0.1:57409_a_ c:control_collection   x:collection1] o.a.s.s.OpenExchangeRatesOrgProvider Unknown key IMPORTANT NOTE
   [junit4]   2> 2548753 WARN  (coreLoadExecutor-7595-thread-1-processing-n:127.0.0.1:57409_a_) [n:127.0.0.1:57409_a_ c:control_collection   x:collection1] o.a.s.s.OpenExchangeRatesOrgProvider Expected key, got STRING
   [junit4]   2> 2548753 INFO  (coreLoadExecutor-7595-thread-1-processing-n:127.0.0.1:57409_a_) [n:127.0.0.1:57409_a_ c:control_collection   x:collection1] o.a.s.s.OpenExchangeRatesOrgProvider Reloading exchange rates from open-exchange-rates.json
   [junit4]   2> 2548754 WARN  (coreLoadExecutor-7595-thread-1-processing-n:127.0.0.1:57409_a_) [n:127.0.0.1:57409_a_ c:control_collection   x:collection1] o.a.s.s.OpenExchangeRatesOrgProvider Unknown key IMPORTANT NOTE
   [junit4]   2> 2548754 WARN  (coreLoadExecutor-7595-thread-1-processing-n:127.0.0.1:57409_a_) [n:127.0.0.1:57409_a_ c:control_collection   x:collection1] o.a.s.s.OpenExchangeRatesOrgProvider Expected key, got STRING
   [junit4]   2> 2548756 INFO  (coreLoadExecutor-7595-thread-1-processing-n:127.0.0.1:57409_a_) [n:127.0.0.1:57409_a_ c:control_collection   x:collection1] o.a.s.c.ConfigSetProperties Did not find ConfigSet properties, assuming default properties: Can't find resource 'configsetprops.json' in classpath or '/configs/conf1', cwd=/Users/jenkins/workspace/Lucene-Solr-trunk-MacOSX/solr/build/solr-core/test/J1
   [junit4]   2> 2548756 INFO  (coreLoadExecutor-7595-thread-1-processing-n:127.0.0.1:57409_a_) [n:127.0.0.1:57409_a_ c:control_collection   x:collection1] o.a.s.c.CoreContainer Creating SolrCore 'collection1' using configuration from collection control_collection
   [junit4]   2> 2548756 INFO  (coreLoadExecutor-7595-thread-1-processing-n:127.0.0.1:57409_a_) [n:127.0.0.1:57409_a_ c:control_collection s:shard1 r:core_node1 x:collection1] o.a.s.c.SolrCore org.apache.solr.core.MockDirectoryFactory
   [junit4]   2> 2548756 INFO  (coreLoadExecutor-7595-thread-1-processing-n:127.0.0.1:57409_a_) [n:127.0.0.1:57409_a_ c:control_collection s:shard1 r:core_node1 x:collection1] o.a.s.c.SolrCore [[collection1] ] Opening new SolrCore at [/Users/jenkins/workspace/Lucene-Solr-trunk-MacOSX/solr/build/solr-core/test/J1/../../../../../../../../../Users/jenkins/workspace/Lucene-Solr-trunk-MacOSX/solr/build/solr-core/test/J1/temp/solr.core.TestDynamicLoading_204D5D95BF66CB57-001/control-001/cores/collection1/], dataDir=[null]
   [junit4]   2> 2548757 INFO  (coreLoadExecutor-7595-thread-1-processing-n:127.0.0.1:57409_a_) [n:127.0.0.1:57409_a_ c:control_collection s:shard1 r:core_node1 x:collection1] o.a.s.c.JmxMonitoredMap JMX monitoring is enabled. Adding Solr mbeans to JMX Server: com.sun.jmx.mbeanserver.JmxMBeanServer@f2fa68e
   [junit4]   2> 2548757 INFO  (coreLoadExecutor-7595-thread-1-processing-n:127.0.0.1:57409_a_) [n:127.0.0.1:57409_a_ c:control_collection s:shard1 r:core_node1 x:collection1] o.a.s.c.CachingDirectoryFactory return new directory for /Users/jenkins/workspace/Lucene-Solr-trunk-MacOSX/solr/build/solr-core/test/J1/../../../../../../../../../Users/jenkins/workspace/Lucene-Solr-trunk-MacOSX/solr/build/solr-core/test/J1/temp/solr.core.TestDynamicLoading_204D5D95BF66CB57-001/control-001/cores/collection1/data
   [junit4]   2> 2548757 INFO  (coreLoadExecutor-7595-thread-1-processing-n:127.0.0.1:57409_a_) [n:127.0.0.1:57409_a_ c:control_collection s:shard1 r:core_node1 x:collection1] o.a.s.c.SolrCore New index directory detected: old=null new=/Users/jenkins/workspace/Lucene-Solr-trunk-MacOSX/solr/build/solr-core/test/J1/../../../../../../../../../Users/jenkins/workspace/Lucene-Solr-trunk-MacOSX/solr/build/solr-core/test/J1/temp/solr.core.TestDynamicLoading_204D5D95BF66CB57-001/control-001/cores/collection1/data/index/
   [junit4]   2> 2548757 WARN  (coreLoadExecutor-7595-thread-1-processing-n:127.0.0.1:57409_a_) [n:127.0.0.1:57409_a_ c:control_collection s:shard1 r:core_node1 x:collection1] o.a.s.c.SolrCore [collection1] Solr index directory '/Users/jenkins/workspace/Lucene-Solr-trunk-MacOSX/solr/build/solr-core/test/J1/../../../../../../../../../Users/jenkins/workspace/Lucene-Solr-trunk-MacOSX/solr/build/solr-core/test/J1/temp/solr.core.TestDynamicLoading_204D5D95BF66CB57-001/control-001/cores/collection1/data/index' doesn't exist. Creating new index...
   [junit4]   2> 2548757 INFO  (coreLoadExecutor-7595-thread-1-processing-n:127.0.0.1:57409_a_) [n:127.0.0.1:57409_a_ c:control_collection s:shard1 r:core_node1 x:collection1] o.a.s.c.CachingDirectoryFactory return new directory for /Users/jenkins/workspace/Lucene-Solr-trunk-MacOSX/solr/build/solr-core/test/J1/../../../../../../../../../Users/jenkins/workspace/Lucene-Solr-trunk-MacOSX/solr/build/solr-core/test/J1/temp/solr.core.TestDynamicLoading_204D5D95BF66CB57-001/control-001/cores/collection1/data/index
   [junit4]   2> 2548757 INFO  (coreLoadExecutor-7595-thread-1-processing-n:127.0.0.1:57409_a_) [n:127.0.0.1:57409_a_ c:control_collection s:shard1 r:core_node1 x:collection1] o.a.s.u.RandomMergePolicy RandomMergePolicy wrapping class org.apache.lucene.index.TieredMergePolicy: [TieredMergePolicy: maxMergeAtOnce=39, maxMergeAtOnceExplicit=34, maxMergedSegmentMB=63.0146484375, floorSegmentMB=1.8828125, forceMergeDeletesPctAllowed=12.35100834432534, segmentsPerTier=37.0, maxCFSSegmentSizeMB=8.796093022207999E12, noCFSRatio=0.3159103520616847
   [junit4]   2> 2548758 INFO  (coreLoadExecutor-7595-thread-1-processing-n:127.0.0.1:57409_a_) [n:127.0.0.1:57409_a_ c:control_collection s:shard1 r:core_node1 x:collection1] o.a.s.c.SolrCore SolrDeletionPolicy.onCommit: commits: num=1
   [junit4]   2> 	commit{dir=MockDirectoryWrapper(RAMDirectory@363b9941 lockFactory=org.apache.lucene.store.SingleInstanceLockFactory@1157175d),segFN=segments_1,generation=1}
   [junit4]   2> 2548758 INFO  (coreLoadExecutor-7595-thread-1-processing-n:127.0.0.1:57409_a_) [n:127.0.0.1:57409_a_ c:control_collection s:shard1 r:core_node1 x:collection1] o.a.s.c.SolrCore newest commit generation = 1
   [junit4]   2> 2548758 INFO  (OldIndexDirectoryCleanupThreadForCore-collection1) [n:127.0.0.1:57409_a_ c:control_collection s:shard1 r:core_node1 x:collection1] o.a.s.c.SolrCore Looking for old index directories to cleanup for core collection1 in /Users/jenkins/workspace/Lucene-Solr-trunk-MacOSX/solr/build/solr-core/test/J1/../../../../../../../../../Users/jenkins/workspace/Lucene-Solr-trunk-MacOSX/solr/build/solr-core/test/J1/temp/solr.core.TestDynamicLoading_204D5D95BF66CB57-001/control-001/cores/collection1/data/
   [junit4]   2> 2548759 WARN  (OldIndexDirectoryCleanupThreadForCore-collection1) [n:127.0.0.1:57409_a_ c:control_collection s:shard1 r:core_node1 x:collection1] o.a.s.c.DirectoryFactory /Users/jenkins/workspace/Lucene-Solr-trunk-MacOSX/solr/build/solr-core/test/J1/../../../../../../../../../Users/jenkins/workspace/Lucene-Solr-trunk-MacOSX/solr/build/solr-core/test/J1/temp/solr.core.TestDynamicLoading_204D5D95BF66CB57-001/control-001/cores/collection1/data/ does not point to a valid data directory; skipping clean-up of old index directories.
   [junit4]   2> 2548761 INFO  (coreLoadExecutor-7595-thread-1-processing-n:127.0.0.1:57409_a_) [n:127.0.0.1:57409_a_ c:control_collection s:shard1 r:core_node1 x:collection1] o.a.s.u.p.UpdateRequestProcessorChain creating updateRequestProcessorChain "nodistrib"
   [junit4]   2> 2548761 INFO  (coreLoadExecutor-7595-thread-1-processing-n:127.0.0.1:57409_a_) [n:127.0.0.1:57409_a_ c:control_collection s:shard1 r:core_node1 x:collection1] o.a.s.u.p.UpdateRequestProcessorChain creating updateRequestProcessorChain "dedupe"
   [junit4]   2> 2548761 INFO  (coreLoadExecutor-7595-thread-1-processing-n:127.0.0.1:57409_a_) [n:127.0.0.1:57409_a_ c:control_collection s:shard1 r:core_node1 x:collection1] o.a.s.u.p.UpdateRequestProcessorChain inserting DistributedUpdateProcessorFactory into updateRequestProcessorChain "dedupe"
   [junit4]   2> 2548761 INFO  (coreLoadExecutor-7595-thread-1-processing-n:127.0.0.1:57409_a_) [n:127.0.0.1:57409_a_ c:control_collection s:shard1 r:core_node1 x:collection1] o.a.s.u.p.UpdateRequestProcessorChain creating updateRequestProcessorChain "stored_sig"
   [junit4]   2> 2548761 INFO  (coreLoadExecutor-7595-thread-1-processing-n:127.0.0.1:57409_a_) [n:127.0.0.1:57409_a_ c:control_collection s:shard1 r:core_node1 x:collection1] o.a.s.u.p.UpdateRequestProcessorChain inserting DistributedUpdateProcessorFactory into updateRequestProcessorChain "stored_sig"
   [junit4]   2> 2548761 INFO  (coreLoadExecutor-7595-thread-1-processing-n:127.0.0.1:57409_a_) [n:127.0.0.1:57409_a_ c:control_collection s:shard1 r:core_node1 x:collection1] o.a.s.u.p.UpdateRequestProcessorChain creating updateRequestProcessorChain "distrib-dup-test-chain-explicit"
   [junit4]   2> 2548761 INFO  (coreLoadExecutor-7595-thread-1-processing-n:127.0.0.1:57409_a_) [n:127.0.0.1:57409_a_ c:control_collection s:shard1 r:core_node1 x:collection1] o.a.s.u.p.UpdateRequestProcessorChain creating updateRequestProcessorChain "distrib-dup-test-chain-implicit"
   [junit4]   2> 2548761 INFO  (coreLoadExecutor-7595-thread-1-processing-n:127.0.0.1:57409_a_) [n:127.0.0.1:57409_a_ c:control_collection s:shard1 r:core_node1 x:collection1] o.a.s.u.p.UpdateRequestProcessorChain inserting DistributedUpdateProcessorFactory into updateRequestProcessorChain "distrib-dup-test-chain-implicit"
   [junit4]   2> 2548762 INFO  (coreLoadExecutor-7595-thread-1-processing-n:127.0.0.1:57409_a_) [n:127.0.0.1:57409_a_ c:control_collection s:shard1 r:core_node1 x:collection1] o.a.s.c.SolrCore no updateRequestProcessorChain defined as default, creating implicit default
   [junit4]   2> 2548765 INFO  (coreLoadExecutor-7595-thread-1-processing-n:127.0.0.1:57409_a_) [n:127.0.0.1:57409_a_ c:control_collection s:shard1 r:core_node1 x:collection1] o.a.s.h.l.XMLLoader xsltCacheLifetimeSeconds=60
   [junit4]   2> 2548766 INFO  (coreLoadExecutor-7595-thread-1-processing-n:127.0.0.1:57409_a_) [n:127.0.0.1:57409_a_ c:control_collection s:shard1 r:core_node1 x:collection1] o.a.s.h.l.XMLLoader xsltCacheLifetimeSeconds=60
   [junit4]   2> 2548766 INFO  (coreLoadExecutor-7595-thread-1-processing-n:127.0.0.1:57409_a_) [n:127.0.0.1:57409_a_ c:control_collection s:shard1 r:core_node1 x:collection1] o.a.s.h.l.XMLLoader xsltCacheLifetimeSeconds=60
   [junit4]   2> 2548768 INFO  (coreLoadExecutor-7595-thread-1-processing-n:127.0.0.1:57409_a_) [n:127.0.0.1:57409_a_ c:control_collection s:shard1 r:core_node1 x:collection1] o.a.s.h.l.XMLLoader xsltCacheLifetimeSeconds=60
   [junit4]   2> 2548770 INFO  (coreLoadExecutor-7595-thread-1-processing-n:127.0.0.1:57409_a_) [n:127.0.0.1:57409_a_ c:control_collection s:shard1 r:core_node1 x:collection1] o.a.s.c.RequestHandlers Registered paths: /admin/mbeans,standard,/update/csv,/update/json/docs,/admin/luke,/admin/segments,/get,/admin/system,/replication,/admin/properties,/config,/schema,/admin/plugins,/admin/logging,/update/json,/admin/threads,/admin/ping,/update,/admin/file
   [junit4]   2> 2548771 INFO  (coreLoadExecutor-7595-thread-1-processing-n:127.0.0.1:57409_a_) [n:127.0.0.1:57409_a_ c:control_collection s:shard1 r:core_node1 x:collection1] o.a.s.c.SolrCore Using default statsCache cache: org.apache.solr.search.stats.LocalStatsCache
   [junit4]   2> 2548774 INFO  (coreLoadExecutor-7595-thread-1-processing-n:127.0.0.1:57409_a_) [n:127.0.0.1:57409_a_ c:control_collection s:shard1 r:core_node1 x:collection1] o.a.s.u.UpdateHandler Using UpdateLog implementation: org.apache.solr.update.UpdateLog
   [junit4]   2> 2548774 INFO  (coreLoadExecutor-7595-thread-1-processing-n:127.0.0.1:57409_a_) [n:127.0.0.1:57409_a_ c:control_collection s:shard1 r:core_node1 x:collection1] o.a.s.u.UpdateLog Initializing UpdateLog: dataDir= defaultSyncLevel=FLUSH numRecordsToKeep=100 maxNumLogsToKeep=10 numVersionBuckets=65536
   [junit4]   2> 2548777 INFO  (coreLoadExecutor-7595-thread-1-processing-n:127.0.0.1:57409_a_) [n:127.0.0.1:57409_a_ c:control_collection s:shard1 r:core_node1 x:collection1] o.a.s.c.SolrCore Hard AutoCommit: disabled
   [junit4]   2> 2548777 INFO  (coreLoadExecutor-7595-thread-1-processing-n:127.0.0.1:57409_a_) [n:127.0.0.1:57409_a_ c:control_collection s:shard1 r:core_node1 x:collection1] o.a.s.c.SolrCore Soft AutoCommit: disabled
   [junit4]   2> 2548777 INFO  (coreLoadExecutor-7595-thread-1-processing-n:127.0.0.1:57409_a_) [n:127.0.0.1:57409_a_ c:control_collection s:shard1 r:core_node1 x:collection1] o.a.s.u.RandomMergePolicy RandomMergePolicy wrapping class org.apache.lucene.index.TieredMergePolicy: [TieredMergePolicy: maxMergeAtOnce=35, maxMergeAtOnceExplicit=43, maxMergedSegmentMB=91.423828125, floorSegmentMB=0.4404296875, forceMergeDeletesPctAllowed=6.2221949777500365, segmentsPerTier=27.0, maxCFSSegmentSizeMB=8.796093022207999E12, noCFSRatio=0.0
   [junit4]   2> 2548778 INFO  (coreLoadExecutor-7595-thread-1-processing-n:127.0.0.1:57409_a_) [n:127.0.0.1:57409_a_ c:control_collection s:shard1 r:core_node1 x:collection1] o.a.s.c.SolrCore SolrDeletionPolicy.onInit: commits: num=1
   [junit4]   2> 	commit{dir=MockDirectoryWrapper(RAMDirectory@363b9941 lockFactory=org.apache.lucene.store.SingleInstanceLockFactory@1157175d),segFN=segments_1,generation=1}
   [junit4]   2> 2548778 INFO  (coreLoadExecutor-7595-thread-1-processing-n:127.0.0.1:57409_a_) [n:127.0.0.1:57409_a_ c:control_collection s:shard1 r:core_node1 x:collection1] o.a.s.c.SolrCore newest commit generation = 1
   [junit4]   2> 2548778 INFO  (coreLoadExecutor-7595-thread-1-processing-n:127.0.0.1:57409_a_) [n:127.0.0.1:57409_a_ c:control_collection s:shard1 r:core_node1 x:collection1] o.a.s.s.SolrIndexSearcher Opening Searcher@682ac9e9[collection1] main
   [junit4]   2> 2548778 INFO  (coreLoadExecutor-7595-thread-1-processing-n:127.0.0.1:57409_a_) [n:127.0.0.1:57409_a_ c:control_collection s:shard1 r:core_node1 x:collection1] o.a.s.c.c.ZkStateReader Load collection config from:/collections/control_collection
   [junit4]   2> 2548781 INFO  (coreLoadExecutor-7595-thread-1-processing-n:127.0.0.1:57409_a_) [n:127.0.0.1:57409_a_ c:control_collection s:shard1 r:core_node1 x:collection1] o.a.s.c.c.ZkStateReader path=/collections/control_collection configName=conf1 specified config exists in ZooKeeper
   [junit4]   2> 2548781 INFO  (coreLoadExecutor-7595-thread-1-processing-n:127.0.0.1:57409_a_) [n:127.0.0.1:57409_a_ c:control_collection s:shard1 r:core_node1 x:collection1] o.a.s.r.ManagedResourceStorage Setting up ZooKeeper-based storage for the RestManager with znodeBase: /configs/conf1
   [junit4]   2> 2548782 INFO  (coreLoadExecutor-7595-thread-1-processing-n:127.0.0.1:57409_a_) [n:127.0.0.1:57409_a_ c:control_collection s:shard1 r:core_node1 x:collection1] o.a.s.r.ManagedResourceStorage Configured ZooKeeperStorageIO with znodeBase: /configs/conf1
   [junit4]   2> 2548782 INFO  (coreLoadExecutor-7595-thread-1-processing-n:127.0.0.1:57409_a_) [n:127.0.0.1:57409_a_ c:control_collection s:shard1 r:core_node1 x:collection1] o.a.s.r.RestManager Initializing RestManager with initArgs: {}
   [junit4]   2> 2548782 INFO  (coreLoadExecutor-7595-thread-1-processing-n:127.0.0.1:57409_a_) [n:127.0.0.1:57409_a_ c:control_collection s:shard1 r:core_node1 x:collection1] o.a.s.r.ManagedResourceStorage Reading _rest_managed.json using ZooKeeperStorageIO:path=/configs/conf1
   [junit4]   2> 2548783 INFO  (coreLoadExecutor-7595-thread-1-processing-n:127.0.0.1:57409_a_) [n:127.0.0.1:57409_a_ c:control_collection s:shard1 r:core_node1 x:collection1] o.a.s.r.ManagedResourceStorage No data found for znode /configs/conf1/_rest_managed.json
   [junit4]   2> 2548783 INFO  (coreLoadExecutor-7595-thread-1-processing-n:127.0.0.1:57409_a_) [n:127.0.0.1:57409_a_ c:control_collection s:shard1 r:core_node1 x:collection1] o.a.s.r.ManagedResourceStorage Loaded null at path _rest_managed.json using ZooKeeperStorageIO:path=/configs/conf1
   [junit4]   2> 2548783 INFO  (coreLoadExecutor-7595-thread-1-processing-n:127.0.0.1:57409_a_) [n:127.0.0.1:57409_a_ c:control_collection s:shard1 r:core_node1 x:collection1] o.a.s.r.RestManager Initializing 0 registered ManagedResources
   [junit4]   2> 2548783 INFO  (coreLoadExecutor-7595-thread-1-processing-n:127.0.0.1:57409_a_) [n:127.0.0.1:57409_a_ c:control_collection s:shard1 r:core_node1 x:collection1] o.a.s.h.ReplicationHandler Commits will be reserved for  10000
   [junit4]   2> 2548784 INFO  (searcherExecutor-7596-thread-1-processing-n:127.0.0.1:57409_a_ x:collection1 s:shard1 c:control_collection r:core_node1) [n:127.0.0.1:57409_a_ c:control_collection s:shard1 r:core_node1 x:collection1] o.a.s.c.SolrCore [collection1] Registered new searcher Searcher@682ac9e9[collection1] main{ExitableDirectoryReader(UninvertingDirectoryReader())}
   [junit4]   2> 2548784 INFO  (coreLoadExecutor-7595-thread-1-processing-n:127.0.0.1:57409_a_) [n:127.0.0.1:57409_a_ c:control_collection s:shard1 r:core_node1 x:collection1] o.a.s.u.UpdateLog Looking up max value of version field to seed version buckets
   [junit4]   2> 2548784 INFO  (coreLoadExecutor-7595-thread-1-processing-n:127.0.0.1:57409_a_) [n:127.0.0.1:57409_a_ c:control_collection s:shard1 r:core_node1 x:collection1] o.a.s.u.VersionInfo Refreshing highest value of _version_ for 65536 version buckets from index
   [junit4]   2> 2548784 INFO  (coreLoadExecutor-7595-thread-1-processing-n:127.0.0.1:57409_a_) [n:127.0.0.1:57409_a_ c:control_collection s:shard1 r:core_node1 x:collection1] o.a.s.u.VersionInfo No terms found for _version_, cannot seed version bucket highest value from index
   [junit4]   2> 2548784 INFO  (coreLoadExecutor-7595-thread-1-processing-n:127.0.0.1:57409_a_) [n:127.0.0.1:57409_a_ c:control_collection s:shard1 r:core_node1 x:collection1] o.a.s.u.UpdateLog Could not find max version in index or recent updates, using new clock 1514172934371934208
   [junit4]   2> 2548789 INFO  (coreLoadExecutor-7595-thread-1-processing-n:127.0.0.1:57409_a_) [n:127.0.0.1:57409_a_ c:control_collection s:shard1 r:core_node1 x:collection1] o.a.s.u.UpdateLog Took 5.0ms to seed version buckets with highest version 1514172934371934208
   [junit4]   2> 2548789 INFO  (coreLoadExecutor-7595-thread-1-processing-n:127.0.0.1:57409_a_) [n:127.0.0.1:57409_a_ c:control_collection s:shard1 r:core_node1 x:collection1] o.a.s.c.ZkController watch zkdir /configs/conf1
   [junit4]   2> 2548790 INFO  (coreLoadExecutor-7595-thread-1-processing-n:127.0.0.1:57409_a_) [n:127.0.0.1:57409_a_ c:control_collection s:shard1 r:core_node1 x:collection1] o.a.s.c.CoreContainer registering core: collection1
   [junit4]   2> 2548792 INFO  (coreZkRegister-7589-thread-1-processing-n:127.0.0.1:57409_a_ x:collection1 s:shard1 c:control_collection r:core_node1) [n:127.0.0.1:57409_a_ c:control_collection s:shard1 r:core_node1 x:collection1] o.a.s.c.ZkController Register replica - core:collection1 address:http://127.0.0.1:57409/a_ collection:control_collection shard:shard1
   [junit4]   2> 2548794 INFO  (coreZkRegister-7589-thread-1-processing-n:127.0.0.1:57409_a_ x:collection1 s:shard1 c:control_collection r:core_node1) [n:127.0.0.1:57409_a_ c:control_collection s:shard1 r:core_node1 x:collection1] o.a.s.c.c.SolrZkClient makePath: /collections/control_collection/leader_elect/shard1/election
   [junit4]   2> 2548800 INFO  (coreZkRegister-7589-thread-1-processing-n:127.0.0.1:57409_a_ x:collection1 s:shard1 c:control_collection r:core_node1) [n:127.0.0.1:57409_a_ c:control_collection s:shard1 r:core_node1 x:collection1] o.a.s.c.LeaderElector Joined leadership election with path: /collections/control_collection/leader_elect/shard1/election/94635808280084484-core_node1-n_0000000000
   [junit4]   2> 2548801 INFO  (coreZkRegister-7589-thread-1-processing-n:127.0.0.1:57409_a_ x:collection1 s:shard1 c:control_collection r:core_node1) [n:127.0.0.1:57409_a_ c:control_collection s:shard1 r:core_node1 x:collection1] o.a.s.c.ShardLeaderElectionContext Running the leader process for shard shard1
   [junit4]   2> 2548804 INFO  (coreZkRegister-7589-thread-1-processing-n:127.0.0.1:57409_a_ x:collection1 s:shard1 c:control_collection r:core_node1) [n:127.0.0.1:57409_a_ c:control_collection s:shard1 r:core_node1 x:collection1] o.a.s.c.ShardLeaderElectionContext Enough replicas found to continue.
   [junit4]   2> 2548804 INFO  (coreZkRegister-7589-thread-1-processing-n:127.0.0.1:57409_a_ x:collection1 s:shard1 c:control_collection r:core_node1) [n:127.0.0.1:57409_a_ c:control_collection s:shard1 r:core_node1 x:collection1] o.a.s.c.ShardLeaderElectionContext I may be the new leader - try and sync
   [junit4]   2> 2548804 INFO  (coreZkRegister-7589-thread-1-processing-n:127.0.0.1:57409_a_ x:collection1 s:shard1 c:control_collection r:core_node1) [n:127.0.0.1:57409_a_ c:control_collection s:shard1 r:core_node1 x:collection1] o.a.s.c.SyncStrategy Sync replicas to http://127.0.0.1:57409/a_/collection1/
   [junit4]   2> 2548804 INFO  (coreZkRegister-7589-thread-1-processing-n:127.0.0.1:57409_a_ x:collection1 s:shard1 c:control_collection r:core_node1) [n:127.0.0.1:57409_a_ c:control_collection s:shard1 r:core_node1 x:collection1] o.a.s.c.SyncStrategy Sync Success - now sync replicas to me
   [junit4]   2> 2548804 INFO  (coreZkRegister-7589-thread-1-processing-n:127.0.0.1:57409_a_ x:collection1 s:shard1 c:control_collection r:core_node1) [n:127.0.0.1:57409_a_ c:control_collection s:shard1 r:core_node1 x:collection1] o.a.s.c.SyncStrategy http://127.0.0.1:57409/a_/collection1/ has no replicas
   [junit4]   2> 2548804 INFO  (coreZkRegister-7589-thread-1-processing-n:127.0.0.1:57409_a_ x:collection1 s:shard1 c:control_collection r:core_node1) [n:127.0.0.1:57409_a_ c:control_collection s:shard1 r:core_node1 x:collection1] o.a.s.c.ShardLeaderElectionContext I am the new leader: http://127.0.0.1:57409/a_/collection1/ shard1
   [junit4]   2> 2548805 INFO  (OverseerStateUpdate-94635808280084484-127.0.0.1:57409_a_-n_0000000000) [n:127.0.0.1:57409_a_    ] o.a.s.c.Overseer processMessage: queueSize: 1, message = {
   [junit4]   2>   "operation":"leader",
   [junit4]   2>   "shard":"shard1",
   [junit4]   2>   "collection":"control_collection"} current state version: 1
   [junit4]   2> 2548805 INFO  (coreZkRegister-7589-thread-1-processing-n:127.0.0.1:57409_a_ x:collection1 s:shard1 c:control_collection r:core_node1) [n:127.0.0.1:57409_a_ c:control_collection s:shard1 r:core_node1 x:collection1] o.a.s.c.c.SolrZkClient makePath: /collections/control_collection/leaders/shard1
   [junit4]   2> 2548809 INFO  (coreZkRegister-7589-thread-1-processing-n:127.0.0.1:57409_a_ x:collection1 s:shard1 c:control_collection r:core_node1) [n:127.0.0.1:57409_a_ c:control_collection s:shard1 r:core_node1 x:collection1] o.a.s.c.ShardLeaderElectionContextBase Creating leader registration node
   [junit4]   2> 2548814 INFO  (OverseerStateUpdate-94635808280084484-127.0.0.1:57409_a_-n_0000000000) [n:127.0.0.1:57409_a_    ] o.a.s.c.Overseer processMessage: queueSize: 1, message = {
   [junit4]   2>   "operation":"leader",
   [junit4]   2>   "shard":"shard1",
   [junit4]   2>   "collection":"control_collection",
   [junit4]   2>   "base_url":"http://127.0.0.1:57409/a_",
   [junit4]   2>   "core":"collection1",
   [junit4]   2>   "state":"active"} current state version: 1
   [junit4]   2> 2548923 INFO  (zkCallback-2718-thread-1-processing-n:127.0.0.1:57409_a_) [n:127.0.0.1:57409_a_    ] o.a.s.c.c.ZkStateReader A cluster state change: WatchedEvent state:SyncConnected type:NodeDataChanged path:/clusterstate.json, has occurred - updating... (live nodes size: 1)
   [junit4]   2> 2548969 INFO  (coreZkRegister-7589-thread-1-processing-n:127.0.0.1:57409_a_ x:collection1 s:shard1 c:control_collection r:core_node1) [n:127.0.0.1:57409_a_ c:control_collection s:shard1 r:core_node1 x:collection1] o.a.s.c.ZkController We are http://127.0.0.1:57409/a_/collection1/ and leader is http://127.0.0.1:57409/a_/collection1/
   [junit4]   2> 2548969 INFO  (coreZkRegister-7589-thread-1-processing-n:127.0.0.1:57409_a_ x:collection1 s:shard1 c:control_collection r:core_node1) [n:127.0.0.1:57409_a_ c:control_collection s:shard1 r:core_node1 x:collection1] o.a.s.c.ZkController No LogReplay needed for core=collection1 baseURL=http://127.0.0.1:57409/a_
   [junit4]   2> 2548969 INFO  (coreZkRegister-7589-thread-1-processing-n:127.0.0.1:57409_a_ x:collection1 s:shard1 c:control_collection r:core_node1) [n:127.0.0.1:57409_a_ c:control_collection s:shard1 r:core_node1 x:collection1] o.a.s.c.ZkController I am the leader, no recovery necessary
   [junit4]   2> 2548969 INFO  (coreZkRegister-7589-thread-1-processing-n:127.0.0.1:57409_a_ x:collection1 s:shard1 c:control_collection r:core_node1) [n:127.0.0.1:57409_a_ c:control_collection s:shard1 r:core_node1 x:collection1] o.a.s.c.ZkController publishing state=active
   [junit4]   2> 2548969 INFO  (coreZkRegister-7589-thread-1-processing-n:127.0.0.1:57409_a_ x:collection1 s:shard1 c:control_collection r:core_node1) [n:127.0.0.1:57409_a_ c:control_collection s:shard1 r:core_node1 x:collection1] o.a.s.c.ZkController numShards not found on descriptor - reading it from system property
   [junit4]   2> 2548973 INFO  (OverseerStateUpdate-94635808280084484-127.0.0.1:57409_a_-n_0000000000) [n:127.0.0.1:57409_a_    ] o.a.s.c.Overseer processMessage: queueSize: 1, message = {
   [junit4]   2>   "core":"collection1",
   [junit4]   2>   "core_node_name":"core_node1",
   [junit4]   2>   "roles":null,
   [junit4]   2>   "base_url":"http://127.0.0.1:57409/a_",
   [junit4]   2>   "node_name":"127.0.0.1:57409_a_",
   [junit4]   2>   "numShards":"1",
   [junit4]   2>   "state":"active",
   [junit4]   2>   "shard":"shard1",
   [junit4]   2>   "collection":"control_collection",
   [junit4]   2>   "operation":"state"} current state version: 2
   [junit4]   2> 2548974 INFO  (OverseerStateUpdate-94635808280084484-127.0.0.1:57409_a_-n_0000000000) [n:127.0.0.1:57409_a_    ] o.a.s.c.o.ReplicaMutator Update state numShards=1 message={
   [junit4]   2>   "core":"collection1",
   [junit4]   2>   "core_node_name":"core_node1",
   [junit4]   2>   "roles":null,
   [junit4]   2>   "base_url":"http://127.0.0.1:57409/a_",
   [junit4]   2>   "node_name":"127.0.0.1:57409_a_",
   [junit4]   2>   "numShards":"1",
   [junit4]   2>   "state":"active",
   [junit4]   2>   "shard":"shard1",
   [junit4]   2>   "collection":"control_collection",
   [junit4]   2>   "operation":"state"}
   [junit4]   2> 2549066 INFO  (TEST-TestDynamicLoading.testDynamicLoading-seed#[204D5D95BF66CB57]) [    ] o.a.s.c.c.SolrZkClient Using default ZkCredentialsProvider
   [junit4]   2> 2549067 INFO  (TEST-TestDynamicLoading.testDynamicLoading-seed#[204D5D95BF66CB57]) [    ] o.a.s.c.c.ConnectionManager Waiting for client to connect to ZooKeeper
   [junit4]   2> 2549068 INFO  (zkCallback-2720-thread-1) [    ] o.a.s.c.c.ConnectionManager Watcher org.apache.solr.common.cloud.ConnectionManager@375f2ce5 name:ZooKeeperConnection Watcher:127.0.0.1:57405/solr got event WatchedEvent state:SyncConnected type:None path:null path:null type:None
   [junit4]   2> 2549068 INFO  (TEST-TestDynamicLoading.testDynamicLoading-seed#[204D5D95BF66CB57]) [    ] o.a.s.c.c.ConnectionManager Client is connected to ZooKeeper
   [junit4]   2> 2549069 INFO  (TEST-TestDynamicLoading.testDynamicLoading-seed#[204D5D95BF66CB57]) [    ] o.a.s.c.c.SolrZkClient Using default ZkACLProvider
   [junit4]   2> 2549069 INFO  (TEST-TestDynamicLoading.testDynamicLoading-seed#[204D5D95BF66CB57]) [    ] o.a.s.c.c.ZkStateReader Updating cluster state from ZooKeeper... 
   [junit4]   2> 2549074 INFO  (TEST-TestDynamicLoading.testDynamicLoading-seed#[204D5D95BF66CB57]) [    ] o.a.s.c.ChaosMonkey monkey: init - expire sessions:false cause connection loss:false
   [junit4]   2> 2549074 INFO  (TEST-TestDynamicLoading.testDynamicLoading-seed#[204D5D95BF66CB57]) [    ] o.a.s.c.AbstractFullDistribZkTestBase Creating collection1 with stateFormat=2
   [junit4]   2> 2549074 INFO  (TEST-TestDynamicLoading.testDynamicLoading-seed#[204D5D95BF66CB57]) [    ] o.a.s.c.c.SolrZkClient Using default ZkCredentialsProvider
   [junit4]   2> 2549075 INFO  (TEST-TestDynamicLoading.testDynamicLoading-seed#[204D5D95BF66CB57]) [    ] o.a.s.c.c.ConnectionManager Waiting for client to connect to ZooKeeper
   [junit4]   2> 2549076 INFO  (zkCallback-2721-thread-1) [    ] o.a.s.c.c.ConnectionManager Watcher org.apache.solr.common.cloud.ConnectionManager@14f3864b name:ZooKeeperConnection Watcher:127.0.0.1:57405/solr got event WatchedEvent state:SyncConnected type:None path:null path:null type:None
   [junit4]   2> 2549076 INFO  (TEST-TestDynamicLoading.testDynamicLoading-seed#[204D5D95BF66CB57]) [    ] o.a.s.c.c.ConnectionManager Client is connected to ZooKeeper
   [junit4]   2> 2549076 INFO  (TEST-TestDynamicLoading.testDynamicLoading-seed#[204D5D95BF66CB57]) [    ] o.a.s.c.c.SolrZkClient Using default ZkACLProvider
   [junit4]   2> 2549080 INFO  (zkCallback-2718-thread-2-processing-n:127.0.0.1:57409_a_) [n:127.0.0.1:57409_a_    ] o.a.s.c.c.ZkStateReader A cluster state change: WatchedEvent state:SyncConnected type:NodeDataChanged path:/clusterstate.json, has occurred - updating... (live nodes size: 1)
   [junit4]   2> 2549080 INFO  (zkCallback-2720-thread-1) [    ] o.a.s.c.c.ZkStateReader A cluster state change: WatchedEvent state:SyncConnected type:NodeDataChanged path:/clusterstate.json, has occurred - updating... (live nodes size: 1)
   [junit4]   2> 2549085 INFO  (OverseerStateUpdate-94635808280084484-127.0.0.1:57409_a_-n_0000000000) [n:127.0.0.1:57409_a_    ] o.a.s.c.Overseer processMessage: queueSize: 1, message = {
   [junit4]   2>   "operation":"create",
   [junit4]   2>   "name":"collection1",
   [junit4]   2>   "numShards":"2",
   [junit4]   2>   "stateFormat":"2"} current state version: 3
   [junit4]   2> 2549085 INFO  (OverseerStateUpdate-94635808280084484-127.0.0.1:57409_a_-n_0000000000) [n:127.0.0.1:57409_a_    ] o.a.s.c.o.ClusterStateMutator building a new cName: collection1
   [junit4]   2> 2549190 INFO  (OverseerStateUpdate-94635808280084484-127.0.0.1:57409_a_-n_0000000000) [n:127.0.0.1:57409_a_    ] o.a.s.c.o.ZkStateWriter going to create_collection /collections/collection1/state.json
   [junit4]   2> 2549522 INFO  (TEST-TestDynamicLoading.testDynamicLoading-seed#[204D5D95BF66CB57]) [    ] o.a.s.SolrTestCaseJ4 Writing core.properties file to /Users/jenkins/workspace/Lucene-Solr-trunk-MacOSX/solr/build/solr-core/test/J1/temp/solr.core.TestDynamicLoading_204D5D95BF66CB57-001/shard-1-001/cores/collection1
   [junit4]   2> 2549524 INFO  (TEST-TestDynamicLoading.testDynamicLoading-seed#[204D5D95BF66CB57]) [    ] o.a.s.c.AbstractFullDistribZkTestBase create jetty 1 in directory /Users/jenkins/workspace/Lucene-Solr-trunk-MacOSX/solr/build/solr-core/test/J1/temp/solr.core.TestDynamicLoading_204D5D95BF66CB57-001/shard-1-001
   [junit4]   2> 2549524 INFO  (TEST-TestDynamicLoading.testDynamicLoading-seed#[204D5D95BF66CB57]) [    ] o.e.j.s.Server jetty-9.2.13.v20150730
   [junit4]   2> 2549527 INFO  (TEST-TestDynamicLoading.testDynamicLoading-seed#[204D5D95BF66CB57]) [    ] o.e.j.s.h.ContextHandler Started o.e.j.s.ServletContextHandler@7fbeec83{/a_,null,AVAILABLE}
   [junit4]   2> 2549528 INFO  (TEST-TestDynamicLoading.testDynamicLoading-seed#[204D5D95BF66CB57]) [    ] o.e.j.s.ServerConnector Started ServerConnector@1bd1e312{HTTP/1.1}{127.0.0.1:57418}
   [junit4]   2> 2549528 INFO  (TEST-TestDynamicLoading.testDynamicLoading-seed#[204D5D95BF66CB57]) [    ] o.e.j.s.Server Started @2553866ms
   [junit4]   2> 2549528 INFO  (TEST-TestDynamicLoading.testDynamicLoading-seed#[204D5D95BF66CB57]) [    ] o.a.s.c.s.e.JettySolrRunner Jetty properties: {solr.data.dir=/Users/jenkins/workspace/Lucene-Solr-trunk-MacOSX/solr/build/solr-core/test/J1/temp/solr.core.TestDynamicLoading_204D5D95BF66CB57-001/tempDir-001/jetty1, solrconfig=solrconfig.xml, hostContext=/a_, hostPort=57418, coreRootDirectory=/Users/jenkins/workspace/Lucene-Solr-trunk-MacOSX/solr/build/solr-core/test/J1/../../../../../../../../../Users/jenkins/workspace/Lucene-Solr-trunk-MacOSX/solr/build/solr-core/test/J1/temp/solr.core.TestDynamicLoading_204D5D95BF66CB57-001/shard-1-001/cores}
   [junit4]   2> 2549528 INFO  (TEST-TestDynamicLoading.testDynamicLoading-seed#[204D5D95BF66CB57]) [    ] o.a.s.s.SolrDispatchFilter SolrDispatchFilter.init(): sun.misc.Launcher$AppClassLoader@74a14482
   [junit4]   2> 2549528 INFO  (TEST-TestDynamicLoading.testDynamicLoading-seed#[204D5D95BF66CB57]) [    ] o.a.s.c.SolrResourceLoader new SolrResourceLoader for directory: '/Users/jenkins/workspace/Lucene-Solr-trunk-MacOSX/solr/build/solr-core/test/J1/../../../../../../../../../Users/jenkins/workspace/Lucene-Solr-trunk-MacOSX/solr/build/solr-core/test/J1/temp/solr.core.TestDynamicLoading_204D5D95BF66CB57-001/shard-1-001/'
   [junit4]   2> 2549552 INFO  (TEST-TestDynamicLoading.testDynamicLoading-seed#[204D5D95BF66CB57]) [    ] o.a.s.c.c.SolrZkClient Using default ZkCredentialsProvider
   [junit4]   2> 2549554 INFO  (TEST-TestDynamicLoading.testDynamicLoading-seed#[204D5D95BF66CB57]) [    ] o.a.s.c.c.ConnectionManager Waiting for client to connect to ZooKeeper
   [junit4]   2> 2549555 INFO  (zkCallback-2722-thread-1) [    ] o.a.s.c.c.ConnectionManager Watcher org.apache.solr.common.cloud.ConnectionManager@5de49a6d name:ZooKeeperConnection Watcher:127.0.0.1:57405/solr got event WatchedEvent state:SyncConnected type:None path:null path:null type:None
   [junit4]   2> 2549555 INFO  (TEST-TestDynamicLoading.testDynamicLoading-seed#[204D5D95BF66CB57]) [    ] o.a.s.c.c.ConnectionManager Client is connected to ZooKeeper
   [junit4]   2> 2549556 INFO  (TEST-TestDynamicLoading.testDynamicLoading-seed#[204D5D95BF66CB57]) [    ] o.a.s.c.c.SolrZkClient Using default ZkACLProvider
   [junit4]   2> 2549557 INFO  (TEST-TestDynamicLoading.testDynamicLoading-seed#[204D5D95BF66CB57]) [    ] o.a.s.s.SolrDispatchFilter Loading solr.xml from SolrHome (not found in ZooKeeper)
   [junit4]   2> 2549558 INFO  (TEST-TestDynamicLoading.testDynamicLoading-seed#[204D5D95BF66CB57]) [    ] o.a.s.c.SolrXmlConfig Loading container configuration from /Users/jenkins/workspace/Lucene-Solr-trunk-MacOSX/solr/build/solr-core/test/J1/../../../../../../../../../Users/jenkins/workspace/Lucene-Solr-trunk-MacOSX/solr/build/solr-core/test/J1/temp/solr.core.TestDynamicLoading_204D5D95BF66CB57-001/shard-1-001/solr.xml
   [junit4]   2> 2549567 INFO  (TEST-TestDynamicLoading.testDynamicLoading-seed#[204D5D95BF66CB57]) [    ] o.a.s.c.CoresLocator Config-defined core root directory: /Users/jenkins/workspace/Lucene-Solr-trunk-MacOSX/solr/build/solr-core/test/J1/../../../../../../../../../Users/jenkins/workspace/Lucene-Solr-trunk-MacOSX/solr/build/solr-core/test/J1/temp/solr.core.TestDynamicLoading_204D5D95BF66CB57-001/shard-1-001/cores
   [junit4]   2> 2549568 INFO  (TEST-TestDynamicLoading.testDynamicLoading-seed#[204D5D95BF66CB57]) [    ] o.a.s.c.CoreContainer New CoreContainer 638754647
   [junit4]   2> 2549568 INFO  (TEST-TestDynamicLoading.testDynamicLoading-seed#[204D5D95BF66CB57]) [    ] o.a.s.c.CoreContainer Loading cores into CoreContainer [instanceDir=/Users/jenkins/workspace/Lucene-Solr-trunk-MacOSX/solr/build/solr-core/test/J1/../../../../../../../../../Users/jenkins/workspace/Lucene-Solr-trunk-MacOSX/solr/build/solr-core/test/J1/temp/solr.core.TestDynamicLoading_204D5D95BF66CB57-001/shard-1-001/]
   [junit4]   2> 2549568 INFO  (TEST-TestDynamicLoading.testDynamicLoading-seed#[204D5D95BF66CB57]) [    ] o.a.s.c.CoreContainer loading shared library: /Users/jenkins/workspace/Lucene-Solr-trunk-MacOSX/solr/build/solr-core/test/J1/../../../../../../../../../Users/jenkins/workspace/Lucene-Solr-trunk-MacOSX/solr/build/solr-core/test/J1/temp/solr.core.TestDynamicLoading_204D5D95BF66CB57-001/shard-1-001/lib
   [junit4]   2> 2549568 WARN  (TEST-TestDynamicLoading.testDynamicLoading-seed#[204D5D95BF66CB57]) [    ] o.a.s.c.SolrResourceLoader Can't find (or read) directory to add to classloader: lib (resolved as: /Users/jenkins/workspace/Lucene-Solr-trunk-MacOSX/solr/build/solr-core/test/J1/../../../../../../../../../Users/jenkins/workspace/Lucene-Solr-trunk-MacOSX/solr/build/solr-core/test/J1/temp/solr.core.TestDynamicLoading_204D5D95BF66CB57-001/shard-1-001/lib).
   [junit4]   2> 2549576 INFO  (TEST-TestDynamicLoading.testDynamicLoading-seed#[204D5D95BF66CB57]) [    ] o.a.s.h.c.HttpShardHandlerFactory created with socketTimeout : 90000,urlScheme : ,connTimeout : 15000,maxConnectionsPerHost : 20,maxConnections : 10000,corePoolSize : 0,maximumPoolSize : 2147483647,maxThreadIdleTime : 5,sizeOfQueue : -1,fairnessPolicy : false,useRetries : false,
   [junit4]   2> 2549578 INFO  (TEST-TestDynamicLoading.testDynamicLoading-seed#[204D5D95BF66CB57]) [    ] o.a.s.u.UpdateShardHandler Creating UpdateShardHandler HTTP client with params: socketTimeout=340000&connTimeout=45000&retry=true
   [junit4]   2> 2549578 INFO  (TEST-TestDynamicLoading.testDynamicLoading-seed#[204D5D95BF66CB57]) [    ] o.a.s.l.LogWatcher SLF4J impl is org.slf4j.impl.Log4jLoggerFactory
   [junit4]   2> 2549578 INFO  (TEST-TestDynamicLoading.testDynamicLoading-seed#[204D5D95BF66CB57]) [    ] o.a.s.l.LogWatcher Registering Log Listener [Log4j (org.slf4j.impl.Log4jLoggerFactory)]
   [junit4]   2> 2549578 INFO  (TEST-TestDynamicLoading.testDynamicLoading-seed#[204D5D95BF66CB57]) [    ] o.a.s.c.ZkContainer Zookeeper client=127.0.0.1:57405/solr
   [junit4]   2> 2549578 INFO  (TEST-TestDynamicLoading.testDynamicLoading-seed#[204D5D95BF66CB57]) [    ] o.a.s.c.ZkController zkHost includes chroot
   [junit4]   2> 2549579 INFO  (TEST-TestDynamicLoading.testDynamicLoading-seed#[204D5D95BF66CB57]) [    ] o.a.s.c.c.SolrZkClient Using default ZkCredentialsProvider
   [junit4]   2> 2549579 INFO  (TEST-TestDynamicLoading.testDynamicLoading-seed#[204D5D95BF66CB57]) [    ] o.a.s.c.c.ConnectionManager Waiting for client to connect to ZooKeeper
   [junit4]   2> 2549581 INFO  (zkCallback-2724-thread-1) [    ] o.a.s.c.c.ConnectionManager Watcher org.apache.solr.common.cloud.ConnectionManager@6c88d84f name:ZooKeeperConnection Watcher:127.0.0.1:57405 got event WatchedEvent state:SyncConnected type:None path:null path:null type:None
   [junit4]   2> 2549581 INFO  (TEST-TestDynamicLoading.testDynamicLoading-seed#[204D5D95BF66CB57]) [    ] o.a.s.c.c.ConnectionManager Client is connected to ZooKeeper
   [junit4]   2> 2549581 INFO  (TEST-TestDynamicLoading.testDynamicLoading-seed#[204D5D95BF66CB57]) [    ] o.a.s.c.c.SolrZkClient Using default ZkACLProvider
   [junit4]   2> 2549584 INFO  (TEST-TestDynamicLoading.testDynamicLoading-seed#[204D5D95BF66CB57]) [n:127.0.0.1:57418_a_    ] o.a.s.c.c.ConnectionManager Waiting for client to connect to ZooKeeper
   [junit4]   2> 2549586 INFO  (zkCallback-2725-thread-1-processing-n:127.0.0.1:57418_a_) [n:127.0.0.1:57418_a_    ] o.a.s.c.c.ConnectionManager Watcher org.apache.solr.common.cloud.ConnectionManager@2193515f name:ZooKeeperConnection Watcher:127.0.0.1:57405/solr got event WatchedEvent state:SyncConnected type:None path:null path:null type:None
   [junit4]   2> 2549586 INFO  (TEST-TestDynamicLoading.testDynamicLoading-seed#[204D5D95BF66CB57]) [n:127.0.0.1:57418_a_    ] o.a.s.c.c.ConnectionManager Client is connected to ZooKeeper
   [junit4]   2> 2549596 INFO  (TEST-TestDynamicLoading.testDynamicLoading-seed#[204D5D95BF66CB57]) [n:127.0.0.1:57418_a_    ] o.a.s.c.c.ZkStateReader Updating cluster state from ZooKeeper... 
   [junit4]   2> 2550616 INFO  (TEST-TestDynamicLoading.testDynamicLoading-seed#[204D5D95BF66CB57]) [n:127.0.0.1:57418_a_    ] o.a.s.c.ZkController Register node as live in ZooKeeper:/live_nodes/127.0.0.1:57418_a_
   [junit4]   2> 2550617 INFO  (TEST-TestDynamicLoading.testDynamicLoading-seed#[204D5D95BF66CB57]) [n:127.0.0.1:57418_a_    ] o.a.s.c.c.SolrZkClient makePath: /live_nodes/127.0.0.1:57418_a_
   [junit4]   2> 2550619 INFO  (zkCallback-2718-thread-2-processing-n:127.0.0.1:57409_a_) [n:127.0.0.1:57409_a_    ] o.a.s.c.c.ZkStateReader A live node change: WatchedEvent state:SyncConnected type:NodeChildrenChanged path:/live_nodes, has occurred - updating... (live nodes size: 1)
   [junit4]   2> 2550619 INFO  (zkCallback-2725-thread-1-processing-n:127.0.0.1:57418_a_) [n:127.0.0.1:57418_a_    ] o.a.s.c.c.ZkStateReader A live node change: WatchedEvent state:SyncConnected type:NodeChildrenChanged path:/live_nodes, has occurred - updating... (live nodes size: 1)
   [junit4]   2> 2550619 INFO  (zkCallback-2720-thread-1) [    ] o.a.s.c.c.ZkStateReader A live node change: WatchedEvent state:SyncConnected type:NodeChildrenChanged path:/live_nodes, has occurred - updating... (live nodes size: 1)
   [junit4]   2> 2550622 INFO  (TEST-TestDynamicLoading.testDynamicLoading-seed#[204D5D95BF66CB57]) [n:127.0.0.1:57418_a_    ] o.a.s.c.Overseer Overseer (id=null) closing
   [junit4]   2> 2550623 INFO  (TEST-TestDynamicLoading.testDynamicLoading-seed#[204D5D95BF66CB57]) [n:127.0.0.1:57418_a_    ] o.a.s.c.LeaderElector Joined leadership election with path: /overseer_elect/election/94635808280084489-127.0.0.1:57418_a_-n_0000000001
   [junit4]   2> 2550624 INFO  (TEST-TestDynamicLoading.testDynamicLoading-seed#[204D5D95BF66CB57]) [n:127.0.0.1:57418_a_    ] o.a.s.c.LeaderElector Watching path /overseer_elect/election/94635808280084484-127.0.0.1:57409_a_-n_0000000000 to know if I could be the leader
   [junit4]   2> 2550632 INFO  (TEST-TestDynamicLoading.testDynamicLoading-seed#[204D5D95BF66CB57]) [n:127.0.0.1:57418_a_    ] o.a.s.c.CoreContainer Security conf doesn't exist. Skipping setup for authorization module.
   [junit4]   2> 2550632 INFO  (TEST-TestDynamicLoading.testDynamicLoading-seed#[204D5D95BF66CB57]) [n:127.0.0.1:57418_a_    ] o.a.s.c.CoreContainer No authentication plugin used.
   [junit4]   2> 2550633 INFO  (TEST-TestDynamicLoading.testDynamicLoading-seed#[204D5D95BF66CB57]) [n:127.0.0.1:57418_a_    ] o.a.s.c.CoresLocator Looking for core definitions underneath /Users/jenkins/workspace/Lucene-Solr-trunk-MacOSX/solr/build/solr-core/test/J1/../../../../../../../../../Users/jenkins/workspace/Lucene-Solr-trunk-MacOSX/solr/build/solr-core/test/J1/temp/solr.core.TestDynamicLoading_204D5D95BF66CB57-001/shard-1-001/cores
   [junit4]   2> 2550635 INFO  (TEST-TestDynamicLoading.testDynamicLoading-seed#[204D5D95BF66CB57]) [n:127.0.0.1:57418_a_    ] o.a.s.c.SolrCore Created CoreDescriptor: {name=collection1, config=solrconfig.xml, transient=false, schema=schema.xml, loadOnStartup=true, configSetProperties=configsetprops.json, instanceDir=/Users/jenkins/workspace/Lucene-Solr-trunk-MacOSX/solr/build/solr-core/test/J1/../../../../../../../../../Users/jenkins/workspace/Lucene-Solr-trunk-MacOSX/solr/build/solr-core/test/J1/temp/solr.core.TestDynamicLoading_204D5D95BF66CB57-001/shard-1-001/cores/collection1, collection=collection1, absoluteInstDir=/Users/jenkins/workspace/Lucene-Solr-trunk-MacOSX/solr/build/solr-core/test/J1/../../../../../../../../../Users/jenkins/workspace/Lucene-Solr-trunk-MacOSX/solr/build/solr-core/test/J1/temp/solr.core.TestDynamicLoading_204D5D95BF66CB57-001/shard-1-001/cores/collection1/, coreNodeName=, dataDir=data/, shard=}
   [junit4]   2> 2550635 INFO  (TEST-TestDynamicLoading.testDynamicLoading-seed#[204D5D95BF66CB57]) [n:127.0.0.1:57418_a_    ] o.a.s.c.CoresLocator Found core collection1 in /Users/jenkins/workspace/Lucene-Solr-trunk-MacOSX/solr/build/solr-core/test/J1/../../../../../../../../../Users/jenkins/workspace/Lucene-Solr-trunk-MacOSX/solr/build/solr-core/test/J1/temp/solr.core.TestDynamicLoading_204D5D95BF66CB57-001/shard-1-001/cores/collection1/
   [junit4]   2> 2550635 INFO  (TEST-TestDynamicLoading.testDynamicLoading-seed#[204D5D95BF66CB57]) [n:127.0.0.1:57418_a_    ] o.a.s.c.CoresLocator Found 1 core definitions
   [junit4]   2> 2550637 INFO  (TEST-TestDynamicLoading.testDynamicLoading-seed#[204D5D95BF66CB57]) [n:127.0.0.1:57418_a_    ] o.a.s.s.SolrDispatchFilter user.dir=/Users/jenkins/workspace/Lucene-Solr-trunk-MacOSX/solr/build/solr-core/test/J1
   [junit4]   2> 2550637 INFO  (TEST-TestDynamicLoading.testDynamicLoading-seed#[204D5D95BF66CB57]) [n:127.0.0.1:57418_a_    ] o.a.s.s.SolrDispatchFilter SolrDispatchFilter.init() done
   [junit4]   2> 2550637 INFO  (coreLoadExecutor-7606-thread-1-processing-n:127.0.0.1:57418_a_) [n:127.0.0.1:57418_a_ c:collection1   x:collection1] o.a.s.c.ZkController publishing state=down
   [junit4]   2> 2550637 INFO  (coreLoadExecutor-7606-thread-1-processing-n:127.0.0.1:57418_a_) [n:127.0.0.1:57418_a_ c:collection1   x:collection1] o.a.s.c.ZkController numShards not found on descriptor - reading it from system property
   [junit4]   2> 2550640 INFO  (coreLoadExecutor-7606-thread-1-processing-n:127.0.0.1:57418_a_) [n:127.0.0.1:57418_a_ c:collection1   x:collection1] o.a.s.c.ZkController Registering watch for collection collection1
   [junit4]   2> 2550640 INFO  (coreLoadExecutor-7606-thread-1-processing-n:127.0.0.1:57418_a_) [n:127.0.0.1:57418_a_ c:collection1   x:collection1] o.a.s.c.c.ZkStateReader addZkWatch collection1
   [junit4]   2> 2550641 INFO  (coreLoadExecutor-7606-thread-1-processing-n:127.0.0.1:57418_a_) [n:127.0.0.1:57418_a_ c:collection1   x:collection1] o.a.s.c.c.ZkStateReader Add data for collection1 ver 0 
   [junit4]   2> 2550641 INFO  (OverseerStateUpdate-94635808280084484-127.0.0.1:57409_a_-n_0000000000) [n:127.0.0.1:57409_a_    ] o.a.s.c.Overseer processMessage: queueSize: 1, message = {
   [junit4]   2>   "core":"collection1",
   [junit4]   2>   "roles":null,
   [junit4]   2>   "base_url":"http://127.0.0.1:57418/a_",
   [junit4]   2>   "node_name":"127.0.0.1:57418_a_",
   [junit4]   2>   "numShards":"2",
   [junit4]   2>   "state":"down",
   [junit4]   2>   "shard":null,
   [junit4]   2>   "collection":"collection1",
   [junit4]   2>   "operation":"state"} current state version: 3
   [junit4]   2> 2550641 INFO  (coreLoadExecutor-7606-thread-1-processing-n:127.0.0.1:57418_a_) [n:127.0.0.1:57418_a_ c:collection1   x:collection1] o.a.s.c.ZkController look for our core node name
   [junit4]   2> 2550641 INFO  (OverseerStateUpdate-94635808280084484-127.0.0.1:57409_a_-n_0000000000) [n:127.0.0.1:57409_a_    ] o.a.s.c.o.ReplicaMutator Update state numShards=2 message={
   [junit4]   2>   "core":"collection1",
   [junit4]   2>   "roles":null,
   [junit4]   2>   "base_url":"http://127.0.0.1:57418/a_",
   [junit4]   2>   "node_name":"127.0.0.1:57418_a_",
   [junit4]   2>   "numShards":"2",
   [junit4]   2>   "state":"down",
   [junit4]   2>   "shard":null,
   [junit4]   2>   "collection":"collection1",
   [junit4]   2>   "operation":"state"}
   [junit4]   2> 2550642 INFO  (OverseerStateUpdate-94635808280084484-127.0.0.1:57409_a_-n_0000000000) [n:127.0.0.1:57409_a_    ] o.a.s.c.o.ReplicaMutator Collection already exists with numShards=2
   [junit4]   2> 2550642 INFO  (OverseerStateUpdate-94635808280084484-127.0.0.1:57409_a_-n_0000000000) [n:127.0.0.1:57409_a_    ] o.a.s.c.o.ReplicaMutator Assigning new node to shard shard=shard2
   [junit4]   2> 2550747 INFO  (OverseerStateUpdate-94635808280084484-127.0.0.1:57409_a_-n_0000000000) [n:127.0.0.1:57409_a_    ] o.a.s.c.o.ZkStateWriter going to update_collection /collections/collection1/state.json version: 0
   [junit4]   2> 2550748 INFO  (zkCallback-2725-thread-1-processing-n:127.0.0.1:57418_a_) [n:127.0.0.1:57418_a_    ] o.a.s.c.c.ZkStateReader A cluster state change: WatchedEvent state:SyncConnected type:NodeDataChanged path:/collections/collection1/state.json for collection collection1 has occurred - updating... (live nodes size: 2)
   [junit4]   2> 2550749 INFO  (zkCallback-2725-thread-1-processing-n:127.0.0.1:57418_a_) [n:127.0.0.1:57418_a_    ] o.a.s.c.c.ZkStateReader Updating data for collection1 from 0 to 1 
   [junit4]   2> 2551642 INFO  (coreLoadExecutor-7606-thread-1-processing-n:127.0.0.1:57418_a_) [n:127.0.0.1:57418_a_ c:collection1   x:collection1] o.a.s.c.ZkController waiting to find shard id in clusterstate for collection1
   [junit4]   2> 2551642 INFO  (coreLoadExecutor-7606-thread-1-processing-n:127.0.0.1:57418_a_) [n:127.0.0.1:57418_a_ c:collection1   x:collection1] o.a.s.c.ZkController Check for collection zkNode:collection1
   [junit4]   2> 2551643 INFO  (coreLoadExecutor-7606-thread-1-processing-n:127.0.0.1:57418_a_) [n:127.0.0.1:57418_a_ c:collection1   x:collection1] o.a.s.c.ZkController Collection zkNode exists
   [junit4]   2> 2551643 INFO  (coreLoadExecutor-7606-thread-1-processing-n:127.0.0.1:57418_a_) [n:127.0.0.1:57418_a_ c:collection1   x:collection1] o.a.s.c.c.ZkStateReader Load collection config from:/collections/collection1
   [junit4]   2> 2551644 INFO  (coreLoadExecutor-7606-thread-1-processing-n:127.0.0.1:57418_a_) [n:127.0.0.1:57418_a_ c:collection1   x:collection1] o.a.s.c.c.ZkStateReader path=/collections/collection1 configName=conf1 specified config exists in ZooKeeper
   [junit4]   2> 2551644 INFO  (coreLoadExecutor-7606-thread-1-processing-n:127.0.0.1:57418_a_) [n:127.0.0.1:57418_a_ c:collection1   x:collection1] o.a.s.c.SolrResourceLoader new SolrResourceLoader for directory: '/Users/jenkins/workspace/Lucene-Solr-trunk-MacOSX/solr/build/solr-core/test/J1/../../../../../../../../../Users/jenkins/workspace/Lucene-Solr-trunk-MacOSX/solr/build/solr-core/test/J1/temp/solr.core.TestDynamicLoading_204D5D95BF66CB57-001/shard-1-001/cores/collection1/'
   [junit4]   2> 2551657 INFO  (coreLoadExecutor-7606-thread-1-processing-n:127.0.0.1:57418_a_) [n:127.0.0.1:57418_a_ c:collection1   x:collection1] o.a.s.c.Config loaded config solrconfig.xml with version 0 
   [junit4]   2> 2551688 INFO  (coreLoadExecutor-7606-thread-1-processing-n:127.0.0.1:57418_a_) [n:127.0.0.1:57418_a_ c:collection1   x:collection1] o.a.s.c.SolrConfig current version of requestparams : -1
   [junit4]   2> 2551691 INFO  (coreLoadExecutor-7606-thread-1-processing-n:127.0.0.1:57418_a_) [n:127.0.0.1:57418_a_ c:collection1   x:collection1] o.a.s.c.SolrConfig Using Lucene MatchVersion: 6.0.0
   [junit4]   2> 2551699 INFO  (coreLoadExecutor-7606-thread-1-processing-n:127.0.0.1:57418_a_) [n:127.0.0.1:57418_a_ c:collection1   x:collection1] o.a.s.c.Config Loaded SolrConfig: solrconfig.xml
   [junit4]   2> 2551701 INFO  (coreLoadExecutor-7606-thread-1-processing-n:127.0.0.1:57418_a_) [n:127.0.0.1:57418_a_ c:collection1   x:collection1] o.a.s.s.IndexSchema Reading Solr Schema from /configs/conf1/schema.xml
   [junit4]   2> 2551706 INFO  (coreLoadExecutor-7606-thread-1-processing-n:127.0.0.1:57418_a_) [n:127.0.0.1:57418_a_ c:collection1   x:collection1] o.a.s.s.IndexSchema [collection1] Schema name=test
   [junit4]   2> 2551825 INFO  (coreLoadExecutor-7606-thread-1-processing-n:127.0.0.1:57418_a_) [n:127.0.0.1:57418_a_ c:collection1   x:collection1] o.a.s.s.OpenExchangeRatesOrgProvider Initialized with rates=open-exchange-rates.json, refreshInterval=1440.
   [junit4]   2> 2551832 INFO  (coreLoadExecutor-7606-thread-1-processing-n:127.0.0.1:57418_a_) [n:127.0.0.1:57418_a_ c:collection1   x:collection1] o.a.s.s.IndexSchema default search field in schema is text
   [junit4]   2> 2551833 INFO  (coreLoadExecutor-7606-thread-1-processing-n:127.0.0.1:57418_a_) [n:127.0.0.1:57418_a_ c:collection1   x:collection1] o.a.s.s.IndexSchema unique key field: id
   [junit4]   2> 2551849 INFO  (coreLoadExecutor-7606-thread-1-processing-n:127.0.0.1:57418_a_) [n:127.0.0.1:57418_a_ c:collection1   x:collection1] o.a.s.s.FileExchangeRateProvider Reloading exchange rates from file currency.xml
   [junit4]   2> 2551852 INFO  (coreLoadExecutor-7606-thread-1-processing-n:127.0.0.1:57418_a_) [n:127.0.0.1:57418_a_ c:collection1   x:collection1] o.a.s.s.FileExchangeRateProvider Reloading exchange rates from file currency.xml
   [junit4]   2> 2551855 INFO  (coreLoadExecutor-7606-thread-1-processing-n:127.0.0.1:57418_a_) [n:127.0.0.1:57418_a_ c:collection1   x:collection1] o.a.s.s.OpenExchangeRatesOrgProvider Reloading exchange rates from open-exchange-rates.json
   [junit4]   2> 2551856 WARN  (coreLoadExecutor-7606-thread-1-processing-n:127.0.0.1:57418_a_) [n:127.0.0.1:57418_a_ c:collection1   x:collection1] o.a.s.s.OpenExchangeRatesOrgProvider Unknown key IMPORTANT NOTE
   [junit4]   2> 2551856 WARN  (coreLoadExecutor-7606-thread-1-processing-n:127.0.0.1:57418_a_) [n:127.0.0.1:57418_a_ c:collection1   x:collection1] o.a.s.s.OpenExchangeRatesOrgProvider Expected key, got STRING
   [junit4]   2> 2551856 INFO  (coreLoadExecutor-7606-thread-1-processing-n:127.0.0.1:57418_a_) [n:127.0.0.1:57418_a_ c:collection1   x:collection1] o.a.s.s.OpenExchangeRatesOrgProvider Reloading exchange rates from open-exchange-rates.json
   [junit4]   2> 2551858 WARN  (coreLoadExecutor-7606-thread-1-pro

[...truncated too long message...]

limit:
   [junit4]   2> 
   [junit4]   2> 	40	/solr/configs/conf1
   [junit4]   2> 	6	/solr/aliases.json
   [junit4]   2> 	5	/solr/security.json
   [junit4]   2> 	2	/solr/configs/.system
   [junit4]   2> 
   [junit4]   2> Maximum concurrent data watches above limit:
   [junit4]   2> 
   [junit4]   2> 	6	/solr/clusterstate.json
   [junit4]   2> 	4	/solr/collections/collection1/state.json
   [junit4]   2> 	2	/solr/collections/.system/state.json
   [junit4]   2> 
   [junit4]   2> Maximum concurrent children watches above limit:
   [junit4]   2> 
   [junit4]   2> 	6	/solr/live_nodes
   [junit4]   2> 	6	/solr/collections
   [junit4]   2> 	3	/solr/overseer/queue
   [junit4]   2> 	3	/solr/overseer/collection-queue-work
   [junit4]   2> 
   [junit4]   2> NOTE: reproduce with: ant test  -Dtestcase=TestDynamicLoading -Dtests.method=testDynamicLoading -Dtests.seed=204D5D95BF66CB57 -Dtests.slow=true -Dtests.locale=de_LU -Dtests.timezone=America/Juneau -Dtests.asserts=true -Dtests.file.encoding=UTF-8
   [junit4] FAILURE 61.9s J1 | TestDynamicLoading.testDynamicLoading <<<
   [junit4]    > Throwable #1: java.lang.AssertionError: Could not get expected value  'X val changed' for path 'x' full output: {
   [junit4]    >   "responseHeader":{
   [junit4]    >     "status":0,
   [junit4]    >     "QTime":0},
   [junit4]    >   "params":{"wt":"json"},
   [junit4]    >   "context":{
   [junit4]    >     "webapp":"/a_",
   [junit4]    >     "path":"/test1",
   [junit4]    >     "httpMethod":"GET"},
   [junit4]    >   "class":"org.apache.solr.core.BlobStoreTestRequestHandler",
   [junit4]    >   "x":"X val"}
   [junit4]    > 	at __randomizedtesting.SeedInfo.seed([204D5D95BF66CB57:F80070C248BB6EF7]:0)
   [junit4]    > 	at org.apache.solr.core.TestSolrConfigHandler.testForResponseElement(TestSolrConfigHandler.java:441)
   [junit4]    > 	at org.apache.solr.core.TestDynamicLoading.testDynamicLoading(TestDynamicLoading.java:260)
   [junit4]    > 	at org.apache.solr.BaseDistributedSearchTestCase$ShardsRepeatRule$ShardsFixedStatement.callStatement(BaseDistributedSearchTestCase.java:963)
   [junit4]    > 	at org.apache.solr.BaseDistributedSearchTestCase$ShardsRepeatRule$ShardsStatement.evaluate(BaseDistributedSearchTestCase.java:938)
   [junit4]    > 	at java.lang.Thread.run(Thread.java:745)
   [junit4]   2> 2608902 INFO  (SUITE-TestDynamicLoading-seed#[204D5D95BF66CB57]-worker) [n:127.0.0.1:57451_a_ c:.system s:shard1 r:core_node1 x:.system_shard1_replica2] o.a.s.SolrTestCaseJ4 ###deleteCore
   [junit4]   2> NOTE: leaving temporary files on disk at: /Users/jenkins/workspace/Lucene-Solr-trunk-MacOSX/solr/build/solr-core/test/J1/temp/solr.core.TestDynamicLoading_204D5D95BF66CB57-001
   [junit4]   2> NOTE: test params are: codec=HighCompressionCompressingStoredFields(storedFieldsFormat=CompressingStoredFieldsFormat(compressionMode=HIGH_COMPRESSION, chunkSize=1, maxDocsPerChunk=3, blockSize=2), termVectorsFormat=CompressingTermVectorsFormat(compressionMode=HIGH_COMPRESSION, chunkSize=1, blockSize=2)), sim=RandomSimilarityProvider(queryNorm=false,coord=crazy): {}, locale=de_LU, timezone=America/Juneau
   [junit4]   2> NOTE: Mac OS X 10.8.5 x86_64/Oracle Corporation 1.8.0_60 (64-bit)/cpus=3,threads=1,free=256370936,total=536870912
   [junit4]   2> NOTE: All tests run in this JVM: [TestEmbeddedSolrServerConstructors, TestSolrDeletionPolicy2, TestTrieFacet, FieldMutatingUpdateProcessorTest, DateRangeFieldTest, TestSQLHandler, CacheHeaderTest, HdfsBasicDistributedZkTest, LeaderInitiatedRecoveryOnCommitTest, SolrCoreCheckLockOnStartupTest, TestConfigReload, TestTrie, DistributedFacetPivotLargeTest, TestZkChroot, DistributedFacetPivotLongTailTest, TestCSVResponseWriter, TestSolrQueryParser, TestHighFrequencyDictionaryFactory, LukeRequestHandlerTest, TestDefaultStatsCache, CursorPagingTest, TestJoin, TestRestoreCore, IgnoreCommitOptimizeUpdateProcessorFactoryTest, SynonymTokenizerTest, TestOverriddenPrefixQueryForCustomFieldType, AssignTest, TestStressRecovery, SharedFSAutoReplicaFailoverTest, SolrCmdDistributorTest, TimeZoneUtilsTest, TestUniqueKeyFieldResource, TestComplexPhraseQParserPlugin, BinaryUpdateRequestHandlerTest, TestJettySolrRunner, CSVRequestHandlerTest, DirectSolrConnectionTest, OutputWriterTest, TestDefaultSimilarityFactory, DeleteShardTest, TestPHPSerializedResponseWriter, TestSolrConfigHandlerCloud, TestCoreDiscovery, TriLevelCompositeIdRoutingTest, SortByFunctionTest, VMParamsZkACLAndCredentialsProvidersTest, TestWriterPerf, TestSolr4Spatial2, TestFreeTextSuggestions, TestFoldingMultitermQuery, HighlighterConfigTest, TestIndexingPerformance, TestReload, CoreAdminHandlerTest, TestRemoveLastDynamicCopyField, HdfsDirectoryTest, TestClassNameShortening, StressHdfsTest, TestRecoveryHdfs, RequestLoggingTest, TermVectorComponentTest, BasicZkTest, NumericFieldsTest, TestQuerySenderListener, DataDrivenBlockJoinTest, TestFuzzyAnalyzedSuggestions, TestInitQParser, ExplicitHLLTest, CdcrRequestHandlerTest, SecurityConfHandlerTest, DistributedDebugComponentTest, SolrIndexSplitterTest, TestScoreJoinQPNoScore, TestSolrQueryParserDefaultOperatorResource, NotRequiredUniqueKeyTest, RulesTest, TestCollationField, RuleEngineTest, FullSolrCloudDistribCmdsTest, SpellCheckCollatorTest, ResponseLogComponentTest, TestPKIAuthenticationPlugin, CollectionStateFormat2Test, SuggesterTest, TestMaxScoreQueryParser, BigEndianAscendingWordSerializerTest, TestDistributedGrouping, ShardSplitTest, SaslZkACLProviderTest, ResponseHeaderTest, ConvertedLegacyTest, TestExpandComponent, TestSolrCoreProperties, DistanceFunctionTest, TestFieldResource, CopyFieldTest, SuggestComponentTest, TestBinaryResponseWriter, TestInfoStreamLogging, TestRandomRequestDistribution, UUIDFieldTest, TestRawResponseWriter, TestDistributedMissingSort, CdcrVersionReplicationTest, MinimalSchemaTest, MergeStrategyTest, BaseCdcrDistributedZkTest, DistanceUnitsTest, ChaosMonkeySafeLeaderTest, TestCryptoKeys, OutOfBoxZkACLAndCredentialsProvidersTest, TestPerFieldSimilarity, HdfsBasicDistributedZk2Test, TestNonDefinedSimilarityFactory, HighlighterMaxOffsetTest, RemoteQueryErrorTest, DistributedTermsComponentTest, TestManagedSynonymFilterFactory, SliceStateTest, TestOrdValues, LeaderElectionIntegrationTest, SparseHLLTest, RAMDirectoryFactoryTest, TermVectorComponentDistributedTest, TestConfigSetsAPIExclusivity, TestOmitPositions, TestConfigSetsAPI, OverseerStatusTest, TestQueryUtils, SearchHandlerTest, SpellPossibilityIteratorTest, BasicDistributedZkTest, UnloadDistributedZkTest, SyncSliceTest, OpenCloseCoreStressTest, ShardRoutingTest, RecoveryZkTest, ShardRoutingCustomTest, AutoCommitTest, TestFaceting, TestHashPartitioner, TestRealTimeGet, TestRangeQuery, SolrCoreTest, StatsComponentTest, TestIndexSearcher, ShowFileRequestHandlerTest, CurrencyFieldXmlFileTest, AnalysisAfterCoreReloadTest, SuggesterTSTTest, SuggesterWFSTTest, WordBreakSolrSpellCheckerTest, TestUpdate, TestWordDelimiterFilterFactory, DefaultValueUpdateProcessorTest, TestRemoteStreaming, SolrInfoMBeanTest, DebugComponentTest, DisMaxRequestHandlerTest, TestQueryTypes, RequestHandlersTest, DocumentBuilderTest, MoreLikeThisHandlerTest, TestArbitraryIndexDir, LoggingHandlerTest, SolrPluginUtilsTest, TestJmxIntegration, MBeansHandlerTest, UniqFieldsUpdateProcessorFactoryTest, TestComponentsName, SolrIndexConfigTest, MultiTermTest, TestBinaryField, TestLuceneMatchVersion, TestCharFilters, TestXIncludeConfig, TestSweetSpotSimilarityFactory, TestBM25SimilarityFactory, ResourceLoaderTest, OpenExchangeRatesOrgProviderTest, URLClassifyProcessorTest, PreAnalyzedFieldTest, TestSystemIdResolver, PrimUtilsTest, TestSuggestSpellingConverter, SpellingQueryConverterTest, ClusterStateTest, TestLRUCache, TestUtils, ZkNodePropsTest, FileUtilsTest, CircularListTest, SolrTestCaseJ4Test, TestHighlightDedupGrouping, TestSimpleTrackingShardHandler, TestTolerantSearch, ActionThrottleTest, AsyncCallRequestStatusResponseTest, AsyncMigrateRouteKeyTest, CleanupOldIndexTest, CloudExitableDirectoryReaderTest, CollectionReloadTest, CollectionsAPIAsyncDistributedZkTest, ConcurrentDeleteAndCreateCollectionTest, CustomCollectionTest, DistributedVersionInfoTest, LeaderFailoverAfterPartitionTest, MigrateRouteKeyTest, OverriddenZkACLAndCredentialsProvidersTest, OverseerCollectionConfigSetProcessorTest, OverseerRolesTest, RollingRestartTest, SolrCloudExampleTest, TestConfigSetsAPIZkFailure, TestDistribDocBasedVersion, TestLeaderElectionZkExpiry, TestLeaderInitiatedRecoveryThread, TestMiniSolrCloudClusterSSL, TestRebalanceLeaders, TestSolrCloudWithKerberosAlt, ExitableDirectoryReaderTest, TestConfigOverlay, TestConfigSetProperties, TestDynamicLoading]
   [junit4] Completed [466/547] on J1 in 61.95s, 1 test, 1 failure <<< FAILURES!

[...truncated 275 lines...]
BUILD FAILED
/Users/jenkins/workspace/Lucene-Solr-trunk-MacOSX/build.xml:775: The following error occurred while executing this line:
/Users/jenkins/workspace/Lucene-Solr-trunk-MacOSX/build.xml:719: The following error occurred while executing this line:
/Users/jenkins/workspace/Lucene-Solr-trunk-MacOSX/build.xml:59: The following error occurred while executing this line:
/Users/jenkins/workspace/Lucene-Solr-trunk-MacOSX/solr/build.xml:233: The following error occurred while executing this line:
/Users/jenkins/workspace/Lucene-Solr-trunk-MacOSX/solr/common-build.xml:516: The following error occurred while executing this line:
/Users/jenkins/workspace/Lucene-Solr-trunk-MacOSX/lucene/common-build.xml:1432: The following error occurred while executing this line:
/Users/jenkins/workspace/Lucene-Solr-trunk-MacOSX/lucene/common-build.xml:987: There were test failures: 547 suites (8 ignored), 2146 tests, 1 failure, 77 ignored (35 assumptions) [seed: 204D5D95BF66CB57]

Total time: 71 minutes 33 seconds
Build step 'Invoke Ant' marked build as failure
Archiving artifacts
[WARNINGS] Skipping publisher since build result is FAILURE
Recording test results
Email was triggered for: Failure - Any
Sending email for trigger: Failure - Any



Mime
View raw message