lucene-dev mailing list archives

Site index · List index
Message view « Date » · « Thread »
Top « Date » · « Thread »
From Policeman Jenkins Server <jenk...@thetaphi.de>
Subject [JENKINS] Lucene-Solr-trunk-Solaris (64bit/jdk1.8.0) - Build # 90 - Failure!
Date Thu, 01 Oct 2015 23:43:54 GMT
Build: http://jenkins.thetaphi.de/job/Lucene-Solr-trunk-Solaris/90/
Java: 64bit/jdk1.8.0 -XX:+UseCompressedOops -XX:+UseConcMarkSweepGC

1 tests failed.
FAILED:  org.apache.solr.security.PKIAuthenticationIntegrationTest.testPkiAuth

Error Message:
There are still nodes recoverying - waited for 10 seconds

Stack Trace:
java.lang.AssertionError: There are still nodes recoverying - waited for 10 seconds
	at __randomizedtesting.SeedInfo.seed([5D88118CA4532CC:356618492AF3B56D]:0)
	at org.junit.Assert.fail(Assert.java:93)
	at org.apache.solr.cloud.AbstractDistribZkTestBase.waitForRecoveriesToFinish(AbstractDistribZkTestBase.java:172)
	at org.apache.solr.cloud.AbstractFullDistribZkTestBase.waitForRecoveriesToFinish(AbstractFullDistribZkTestBase.java:836)
	at org.apache.solr.cloud.AbstractFullDistribZkTestBase.waitForThingsToLevelOut(AbstractFullDistribZkTestBase.java:1393)
	at org.apache.solr.security.PKIAuthenticationIntegrationTest.testPkiAuth(PKIAuthenticationIntegrationTest.java:52)
	at sun.reflect.NativeMethodAccessorImpl.invoke0(Native Method)
	at sun.reflect.NativeMethodAccessorImpl.invoke(NativeMethodAccessorImpl.java:62)
	at sun.reflect.DelegatingMethodAccessorImpl.invoke(DelegatingMethodAccessorImpl.java:43)
	at java.lang.reflect.Method.invoke(Method.java:497)
	at com.carrotsearch.randomizedtesting.RandomizedRunner.invoke(RandomizedRunner.java:1665)
	at com.carrotsearch.randomizedtesting.RandomizedRunner$8.evaluate(RandomizedRunner.java:864)
	at com.carrotsearch.randomizedtesting.RandomizedRunner$9.evaluate(RandomizedRunner.java:900)
	at com.carrotsearch.randomizedtesting.RandomizedRunner$10.evaluate(RandomizedRunner.java:914)
	at org.apache.solr.BaseDistributedSearchTestCase$ShardsRepeatRule$ShardsFixedStatement.callStatement(BaseDistributedSearchTestCase.java:963)
	at org.apache.solr.BaseDistributedSearchTestCase$ShardsRepeatRule$ShardsStatement.evaluate(BaseDistributedSearchTestCase.java:938)
	at com.carrotsearch.randomizedtesting.rules.SystemPropertiesRestoreRule$1.evaluate(SystemPropertiesRestoreRule.java:57)
	at org.apache.lucene.util.TestRuleSetupTeardownChained$1.evaluate(TestRuleSetupTeardownChained.java:50)
	at org.apache.lucene.util.AbstractBeforeAfterRule$1.evaluate(AbstractBeforeAfterRule.java:46)
	at org.apache.lucene.util.TestRuleThreadAndTestName$1.evaluate(TestRuleThreadAndTestName.java:49)
	at org.apache.lucene.util.TestRuleIgnoreAfterMaxFailures$1.evaluate(TestRuleIgnoreAfterMaxFailures.java:65)
	at org.apache.lucene.util.TestRuleMarkFailure$1.evaluate(TestRuleMarkFailure.java:48)
	at com.carrotsearch.randomizedtesting.rules.StatementAdapter.evaluate(StatementAdapter.java:36)
	at com.carrotsearch.randomizedtesting.ThreadLeakControl$StatementRunner.run(ThreadLeakControl.java:367)
	at com.carrotsearch.randomizedtesting.ThreadLeakControl.forkTimeoutingTask(ThreadLeakControl.java:809)
	at com.carrotsearch.randomizedtesting.ThreadLeakControl$3.evaluate(ThreadLeakControl.java:460)
	at com.carrotsearch.randomizedtesting.RandomizedRunner.runSingleTest(RandomizedRunner.java:873)
	at com.carrotsearch.randomizedtesting.RandomizedRunner$5.evaluate(RandomizedRunner.java:775)
	at com.carrotsearch.randomizedtesting.RandomizedRunner$6.evaluate(RandomizedRunner.java:809)
	at com.carrotsearch.randomizedtesting.RandomizedRunner$7.evaluate(RandomizedRunner.java:820)
	at com.carrotsearch.randomizedtesting.rules.StatementAdapter.evaluate(StatementAdapter.java:36)
	at com.carrotsearch.randomizedtesting.rules.SystemPropertiesRestoreRule$1.evaluate(SystemPropertiesRestoreRule.java:57)
	at org.apache.lucene.util.AbstractBeforeAfterRule$1.evaluate(AbstractBeforeAfterRule.java:46)
	at com.carrotsearch.randomizedtesting.rules.StatementAdapter.evaluate(StatementAdapter.java:36)
	at org.apache.lucene.util.TestRuleStoreClassName$1.evaluate(TestRuleStoreClassName.java:42)
	at com.carrotsearch.randomizedtesting.rules.NoShadowingOrOverridesOnMethodsRule$1.evaluate(NoShadowingOrOverridesOnMethodsRule.java:39)
	at com.carrotsearch.randomizedtesting.rules.NoShadowingOrOverridesOnMethodsRule$1.evaluate(NoShadowingOrOverridesOnMethodsRule.java:39)
	at com.carrotsearch.randomizedtesting.rules.StatementAdapter.evaluate(StatementAdapter.java:36)
	at com.carrotsearch.randomizedtesting.rules.StatementAdapter.evaluate(StatementAdapter.java:36)
	at com.carrotsearch.randomizedtesting.rules.StatementAdapter.evaluate(StatementAdapter.java:36)
	at org.apache.lucene.util.TestRuleAssertionsRequired$1.evaluate(TestRuleAssertionsRequired.java:54)
	at org.apache.lucene.util.TestRuleMarkFailure$1.evaluate(TestRuleMarkFailure.java:48)
	at org.apache.lucene.util.TestRuleIgnoreAfterMaxFailures$1.evaluate(TestRuleIgnoreAfterMaxFailures.java:65)
	at org.apache.lucene.util.TestRuleIgnoreTestSuites$1.evaluate(TestRuleIgnoreTestSuites.java:55)
	at com.carrotsearch.randomizedtesting.rules.StatementAdapter.evaluate(StatementAdapter.java:36)
	at com.carrotsearch.randomizedtesting.ThreadLeakControl$StatementRunner.run(ThreadLeakControl.java:367)
	at java.lang.Thread.run(Thread.java:745)




Build Log:
[...truncated 10895 lines...]
   [junit4] Suite: org.apache.solr.security.PKIAuthenticationIntegrationTest
   [junit4]   2> Creating dataDir: /export/home/jenkins/workspace/Lucene-Solr-trunk-Solaris/solr/build/solr-core/test/J1/temp/solr.security.PKIAuthenticationIntegrationTest_5D88118CA4532CC-001/init-core-data-001
   [junit4]   2> 3262052 INFO  (SUITE-PKIAuthenticationIntegrationTest-seed#[5D88118CA4532CC]-worker) [    ] o.a.s.BaseDistributedSearchTestCase Setting hostContext system property: /h_xg/vp
   [junit4]   2> 3262057 INFO  (TEST-PKIAuthenticationIntegrationTest.testPkiAuth-seed#[5D88118CA4532CC]) [    ] o.a.s.c.ZkTestServer STARTING ZK TEST SERVER
   [junit4]   2> 3262058 INFO  (Thread-10541) [    ] o.a.s.c.ZkTestServer client port:0.0.0.0/0.0.0.0:0
   [junit4]   2> 3262058 INFO  (Thread-10541) [    ] o.a.s.c.ZkTestServer Starting server
   [junit4]   2> 3262158 INFO  (TEST-PKIAuthenticationIntegrationTest.testPkiAuth-seed#[5D88118CA4532CC]) [    ] o.a.s.c.ZkTestServer start zk server on port:48764
   [junit4]   2> 3262159 INFO  (TEST-PKIAuthenticationIntegrationTest.testPkiAuth-seed#[5D88118CA4532CC]) [    ] o.a.s.c.c.SolrZkClient Using default ZkCredentialsProvider
   [junit4]   2> 3262159 INFO  (TEST-PKIAuthenticationIntegrationTest.testPkiAuth-seed#[5D88118CA4532CC]) [    ] o.a.s.c.c.ConnectionManager Waiting for client to connect to ZooKeeper
   [junit4]   2> 3262162 INFO  (zkCallback-2667-thread-1) [    ] o.a.s.c.c.ConnectionManager Watcher org.apache.solr.common.cloud.ConnectionManager@6b501423 name:ZooKeeperConnection Watcher:127.0.0.1:48764 got event WatchedEvent state:SyncConnected type:None path:null path:null type:None
   [junit4]   2> 3262163 INFO  (TEST-PKIAuthenticationIntegrationTest.testPkiAuth-seed#[5D88118CA4532CC]) [    ] o.a.s.c.c.ConnectionManager Client is connected to ZooKeeper
   [junit4]   2> 3262163 INFO  (TEST-PKIAuthenticationIntegrationTest.testPkiAuth-seed#[5D88118CA4532CC]) [    ] o.a.s.c.c.SolrZkClient Using default ZkACLProvider
   [junit4]   2> 3262163 INFO  (TEST-PKIAuthenticationIntegrationTest.testPkiAuth-seed#[5D88118CA4532CC]) [    ] o.a.s.c.c.SolrZkClient makePath: /solr
   [junit4]   2> 3262167 INFO  (TEST-PKIAuthenticationIntegrationTest.testPkiAuth-seed#[5D88118CA4532CC]) [    ] o.a.s.c.c.SolrZkClient Using default ZkCredentialsProvider
   [junit4]   2> 3262168 INFO  (TEST-PKIAuthenticationIntegrationTest.testPkiAuth-seed#[5D88118CA4532CC]) [    ] o.a.s.c.c.ConnectionManager Waiting for client to connect to ZooKeeper
   [junit4]   2> 3262170 INFO  (zkCallback-2668-thread-1) [    ] o.a.s.c.c.ConnectionManager Watcher org.apache.solr.common.cloud.ConnectionManager@2f87bf0 name:ZooKeeperConnection Watcher:127.0.0.1:48764/solr got event WatchedEvent state:SyncConnected type:None path:null path:null type:None
   [junit4]   2> 3262170 INFO  (TEST-PKIAuthenticationIntegrationTest.testPkiAuth-seed#[5D88118CA4532CC]) [    ] o.a.s.c.c.ConnectionManager Client is connected to ZooKeeper
   [junit4]   2> 3262170 INFO  (TEST-PKIAuthenticationIntegrationTest.testPkiAuth-seed#[5D88118CA4532CC]) [    ] o.a.s.c.c.SolrZkClient Using default ZkACLProvider
   [junit4]   2> 3262170 INFO  (TEST-PKIAuthenticationIntegrationTest.testPkiAuth-seed#[5D88118CA4532CC]) [    ] o.a.s.c.c.SolrZkClient makePath: /collections/collection1
   [junit4]   2> 3262174 INFO  (TEST-PKIAuthenticationIntegrationTest.testPkiAuth-seed#[5D88118CA4532CC]) [    ] o.a.s.c.c.SolrZkClient makePath: /collections/collection1/shards
   [junit4]   2> 3262176 INFO  (TEST-PKIAuthenticationIntegrationTest.testPkiAuth-seed#[5D88118CA4532CC]) [    ] o.a.s.c.c.SolrZkClient makePath: /collections/control_collection
   [junit4]   2> 3262178 INFO  (TEST-PKIAuthenticationIntegrationTest.testPkiAuth-seed#[5D88118CA4532CC]) [    ] o.a.s.c.c.SolrZkClient makePath: /collections/control_collection/shards
   [junit4]   2> 3262181 INFO  (TEST-PKIAuthenticationIntegrationTest.testPkiAuth-seed#[5D88118CA4532CC]) [    ] o.a.s.c.AbstractZkTestCase put /export/home/jenkins/workspace/Lucene-Solr-trunk-Solaris/solr/core/src/test-files/solr/collection1/conf/solrconfig-tlog.xml to /configs/conf1/solrconfig.xml
   [junit4]   2> 3262181 INFO  (TEST-PKIAuthenticationIntegrationTest.testPkiAuth-seed#[5D88118CA4532CC]) [    ] o.a.s.c.c.SolrZkClient makePath: /configs/conf1/solrconfig.xml
   [junit4]   2> 3262185 INFO  (TEST-PKIAuthenticationIntegrationTest.testPkiAuth-seed#[5D88118CA4532CC]) [    ] o.a.s.c.AbstractZkTestCase put /export/home/jenkins/workspace/Lucene-Solr-trunk-Solaris/solr/core/src/test-files/solr/collection1/conf/schema.xml to /configs/conf1/schema.xml
   [junit4]   2> 3262186 INFO  (TEST-PKIAuthenticationIntegrationTest.testPkiAuth-seed#[5D88118CA4532CC]) [    ] o.a.s.c.c.SolrZkClient makePath: /configs/conf1/schema.xml
   [junit4]   2> 3262189 INFO  (TEST-PKIAuthenticationIntegrationTest.testPkiAuth-seed#[5D88118CA4532CC]) [    ] o.a.s.c.AbstractZkTestCase put /export/home/jenkins/workspace/Lucene-Solr-trunk-Solaris/solr/core/src/test-files/solr/collection1/conf/solrconfig.snippet.randomindexconfig.xml to /configs/conf1/solrconfig.snippet.randomindexconfig.xml
   [junit4]   2> 3262189 INFO  (TEST-PKIAuthenticationIntegrationTest.testPkiAuth-seed#[5D88118CA4532CC]) [    ] o.a.s.c.c.SolrZkClient makePath: /configs/conf1/solrconfig.snippet.randomindexconfig.xml
   [junit4]   2> 3262192 INFO  (TEST-PKIAuthenticationIntegrationTest.testPkiAuth-seed#[5D88118CA4532CC]) [    ] o.a.s.c.AbstractZkTestCase put /export/home/jenkins/workspace/Lucene-Solr-trunk-Solaris/solr/core/src/test-files/solr/collection1/conf/stopwords.txt to /configs/conf1/stopwords.txt
   [junit4]   2> 3262192 INFO  (TEST-PKIAuthenticationIntegrationTest.testPkiAuth-seed#[5D88118CA4532CC]) [    ] o.a.s.c.c.SolrZkClient makePath: /configs/conf1/stopwords.txt
   [junit4]   2> 3262195 INFO  (TEST-PKIAuthenticationIntegrationTest.testPkiAuth-seed#[5D88118CA4532CC]) [    ] o.a.s.c.AbstractZkTestCase put /export/home/jenkins/workspace/Lucene-Solr-trunk-Solaris/solr/core/src/test-files/solr/collection1/conf/protwords.txt to /configs/conf1/protwords.txt
   [junit4]   2> 3262195 INFO  (TEST-PKIAuthenticationIntegrationTest.testPkiAuth-seed#[5D88118CA4532CC]) [    ] o.a.s.c.c.SolrZkClient makePath: /configs/conf1/protwords.txt
   [junit4]   2> 3262198 INFO  (TEST-PKIAuthenticationIntegrationTest.testPkiAuth-seed#[5D88118CA4532CC]) [    ] o.a.s.c.AbstractZkTestCase put /export/home/jenkins/workspace/Lucene-Solr-trunk-Solaris/solr/core/src/test-files/solr/collection1/conf/currency.xml to /configs/conf1/currency.xml
   [junit4]   2> 3262198 INFO  (TEST-PKIAuthenticationIntegrationTest.testPkiAuth-seed#[5D88118CA4532CC]) [    ] o.a.s.c.c.SolrZkClient makePath: /configs/conf1/currency.xml
   [junit4]   2> 3262201 INFO  (TEST-PKIAuthenticationIntegrationTest.testPkiAuth-seed#[5D88118CA4532CC]) [    ] o.a.s.c.AbstractZkTestCase put /export/home/jenkins/workspace/Lucene-Solr-trunk-Solaris/solr/core/src/test-files/solr/collection1/conf/enumsConfig.xml to /configs/conf1/enumsConfig.xml
   [junit4]   2> 3262201 INFO  (TEST-PKIAuthenticationIntegrationTest.testPkiAuth-seed#[5D88118CA4532CC]) [    ] o.a.s.c.c.SolrZkClient makePath: /configs/conf1/enumsConfig.xml
   [junit4]   2> 3262204 INFO  (TEST-PKIAuthenticationIntegrationTest.testPkiAuth-seed#[5D88118CA4532CC]) [    ] o.a.s.c.AbstractZkTestCase put /export/home/jenkins/workspace/Lucene-Solr-trunk-Solaris/solr/core/src/test-files/solr/collection1/conf/open-exchange-rates.json to /configs/conf1/open-exchange-rates.json
   [junit4]   2> 3262204 INFO  (TEST-PKIAuthenticationIntegrationTest.testPkiAuth-seed#[5D88118CA4532CC]) [    ] o.a.s.c.c.SolrZkClient makePath: /configs/conf1/open-exchange-rates.json
   [junit4]   2> 3262207 INFO  (TEST-PKIAuthenticationIntegrationTest.testPkiAuth-seed#[5D88118CA4532CC]) [    ] o.a.s.c.AbstractZkTestCase put /export/home/jenkins/workspace/Lucene-Solr-trunk-Solaris/solr/core/src/test-files/solr/collection1/conf/mapping-ISOLatin1Accent.txt to /configs/conf1/mapping-ISOLatin1Accent.txt
   [junit4]   2> 3262207 INFO  (TEST-PKIAuthenticationIntegrationTest.testPkiAuth-seed#[5D88118CA4532CC]) [    ] o.a.s.c.c.SolrZkClient makePath: /configs/conf1/mapping-ISOLatin1Accent.txt
   [junit4]   2> 3262212 INFO  (TEST-PKIAuthenticationIntegrationTest.testPkiAuth-seed#[5D88118CA4532CC]) [    ] o.a.s.c.AbstractZkTestCase put /export/home/jenkins/workspace/Lucene-Solr-trunk-Solaris/solr/core/src/test-files/solr/collection1/conf/old_synonyms.txt to /configs/conf1/old_synonyms.txt
   [junit4]   2> 3262212 INFO  (TEST-PKIAuthenticationIntegrationTest.testPkiAuth-seed#[5D88118CA4532CC]) [    ] o.a.s.c.c.SolrZkClient makePath: /configs/conf1/old_synonyms.txt
   [junit4]   2> 3262215 INFO  (TEST-PKIAuthenticationIntegrationTest.testPkiAuth-seed#[5D88118CA4532CC]) [    ] o.a.s.c.AbstractZkTestCase put /export/home/jenkins/workspace/Lucene-Solr-trunk-Solaris/solr/core/src/test-files/solr/collection1/conf/synonyms.txt to /configs/conf1/synonyms.txt
   [junit4]   2> 3262216 INFO  (TEST-PKIAuthenticationIntegrationTest.testPkiAuth-seed#[5D88118CA4532CC]) [    ] o.a.s.c.c.SolrZkClient makePath: /configs/conf1/synonyms.txt
   [junit4]   2> 3262992 INFO  (TEST-PKIAuthenticationIntegrationTest.testPkiAuth-seed#[5D88118CA4532CC]) [    ] o.a.s.SolrTestCaseJ4 Writing core.properties file to /export/home/jenkins/workspace/Lucene-Solr-trunk-Solaris/solr/build/solr-core/test/J1/temp/solr.security.PKIAuthenticationIntegrationTest_5D88118CA4532CC-001/control-001/cores/collection1
   [junit4]   2> 3262994 INFO  (TEST-PKIAuthenticationIntegrationTest.testPkiAuth-seed#[5D88118CA4532CC]) [    ] o.e.j.s.Server jetty-9.2.13.v20150730
   [junit4]   2> 3262996 INFO  (TEST-PKIAuthenticationIntegrationTest.testPkiAuth-seed#[5D88118CA4532CC]) [    ] o.e.j.s.h.ContextHandler Started o.e.j.s.ServletContextHandler@377440ac{/h_xg/vp,null,AVAILABLE}
   [junit4]   2> 3262997 INFO  (TEST-PKIAuthenticationIntegrationTest.testPkiAuth-seed#[5D88118CA4532CC]) [    ] o.e.j.s.ServerConnector Started ServerConnector@731b6d29{HTTP/1.1}{127.0.0.1:57799}
   [junit4]   2> 3262997 INFO  (TEST-PKIAuthenticationIntegrationTest.testPkiAuth-seed#[5D88118CA4532CC]) [    ] o.e.j.s.Server Started @3315346ms
   [junit4]   2> 3262997 INFO  (TEST-PKIAuthenticationIntegrationTest.testPkiAuth-seed#[5D88118CA4532CC]) [    ] o.a.s.c.s.e.JettySolrRunner Jetty properties: {solr.data.dir=/export/home/jenkins/workspace/Lucene-Solr-trunk-Solaris/solr/build/solr-core/test/J1/temp/solr.security.PKIAuthenticationIntegrationTest_5D88118CA4532CC-001/tempDir-001/control/data, hostContext=/h_xg/vp, hostPort=57799, coreRootDirectory=/export/home/jenkins/workspace/Lucene-Solr-trunk-Solaris/solr/build/solr-core/test/J1/temp/solr.security.PKIAuthenticationIntegrationTest_5D88118CA4532CC-001/control-001/cores}
   [junit4]   2> 3262997 INFO  (TEST-PKIAuthenticationIntegrationTest.testPkiAuth-seed#[5D88118CA4532CC]) [    ] o.a.s.s.SolrDispatchFilter SolrDispatchFilter.init(): sun.misc.Launcher$AppClassLoader@659e0bfd
   [junit4]   2> 3262997 INFO  (TEST-PKIAuthenticationIntegrationTest.testPkiAuth-seed#[5D88118CA4532CC]) [    ] o.a.s.c.SolrResourceLoader new SolrResourceLoader for directory: '/export/home/jenkins/workspace/Lucene-Solr-trunk-Solaris/solr/build/solr-core/test/J1/temp/solr.security.PKIAuthenticationIntegrationTest_5D88118CA4532CC-001/control-001/'
   [junit4]   2> 3263018 INFO  (TEST-PKIAuthenticationIntegrationTest.testPkiAuth-seed#[5D88118CA4532CC]) [    ] o.a.s.c.c.SolrZkClient Using default ZkCredentialsProvider
   [junit4]   2> 3263019 INFO  (TEST-PKIAuthenticationIntegrationTest.testPkiAuth-seed#[5D88118CA4532CC]) [    ] o.a.s.c.c.ConnectionManager Waiting for client to connect to ZooKeeper
   [junit4]   2> 3263021 INFO  (zkCallback-2669-thread-1) [    ] o.a.s.c.c.ConnectionManager Watcher org.apache.solr.common.cloud.ConnectionManager@5fcd29b0 name:ZooKeeperConnection Watcher:127.0.0.1:48764/solr got event WatchedEvent state:SyncConnected type:None path:null path:null type:None
   [junit4]   2> 3263021 INFO  (TEST-PKIAuthenticationIntegrationTest.testPkiAuth-seed#[5D88118CA4532CC]) [    ] o.a.s.c.c.ConnectionManager Client is connected to ZooKeeper
   [junit4]   2> 3263022 INFO  (TEST-PKIAuthenticationIntegrationTest.testPkiAuth-seed#[5D88118CA4532CC]) [    ] o.a.s.c.c.SolrZkClient Using default ZkACLProvider
   [junit4]   2> 3263023 INFO  (TEST-PKIAuthenticationIntegrationTest.testPkiAuth-seed#[5D88118CA4532CC]) [    ] o.a.s.s.SolrDispatchFilter Loading solr.xml from SolrHome (not found in ZooKeeper)
   [junit4]   2> 3263023 INFO  (TEST-PKIAuthenticationIntegrationTest.testPkiAuth-seed#[5D88118CA4532CC]) [    ] o.a.s.c.SolrXmlConfig Loading container configuration from /export/home/jenkins/workspace/Lucene-Solr-trunk-Solaris/solr/build/solr-core/test/J1/temp/solr.security.PKIAuthenticationIntegrationTest_5D88118CA4532CC-001/control-001/solr.xml
   [junit4]   2> 3263028 INFO  (TEST-PKIAuthenticationIntegrationTest.testPkiAuth-seed#[5D88118CA4532CC]) [    ] o.a.s.c.CoresLocator Config-defined core root directory: /export/home/jenkins/workspace/Lucene-Solr-trunk-Solaris/solr/build/solr-core/test/J1/temp/solr.security.PKIAuthenticationIntegrationTest_5D88118CA4532CC-001/control-001/cores
   [junit4]   2> 3263028 INFO  (TEST-PKIAuthenticationIntegrationTest.testPkiAuth-seed#[5D88118CA4532CC]) [    ] o.a.s.c.CoreContainer New CoreContainer 2061404491
   [junit4]   2> 3263028 INFO  (TEST-PKIAuthenticationIntegrationTest.testPkiAuth-seed#[5D88118CA4532CC]) [    ] o.a.s.c.CoreContainer Loading cores into CoreContainer [instanceDir=/export/home/jenkins/workspace/Lucene-Solr-trunk-Solaris/solr/build/solr-core/test/J1/temp/solr.security.PKIAuthenticationIntegrationTest_5D88118CA4532CC-001/control-001/]
   [junit4]   2> 3263028 INFO  (TEST-PKIAuthenticationIntegrationTest.testPkiAuth-seed#[5D88118CA4532CC]) [    ] o.a.s.c.CoreContainer loading shared library: /export/home/jenkins/workspace/Lucene-Solr-trunk-Solaris/solr/build/solr-core/test/J1/temp/solr.security.PKIAuthenticationIntegrationTest_5D88118CA4532CC-001/control-001/lib
   [junit4]   2> 3263028 WARN  (TEST-PKIAuthenticationIntegrationTest.testPkiAuth-seed#[5D88118CA4532CC]) [    ] o.a.s.c.SolrResourceLoader Can't find (or read) directory to add to classloader: lib (resolved as: /export/home/jenkins/workspace/Lucene-Solr-trunk-Solaris/solr/build/solr-core/test/J1/temp/solr.security.PKIAuthenticationIntegrationTest_5D88118CA4532CC-001/control-001/lib).
   [junit4]   2> 3263043 INFO  (TEST-PKIAuthenticationIntegrationTest.testPkiAuth-seed#[5D88118CA4532CC]) [    ] o.a.s.h.c.HttpShardHandlerFactory created with socketTimeout : 90000,urlScheme : ,connTimeout : 15000,maxConnectionsPerHost : 20,maxConnections : 10000,corePoolSize : 0,maximumPoolSize : 2147483647,maxThreadIdleTime : 5,sizeOfQueue : -1,fairnessPolicy : false,useRetries : false,
   [junit4]   2> 3263045 INFO  (TEST-PKIAuthenticationIntegrationTest.testPkiAuth-seed#[5D88118CA4532CC]) [    ] o.a.s.u.UpdateShardHandler Creating UpdateShardHandler HTTP client with params: socketTimeout=340000&connTimeout=45000&retry=true
   [junit4]   2> 3263046 INFO  (TEST-PKIAuthenticationIntegrationTest.testPkiAuth-seed#[5D88118CA4532CC]) [    ] o.a.s.l.LogWatcher SLF4J impl is org.slf4j.impl.Log4jLoggerFactory
   [junit4]   2> 3263046 INFO  (TEST-PKIAuthenticationIntegrationTest.testPkiAuth-seed#[5D88118CA4532CC]) [    ] o.a.s.l.LogWatcher Registering Log Listener [Log4j (org.slf4j.impl.Log4jLoggerFactory)]
   [junit4]   2> 3263047 INFO  (TEST-PKIAuthenticationIntegrationTest.testPkiAuth-seed#[5D88118CA4532CC]) [    ] o.a.s.c.ZkContainer Zookeeper client=127.0.0.1:48764/solr
   [junit4]   2> 3263047 INFO  (TEST-PKIAuthenticationIntegrationTest.testPkiAuth-seed#[5D88118CA4532CC]) [    ] o.a.s.c.ZkController zkHost includes chroot
   [junit4]   2> 3263047 INFO  (TEST-PKIAuthenticationIntegrationTest.testPkiAuth-seed#[5D88118CA4532CC]) [    ] o.a.s.c.c.SolrZkClient Using default ZkCredentialsProvider
   [junit4]   2> 3263047 INFO  (TEST-PKIAuthenticationIntegrationTest.testPkiAuth-seed#[5D88118CA4532CC]) [    ] o.a.s.c.c.ConnectionManager Waiting for client to connect to ZooKeeper
   [junit4]   2> 3263049 INFO  (zkCallback-2671-thread-1) [    ] o.a.s.c.c.ConnectionManager Watcher org.apache.solr.common.cloud.ConnectionManager@78e32720 name:ZooKeeperConnection Watcher:127.0.0.1:48764 got event WatchedEvent state:SyncConnected type:None path:null path:null type:None
   [junit4]   2> 3263049 INFO  (TEST-PKIAuthenticationIntegrationTest.testPkiAuth-seed#[5D88118CA4532CC]) [    ] o.a.s.c.c.ConnectionManager Client is connected to ZooKeeper
   [junit4]   2> 3263050 INFO  (TEST-PKIAuthenticationIntegrationTest.testPkiAuth-seed#[5D88118CA4532CC]) [    ] o.a.s.c.c.SolrZkClient Using default ZkACLProvider
   [junit4]   2> 3263051 INFO  (TEST-PKIAuthenticationIntegrationTest.testPkiAuth-seed#[5D88118CA4532CC]) [n:127.0.0.1:57799_h_xg%2Fvp    ] o.a.s.c.c.ConnectionManager Waiting for client to connect to ZooKeeper
   [junit4]   2> 3263053 INFO  (zkCallback-2672-thread-1-processing-n:127.0.0.1:57799_h_xg%2Fvp) [n:127.0.0.1:57799_h_xg%2Fvp    ] o.a.s.c.c.ConnectionManager Watcher org.apache.solr.common.cloud.ConnectionManager@6f28508c name:ZooKeeperConnection Watcher:127.0.0.1:48764/solr got event WatchedEvent state:SyncConnected type:None path:null path:null type:None
   [junit4]   2> 3263054 INFO  (TEST-PKIAuthenticationIntegrationTest.testPkiAuth-seed#[5D88118CA4532CC]) [n:127.0.0.1:57799_h_xg%2Fvp    ] o.a.s.c.c.ConnectionManager Client is connected to ZooKeeper
   [junit4]   2> 3263056 INFO  (TEST-PKIAuthenticationIntegrationTest.testPkiAuth-seed#[5D88118CA4532CC]) [n:127.0.0.1:57799_h_xg%2Fvp    ] o.a.s.c.c.SolrZkClient makePath: /overseer/queue
   [junit4]   2> 3263059 INFO  (TEST-PKIAuthenticationIntegrationTest.testPkiAuth-seed#[5D88118CA4532CC]) [n:127.0.0.1:57799_h_xg%2Fvp    ] o.a.s.c.c.SolrZkClient makePath: /overseer/collection-queue-work
   [junit4]   2> 3263068 INFO  (TEST-PKIAuthenticationIntegrationTest.testPkiAuth-seed#[5D88118CA4532CC]) [n:127.0.0.1:57799_h_xg%2Fvp    ] o.a.s.c.c.SolrZkClient makePath: /overseer/collection-map-running
   [junit4]   2> 3263073 INFO  (TEST-PKIAuthenticationIntegrationTest.testPkiAuth-seed#[5D88118CA4532CC]) [n:127.0.0.1:57799_h_xg%2Fvp    ] o.a.s.c.c.SolrZkClient makePath: /overseer/collection-map-completed
   [junit4]   2> 3263077 INFO  (TEST-PKIAuthenticationIntegrationTest.testPkiAuth-seed#[5D88118CA4532CC]) [n:127.0.0.1:57799_h_xg%2Fvp    ] o.a.s.c.c.SolrZkClient makePath: /overseer/collection-map-failure
   [junit4]   2> 3263080 INFO  (TEST-PKIAuthenticationIntegrationTest.testPkiAuth-seed#[5D88118CA4532CC]) [n:127.0.0.1:57799_h_xg%2Fvp    ] o.a.s.c.c.SolrZkClient makePath: /live_nodes
   [junit4]   2> 3263083 INFO  (TEST-PKIAuthenticationIntegrationTest.testPkiAuth-seed#[5D88118CA4532CC]) [n:127.0.0.1:57799_h_xg%2Fvp    ] o.a.s.c.c.SolrZkClient makePath: /aliases.json
   [junit4]   2> 3263085 INFO  (TEST-PKIAuthenticationIntegrationTest.testPkiAuth-seed#[5D88118CA4532CC]) [n:127.0.0.1:57799_h_xg%2Fvp    ] o.a.s.c.c.SolrZkClient makePath: /clusterstate.json
   [junit4]   2> 3263087 INFO  (TEST-PKIAuthenticationIntegrationTest.testPkiAuth-seed#[5D88118CA4532CC]) [n:127.0.0.1:57799_h_xg%2Fvp    ] o.a.s.c.c.SolrZkClient makePath: /security.json
   [junit4]   2> 3263089 INFO  (TEST-PKIAuthenticationIntegrationTest.testPkiAuth-seed#[5D88118CA4532CC]) [n:127.0.0.1:57799_h_xg%2Fvp    ] o.a.s.c.ZkController Register node as live in ZooKeeper:/live_nodes/127.0.0.1:57799_h_xg%2Fvp
   [junit4]   2> 3263089 INFO  (TEST-PKIAuthenticationIntegrationTest.testPkiAuth-seed#[5D88118CA4532CC]) [n:127.0.0.1:57799_h_xg%2Fvp    ] o.a.s.c.c.SolrZkClient makePath: /live_nodes/127.0.0.1:57799_h_xg%2Fvp
   [junit4]   2> 3263092 INFO  (TEST-PKIAuthenticationIntegrationTest.testPkiAuth-seed#[5D88118CA4532CC]) [n:127.0.0.1:57799_h_xg%2Fvp    ] o.a.s.c.c.SolrZkClient makePath: /overseer_elect
   [junit4]   2> 3263094 INFO  (TEST-PKIAuthenticationIntegrationTest.testPkiAuth-seed#[5D88118CA4532CC]) [n:127.0.0.1:57799_h_xg%2Fvp    ] o.a.s.c.c.SolrZkClient makePath: /overseer_elect/election
   [junit4]   2> 3263096 INFO  (TEST-PKIAuthenticationIntegrationTest.testPkiAuth-seed#[5D88118CA4532CC]) [n:127.0.0.1:57799_h_xg%2Fvp    ] o.a.s.c.Overseer Overseer (id=null) closing
   [junit4]   2> 3263097 INFO  (TEST-PKIAuthenticationIntegrationTest.testPkiAuth-seed#[5D88118CA4532CC]) [n:127.0.0.1:57799_h_xg%2Fvp    ] o.a.s.c.LeaderElector Joined leadership election with path: /overseer_elect/election/94617162632527876-127.0.0.1:57799_h_xg%2Fvp-n_0000000000
   [junit4]   2> 3263098 INFO  (TEST-PKIAuthenticationIntegrationTest.testPkiAuth-seed#[5D88118CA4532CC]) [n:127.0.0.1:57799_h_xg%2Fvp    ] o.a.s.c.OverseerElectionContext I am going to be the leader 127.0.0.1:57799_h_xg%2Fvp
   [junit4]   2> 3263098 INFO  (TEST-PKIAuthenticationIntegrationTest.testPkiAuth-seed#[5D88118CA4532CC]) [n:127.0.0.1:57799_h_xg%2Fvp    ] o.a.s.c.c.SolrZkClient makePath: /overseer_elect/leader
   [junit4]   2> 3263101 INFO  (TEST-PKIAuthenticationIntegrationTest.testPkiAuth-seed#[5D88118CA4532CC]) [n:127.0.0.1:57799_h_xg%2Fvp    ] o.a.s.c.Overseer Overseer (id=94617162632527876-127.0.0.1:57799_h_xg%2Fvp-n_0000000000) starting
   [junit4]   2> 3263103 INFO  (TEST-PKIAuthenticationIntegrationTest.testPkiAuth-seed#[5D88118CA4532CC]) [n:127.0.0.1:57799_h_xg%2Fvp    ] o.a.s.c.c.SolrZkClient makePath: /overseer/queue-work
   [junit4]   2> 3263114 INFO  (TEST-PKIAuthenticationIntegrationTest.testPkiAuth-seed#[5D88118CA4532CC]) [n:127.0.0.1:57799_h_xg%2Fvp    ] o.a.s.c.OverseerAutoReplicaFailoverThread Starting OverseerAutoReplicaFailoverThread autoReplicaFailoverWorkLoopDelay=10000 autoReplicaFailoverWaitAfterExpiration=30000 autoReplicaFailoverBadNodeExpiration=60000
   [junit4]   2> 3263114 INFO  (OverseerCollectionConfigSetProcessor-94617162632527876-127.0.0.1:57799_h_xg%2Fvp-n_0000000000) [n:127.0.0.1:57799_h_xg%2Fvp    ] o.a.s.c.OverseerTaskProcessor Process current queue of overseer operations
   [junit4]   2> 3263115 INFO  (TEST-PKIAuthenticationIntegrationTest.testPkiAuth-seed#[5D88118CA4532CC]) [n:127.0.0.1:57799_h_xg%2Fvp    ] o.a.s.c.c.ZkStateReader Updating cluster state from ZooKeeper... 
   [junit4]   2> 3263115 INFO  (OverseerStateUpdate-94617162632527876-127.0.0.1:57799_h_xg%2Fvp-n_0000000000) [n:127.0.0.1:57799_h_xg%2Fvp    ] o.a.s.c.Overseer Starting to work on the main queue
   [junit4]   2> 3263126 INFO  (TEST-PKIAuthenticationIntegrationTest.testPkiAuth-seed#[5D88118CA4532CC]) [n:127.0.0.1:57799_h_xg%2Fvp    ] o.a.s.c.CoreContainer Security conf doesn't exist. Skipping setup for authorization module.
   [junit4]   2> 3263126 INFO  (TEST-PKIAuthenticationIntegrationTest.testPkiAuth-seed#[5D88118CA4532CC]) [n:127.0.0.1:57799_h_xg%2Fvp    ] o.a.s.c.CoreContainer No authentication plugin used.
   [junit4]   2> 3263128 INFO  (TEST-PKIAuthenticationIntegrationTest.testPkiAuth-seed#[5D88118CA4532CC]) [n:127.0.0.1:57799_h_xg%2Fvp    ] o.a.s.c.CoresLocator Looking for core definitions underneath /export/home/jenkins/workspace/Lucene-Solr-trunk-Solaris/solr/build/solr-core/test/J1/temp/solr.security.PKIAuthenticationIntegrationTest_5D88118CA4532CC-001/control-001/cores
   [junit4]   2> 3263128 INFO  (TEST-PKIAuthenticationIntegrationTest.testPkiAuth-seed#[5D88118CA4532CC]) [n:127.0.0.1:57799_h_xg%2Fvp    ] o.a.s.c.SolrCore Created CoreDescriptor: {name=collection1, config=solrconfig.xml, transient=false, schema=schema.xml, loadOnStartup=true, configSetProperties=configsetprops.json, instanceDir=/export/home/jenkins/workspace/Lucene-Solr-trunk-Solaris/solr/build/solr-core/test/J1/temp/solr.security.PKIAuthenticationIntegrationTest_5D88118CA4532CC-001/control-001/cores/collection1, collection=control_collection, absoluteInstDir=/export/home/jenkins/workspace/Lucene-Solr-trunk-Solaris/solr/build/solr-core/test/J1/temp/solr.security.PKIAuthenticationIntegrationTest_5D88118CA4532CC-001/control-001/cores/collection1/, coreNodeName=, dataDir=data/, shard=}
   [junit4]   2> 3263128 INFO  (TEST-PKIAuthenticationIntegrationTest.testPkiAuth-seed#[5D88118CA4532CC]) [n:127.0.0.1:57799_h_xg%2Fvp    ] o.a.s.c.CoresLocator Found core collection1 in /export/home/jenkins/workspace/Lucene-Solr-trunk-Solaris/solr/build/solr-core/test/J1/temp/solr.security.PKIAuthenticationIntegrationTest_5D88118CA4532CC-001/control-001/cores/collection1/
   [junit4]   2> 3263129 INFO  (TEST-PKIAuthenticationIntegrationTest.testPkiAuth-seed#[5D88118CA4532CC]) [n:127.0.0.1:57799_h_xg%2Fvp    ] o.a.s.c.CoresLocator Found 1 core definitions
   [junit4]   2> 3263130 INFO  (TEST-PKIAuthenticationIntegrationTest.testPkiAuth-seed#[5D88118CA4532CC]) [n:127.0.0.1:57799_h_xg%2Fvp    ] o.a.s.s.SolrDispatchFilter user.dir=/export/home/jenkins/workspace/Lucene-Solr-trunk-Solaris/solr/build/solr-core/test/J1
   [junit4]   2> 3263130 INFO  (TEST-PKIAuthenticationIntegrationTest.testPkiAuth-seed#[5D88118CA4532CC]) [n:127.0.0.1:57799_h_xg%2Fvp    ] o.a.s.s.SolrDispatchFilter SolrDispatchFilter.init() done
   [junit4]   2> 3263130 INFO  (coreLoadExecutor-9137-thread-1-processing-n:127.0.0.1:57799_h_xg%2Fvp) [n:127.0.0.1:57799_h_xg%2Fvp c:control_collection   x:collection1] o.a.s.c.ZkController publishing state=down
   [junit4]   2> 3263130 INFO  (coreLoadExecutor-9137-thread-1-processing-n:127.0.0.1:57799_h_xg%2Fvp) [n:127.0.0.1:57799_h_xg%2Fvp c:control_collection   x:collection1] o.a.s.c.ZkController numShards not found on descriptor - reading it from system property
   [junit4]   2> 3263134 INFO  (OverseerStateUpdate-94617162632527876-127.0.0.1:57799_h_xg%2Fvp-n_0000000000) [n:127.0.0.1:57799_h_xg%2Fvp    ] o.a.s.c.Overseer processMessage: queueSize: 1, message = {
   [junit4]   2>   "core":"collection1",
   [junit4]   2>   "roles":null,
   [junit4]   2>   "base_url":"http://127.0.0.1:57799/h_xg/vp",
   [junit4]   2>   "node_name":"127.0.0.1:57799_h_xg%2Fvp",
   [junit4]   2>   "numShards":"1",
   [junit4]   2>   "state":"down",
   [junit4]   2>   "shard":null,
   [junit4]   2>   "collection":"control_collection",
   [junit4]   2>   "operation":"state"} current state version: 0
   [junit4]   2> 3263134 INFO  (coreLoadExecutor-9137-thread-1-processing-n:127.0.0.1:57799_h_xg%2Fvp) [n:127.0.0.1:57799_h_xg%2Fvp c:control_collection   x:collection1] o.a.s.c.ZkController look for our core node name
   [junit4]   2> 3263134 INFO  (OverseerStateUpdate-94617162632527876-127.0.0.1:57799_h_xg%2Fvp-n_0000000000) [n:127.0.0.1:57799_h_xg%2Fvp    ] o.a.s.c.o.ReplicaMutator Update state numShards=1 message={
   [junit4]   2>   "core":"collection1",
   [junit4]   2>   "roles":null,
   [junit4]   2>   "base_url":"http://127.0.0.1:57799/h_xg/vp",
   [junit4]   2>   "node_name":"127.0.0.1:57799_h_xg%2Fvp",
   [junit4]   2>   "numShards":"1",
   [junit4]   2>   "state":"down",
   [junit4]   2>   "shard":null,
   [junit4]   2>   "collection":"control_collection",
   [junit4]   2>   "operation":"state"}
   [junit4]   2> 3263135 INFO  (OverseerStateUpdate-94617162632527876-127.0.0.1:57799_h_xg%2Fvp-n_0000000000) [n:127.0.0.1:57799_h_xg%2Fvp    ] o.a.s.c.o.ClusterStateMutator building a new cName: control_collection
   [junit4]   2> 3263136 INFO  (OverseerStateUpdate-94617162632527876-127.0.0.1:57799_h_xg%2Fvp-n_0000000000) [n:127.0.0.1:57799_h_xg%2Fvp    ] o.a.s.c.o.ReplicaMutator Assigning new node to shard shard=shard1
   [junit4]   2> 3263137 INFO  (zkCallback-2672-thread-1-processing-n:127.0.0.1:57799_h_xg%2Fvp) [n:127.0.0.1:57799_h_xg%2Fvp    ] o.a.s.c.c.ZkStateReader A cluster state change: WatchedEvent state:SyncConnected type:NodeDataChanged path:/clusterstate.json, has occurred - updating... (live nodes size: 1)
   [junit4]   2> 3264136 INFO  (coreLoadExecutor-9137-thread-1-processing-n:127.0.0.1:57799_h_xg%2Fvp) [n:127.0.0.1:57799_h_xg%2Fvp c:control_collection   x:collection1] o.a.s.c.ZkController waiting to find shard id in clusterstate for collection1
   [junit4]   2> 3264136 INFO  (coreLoadExecutor-9137-thread-1-processing-n:127.0.0.1:57799_h_xg%2Fvp) [n:127.0.0.1:57799_h_xg%2Fvp c:control_collection   x:collection1] o.a.s.c.ZkController Check for collection zkNode:control_collection
   [junit4]   2> 3264138 INFO  (coreLoadExecutor-9137-thread-1-processing-n:127.0.0.1:57799_h_xg%2Fvp) [n:127.0.0.1:57799_h_xg%2Fvp c:control_collection   x:collection1] o.a.s.c.ZkController Collection zkNode exists
   [junit4]   2> 3264138 INFO  (coreLoadExecutor-9137-thread-1-processing-n:127.0.0.1:57799_h_xg%2Fvp) [n:127.0.0.1:57799_h_xg%2Fvp c:control_collection   x:collection1] o.a.s.c.c.ZkStateReader Load collection config from:/collections/control_collection
   [junit4]   2> 3264139 INFO  (coreLoadExecutor-9137-thread-1-processing-n:127.0.0.1:57799_h_xg%2Fvp) [n:127.0.0.1:57799_h_xg%2Fvp c:control_collection   x:collection1] o.a.s.c.c.ZkStateReader path=/collections/control_collection configName=conf1 specified config exists in ZooKeeper
   [junit4]   2> 3264139 INFO  (coreLoadExecutor-9137-thread-1-processing-n:127.0.0.1:57799_h_xg%2Fvp) [n:127.0.0.1:57799_h_xg%2Fvp c:control_collection   x:collection1] o.a.s.c.SolrResourceLoader new SolrResourceLoader for directory: '/export/home/jenkins/workspace/Lucene-Solr-trunk-Solaris/solr/build/solr-core/test/J1/temp/solr.security.PKIAuthenticationIntegrationTest_5D88118CA4532CC-001/control-001/cores/collection1/'
   [junit4]   2> 3264162 INFO  (coreLoadExecutor-9137-thread-1-processing-n:127.0.0.1:57799_h_xg%2Fvp) [n:127.0.0.1:57799_h_xg%2Fvp c:control_collection   x:collection1] o.a.s.c.Config loaded config solrconfig.xml with version 0 
   [junit4]   2> 3264168 INFO  (coreLoadExecutor-9137-thread-1-processing-n:127.0.0.1:57799_h_xg%2Fvp) [n:127.0.0.1:57799_h_xg%2Fvp c:control_collection   x:collection1] o.a.s.c.SolrConfig current version of requestparams : -1
   [junit4]   2> 3264173 INFO  (coreLoadExecutor-9137-thread-1-processing-n:127.0.0.1:57799_h_xg%2Fvp) [n:127.0.0.1:57799_h_xg%2Fvp c:control_collection   x:collection1] o.a.s.c.SolrConfig Using Lucene MatchVersion: 6.0.0
   [junit4]   2> 3264181 INFO  (coreLoadExecutor-9137-thread-1-processing-n:127.0.0.1:57799_h_xg%2Fvp) [n:127.0.0.1:57799_h_xg%2Fvp c:control_collection   x:collection1] o.a.s.c.Config Loaded SolrConfig: solrconfig.xml
   [junit4]   2> 3264182 INFO  (coreLoadExecutor-9137-thread-1-processing-n:127.0.0.1:57799_h_xg%2Fvp) [n:127.0.0.1:57799_h_xg%2Fvp c:control_collection   x:collection1] o.a.s.s.IndexSchema Reading Solr Schema from /configs/conf1/schema.xml
   [junit4]   2> 3264189 INFO  (coreLoadExecutor-9137-thread-1-processing-n:127.0.0.1:57799_h_xg%2Fvp) [n:127.0.0.1:57799_h_xg%2Fvp c:control_collection   x:collection1] o.a.s.s.IndexSchema [collection1] Schema name=test
   [junit4]   2> 3264318 INFO  (coreLoadExecutor-9137-thread-1-processing-n:127.0.0.1:57799_h_xg%2Fvp) [n:127.0.0.1:57799_h_xg%2Fvp c:control_collection   x:collection1] o.a.s.s.OpenExchangeRatesOrgProvider Initialized with rates=open-exchange-rates.json, refreshInterval=1440.
   [junit4]   2> 3264327 INFO  (coreLoadExecutor-9137-thread-1-processing-n:127.0.0.1:57799_h_xg%2Fvp) [n:127.0.0.1:57799_h_xg%2Fvp c:control_collection   x:collection1] o.a.s.s.IndexSchema default search field in schema is text
   [junit4]   2> 3264327 INFO  (coreLoadExecutor-9137-thread-1-processing-n:127.0.0.1:57799_h_xg%2Fvp) [n:127.0.0.1:57799_h_xg%2Fvp c:control_collection   x:collection1] o.a.s.s.IndexSchema unique key field: id
   [junit4]   2> 3264356 INFO  (coreLoadExecutor-9137-thread-1-processing-n:127.0.0.1:57799_h_xg%2Fvp) [n:127.0.0.1:57799_h_xg%2Fvp c:control_collection   x:collection1] o.a.s.s.FileExchangeRateProvider Reloading exchange rates from file currency.xml
   [junit4]   2> 3264359 INFO  (coreLoadExecutor-9137-thread-1-processing-n:127.0.0.1:57799_h_xg%2Fvp) [n:127.0.0.1:57799_h_xg%2Fvp c:control_collection   x:collection1] o.a.s.s.FileExchangeRateProvider Reloading exchange rates from file currency.xml
   [junit4]   2> 3264362 INFO  (coreLoadExecutor-9137-thread-1-processing-n:127.0.0.1:57799_h_xg%2Fvp) [n:127.0.0.1:57799_h_xg%2Fvp c:control_collection   x:collection1] o.a.s.s.OpenExchangeRatesOrgProvider Reloading exchange rates from open-exchange-rates.json
   [junit4]   2> 3264364 WARN  (coreLoadExecutor-9137-thread-1-processing-n:127.0.0.1:57799_h_xg%2Fvp) [n:127.0.0.1:57799_h_xg%2Fvp c:control_collection   x:collection1] o.a.s.s.OpenExchangeRatesOrgProvider Unknown key IMPORTANT NOTE
   [junit4]   2> 3264364 WARN  (coreLoadExecutor-9137-thread-1-processing-n:127.0.0.1:57799_h_xg%2Fvp) [n:127.0.0.1:57799_h_xg%2Fvp c:control_collection   x:collection1] o.a.s.s.OpenExchangeRatesOrgProvider Expected key, got STRING
   [junit4]   2> 3264364 INFO  (coreLoadExecutor-9137-thread-1-processing-n:127.0.0.1:57799_h_xg%2Fvp) [n:127.0.0.1:57799_h_xg%2Fvp c:control_collection   x:collection1] o.a.s.s.OpenExchangeRatesOrgProvider Reloading exchange rates from open-exchange-rates.json
   [junit4]   2> 3264366 WARN  (coreLoadExecutor-9137-thread-1-processing-n:127.0.0.1:57799_h_xg%2Fvp) [n:127.0.0.1:57799_h_xg%2Fvp c:control_collection   x:collection1] o.a.s.s.OpenExchangeRatesOrgProvider Unknown key IMPORTANT NOTE
   [junit4]   2> 3264366 WARN  (coreLoadExecutor-9137-thread-1-processing-n:127.0.0.1:57799_h_xg%2Fvp) [n:127.0.0.1:57799_h_xg%2Fvp c:control_collection   x:collection1] o.a.s.s.OpenExchangeRatesOrgProvider Expected key, got STRING
   [junit4]   2> 3264368 INFO  (coreLoadExecutor-9137-thread-1-processing-n:127.0.0.1:57799_h_xg%2Fvp) [n:127.0.0.1:57799_h_xg%2Fvp c:control_collection   x:collection1] o.a.s.c.ConfigSetProperties Did not find ConfigSet properties, assuming default properties: Can't find resource 'configsetprops.json' in classpath or '/configs/conf1', cwd=/export/home/jenkins/workspace/Lucene-Solr-trunk-Solaris/solr/build/solr-core/test/J1
   [junit4]   2> 3264368 INFO  (coreLoadExecutor-9137-thread-1-processing-n:127.0.0.1:57799_h_xg%2Fvp) [n:127.0.0.1:57799_h_xg%2Fvp c:control_collection   x:collection1] o.a.s.c.CoreContainer Creating SolrCore 'collection1' using configuration from collection control_collection
   [junit4]   2> 3264368 INFO  (coreLoadExecutor-9137-thread-1-processing-n:127.0.0.1:57799_h_xg%2Fvp) [n:127.0.0.1:57799_h_xg%2Fvp c:control_collection s:shard1 r:core_node1 x:collection1] o.a.s.c.SolrCore org.apache.solr.core.MockDirectoryFactory
   [junit4]   2> 3264368 INFO  (coreLoadExecutor-9137-thread-1-processing-n:127.0.0.1:57799_h_xg%2Fvp) [n:127.0.0.1:57799_h_xg%2Fvp c:control_collection s:shard1 r:core_node1 x:collection1] o.a.s.c.SolrCore [[collection1] ] Opening new SolrCore at [/export/home/jenkins/workspace/Lucene-Solr-trunk-Solaris/solr/build/solr-core/test/J1/temp/solr.security.PKIAuthenticationIntegrationTest_5D88118CA4532CC-001/control-001/cores/collection1/], dataDir=[null]
   [junit4]   2> 3264369 INFO  (coreLoadExecutor-9137-thread-1-processing-n:127.0.0.1:57799_h_xg%2Fvp) [n:127.0.0.1:57799_h_xg%2Fvp c:control_collection s:shard1 r:core_node1 x:collection1] o.a.s.c.JmxMonitoredMap JMX monitoring is enabled. Adding Solr mbeans to JMX Server: com.sun.jmx.mbeanserver.JmxMBeanServer@edbd445
   [junit4]   2> 3264369 INFO  (coreLoadExecutor-9137-thread-1-processing-n:127.0.0.1:57799_h_xg%2Fvp) [n:127.0.0.1:57799_h_xg%2Fvp c:control_collection s:shard1 r:core_node1 x:collection1] o.a.s.c.CachingDirectoryFactory return new directory for /export/home/jenkins/workspace/Lucene-Solr-trunk-Solaris/solr/build/solr-core/test/J1/temp/solr.security.PKIAuthenticationIntegrationTest_5D88118CA4532CC-001/control-001/cores/collection1/data
   [junit4]   2> 3264369 INFO  (coreLoadExecutor-9137-thread-1-processing-n:127.0.0.1:57799_h_xg%2Fvp) [n:127.0.0.1:57799_h_xg%2Fvp c:control_collection s:shard1 r:core_node1 x:collection1] o.a.s.c.SolrCore New index directory detected: old=null new=/export/home/jenkins/workspace/Lucene-Solr-trunk-Solaris/solr/build/solr-core/test/J1/temp/solr.security.PKIAuthenticationIntegrationTest_5D88118CA4532CC-001/control-001/cores/collection1/data/index/
   [junit4]   2> 3264369 WARN  (coreLoadExecutor-9137-thread-1-processing-n:127.0.0.1:57799_h_xg%2Fvp) [n:127.0.0.1:57799_h_xg%2Fvp c:control_collection s:shard1 r:core_node1 x:collection1] o.a.s.c.SolrCore [collection1] Solr index directory '/export/home/jenkins/workspace/Lucene-Solr-trunk-Solaris/solr/build/solr-core/test/J1/temp/solr.security.PKIAuthenticationIntegrationTest_5D88118CA4532CC-001/control-001/cores/collection1/data/index' doesn't exist. Creating new index...
   [junit4]   2> 3264370 INFO  (coreLoadExecutor-9137-thread-1-processing-n:127.0.0.1:57799_h_xg%2Fvp) [n:127.0.0.1:57799_h_xg%2Fvp c:control_collection s:shard1 r:core_node1 x:collection1] o.a.s.c.CachingDirectoryFactory return new directory for /export/home/jenkins/workspace/Lucene-Solr-trunk-Solaris/solr/build/solr-core/test/J1/temp/solr.security.PKIAuthenticationIntegrationTest_5D88118CA4532CC-001/control-001/cores/collection1/data/index
   [junit4]   2> 3264370 INFO  (coreLoadExecutor-9137-thread-1-processing-n:127.0.0.1:57799_h_xg%2Fvp) [n:127.0.0.1:57799_h_xg%2Fvp c:control_collection s:shard1 r:core_node1 x:collection1] o.a.s.u.RandomMergePolicy RandomMergePolicy wrapping class org.apache.lucene.index.TieredMergePolicy: [TieredMergePolicy: maxMergeAtOnce=34, maxMergeAtOnceExplicit=25, maxMergedSegmentMB=94.7490234375, floorSegmentMB=1.6015625, forceMergeDeletesPctAllowed=4.24564701763654, segmentsPerTier=15.0, maxCFSSegmentSizeMB=8.796093022207999E12, noCFSRatio=0.8210932217831355
   [junit4]   2> 3264371 INFO  (coreLoadExecutor-9137-thread-1-processing-n:127.0.0.1:57799_h_xg%2Fvp) [n:127.0.0.1:57799_h_xg%2Fvp c:control_collection s:shard1 r:core_node1 x:collection1] o.a.s.c.SolrCore SolrDeletionPolicy.onCommit: commits: num=1
   [junit4]   2> 	commit{dir=MockDirectoryWrapper(NRTCachingDirectory(RAMDirectory@294db27e lockFactory=org.apache.lucene.store.SingleInstanceLockFactory@75eabd35; maxCacheMB=0.263671875 maxMergeSizeMB=0.6357421875)),segFN=segments_1,generation=1}
   [junit4]   2> 3264371 INFO  (coreLoadExecutor-9137-thread-1-processing-n:127.0.0.1:57799_h_xg%2Fvp) [n:127.0.0.1:57799_h_xg%2Fvp c:control_collection s:shard1 r:core_node1 x:collection1] o.a.s.c.SolrCore newest commit generation = 1
   [junit4]   2> 3264378 INFO  (coreLoadExecutor-9137-thread-1-processing-n:127.0.0.1:57799_h_xg%2Fvp) [n:127.0.0.1:57799_h_xg%2Fvp c:control_collection s:shard1 r:core_node1 x:collection1] o.a.s.u.p.UpdateRequestProcessorChain creating updateRequestProcessorChain "nodistrib"
   [junit4]   2> 3264379 INFO  (coreLoadExecutor-9137-thread-1-processing-n:127.0.0.1:57799_h_xg%2Fvp) [n:127.0.0.1:57799_h_xg%2Fvp c:control_collection s:shard1 r:core_node1 x:collection1] o.a.s.u.p.UpdateRequestProcessorChain creating updateRequestProcessorChain "dedupe"
   [junit4]   2> 3264379 INFO  (coreLoadExecutor-9137-thread-1-processing-n:127.0.0.1:57799_h_xg%2Fvp) [n:127.0.0.1:57799_h_xg%2Fvp c:control_collection s:shard1 r:core_node1 x:collection1] o.a.s.u.p.UpdateRequestProcessorChain inserting DistributedUpdateProcessorFactory into updateRequestProcessorChain "dedupe"
   [junit4]   2> 3264379 INFO  (coreLoadExecutor-9137-thread-1-processing-n:127.0.0.1:57799_h_xg%2Fvp) [n:127.0.0.1:57799_h_xg%2Fvp c:control_collection s:shard1 r:core_node1 x:collection1] o.a.s.u.p.UpdateRequestProcessorChain creating updateRequestProcessorChain "stored_sig"
   [junit4]   2> 3264379 INFO  (coreLoadExecutor-9137-thread-1-processing-n:127.0.0.1:57799_h_xg%2Fvp) [n:127.0.0.1:57799_h_xg%2Fvp c:control_collection s:shard1 r:core_node1 x:collection1] o.a.s.u.p.UpdateRequestProcessorChain inserting DistributedUpdateProcessorFactory into updateRequestProcessorChain "stored_sig"
   [junit4]   2> 3264379 INFO  (coreLoadExecutor-9137-thread-1-processing-n:127.0.0.1:57799_h_xg%2Fvp) [n:127.0.0.1:57799_h_xg%2Fvp c:control_collection s:shard1 r:core_node1 x:collection1] o.a.s.u.p.UpdateRequestProcessorChain creating updateRequestProcessorChain "distrib-dup-test-chain-explicit"
   [junit4]   2> 3264380 INFO  (coreLoadExecutor-9137-thread-1-processing-n:127.0.0.1:57799_h_xg%2Fvp) [n:127.0.0.1:57799_h_xg%2Fvp c:control_collection s:shard1 r:core_node1 x:collection1] o.a.s.u.p.UpdateRequestProcessorChain creating updateRequestProcessorChain "distrib-dup-test-chain-implicit"
   [junit4]   2> 3264380 INFO  (coreLoadExecutor-9137-thread-1-processing-n:127.0.0.1:57799_h_xg%2Fvp) [n:127.0.0.1:57799_h_xg%2Fvp c:control_collection s:shard1 r:core_node1 x:collection1] o.a.s.u.p.UpdateRequestProcessorChain inserting DistributedUpdateProcessorFactory into updateRequestProcessorChain "distrib-dup-test-chain-implicit"
   [junit4]   2> 3264380 INFO  (coreLoadExecutor-9137-thread-1-processing-n:127.0.0.1:57799_h_xg%2Fvp) [n:127.0.0.1:57799_h_xg%2Fvp c:control_collection s:shard1 r:core_node1 x:collection1] o.a.s.c.SolrCore no updateRequestProcessorChain defined as default, creating implicit default
   [junit4]   2> 3264383 INFO  (coreLoadExecutor-9137-thread-1-processing-n:127.0.0.1:57799_h_xg%2Fvp) [n:127.0.0.1:57799_h_xg%2Fvp c:control_collection s:shard1 r:core_node1 x:collection1] o.a.s.h.l.XMLLoader xsltCacheLifetimeSeconds=60
   [junit4]   2> 3264385 INFO  (coreLoadExecutor-9137-thread-1-processing-n:127.0.0.1:57799_h_xg%2Fvp) [n:127.0.0.1:57799_h_xg%2Fvp c:control_collection s:shard1 r:core_node1 x:collection1] o.a.s.h.l.XMLLoader xsltCacheLifetimeSeconds=60
   [junit4]   2> 3264386 INFO  (coreLoadExecutor-9137-thread-1-processing-n:127.0.0.1:57799_h_xg%2Fvp) [n:127.0.0.1:57799_h_xg%2Fvp c:control_collection s:shard1 r:core_node1 x:collection1] o.a.s.h.l.XMLLoader xsltCacheLifetimeSeconds=60
   [junit4]   2> 3264388 INFO  (coreLoadExecutor-9137-thread-1-processing-n:127.0.0.1:57799_h_xg%2Fvp) [n:127.0.0.1:57799_h_xg%2Fvp c:control_collection s:shard1 r:core_node1 x:collection1] o.a.s.h.l.XMLLoader xsltCacheLifetimeSeconds=60
   [junit4]   2> 3264393 INFO  (coreLoadExecutor-9137-thread-1-processing-n:127.0.0.1:57799_h_xg%2Fvp) [n:127.0.0.1:57799_h_xg%2Fvp c:control_collection s:shard1 r:core_node1 x:collection1] o.a.s.c.RequestHandlers Registered paths: /admin/mbeans,standard,/update/csv,/update/json/docs,/admin/luke,/admin/segments,/get,/admin/system,/replication,/admin/properties,/config,/schema,/admin/plugins,/admin/logging,/update/json,/admin/threads,/admin/ping,/update,/admin/file
   [junit4]   2> 3264394 INFO  (coreLoadExecutor-9137-thread-1-processing-n:127.0.0.1:57799_h_xg%2Fvp) [n:127.0.0.1:57799_h_xg%2Fvp c:control_collection s:shard1 r:core_node1 x:collection1] o.a.s.c.SolrCore Using default statsCache cache: org.apache.solr.search.stats.LocalStatsCache
   [junit4]   2> 3264395 INFO  (coreLoadExecutor-9137-thread-1-processing-n:127.0.0.1:57799_h_xg%2Fvp) [n:127.0.0.1:57799_h_xg%2Fvp c:control_collection s:shard1 r:core_node1 x:collection1] o.a.s.u.UpdateHandler Using UpdateLog implementation: org.apache.solr.update.UpdateLog
   [junit4]   2> 3264395 INFO  (coreLoadExecutor-9137-thread-1-processing-n:127.0.0.1:57799_h_xg%2Fvp) [n:127.0.0.1:57799_h_xg%2Fvp c:control_collection s:shard1 r:core_node1 x:collection1] o.a.s.u.UpdateLog Initializing UpdateLog: dataDir= defaultSyncLevel=FLUSH numRecordsToKeep=100 maxNumLogsToKeep=10 numVersionBuckets=65536
   [junit4]   2> 3264397 INFO  (coreLoadExecutor-9137-thread-1-processing-n:127.0.0.1:57799_h_xg%2Fvp) [n:127.0.0.1:57799_h_xg%2Fvp c:control_collection s:shard1 r:core_node1 x:collection1] o.a.s.c.SolrCore Hard AutoCommit: disabled
   [junit4]   2> 3264397 INFO  (coreLoadExecutor-9137-thread-1-processing-n:127.0.0.1:57799_h_xg%2Fvp) [n:127.0.0.1:57799_h_xg%2Fvp c:control_collection s:shard1 r:core_node1 x:collection1] o.a.s.c.SolrCore Soft AutoCommit: disabled
   [junit4]   2> 3264398 INFO  (OldIndexDirectoryCleanupThreadForCore-collection1) [n:127.0.0.1:57799_h_xg%2Fvp c:control_collection s:shard1 r:core_node1 x:collection1] o.a.s.c.SolrCore Looking for old index directories to cleanup for core collection1 in /export/home/jenkins/workspace/Lucene-Solr-trunk-Solaris/solr/build/solr-core/test/J1/temp/solr.security.PKIAuthenticationIntegrationTest_5D88118CA4532CC-001/control-001/cores/collection1/data/
   [junit4]   2> 3264398 INFO  (coreLoadExecutor-9137-thread-1-processing-n:127.0.0.1:57799_h_xg%2Fvp) [n:127.0.0.1:57799_h_xg%2Fvp c:control_collection s:shard1 r:core_node1 x:collection1] o.a.s.u.RandomMergePolicy RandomMergePolicy wrapping class org.apache.lucene.index.LogDocMergePolicy: [LogDocMergePolicy: minMergeSize=1000, mergeFactor=48, maxMergeSize=9223372036854775807, maxMergeSizeForForcedMerge=9223372036854775807, calibrateSizeByDeletes=false, maxMergeDocs=2147483647, maxCFSSegmentSizeMB=8.796093022207999E12, noCFSRatio=0.0]
   [junit4]   2> 3264399 INFO  (coreLoadExecutor-9137-thread-1-processing-n:127.0.0.1:57799_h_xg%2Fvp) [n:127.0.0.1:57799_h_xg%2Fvp c:control_collection s:shard1 r:core_node1 x:collection1] o.a.s.c.SolrCore SolrDeletionPolicy.onInit: commits: num=1
   [junit4]   2> 	commit{dir=MockDirectoryWrapper(NRTCachingDirectory(RAMDirectory@294db27e lockFactory=org.apache.lucene.store.SingleInstanceLockFactory@75eabd35; maxCacheMB=0.263671875 maxMergeSizeMB=0.6357421875)),segFN=segments_1,generation=1}
   [junit4]   2> 3264399 INFO  (coreLoadExecutor-9137-thread-1-processing-n:127.0.0.1:57799_h_xg%2Fvp) [n:127.0.0.1:57799_h_xg%2Fvp c:control_collection s:shard1 r:core_node1 x:collection1] o.a.s.c.SolrCore newest commit generation = 1
   [junit4]   2> 3264400 INFO  (coreLoadExecutor-9137-thread-1-processing-n:127.0.0.1:57799_h_xg%2Fvp) [n:127.0.0.1:57799_h_xg%2Fvp c:control_collection s:shard1 r:core_node1 x:collection1] o.a.s.s.SolrIndexSearcher Opening Searcher@4da24d7d[collection1] main
   [junit4]   2> 3264400 INFO  (coreLoadExecutor-9137-thread-1-processing-n:127.0.0.1:57799_h_xg%2Fvp) [n:127.0.0.1:57799_h_xg%2Fvp c:control_collection s:shard1 r:core_node1 x:collection1] o.a.s.c.c.ZkStateReader Load collection config from:/collections/control_collection
   [junit4]   2> 3264401 INFO  (coreLoadExecutor-9137-thread-1-processing-n:127.0.0.1:57799_h_xg%2Fvp) [n:127.0.0.1:57799_h_xg%2Fvp c:control_collection s:shard1 r:core_node1 x:collection1] o.a.s.c.c.ZkStateReader path=/collections/control_collection configName=conf1 specified config exists in ZooKeeper
   [junit4]   2> 3264401 INFO  (coreLoadExecutor-9137-thread-1-processing-n:127.0.0.1:57799_h_xg%2Fvp) [n:127.0.0.1:57799_h_xg%2Fvp c:control_collection s:shard1 r:core_node1 x:collection1] o.a.s.r.ManagedResourceStorage Setting up ZooKeeper-based storage for the RestManager with znodeBase: /configs/conf1
   [junit4]   2> 3264402 INFO  (coreLoadExecutor-9137-thread-1-processing-n:127.0.0.1:57799_h_xg%2Fvp) [n:127.0.0.1:57799_h_xg%2Fvp c:control_collection s:shard1 r:core_node1 x:collection1] o.a.s.r.ManagedResourceStorage Configured ZooKeeperStorageIO with znodeBase: /configs/conf1
   [junit4]   2> 3264402 INFO  (coreLoadExecutor-9137-thread-1-processing-n:127.0.0.1:57799_h_xg%2Fvp) [n:127.0.0.1:57799_h_xg%2Fvp c:control_collection s:shard1 r:core_node1 x:collection1] o.a.s.r.RestManager Initializing RestManager with initArgs: {}
   [junit4]   2> 3264402 INFO  (coreLoadExecutor-9137-thread-1-processing-n:127.0.0.1:57799_h_xg%2Fvp) [n:127.0.0.1:57799_h_xg%2Fvp c:control_collection s:shard1 r:core_node1 x:collection1] o.a.s.r.ManagedResourceStorage Reading _rest_managed.json using ZooKeeperStorageIO:path=/configs/conf1
   [junit4]   2> 3264402 INFO  (coreLoadExecutor-9137-thread-1-processing-n:127.0.0.1:57799_h_xg%2Fvp) [n:127.0.0.1:57799_h_xg%2Fvp c:control_collection s:shard1 r:core_node1 x:collection1] o.a.s.r.ManagedResourceStorage No data found for znode /configs/conf1/_rest_managed.json
   [junit4]   2> 3264402 INFO  (coreLoadExecutor-9137-thread-1-processing-n:127.0.0.1:57799_h_xg%2Fvp) [n:127.0.0.1:57799_h_xg%2Fvp c:control_collection s:shard1 r:core_node1 x:collection1] o.a.s.r.ManagedResourceStorage Loaded null at path _rest_managed.json using ZooKeeperStorageIO:path=/configs/conf1
   [junit4]   2> 3264403 INFO  (coreLoadExecutor-9137-thread-1-processing-n:127.0.0.1:57799_h_xg%2Fvp) [n:127.0.0.1:57799_h_xg%2Fvp c:control_collection s:shard1 r:core_node1 x:collection1] o.a.s.r.RestManager Initializing 0 registered ManagedResources
   [junit4]   2> 3264403 INFO  (coreLoadExecutor-9137-thread-1-processing-n:127.0.0.1:57799_h_xg%2Fvp) [n:127.0.0.1:57799_h_xg%2Fvp c:control_collection s:shard1 r:core_node1 x:collection1] o.a.s.h.ReplicationHandler Commits will be reserved for  10000
   [junit4]   2> 3264403 INFO  (coreLoadExecutor-9137-thread-1-processing-n:127.0.0.1:57799_h_xg%2Fvp) [n:127.0.0.1:57799_h_xg%2Fvp c:control_collection s:shard1 r:core_node1 x:collection1] o.a.s.u.UpdateLog Looking up max value of version field to seed version buckets
   [junit4]   2> 3264404 INFO  (coreLoadExecutor-9137-thread-1-processing-n:127.0.0.1:57799_h_xg%2Fvp) [n:127.0.0.1:57799_h_xg%2Fvp c:control_collection s:shard1 r:core_node1 x:collection1] o.a.s.u.VersionInfo Refreshing highest value of _version_ for 65536 version buckets from index
   [junit4]   2> 3264404 INFO  (coreLoadExecutor-9137-thread-1-processing-n:127.0.0.1:57799_h_xg%2Fvp) [n:127.0.0.1:57799_h_xg%2Fvp c:control_collection s:shard1 r:core_node1 x:collection1] o.a.s.u.VersionInfo No terms found for _version_, cannot seed version bucket highest value from index
   [junit4]   2> 3264405 INFO  (coreLoadExecutor-9137-thread-1-processing-n:127.0.0.1:57799_h_xg%2Fvp) [n:127.0.0.1:57799_h_xg%2Fvp c:control_collection s:shard1 r:core_node1 x:collection1] o.a.s.u.UpdateLog Could not find max version in index or recent updates, using new clock 1513874604578308096
   [junit4]   2> 3264405 INFO  (searcherExecutor-9138-thread-1-processing-n:127.0.0.1:57799_h_xg%2Fvp x:collection1 s:shard1 c:control_collection r:core_node1) [n:127.0.0.1:57799_h_xg%2Fvp c:control_collection s:shard1 r:core_node1 x:collection1] o.a.s.c.SolrCore [collection1] Registered new searcher Searcher@4da24d7d[collection1] main{ExitableDirectoryReader(UninvertingDirectoryReader())}
   [junit4]   2> 3264407 INFO  (coreLoadExecutor-9137-thread-1-processing-n:127.0.0.1:57799_h_xg%2Fvp) [n:127.0.0.1:57799_h_xg%2Fvp c:control_collection s:shard1 r:core_node1 x:collection1] o.a.s.u.UpdateLog Took 2.0ms to seed version buckets with highest version 1513874604578308096
   [junit4]   2> 3264407 INFO  (coreLoadExecutor-9137-thread-1-processing-n:127.0.0.1:57799_h_xg%2Fvp) [n:127.0.0.1:57799_h_xg%2Fvp c:control_collection s:shard1 r:core_node1 x:collection1] o.a.s.c.ZkController watch zkdir /configs/conf1
   [junit4]   2> 3264408 INFO  (coreLoadExecutor-9137-thread-1-processing-n:127.0.0.1:57799_h_xg%2Fvp) [n:127.0.0.1:57799_h_xg%2Fvp c:control_collection s:shard1 r:core_node1 x:collection1] o.a.s.c.CoreContainer registering core: collection1
   [junit4]   2> 3264409 INFO  (coreZkRegister-9131-thread-1-processing-n:127.0.0.1:57799_h_xg%2Fvp x:collection1 s:shard1 c:control_collection r:core_node1) [n:127.0.0.1:57799_h_xg%2Fvp c:control_collection s:shard1 r:core_node1 x:collection1] o.a.s.c.ZkController Register replica - core:collection1 address:http://127.0.0.1:57799/h_xg/vp collection:control_collection shard:shard1
   [junit4]   2> 3264410 INFO  (coreZkRegister-9131-thread-1-processing-n:127.0.0.1:57799_h_xg%2Fvp x:collection1 s:shard1 c:control_collection r:core_node1) [n:127.0.0.1:57799_h_xg%2Fvp c:control_collection s:shard1 r:core_node1 x:collection1] o.a.s.c.c.SolrZkClient makePath: /collections/control_collection/leader_elect/shard1/election
   [junit4]   2> 3264418 INFO  (coreZkRegister-9131-thread-1-processing-n:127.0.0.1:57799_h_xg%2Fvp x:collection1 s:shard1 c:control_collection r:core_node1) [n:127.0.0.1:57799_h_xg%2Fvp c:control_collection s:shard1 r:core_node1 x:collection1] o.a.s.c.LeaderElector Joined leadership election with path: /collections/control_collection/leader_elect/shard1/election/94617162632527876-core_node1-n_0000000000
   [junit4]   2> 3264419 INFO  (coreZkRegister-9131-thread-1-processing-n:127.0.0.1:57799_h_xg%2Fvp x:collection1 s:shard1 c:control_collection r:core_node1) [n:127.0.0.1:57799_h_xg%2Fvp c:control_collection s:shard1 r:core_node1 x:collection1] o.a.s.c.ShardLeaderElectionContext Running the leader process for shard shard1
   [junit4]   2> 3264427 INFO  (coreZkRegister-9131-thread-1-processing-n:127.0.0.1:57799_h_xg%2Fvp x:collection1 s:shard1 c:control_collection r:core_node1) [n:127.0.0.1:57799_h_xg%2Fvp c:control_collection s:shard1 r:core_node1 x:collection1] o.a.s.c.ShardLeaderElectionContext Enough replicas found to continue.
   [junit4]   2> 3264427 INFO  (coreZkRegister-9131-thread-1-processing-n:127.0.0.1:57799_h_xg%2Fvp x:collection1 s:shard1 c:control_collection r:core_node1) [n:127.0.0.1:57799_h_xg%2Fvp c:control_collection s:shard1 r:core_node1 x:collection1] o.a.s.c.ShardLeaderElectionContext I may be the new leader - try and sync
   [junit4]   2> 3264427 INFO  (coreZkRegister-9131-thread-1-processing-n:127.0.0.1:57799_h_xg%2Fvp x:collection1 s:shard1 c:control_collection r:core_node1) [n:127.0.0.1:57799_h_xg%2Fvp c:control_collection s:shard1 r:core_node1 x:collection1] o.a.s.c.SyncStrategy Sync replicas to http://127.0.0.1:57799/h_xg/vp/collection1/
   [junit4]   2> 3264428 INFO  (coreZkRegister-9131-thread-1-processing-n:127.0.0.1:57799_h_xg%2Fvp x:collection1 s:shard1 c:control_collection r:core_node1) [n:127.0.0.1:57799_h_xg%2Fvp c:control_collection s:shard1 r:core_node1 x:collection1] o.a.s.c.SyncStrategy Sync Success - now sync replicas to me
   [junit4]   2> 3264428 INFO  (coreZkRegister-9131-thread-1-processing-n:127.0.0.1:57799_h_xg%2Fvp x:collection1 s:shard1 c:control_collection r:core_node1) [n:127.0.0.1:57799_h_xg%2Fvp c:control_collection s:shard1 r:core_node1 x:collection1] o.a.s.c.SyncStrategy http://127.0.0.1:57799/h_xg/vp/collection1/ has no replicas
   [junit4]   2> 3264428 INFO  (coreZkRegister-9131-thread-1-processing-n:127.0.0.1:57799_h_xg%2Fvp x:collection1 s:shard1 c:control_collection r:core_node1) [n:127.0.0.1:57799_h_xg%2Fvp c:control_collection s:shard1 r:core_node1 x:collection1] o.a.s.c.ShardLeaderElectionContext I am the new leader: http://127.0.0.1:57799/h_xg/vp/collection1/ shard1
   [junit4]   2> 3264429 INFO  (coreZkRegister-9131-thread-1-processing-n:127.0.0.1:57799_h_xg%2Fvp x:collection1 s:shard1 c:control_collection r:core_node1) [n:127.0.0.1:57799_h_xg%2Fvp c:control_collection s:shard1 r:core_node1 x:collection1] o.a.s.c.c.SolrZkClient makePath: /collections/control_collection/leaders/shard1
   [junit4]   2> 3264437 INFO  (OverseerStateUpdate-94617162632527876-127.0.0.1:57799_h_xg%2Fvp-n_0000000000) [n:127.0.0.1:57799_h_xg%2Fvp    ] o.a.s.c.Overseer processMessage: queueSize: 1, message = {
   [junit4]   2>   "operation":"leader",
   [junit4]   2>   "shard":"shard1",
   [junit4]   2>   "collection":"control_collection"} current state version: 1
   [junit4]   2> 3264441 INFO  (coreZkRegister-9131-thread-1-processing-n:127.0.0.1:57799_h_xg%2Fvp x:collection1 s:shard1 c:control_collection r:core_node1) [n:127.0.0.1:57799_h_xg%2Fvp c:control_collection s:shard1 r:core_node1 x:collection1] o.a.s.c.ShardLeaderElectionContextBase Creating leader registration node
   [junit4]   2> 3264447 INFO  (OverseerStateUpdate-94617162632527876-127.0.0.1:57799_h_xg%2Fvp-n_0000000000) [n:127.0.0.1:57799_h_xg%2Fvp    ] o.a.s.c.Overseer processMessage: queueSize: 1, message = {
   [junit4]   2>   "operation":"leader",
   [junit4]   2>   "shard":"shard1",
   [junit4]   2>   "collection":"control_collection",
   [junit4]   2>   "base_url":"http://127.0.0.1:57799/h_xg/vp",
   [junit4]   2>   "core":"collection1",
   [junit4]   2>   "state":"active"} current state version: 1
   [junit4]   2> 3264570 INFO  (zkCallback-2672-thread-2-processing-n:127.0.0.1:57799_h_xg%2Fvp) [n:127.0.0.1:57799_h_xg%2Fvp    ] o.a.s.c.c.ZkStateReader A cluster state change: WatchedEvent state:SyncConnected type:NodeDataChanged path:/clusterstate.json, has occurred - updating... (live nodes size: 1)
   [junit4]   2> 3264603 INFO  (coreZkRegister-9131-thread-1-processing-n:127.0.0.1:57799_h_xg%2Fvp x:collection1 s:shard1 c:control_collection r:core_node1) [n:127.0.0.1:57799_h_xg%2Fvp c:control_collection s:shard1 r:core_node1 x:collection1] o.a.s.c.ZkController We are http://127.0.0.1:57799/h_xg/vp/collection1/ and leader is http://127.0.0.1:57799/h_xg/vp/collection1/
   [junit4]   2> 3264603 INFO  (coreZkRegister-9131-thread-1-processing-n:127.0.0.1:57799_h_xg%2Fvp x:collection1 s:shard1 c:control_collection r:core_node1) [n:127.0.0.1:57799_h_xg%2Fvp c:control_collection s:shard1 r:core_node1 x:collection1] o.a.s.c.ZkController No LogReplay needed for core=collection1 baseURL=http://127.0.0.1:57799/h_xg/vp
   [junit4]   2> 3264603 INFO  (coreZkRegister-9131-thread-1-processing-n:127.0.0.1:57799_h_xg%2Fvp x:collection1 s:shard1 c:control_collection r:core_node1) [n:127.0.0.1:57799_h_xg%2Fvp c:control_collection s:shard1 r:core_node1 x:collection1] o.a.s.c.ZkController I am the leader, no recovery necessary
   [junit4]   2> 3264603 INFO  (coreZkRegister-9131-thread-1-processing-n:127.0.0.1:57799_h_xg%2Fvp x:collection1 s:shard1 c:control_collection r:core_node1) [n:127.0.0.1:57799_h_xg%2Fvp c:control_collection s:shard1 r:core_node1 x:collection1] o.a.s.c.ZkController publishing state=active
   [junit4]   2> 3264603 INFO  (coreZkRegister-9131-thread-1-processing-n:127.0.0.1:57799_h_xg%2Fvp x:collection1 s:shard1 c:control_collection r:core_node1) [n:127.0.0.1:57799_h_xg%2Fvp c:control_collection s:shard1 r:core_node1 x:collection1] o.a.s.c.ZkController numShards not found on descriptor - reading it from system property
   [junit4]   2> 3264614 INFO  (OverseerStateUpdate-94617162632527876-127.0.0.1:57799_h_xg%2Fvp-n_0000000000) [n:127.0.0.1:57799_h_xg%2Fvp    ] o.a.s.c.Overseer processMessage: queueSize: 1, message = {
   [junit4]   2>   "core":"collection1",
   [junit4]   2>   "core_node_name":"core_node1",
   [junit4]   2>   "roles":null,
   [junit4]   2>   "base_url":"http://127.0.0.1:57799/h_xg/vp",
   [junit4]   2>   "node_name":"127.0.0.1:57799_h_xg%2Fvp",
   [junit4]   2>   "numShards":"1",
   [junit4]   2>   "state":"active",
   [junit4]   2>   "shard":"shard1",
   [junit4]   2>   "collection":"control_collection",
   [junit4]   2>   "operation":"state"} current state version: 2
   [junit4]   2> 3264615 INFO  (OverseerStateUpdate-94617162632527876-127.0.0.1:57799_h_xg%2Fvp-n_0000000000) [n:127.0.0.1:57799_h_xg%2Fvp    ] o.a.s.c.o.ReplicaMutator Update state numShards=1 message={
   [junit4]   2>   "core":"collection1",
   [junit4]   2>   "core_node_name":"core_node1",
   [junit4]   2>   "roles":null,
   [junit4]   2>   "base_url":"http://127.0.0.1:57799/h_xg/vp",
   [junit4]   2>   "node_name":"127.0.0.1:57799_h_xg%2Fvp",
   [junit4]   2>   "numShards":"1",
   [junit4]   2>   "state":"active",
   [junit4]   2>   "shard":"shard1",
   [junit4]   2>   "collection":"control_collection",
   [junit4]   2>   "operation":"state"}
   [junit4]   2> 3264635 INFO  (TEST-PKIAuthenticationIntegrationTest.testPkiAuth-seed#[5D88118CA4532CC]) [    ] o.a.s.c.c.SolrZkClient Using default ZkCredentialsProvider
   [junit4]   2> 3264636 INFO  (TEST-PKIAuthenticationIntegrationTest.testPkiAuth-seed#[5D88118CA4532CC]) [    ] o.a.s.c.c.ConnectionManager Waiting for client to connect to ZooKeeper
   [junit4]   2> 3264638 INFO  (zkCallback-2674-thread-1) [    ] o.a.s.c.c.ConnectionManager Watcher org.apache.solr.common.cloud.ConnectionManager@4cbc14b2 name:ZooKeeperConnection Watcher:127.0.0.1:48764/solr got event WatchedEvent state:SyncConnected type:None path:null path:null type:None
   [junit4]   2> 3264638 INFO  (TEST-PKIAuthenticationIntegrationTest.testPkiAuth-seed#[5D88118CA4532CC]) [    ] o.a.s.c.c.ConnectionManager Client is connected to ZooKeeper
   [junit4]   2> 3264638 INFO  (TEST-PKIAuthenticationIntegrationTest.testPkiAuth-seed#[5D88118CA4532CC]) [    ] o.a.s.c.c.SolrZkClient Using default ZkACLProvider
   [junit4]   2> 3264638 INFO  (TEST-PKIAuthenticationIntegrationTest.testPkiAuth-seed#[5D88118CA4532CC]) [    ] o.a.s.c.c.ZkStateReader Updating cluster state from ZooKeeper... 
   [junit4]   2> 3264644 INFO  (TEST-PKIAuthenticationIntegrationTest.testPkiAuth-seed#[5D88118CA4532CC]) [    ] o.a.s.c.ChaosMonkey monkey: init - expire sessions:false cause connection loss:false
   [junit4]   2> 3264720 INFO  (zkCallback-2674-thread-1) [    ] o.a.s.c.c.ZkStateReader A cluster state change: WatchedEvent state:SyncConnected type:NodeDataChanged path:/clusterstate.json, has occurred - updating... (live nodes size: 1)
   [junit4]   2> 3264720 INFO  (zkCallback-2672-thread-1-processing-n:127.0.0.1:57799_h_xg%2Fvp) [n:127.0.0.1:57799_h_xg%2Fvp    ] o.a.s.c.c.ZkStateReader A cluster state change: WatchedEvent state:SyncConnected type:NodeDataChanged path:/clusterstate.json, has occurred - updating... (live nodes size: 1)
   [junit4]   2> 3264836 INFO  (TEST-PKIAuthenticationIntegrationTest.testPkiAuth-seed#[5D88118CA4532CC]) [    ] o.a.s.SolrTestCaseJ4 Writing core.properties file to /export/home/jenkins/workspace/Lucene-Solr-trunk-Solaris/solr/build/solr-core/test/J1/temp/solr.security.PKIAuthenticationIntegrationTest_5D88118CA4532CC-001/shard-1-001/cores/collection1
   [junit4]   2> 3264837 INFO  (TEST-PKIAuthenticationIntegrationTest.testPkiAuth-seed#[5D88118CA4532CC]) [    ] o.a.s.c.AbstractFullDistribZkTestBase create jetty 1 in directory /export/home/jenkins/workspace/Lucene-Solr-trunk-Solaris/solr/build/solr-core/test/J1/temp/solr.security.PKIAuthenticationIntegrationTest_5D88118CA4532CC-001/shard-1-001
   [junit4]   2> 3264838 INFO  (TEST-PKIAuthenticationIntegrationTest.testPkiAuth-seed#[5D88118CA4532CC]) [    ] o.e.j.s.Server jetty-9.2.13.v20150730
   [junit4]   2> 3264840 INFO  (TEST-PKIAuthenticationIntegrationTest.testPkiAuth-seed#[5D88118CA4532CC]) [    ] o.e.j.s.h.ContextHandler Started o.e.j.s.ServletContextHandler@70ea6285{/h_xg/vp,null,AVAILABLE}
   [junit4]   2> 3264840 INFO  (TEST-PKIAuthenticationIntegrationTest.testPkiAuth-seed#[5D88118CA4532CC]) [    ] o.e.j.s.ServerConnector Started ServerConnector@942df38{HTTP/1.1}{127.0.0.1:53671}
   [junit4]   2> 3264840 INFO  (TEST-PKIAuthenticationIntegrationTest.testPkiAuth-seed#[5D88118CA4532CC]) [    ] o.e.j.s.Server Started @3317312ms
   [junit4]   2> 3264841 INFO  (TEST-PKIAuthenticationIntegrationTest.testPkiAuth-seed#[5D88118CA4532CC]) [    ] o.a.s.c.s.e.JettySolrRunner Jetty properties: {solr.data.dir=/export/home/jenkins/workspace/Lucene-Solr-trunk-Solaris/solr/build/solr-core/test/J1/temp/solr.security.PKIAuthenticationIntegrationTest_5D88118CA4532CC-001/tempDir-001/jetty1, solrconfig=solrconfig.xml, hostContext=/h_xg/vp, hostPort=53671, coreRootDirectory=/export/home/jenkins/workspace/Lucene-Solr-trunk-Solaris/solr/build/solr-core/test/J1/../../../../../../../../../../export/home/jenkins/workspace/Lucene-Solr-trunk-Solaris/solr/build/solr-core/test/J1/temp/solr.security.PKIAuthenticationIntegrationTest_5D88118CA4532CC-001/shard-1-001/cores}
   [junit4]   2> 3264841 INFO  (TEST-PKIAuthenticationIntegrationTest.testPkiAuth-seed#[5D88118CA4532CC]) [    ] o.a.s.s.SolrDispatchFilter SolrDispatchFilter.init(): sun.misc.Launcher$AppClassLoader@659e0bfd
   [junit4]   2> 3264841 INFO  (TEST-PKIAuthenticationIntegrationTest.testPkiAuth-seed#[5D88118CA4532CC]) [    ] o.a.s.c.SolrResourceLoader new SolrResourceLoader for directory: '/export/home/jenkins/workspace/Lucene-Solr-trunk-Solaris/solr/build/solr-core/test/J1/../../../../../../../../../../export/home/jenkins/workspace/Lucene-Solr-trunk-Solaris/solr/build/solr-core/test/J1/temp/solr.security.PKIAuthenticationIntegrationTest_5D88118CA4532CC-001/shard-1-001/'
   [junit4]   2> 3264860 INFO  (TEST-PKIAuthenticationIntegrationTest.testPkiAuth-seed#[5D88118CA4532CC]) [    ] o.a.s.c.c.SolrZkClient Using default ZkCredentialsProvider
   [junit4]   2> 3264861 INFO  (TEST-PKIAuthenticationIntegrationTest.testPkiAuth-seed#[5D88118CA4532CC]) [    ] o.a.s.c.c.ConnectionManager Waiting for client to connect to ZooKeeper
   [junit4]   2> 3264872 INFO  (zkCallback-2675-thread-1) [    ] o.a.s.c.c.ConnectionManager Watcher org.apache.solr.common.cloud.ConnectionManager@7ed55101 name:ZooKeeperConnection Watcher:127.0.0.1:48764/solr got event WatchedEvent state:SyncConnected type:None path:null path:null type:None
   [junit4]   2> 3264872 INFO  (TEST-PKIAuthenticationIntegrationTest.testPkiAuth-seed#[5D88118CA4532CC]) [    ] o.a.s.c.c.ConnectionManager Client is connected to ZooKeeper
   [junit4]   2> 3264872 INFO  (TEST-PKIAuthenticationIntegrationTest.testPkiAuth-seed#[5D88118CA4532CC]) [    ] o.a.s.c.c.SolrZkClient Using default ZkACLProvider
   [junit4]   2> 3264874 INFO  (TEST-PKIAuthenticationIntegrationTest.testPkiAuth-seed#[5D88118CA4532CC]) [    ] o.a.s.s.SolrDispatchFilter Loading solr.xml from SolrHome (not found in ZooKeeper)
   [junit4]   2> 3264874 INFO  (TEST-PKIAuthenticationIntegrationTest.testPkiAuth-seed#[5D88118CA4532CC]) [    ] o.a.s.c.SolrXmlConfig Loading container configuration from /export/home/jenkins/workspace/Lucene-Solr-trunk-Solaris/solr/build/solr-core/test/J1/../../../../../../../../../../export/home/jenkins/workspace/Lucene-Solr-trunk-Solaris/solr/build/solr-core/test/J1/temp/solr.security.PKIAuthenticationIntegrationTest_5D88118CA4532CC-001/shard-1-001/solr.xml
   [junit4]   2> 3264880 INFO  (TEST-PKIAuthenticationIntegrationTest.testPkiAuth-seed#[5D88118CA4532CC]) [    ] o.a.s.c.CoresLocator Config-defined core root directory: /export/home/jenkins/workspace/Lucene-Solr-trunk-Solaris/solr/build/solr-core/test/J1/../../../../../../../../../../export/home/jenkins/workspace/Lucene-Solr-trunk-Solaris/solr/build/solr-core/test/J1/temp/solr.security.PKIAuthenticationIntegrationTest_5D88118CA4532CC-001/shard-1-001/cores
   [junit4]   2> 3264880 INFO  (TEST-PKIAuthenticationIntegrationTest.testPkiAuth-seed#[5D88118CA4532CC]) [    ] o.a.s.c.CoreContainer New CoreContainer 1692134363
   [junit4]   2> 3264880 INFO  (TEST-PKIAuthenticationIntegrationTest.testPkiAuth-seed#[5D88118CA4532CC]) [    ] o.a.s.c.CoreContainer Loading cores into CoreContainer [instanceDir=/export/home/jenkins/workspace/Lucene-Solr-trunk-Solaris/solr/build/solr-core/test/J1/../../../../../../../../../../export/home/jenkins/workspace/Lucene-Solr-trunk-Solaris/solr/build/solr-core/test/J1/temp/solr.security.PKIAuthenticationIntegrationTest_5D88118CA4532CC-001/shard-1-001/]
   [junit4]   2> 3264880 INFO  (TEST-PKIAuthenticationIntegrationTest.testPkiAuth-seed#[5D88118CA4532CC]) [    ] o.a.s.c.CoreContainer loading shared library: /export/home/jenkins/workspace/Lucene-Solr-trunk-Solaris/solr/build/solr-core/test/J1/../../../../../../../../../../export/home/jenkins/workspace/Lucene-Solr-trunk-Solaris/solr/build/solr-core/test/J1/temp/solr.security.PKIAuthenticationIntegrationTest_5D88118CA4532CC-001/shard-1-001/lib
   [junit4]   2> 3264881 WARN  (TEST-PKIAuthenticationIntegrationTest.testPkiAuth-seed#[5D88118CA4532CC]) [    ] o.a.s.c.SolrResourceLoader Can't find (or read) directory to add to classloader: lib (resolved as: /export/home/jenkins/workspace/Lucene-Solr-trunk-Solaris/solr/build/solr-core/test/J1/../../../../../../../../../../export/home/jenkins/workspace/Lucene-Solr-trunk-Solaris/solr/build/solr-core/test/J1/temp/solr.security.PKIAuthenticationIntegrationTest_5D88118CA4532CC-001/shard-1-001/lib).
   [junit4]   2> 3264890 INFO  (TEST-PKIAuthenticationIntegrationTest.testPkiAuth-seed#[5D88118CA4532CC]) [    ] o.a.s.h.c.HttpShardHandlerFactory created with socketTimeout : 90000,urlScheme : ,connTimeout : 15000,maxConnectionsPerHost : 20,maxConnections : 10000,corePoolSize : 0,maximumPoolSize : 2147483647,maxThreadIdleTime : 5,sizeOfQueue : -1,fairnessPolicy : false,useRetries : false,
   [junit4]   2> 3264893 INFO  (TEST-PKIAuthenticationIntegrationTest.testPkiAuth-seed#[5D88118CA4532CC]) [    ] o.a.s.u.UpdateShardHandler Creating UpdateShardHandler HTTP client with params: socketTimeout=340000&connTimeout=45000&retry=true
   [junit4]   2> 3264894 INFO  (TEST-PKIAuthenticationIntegrationTest.testPkiAuth-seed#[5D88118CA4532CC]) [    ] o.a.s.l.LogWatcher SLF4J impl is org.slf4j.impl.Log4jLoggerFactory
   [junit4]   2> 3264895 INFO  (TEST-PKIAuthenticationIntegrationTest.testPkiAuth-seed#[5D88118CA4532CC]) [    ] o.a.s.l.LogWatcher Registering Log Listener [Log4j (org.slf4j.impl.Log4jLoggerFactory)]
   [junit4]   2> 3264895 INFO  (TEST-PKIAuthenticationIntegrationTest.testPkiAuth-seed#[5D88118CA4532CC]) [    ] o.a.s.c.ZkContainer Zookeeper client=127.0.0.1:48764/solr
   [junit4]   2> 3264895 INFO  (TEST-PKIAuthenticationIntegrationTest.testPkiAuth-seed#[5D88118CA4532CC]) [    ] o.a.s.c.ZkController zkHost includes chroot
   [junit4]   2> 3264895 INFO  (TEST-PKIAuthenticationIntegrationTest.testPkiAuth-seed#[5D88118CA4532CC]) [    ] o.a.s.c.c.SolrZkClient Using default ZkCredentialsProvider
   [junit4]   2> 3264895 INFO  (TEST-PKIAuthenticationIntegrationTest.testPkiAuth-seed#[5D88118CA4532CC]) [    ] o.a.s.c.c.ConnectionManager Waiting for client to connect to ZooKeeper
   [junit4]   2> 3264897 INFO  (zkCallback-2677-thread-1) [    ] o.a.s.c.c.ConnectionManager Watcher org.apache.solr.common.cloud.ConnectionManager@39b6377e name:ZooKeeperConnection Watcher:127.0.0.1:48764 got event WatchedEvent state:SyncConnected type:None path:null path:null type:None
   [junit4]   2> 3264898 INFO  (TEST-PKIAuthenticationIntegrationTest.testPkiAuth-seed#[5D88118CA4532CC]) [    ] o.a.s.c.c.ConnectionManager Client is connected to ZooKeeper
   [junit4]   2> 3264898 INFO  (TEST-PKIAuthenticationIntegrationTest.testPkiAuth-seed#[5D88118CA4532CC]) [    ] o.a.s.c.c.SolrZkClient Using default ZkACLProvider
   [junit4]   2> 3264900 INFO  (TEST-PKIAuthenticationIntegrationTest.testPkiAuth-seed#[5D88118CA4532CC]) [n:127.0.0.1:53671_h_xg%2Fvp    ] o.a.s.c.c.ConnectionManager Waiting for client to connect to ZooKeeper
   [junit4]   2> 3264901 INFO  (zkCallback-2678-thread-1-processing-n:127.0.0.1:53671_h_xg%2Fvp) [n:127.0.0.1:53671_h_xg%2Fvp    ] o.a.s.c.c.ConnectionManager Watcher org.apache.solr.common.cloud.ConnectionManager@35a95872 name:ZooKeeperConnection Watcher:127.0.0.1:48764/solr got event WatchedEvent state:SyncConnected type:None path:null path:null type:None
   [junit4]   2> 3264902 INFO  (TEST-PKIAuthenticationIntegrationTest.testPkiAuth-seed#[5D88118CA4532CC]) [n:127.0.0.1:53671_h_xg%2Fvp    ] o.a.s.c.c.ConnectionManager Client is connected to ZooKeeper
   [junit4]   2> 3264912 INFO  (TEST-PKIAuthenticationIntegrationTest.testPkiAuth-seed#[5D88118CA4532CC]) [n:127.0.0.1:53671_h_xg%2Fvp    ] o.a.s.c.c.ZkStateReader Updating cluster state from ZooKeeper... 
   [junit4]   2> 3265923 INFO  (TEST-PKIAuthenticationIntegrationTest.testPkiAuth-seed#[5D88118CA4532CC]) [n:127.0.0.1:53671_h_xg%2Fvp    ] o.a.s.c.ZkController Register node as live in ZooKeeper:/live_nodes/127.0.0.1:53671_h_xg%2Fvp
   [junit4]   2> 3265924 INFO  (TEST-PKIAuthenticationIntegrationTest.testPkiAuth-seed#[5D88118CA4532CC]) [n:127.0.0.1:53671_h_xg%2Fvp    ] o.a.s.c.c.SolrZkClient makePath: /live_nodes/127.0.0.1:53671_h_xg%2Fvp
   [junit4]   2> 3265925 INFO  (zkCallback-2672-thread-1-processing-n:127.0.0.1:57799_h_xg%2Fvp) [n:127.0.0.1:57799_h_xg%2Fvp    ] o.a.s.c.c.ZkStateReader A live node change: WatchedEvent state:SyncConnected type:NodeChildrenChanged path:/live_nodes, has occurred - updating... (live nodes size: 1)
   [junit4]   2> 3265925 INFO  (zkCallback-2674-thread-1) [    ] o.a.s.c.c.ZkStateReader A live node change: WatchedEvent state:SyncConnected type:NodeChildrenChanged path:/live_nodes, has occurred - updating... (live nodes size: 1)
   [junit4]   2> 3265926 INFO  (zkCallback-2678-thread-1-processing-n:127.0.0.1:53671_h_xg%2Fvp) [n:127.0.0.1:53671_h_xg%2Fvp    ] o.a.s.c.c.ZkStateReader A live node change: WatchedEvent state:SyncConnected type:NodeChildrenChanged path:/live_nodes, has occurred - updating... (live nodes size: 1)
   [junit4]   2> 3265927 INFO  (TEST-PKIAuthenticationIntegrationTest.testPkiAuth-seed#[5D88118CA4532CC]) [n:127.0.0.1:53671_h_xg%2Fvp    ] o.a.s.c.Overseer Overseer (id=null) closing
   [junit4]   2> 3265928 INFO  (TEST-PKIAuthenticationIntegrationTest.testPkiAuth-seed#[5D88118CA4532CC]) [n:127.0.0.1:53671_h_xg%2Fvp    ] o.a.s.c.LeaderElector Joined leadership election with path: /overseer_elect/election/94617162632527880-127.0.0.1:53671_h_xg%2Fvp-n_0000000001
   [junit4]   2> 3265929 INFO  (TEST-PKIAuthenticationIntegrationTest.testPkiAuth-seed#[5D88118CA4532CC]) [n:127.0.0.1:53671_h_xg%2Fvp    ] o.a.s.c.LeaderElector Watching path /overseer_elect/election/94617162632527876-127.0.0.1:57799_h_xg%2Fvp-n_0000000000 to know if I could be the leader
   [junit4]   2> 3265935 INFO  (TEST-PKIAuthenticationIntegrationTest.testPkiAuth-seed#[5D88118CA4532CC]) [n:127.0.0.1:53671_h_xg%2Fvp    ] o.a.s.c.CoreContainer Security conf doesn't exist. Skipping setup for authorization module.
   [junit4]   2> 3265935 INFO  (TEST-PKIAuthenticationIntegrationTest.testPkiAuth-seed#[5D88118CA4532CC]) [n:127.0.0.1:53671_h_xg%2Fvp    ] o.a.s.c.CoreContainer No authentication plugin used.
   [junit4]   2> 3265936 INFO  (TEST-PKIAuthenticationIntegrationTest.testPkiAuth-seed#[5D88118CA4532CC]) [n:127.0.0.1:53671_h_xg%2Fvp    ] o.a.s.c.CoresLocator Looking for core definitions underneath /export/home/jenkins/workspace/Lucene-Solr-trunk-Solaris/solr/build/solr-core/test/J1/../../../../../../../../../../export/home/jenkins/workspace/Lucene-Solr-trunk-Solaris/solr/build/solr-core/test/J1/temp/solr.security.PKIAuthenticationIntegrationTest_5D88118CA4532CC-001/shard-1-001/cores
   [junit4]   2> 3265937 INFO  (TEST-PKIAuthenticationIntegrationTest.testPkiAuth-seed#[5D88118CA4532CC]) [n:127.0.0.1:53671_h_xg%2Fvp    ] o.a.s.c.SolrCore Created CoreDescriptor: {name=collection1, config=solrconfig.xml, transient=false, schema=schema.xml, loadOnStartup=true, configSetProperties=configsetprops.json, instanceDir=/export/home/jenkins/workspace/Lucene-Solr-trunk-Solaris/solr/build/solr-core/test/J1/../../../../../../../../../../export/home/jenkins/workspace/Lucene-Solr-trunk-Solaris/solr/build/solr-core/test/J1/temp/solr.security.PKIAuthenticationIntegrationTest_5D88118CA4532CC-001/shard-1-001/cores/collection1, collection=collection1, absoluteInstDir=/export/home/jenkins/workspace/Lucene-Solr-trunk-Solaris/solr/build/solr-core/test/J1/../../../../../../../../../../export/home/jenkins/workspace/Lucene-Solr-trunk-Solaris/solr/build/solr-core/test/J1/temp/solr.security.PKIAuthenticationIntegrationTest_5D88118CA4532CC-001/shard-1-001/cores/collection1/, coreNodeName=, dataDir=data/, shard=}
   [junit4]   2> 3265937 INFO  (TEST-PKIAuthenticationIntegrationTest.testPkiAuth-seed#[5D88118CA4532CC]) [n:127.0.0.1:53671_h_xg%2Fvp    ] o.a.s.c.CoresLocator Found core collection1 in /export/home/jenkins/workspace/Lucene-Solr-trunk-Solaris/solr/build/solr-core/test/J1/../../../../../../../../../../export/home/jenkins/workspace/Lucene-Solr-trunk-Solaris/solr/build/solr-core/test/J1/temp/solr.security.PKIAuthenticationIntegrationTest_5D88118CA4532CC-001/shard-1-001/cores/collection1/
   [junit4]   2> 3265937 INFO  (TEST-PKIAuthenticationIntegrationTest.testPkiAuth-seed#[5D88118CA4532CC]) [n:127.0.0.1:53671_h_xg%2Fvp    ] o.a.s.c.CoresLocator Found 1 core definitions
   [junit4]   2> 3265939 INFO  (TEST-PKIAuthenticationIntegrationTest.testPkiAuth-seed#[5D88118CA4532CC]) [n:127.0.0.1:53671_h_xg%2Fvp    ] o.a.s.s.SolrDispatchFilter user.dir=/export/home/jenkins/workspace/Lucene-Solr-trunk-Solaris/solr/build/solr-core/test/J1
   [junit4]   2> 3265939 INFO  (TEST-PKIAuthenticationIntegrationTest.testPkiAuth-seed#[5D88118CA4532CC]) [n:127.0.0.1:53671_h_xg%2Fvp    ] o.a.s.s.SolrDispatchFilter SolrDispatchFilter.init() done
   [junit4]   2> 3265939 INFO  (coreLoadExecutor-9148-thread-1-processing-n:127.0.0.1:53671_h_xg%2Fvp) [n:127.0.0.1:53671_h_xg%2Fvp c:collection1   x:collection1] o.a.s.c.ZkController publishing state=down
   [junit4]   2> 3265939 INFO  (coreLoadExecutor-9148-thread-1-processing-n:127.0.0.1:53671_h_xg%2Fvp) [n:127.0.0.1:53671_h_xg%2Fvp c:collection1   x:collection1] o.a.s.c.ZkController numShards not found on descriptor - reading it from system property
   [junit4]   2> 3265942 INFO  (OverseerStateUpdate-94617162632527876-127.0.0.1:57799_h_xg%2Fvp-n_0000000000) [n:127.0.0.1:57799_h_xg%2Fvp    ] o.a.s.c.Overseer processMessage: queueSize: 1, message = {
   [junit4]   2>   "core":"collection1",
   [junit4]   2>   "roles":null,
   [junit4]   2>   "base_url":"http://127.0.0.1:53671/h_xg/vp",
   [junit4]   2>   "node_name":"127.0.0.1:53671_h_xg%2Fvp",
   [junit4]   2>   "numShards":"2",
   [junit4]   2>   "state":"down",
   [junit4]   2>   "shard":null,
   [junit4]   2>   "collection":"collection1",
   [junit4]   2>   "operation":"state"} current state version: 3
   [junit4]   2> 3265942 INFO  (OverseerStateUpdate-94617162632527876-127.0.0.1:57799_h_xg%2Fvp-n_0000000000) [n:127.0.0.1:57799_h_xg%2Fvp    ] o.a.s.c.o.ReplicaMutator Update state numShards=2 message={
   [junit4]   2>   "core":"collection1",
   [junit4]   2>   "roles":null,
   [junit4]   2>   "base_url":"http://127.0.0.1:53671/h_xg/vp",
   [junit4]   2>   "node_name":"127.0.0.1:53671_h_xg%2Fvp",
   [junit4]   2>   "numShards":"2",
   [junit4]   2>   "state":"down",
   [junit4]   2>   "shard":null,
   [junit4]   2>   "collection":"collection1",
   [junit4]   2>   "operation":"state"}
   [junit4]   2> 3265942 INFO  (OverseerStateUpdate-94617162632527876-127.0.0.1:57799_h_xg%2Fvp-n_0000000000) [n:127.0.0.1:57799_h_xg%2Fvp    ] o.a.s.c.o.ClusterStateMutator building a new cName: collection1
   [junit4]   2> 3265942 INFO  (OverseerStateUpdate-94617162632527876-127.0.0.1:57799_h_xg%2Fvp-n_0000000000) [n:127.0.0.1:57799_h_xg%2Fvp    ] o.a.s.c.o.ReplicaMutator Assigning new node to shard shard=shard2
   [junit4]   2> 3265943 INFO  (coreLoadExecutor-9148-thread-1-processing-n:127.0.0.1:53671_h_xg%2Fvp) [n:127.0.0.1:53671_h_xg%2Fvp c:collection1   x:collection1] o.a.s.c.ZkController look for our core node name
   [junit4]   2> 3266046 INFO  (zkCallback-2674-thread-1) [    ] o.a.s.c.c.ZkStateReader A cluster state change: WatchedEvent state:SyncConnected type:NodeDataChanged path:/clusterstate.json, has occurred - updating... (live nodes size: 2)
   [junit4]   2> 3266046 INFO  (zkCallback-2678-thread-1-processing-n:127.0.0.1:53671_h_xg%2Fvp) [n:127.0.0.1:53671_h_xg%2Fvp    ] o.a.s.c.c.ZkStateReader A cluster state change: WatchedEvent state:SyncConnected type:NodeDataChanged path:/clusterstate.json, has occurred - updating... (live nodes size: 2)
   [junit4]   2> 3266047 INFO  (zkCallback-2672-thread-1-processing-n:127.0.0.1:57799_h_xg%2Fvp) [n:127.0.0.1:57799_h_xg%2Fvp    ] o.a.s.c.c.ZkStateReader A cluster state change: WatchedEvent state:SyncConnected type:NodeDataChanged path:/clusterstate.json, has occurred - updating... (live nodes size: 2)
   [junit4]   2> 3266944 INFO  (coreLoadExecutor-9148-thread-1-processing-n:127.0.0.1:53671_h_xg%2Fvp) [n:127.0.0.1:53671_h_xg%2Fvp c:collection1   x:collection1] o.a.s.c.ZkController waiting to find shard id in clusterstate for collection1
   [junit4]   2> 3266945 INFO  (coreLoadExecutor-9148-thread-1-processing-n:127.0.0.1:53671_h_xg%2Fvp) [n:127.0.0.1:53671_h_xg%2Fvp c:collection1   x:collection1] o.a.s.c.ZkController Check for collection zkNode:collection1
   [junit4]   2> 3266946 INFO  (coreLoadExecutor-9148-thread-1-processing-n:127.0.0.1:53671_h_xg%2Fvp) [n:127.0.0.1:53671_h_xg%2Fvp c:collection1   x:collection1] o.a.s.c.ZkController Collection zkNode exists
   [junit4]   2> 3266946 INFO  (coreLoadExecutor-9148-thread-1-processing-n:127.0.0.1:53671_h_xg%2Fvp) [n:127.0.0.1:53671_h_xg%2Fvp c:collection1   x:collection1] o.a.s.c.c.ZkStateReader Load collection config from:/collections/collection1
   [junit4]   2> 3266948 INFO  (coreLoadExecutor-9148-thread-1-processing-n:127.0.0.1:53671_h_xg%2Fvp) [n:127.0.0.1:53671_h_xg%2Fvp c:collection1   x:collection1] o.a.s.c.c.ZkStateReader path=/collections/collection1 configName=conf1 specified config exists in ZooKeeper
   [junit4]   2> 3266948 INFO  (coreLoadExecutor-9148-thread-1-processing-n:127.0.0.1:53671_h_xg%2Fvp) [n:127.0.0.1:53671_h_xg%2Fvp c:collection1   x:collection1] o.a.s.c.SolrResourceLoader new SolrResourceLoader for directory: '/export/home/jenkins/workspace/Lucene-Solr-trunk-Solaris/solr/build/solr-core/test/J1/../../../../../../../../../../export/home/jenkins/workspace/Lucene-Solr-trunk-Solaris/solr/build/solr-core/test/J1/temp/solr.security.PKIAuthenticationIntegrationTest_5D88118CA4532CC-001/shard-1-001/cores/collection1/'
   [junit4]   2> 3266972 INFO  (coreLoadExecutor-9148-thread-1-processing-n:127.0.0.1:53671_h_xg%2Fvp) [n:127.0.0.1:53671_h_xg%2Fvp c:collection1   x:collection1] o.a.s.c.Config loaded config solrconfig.xml with version 0 
   [junit4]   2> 3266979 INFO  (coreLoadExecutor-9148-thread-1-processing-n:127.0.0.1:53671_h_xg%2Fvp) [n:127.0.0.1:53671_h_xg%2Fvp c:collection1   x:collection1] o.a.s.c.SolrConfig current version of requestparams : -1
   [junit4]   2> 3266984 INFO  (coreLoadExecutor-9148-thread-1-processing-n:127.0.0.1:53671_h_xg%2Fvp) [n:127.0.0.1:53671_h_xg%2Fvp c:collection1   x:collection1] o.a.s.c.SolrConfig Using Lucene MatchVersion: 6.0.0
   [junit4]   2> 3266990 INFO  (coreLoadExecutor-9148-thread-1-processing-n:127.0.0.1:53671_h_xg%2Fvp) [n:127.0.0.1:53671_h_xg%2Fvp c:collection1   x:collection1] o.a.s.c.Config Loaded SolrConfig: solrconfig.xml
   [junit4]   2> 3266993 INFO  (coreLoadExecutor-9148-thread-1-processing-n:127.0.0.1:53671_h_xg%2Fvp) [n:127.0.0.1:53671_h_xg%2Fvp c:collection1   x:collection1] o.a.s.s.IndexSchema Reading Solr Schema from /configs/conf1/schema.xml
   [junit4]   2> 3266997 INFO  (coreLoadExecutor-9148-thread-1-processing-n:127.0.0.1:53671_h_xg%2Fvp) [n:127.0.0.1:53671_h_xg%2Fvp c:collection1   x:collection1] o.a.s.s.IndexSchema [collection1] Schema name=test
   [junit4]   2> 3267076 INFO  (coreLoadExecutor-9148-thread-1-processing-n:127.0.0.1:53671_h_xg%2Fvp) [n:127.0.0.1:53671_h_xg%2Fvp c:collection1   x:collection1] o.a.s.s.OpenExchangeRatesOrgProvider Initialized with rates=open-exchange-rates.json, refreshInterval=1440.
   [junit4]   2> 3267084 INFO  (coreLoadExecutor-9148-thread-1-processing-n:127.0.0.1:53671_h_xg%2Fvp) [n:127.0.0.1:53671_h_xg%2Fvp c:collection1   x:collection1] o.a.s.s.IndexSchema default search field in schema is text
   [junit4]   2> 3267085 INFO  (coreLoadExecutor-9148-thread-1-processing-n:127.0.0.1:53671_h_xg%2Fvp) [n:127.0.0.1:53671_h_xg%2Fvp c:collection1   x:collection1] o.a.s.s.IndexSchema unique key field: id
   [junit4]   2> 3267099 INFO  (coreLoadExecutor-9148-thread-1-processing-n:127.0.0.1:53671_h_xg%2Fvp) [n:127.0.0.1:53671_h_xg%2Fvp c:collection1   x:collection1] o.a.s.s.FileExchangeRateProvider Reloading exchange rates from file currency.xml
   [junit4]   2> 3267102 INFO  (coreLoadExecutor-9148-thread-1-processing-n:127.0.0.1:53671_h_xg%2Fvp) [n:127.0.0.1:53671_h_xg%2Fvp c:collection1   x:collection1] o.a.s.s.FileExchangeRateProvider Reloading exchange rates from file currency.xml
   [junit4]   2> 3267104 INFO  (coreLoadExecutor-9148-thread-1-processing-n:127.0.0.1:53671_h_xg%2Fvp) [n:127.0.0.1:53671_h_xg%2Fvp c:collection1   x:collection1] o.a.s.s.OpenExchangeRatesOrgProvider Reloading exchange rates from open-exchange-rates.json
   [junit4]   2> 3267107 WARN  (coreLoadExecutor-9148-thread-1-processing-n:127.0.0.1:53671_h_xg%2Fvp) [n:127.0.0.1:53671_h_xg%2Fvp c:collection1   x:collection1] o.a.s.s.OpenExchangeRatesOrgProvider Unknown key IMPORTANT NOTE
   [junit4]   2> 3267107 WARN  (coreLoadExecutor-9148-thread-1-processing-n:127.0.0.1:53671_h_xg%2Fvp) [n:127.0.0.1:53671_h_xg%2Fvp c:collection1   x:collection1] o.a.s.s.OpenExchangeRatesOrgProvider Expected key, got STRING
   [junit4]   2> 3267107 INFO  (coreLoadExecutor-9148-thread-1-processing-n:127.0.0.1:53671_h_xg%2Fvp) [n:127.0.0.1:53671_h_xg%2Fvp c:collection1   x:collection1] o.a.s.s.OpenExchangeRatesOrgProvider Reloading exchange rates from open-exchange-rates.json
   [junit4]   2> 3267109 WARN  (coreLoadExecutor-9148-thread-1-processing-n:127.0.0.1:53671_h_xg%2Fvp) [n:127.0.0.1:53671_h_xg%2Fvp c:collection1   x:collection1] o.a.s.s.OpenExchangeRatesOrgProvider Unknown key IMPORTANT NOTE
   [junit4]   2> 3267109 WARN  (coreLoadExecutor-9148-thread-1-processing-n:127.0.0.1:53671_h_xg%2Fvp) [n:127.0.0.1:53671_h_xg%2Fvp c:collection1   x:collection1] o.a.s.s.OpenExchangeRatesOrgProvider Expected key, got STRING
   [junit4]   2> 3267111 INFO  (coreLoadExecutor-9148-thread-1-processing-n:127.0.0.1:53671_h_xg%2Fvp) [n:127.0.0.1:53671_h_xg%2Fvp c:collection1   x:collection1] o.a.s.c.ConfigSetProperties Did not find ConfigSet properties, assuming default properties: 

[...truncated too long message...]

bstractFullDistribZkTestBase.waitForThingsToLevelOut(AbstractFullDistribZkTestBase.java:1393)
   [junit4]    > 	at org.apache.solr.security.PKIAuthenticationIntegrationTest.testPkiAuth(PKIAuthenticationIntegrationTest.java:52)
   [junit4]    > 	at org.apache.solr.BaseDistributedSearchTestCase$ShardsRepeatRule$ShardsFixedStatement.callStatement(BaseDistributedSearchTestCase.java:963)
   [junit4]    > 	at org.apache.solr.BaseDistributedSearchTestCase$ShardsRepeatRule$ShardsStatement.evaluate(BaseDistributedSearchTestCase.java:938)
   [junit4]    > 	at java.lang.Thread.run(Thread.java:745)
   [junit4]   2> 3310511 INFO  (SUITE-PKIAuthenticationIntegrationTest-seed#[5D88118CA4532CC]-worker) [n:127.0.0.1:52865_h_xg%2Fvp c:collection1 s:shard1 r:core_node4 x:collection1] o.a.s.SolrTestCaseJ4 ###deleteCore
   [junit4]   2> NOTE: leaving temporary files on disk at: /export/home/jenkins/workspace/Lucene-Solr-trunk-Solaris/solr/build/solr-core/test/J1/temp/solr.security.PKIAuthenticationIntegrationTest_5D88118CA4532CC-001
   [junit4]   2> Oct 01, 2015 11:49:34 PM com.carrotsearch.randomizedtesting.ThreadLeakControl checkThreadLeaks
   [junit4]   2> WARNING: Will linger awaiting termination of 1 leaked thread(s).
   [junit4]   2> NOTE: test params are: codec=CheapBastard, sim=ClassicSimilarity, locale=es_ES, timezone=ROK
   [junit4]   2> NOTE: SunOS 5.11 amd64/Oracle Corporation 1.8.0_60 (64-bit)/cpus=3,threads=1,free=98223976,total=518979584
   [junit4]   2> NOTE: All tests run in this JVM: [CollectionReloadTest, TestBinaryResponseWriter, CursorPagingTest, TermVectorComponentTest, DistributedFacetPivotLargeTest, TestSchemaNameResource, TestReRankQParserPlugin, HLLUtilTest, CurrencyFieldOpenExchangeTest, TestRestoreCore, TestRecoveryHdfs, TestStandardQParsers, AutoCommitTest, SuggesterTest, ClusterStateTest, TermVectorComponentDistributedTest, TestCSVResponseWriter, SpellCheckComponentTest, SliceStateTest, DistanceFunctionTest, TestAuthorizationFramework, TestRuleBasedAuthorizationPlugin, AnalyticsQueryTest, TestNonDefinedSimilarityFactory, TestConfigReload, TestLRUStatsCache, SearchHandlerTest, TestLMJelinekMercerSimilarityFactory, FieldMutatingUpdateProcessorTest, ShardRoutingCustomTest, TestRealTimeGet, ShowFileRequestHandlerTest, DirectUpdateHandlerOptimizeTest, CdcrUpdateLogTest, SpellingQueryConverterTest, TestSuggestSpellingConverter, TestCustomDocTransformer, TestDefaultSimilarityFactory, FieldAnalysisRequestHandlerTest, BigEndianAscendingWordSerializerTest, TestDownShardTolerantSearch, AsyncCallRequestStatusResponseTest, TestBM25SimilarityFactory, SaslZkACLProviderTest, TestDefaultSearchFieldResource, DocExpirationUpdateProcessorFactoryTest, CollectionStateFormat2Test, TestIndexingPerformance, TestRandomFaceting, TestJoin, DirectSolrConnectionTest, CSVRequestHandlerTest, SolrInfoMBeanTest, TestReversedWildcardFilterFactory, CollectionsAPIAsyncDistributedZkTest, HdfsLockFactoryTest, TestTrie, ZkStateWriterTest, TestSolrQueryParserDefaultOperatorResource, TestCollationField, NumericFieldsTest, TestSolrDynamicMBean, TestRandomRequestDistribution, ChaosMonkeySafeLeaderTest, BasicAuthIntegrationTest, TestNamedUpdateProcessors, CoreAdminHandlerTest, TestOverriddenPrefixQueryForCustomFieldType, TestSmileRequest, SecurityConfHandlerTest, SolrCloudExampleTest, TestBadConfig, TestConfigSetImmutable, TestCopyFieldCollectionResource, NoCacheHeaderTest, MultiTermTest, TimeZoneUtilsTest, TestHdfsUpdateLog, CleanupOldIndexTest, QueryParsingTest, TestBulkSchemaAPI, TriLevelCompositeIdRoutingTest, UUIDUpdateProcessorFallbackTest, DeleteLastCustomShardedReplicaTest, PrimUtilsTest, ZkStateReaderTest, TestWriterPerf, SolrIndexSplitterTest, TestExclusionRuleCollectionAccess, TestSortByMinMaxFunction, CircularListTest, CollectionsAPIDistributedZkTest, SuggesterWFSTTest, CdcrRequestHandlerTest, CacheHeaderTest, TestMiniSolrCloudClusterSSL, SolrCmdDistributorTest, TestInfoStreamLogging, LeaderElectionIntegrationTest, TestOmitPositions, TestPerFieldSimilarity, TestRecovery, SSLMigrationTest, TestConfigOverlay, TestFreeTextSuggestions, TestRawResponseWriter, TestMaxScoreQueryParser, EnumFieldTest, DistributedFacetPivotLongTailTest, ReplicationFactorTest, ResponseHeaderTest, VersionInfoTest, NotRequiredUniqueKeyTest, TestDistributedGrouping, TestCloudPivotFacet, BinaryUpdateRequestHandlerTest, TestCollectionAPI, TestQueryTypes, SpellPossibilityIteratorTest, TestManagedResource, CdcrVersionReplicationTest, DefaultValueUpdateProcessorTest, HighlighterConfigTest, BasicZkTest, RequestLoggingTest, FileBasedSpellCheckerTest, TestRangeQuery, RankQueryTest, DataDrivenBlockJoinTest, BasicDistributedZkTest, BasicDistributedZk2Test, OpenCloseCoreStressTest, OverseerTest, ShardRoutingTest, RecoveryZkTest, FullSolrCloudDistribCmdsTest, ClusterStateUpdateTest, LeaderElectionTest, TestZkChroot, TestFaceting, TestHashPartitioner, ZkControllerTest, TestStressReorder, TestStressVersions, TestCoreContainer, SolrCoreTest, QueryElevationComponentTest, PeerSyncTest, TestSort, BasicFunctionalityTest, DirectUpdateHandlerTest, DistributedQueryElevationComponentTest, CurrencyFieldXmlFileTest, TestCoreDiscovery, SpellCheckCollatorTest, SuggesterTSTTest, SolrCoreCheckLockOnStartupTest, TestAtomicUpdateErrorCases, StatelessScriptUpdateProcessorFactoryTest, XsltUpdateRequestHandlerTest, TestQueryUtils, StandardRequestHandlerTest, DirectSolrSpellCheckerTest, PrimitiveFieldTypeTest, TestValueSourceCache, TestSolrQueryParser, IndexSchemaRuntimeFieldTest, RegexBoostProcessorTest, TestJmxIntegration, MBeansHandlerTest, UniqFieldsUpdateProcessorFactoryTest, JsonLoaderTest, SOLR749Test, UpdateParamsTest, CopyFieldTest, SolrIndexConfigTest, TestMergePolicyConfig, TestSolrDeletionPolicy2, SampleTest, TestBinaryField, TestSearchPerf, MinimalSchemaTest, TestElisionMultitermQuery, OutputWriterTest, TestFuzzyAnalyzedSuggestions, ExternalFileFieldSortTest, TestSolrCoreProperties, TestCharFilters, SynonymTokenizerTest, TestXIncludeConfig, EchoParamsTest, TestIBSimilarityFactory, ResourceLoaderTest, TestFastOutputStream, OpenExchangeRatesOrgProviderTest, URLClassifyProcessorTest, TestFastLRUCache, DateMathParserTest, ChaosMonkeyNothingIsSafeTest, PreAnalyzedFieldTest, DateFieldTest, DOMUtilTest, RAMDirectoryFactoryTest, TestSolrJ, TestUtils, ZkNodePropsTest, SystemInfoHandlerTest, UUIDFieldTest, TestRTGBase, SolrTestCaseJ4Test, TestCrossCoreJoin, TestCursorMarkWithoutUniqueKey, TestHighlightDedupGrouping, TestTolerantSearch, TestEmbeddedSolrServerConstructors, TestJettySolrRunner, AliasIntegrationTest, CollectionTooManyReplicasTest, DistribDocExpirationUpdateProcessorTest, LeaderFailoverAfterPartitionTest, LeaderInitiatedRecoveryOnCommitTest, MultiThreadedOCPTest, ShardSplitTest, TestCloudInspectUtil, TestConfigSetsAPI, TestConfigSetsAPIExclusivity, TestConfigSetsAPIZkFailure, TestDistribDocBasedVersion, TestMiniSolrCloudCluster, TestRebalanceLeaders, TestShortCircuitedRequests, HdfsChaosMonkeySafeLeaderTest, HdfsCollectionsAPIDistributedZkTest, HdfsNNFailoverTest, HdfsRecoveryZkTest, HdfsSyncSliceTest, HdfsUnloadDistributedZkTest, HdfsWriteToMultipleCollectionsTest, StressHdfsTest, CachingDirectoryFactoryTest, QueryResultKeyTest, TestConfigSets, TestDynamicLoading, TestImplicitCoreProperties, TestInitParams, TestReloadAndDeleteDocs, TestShardHandlerFactory, TestReplicationHandlerBackup, TestSolrConfigHandlerConcurrent, CoreAdminCreateDiscoverTest, CoreMergeIndexesAdminHandlerTest, DistributedDebugComponentTest, DistributedFacetPivotSmallAdvancedTest, DistributedQueryComponentCustomSortTest, DistributedQueryComponentOptimizationTest, TestExpandComponent, TestPivotHelperCode, TestTrackingShardHandlerFactory, JavabinLoaderTest, HighlighterMaxOffsetTest, SmileWriterTest, TestIntervalFaceting, TestMacros, TestChildDocTransformer, TestSortingResponseWriter, TestManagedResourceStorage, TestRestManager, TestClassNameShortening, TestDynamicFieldCollectionResource, TestFieldCollectionResource, TestFieldResource, TestFieldTypeCollectionResource, TestFieldTypeResource, TestManagedSchemaFieldResource, TestManagedSynonymFilterFactory, SpatialRPTFieldTypeTest, TestCloudManagedSchema, AnalyticsMergeStrategyTest, CursorMarkTest, MergeStrategyTest, TestAddFieldRealTimeGet, TestCollapseQParserPlugin, TestComplexPhraseQParserPlugin, TestCustomSort, TestHashQParserPlugin, TestMissingGroups, TestReloadDeadlock, TestSearcherReuse, TestSolr4Spatial2, TestStressUserVersions, TestTrieFacet, TestJsonFacets, TestMinMaxOnMultiValuedField, TestScoreJoinQPNoScore, TestScoreJoinQPScore, CloudMLTQParserTest, PKIAuthenticationIntegrationTest]
   [junit4] Completed [532/546] on J1 in 48.75s, 1 test, 1 failure <<< FAILURES!

[...truncated 52 lines...]
BUILD FAILED
/export/home/jenkins/workspace/Lucene-Solr-trunk-Solaris/build.xml:775: The following error occurred while executing this line:
/export/home/jenkins/workspace/Lucene-Solr-trunk-Solaris/build.xml:719: The following error occurred while executing this line:
/export/home/jenkins/workspace/Lucene-Solr-trunk-Solaris/build.xml:59: The following error occurred while executing this line:
/export/home/jenkins/workspace/Lucene-Solr-trunk-Solaris/solr/build.xml:233: The following error occurred while executing this line:
/export/home/jenkins/workspace/Lucene-Solr-trunk-Solaris/solr/common-build.xml:516: The following error occurred while executing this line:
/export/home/jenkins/workspace/Lucene-Solr-trunk-Solaris/lucene/common-build.xml:1432: The following error occurred while executing this line:
/export/home/jenkins/workspace/Lucene-Solr-trunk-Solaris/lucene/common-build.xml:987: There were test failures: 546 suites (8 ignored), 2145 tests, 1 failure, 47 ignored (35 assumptions) [seed: 5D88118CA4532CC]

Total time: 76 minutes 11 seconds
Build step 'Invoke Ant' marked build as failure
Archiving artifacts
[WARNINGS] Skipping publisher since build result is FAILURE
Recording test results
Email was triggered for: Failure - Any
Sending email for trigger: Failure - Any



Mime
View raw message