lucene-dev mailing list archives

Site index · List index
Message view « Date » · « Thread »
Top « Date » · « Thread »
From Policeman Jenkins Server <jenk...@thetaphi.de>
Subject [JENKINS] Lucene-Solr-5.x-MacOSX (64bit/jdk1.8.0) - Build # 2729 - Failure!
Date Wed, 07 Oct 2015 03:38:52 GMT
Build: http://jenkins.thetaphi.de/job/Lucene-Solr-5.x-MacOSX/2729/
Java: 64bit/jdk1.8.0 -XX:+UseCompressedOops -XX:+UseConcMarkSweepGC

1 tests failed.
FAILED:  org.apache.solr.cloud.SolrCloudExampleTest.testLoadDocsIntoGettingStartedCollection

Error Message:
Delete action failed!

Stack Trace:
java.lang.AssertionError: Delete action failed!
	at __randomizedtesting.SeedInfo.seed([6F145AE51E2E137C:7C77688A2F41AADA]:0)
	at org.junit.Assert.fail(Assert.java:93)
	at org.junit.Assert.assertTrue(Assert.java:43)
	at org.apache.solr.cloud.SolrCloudExampleTest.doTestDeleteAction(SolrCloudExampleTest.java:169)
	at org.apache.solr.cloud.SolrCloudExampleTest.testLoadDocsIntoGettingStartedCollection(SolrCloudExampleTest.java:145)
	at sun.reflect.NativeMethodAccessorImpl.invoke0(Native Method)
	at sun.reflect.NativeMethodAccessorImpl.invoke(NativeMethodAccessorImpl.java:62)
	at sun.reflect.DelegatingMethodAccessorImpl.invoke(DelegatingMethodAccessorImpl.java:43)
	at java.lang.reflect.Method.invoke(Method.java:497)
	at com.carrotsearch.randomizedtesting.RandomizedRunner.invoke(RandomizedRunner.java:1665)
	at com.carrotsearch.randomizedtesting.RandomizedRunner$8.evaluate(RandomizedRunner.java:864)
	at com.carrotsearch.randomizedtesting.RandomizedRunner$9.evaluate(RandomizedRunner.java:900)
	at com.carrotsearch.randomizedtesting.RandomizedRunner$10.evaluate(RandomizedRunner.java:914)
	at org.apache.solr.BaseDistributedSearchTestCase$ShardsRepeatRule$ShardsFixedStatement.callStatement(BaseDistributedSearchTestCase.java:963)
	at org.apache.solr.BaseDistributedSearchTestCase$ShardsRepeatRule$ShardsStatement.evaluate(BaseDistributedSearchTestCase.java:938)
	at com.carrotsearch.randomizedtesting.rules.SystemPropertiesRestoreRule$1.evaluate(SystemPropertiesRestoreRule.java:57)
	at org.apache.lucene.util.TestRuleSetupTeardownChained$1.evaluate(TestRuleSetupTeardownChained.java:50)
	at org.apache.lucene.util.AbstractBeforeAfterRule$1.evaluate(AbstractBeforeAfterRule.java:46)
	at org.apache.lucene.util.TestRuleThreadAndTestName$1.evaluate(TestRuleThreadAndTestName.java:49)
	at org.apache.lucene.util.TestRuleIgnoreAfterMaxFailures$1.evaluate(TestRuleIgnoreAfterMaxFailures.java:65)
	at org.apache.lucene.util.TestRuleMarkFailure$1.evaluate(TestRuleMarkFailure.java:48)
	at com.carrotsearch.randomizedtesting.rules.StatementAdapter.evaluate(StatementAdapter.java:36)
	at com.carrotsearch.randomizedtesting.ThreadLeakControl$StatementRunner.run(ThreadLeakControl.java:367)
	at com.carrotsearch.randomizedtesting.ThreadLeakControl.forkTimeoutingTask(ThreadLeakControl.java:809)
	at com.carrotsearch.randomizedtesting.ThreadLeakControl$3.evaluate(ThreadLeakControl.java:460)
	at com.carrotsearch.randomizedtesting.RandomizedRunner.runSingleTest(RandomizedRunner.java:873)
	at com.carrotsearch.randomizedtesting.RandomizedRunner$5.evaluate(RandomizedRunner.java:775)
	at com.carrotsearch.randomizedtesting.RandomizedRunner$6.evaluate(RandomizedRunner.java:809)
	at com.carrotsearch.randomizedtesting.RandomizedRunner$7.evaluate(RandomizedRunner.java:820)
	at com.carrotsearch.randomizedtesting.rules.StatementAdapter.evaluate(StatementAdapter.java:36)
	at com.carrotsearch.randomizedtesting.rules.SystemPropertiesRestoreRule$1.evaluate(SystemPropertiesRestoreRule.java:57)
	at org.apache.lucene.util.AbstractBeforeAfterRule$1.evaluate(AbstractBeforeAfterRule.java:46)
	at com.carrotsearch.randomizedtesting.rules.StatementAdapter.evaluate(StatementAdapter.java:36)
	at org.apache.lucene.util.TestRuleStoreClassName$1.evaluate(TestRuleStoreClassName.java:42)
	at com.carrotsearch.randomizedtesting.rules.NoShadowingOrOverridesOnMethodsRule$1.evaluate(NoShadowingOrOverridesOnMethodsRule.java:39)
	at com.carrotsearch.randomizedtesting.rules.NoShadowingOrOverridesOnMethodsRule$1.evaluate(NoShadowingOrOverridesOnMethodsRule.java:39)
	at com.carrotsearch.randomizedtesting.rules.StatementAdapter.evaluate(StatementAdapter.java:36)
	at com.carrotsearch.randomizedtesting.rules.StatementAdapter.evaluate(StatementAdapter.java:36)
	at com.carrotsearch.randomizedtesting.rules.StatementAdapter.evaluate(StatementAdapter.java:36)
	at org.apache.lucene.util.TestRuleAssertionsRequired$1.evaluate(TestRuleAssertionsRequired.java:54)
	at org.apache.lucene.util.TestRuleMarkFailure$1.evaluate(TestRuleMarkFailure.java:48)
	at org.apache.lucene.util.TestRuleIgnoreAfterMaxFailures$1.evaluate(TestRuleIgnoreAfterMaxFailures.java:65)
	at org.apache.lucene.util.TestRuleIgnoreTestSuites$1.evaluate(TestRuleIgnoreTestSuites.java:55)
	at com.carrotsearch.randomizedtesting.rules.StatementAdapter.evaluate(StatementAdapter.java:36)
	at com.carrotsearch.randomizedtesting.ThreadLeakControl$StatementRunner.run(ThreadLeakControl.java:367)
	at java.lang.Thread.run(Thread.java:745)




Build Log:
[...truncated 10901 lines...]
   [junit4] Suite: org.apache.solr.cloud.SolrCloudExampleTest
   [junit4]   2> Creating dataDir: /Users/jenkins/workspace/Lucene-Solr-5.x-MacOSX/solr/build/solr-core/test/J1/temp/solr.cloud.SolrCloudExampleTest_6F145AE51E2E137C-001/init-core-data-001
   [junit4]   2> 2411216 INFO  (SUITE-SolrCloudExampleTest-seed#[6F145AE51E2E137C]-worker) [    ] o.a.s.SolrTestCaseJ4 Randomized ssl (false) and clientAuth (false)
   [junit4]   2> 2411216 INFO  (SUITE-SolrCloudExampleTest-seed#[6F145AE51E2E137C]-worker) [    ] o.a.s.BaseDistributedSearchTestCase Setting hostContext system property: /_/wb
   [junit4]   2> 2411218 INFO  (TEST-SolrCloudExampleTest.testLoadDocsIntoGettingStartedCollection-seed#[6F145AE51E2E137C]) [    ] o.a.s.c.ZkTestServer STARTING ZK TEST SERVER
   [junit4]   2> 2411219 INFO  (Thread-6073) [    ] o.a.s.c.ZkTestServer client port:0.0.0.0/0.0.0.0:0
   [junit4]   2> 2411219 INFO  (Thread-6073) [    ] o.a.s.c.ZkTestServer Starting server
   [junit4]   2> 2411320 INFO  (TEST-SolrCloudExampleTest.testLoadDocsIntoGettingStartedCollection-seed#[6F145AE51E2E137C]) [    ] o.a.s.c.ZkTestServer start zk server on port:60644
   [junit4]   2> 2411320 INFO  (TEST-SolrCloudExampleTest.testLoadDocsIntoGettingStartedCollection-seed#[6F145AE51E2E137C]) [    ] o.a.s.c.c.SolrZkClient Using default ZkCredentialsProvider
   [junit4]   2> 2411321 INFO  (TEST-SolrCloudExampleTest.testLoadDocsIntoGettingStartedCollection-seed#[6F145AE51E2E137C]) [    ] o.a.s.c.c.ConnectionManager Waiting for client to connect to ZooKeeper
   [junit4]   2> 2411326 INFO  (zkCallback-2533-thread-1) [    ] o.a.s.c.c.ConnectionManager Watcher org.apache.solr.common.cloud.ConnectionManager@1f49ab17 name:ZooKeeperConnection Watcher:127.0.0.1:60644 got event WatchedEvent state:SyncConnected type:None path:null path:null type:None
   [junit4]   2> 2411326 INFO  (TEST-SolrCloudExampleTest.testLoadDocsIntoGettingStartedCollection-seed#[6F145AE51E2E137C]) [    ] o.a.s.c.c.ConnectionManager Client is connected to ZooKeeper
   [junit4]   2> 2411327 INFO  (TEST-SolrCloudExampleTest.testLoadDocsIntoGettingStartedCollection-seed#[6F145AE51E2E137C]) [    ] o.a.s.c.c.SolrZkClient Using default ZkACLProvider
   [junit4]   2> 2411327 INFO  (TEST-SolrCloudExampleTest.testLoadDocsIntoGettingStartedCollection-seed#[6F145AE51E2E137C]) [    ] o.a.s.c.c.SolrZkClient makePath: /solr
   [junit4]   2> 2411331 INFO  (TEST-SolrCloudExampleTest.testLoadDocsIntoGettingStartedCollection-seed#[6F145AE51E2E137C]) [    ] o.a.s.c.c.SolrZkClient Using default ZkCredentialsProvider
   [junit4]   2> 2411332 INFO  (TEST-SolrCloudExampleTest.testLoadDocsIntoGettingStartedCollection-seed#[6F145AE51E2E137C]) [    ] o.a.s.c.c.ConnectionManager Waiting for client to connect to ZooKeeper
   [junit4]   2> 2411333 INFO  (zkCallback-2534-thread-1) [    ] o.a.s.c.c.ConnectionManager Watcher org.apache.solr.common.cloud.ConnectionManager@3f062354 name:ZooKeeperConnection Watcher:127.0.0.1:60644/solr got event WatchedEvent state:SyncConnected type:None path:null path:null type:None
   [junit4]   2> 2411333 INFO  (TEST-SolrCloudExampleTest.testLoadDocsIntoGettingStartedCollection-seed#[6F145AE51E2E137C]) [    ] o.a.s.c.c.ConnectionManager Client is connected to ZooKeeper
   [junit4]   2> 2411334 INFO  (TEST-SolrCloudExampleTest.testLoadDocsIntoGettingStartedCollection-seed#[6F145AE51E2E137C]) [    ] o.a.s.c.c.SolrZkClient Using default ZkACLProvider
   [junit4]   2> 2411334 INFO  (TEST-SolrCloudExampleTest.testLoadDocsIntoGettingStartedCollection-seed#[6F145AE51E2E137C]) [    ] o.a.s.c.c.SolrZkClient makePath: /collections/collection1
   [junit4]   2> 2411337 INFO  (TEST-SolrCloudExampleTest.testLoadDocsIntoGettingStartedCollection-seed#[6F145AE51E2E137C]) [    ] o.a.s.c.c.SolrZkClient makePath: /collections/collection1/shards
   [junit4]   2> 2411340 INFO  (TEST-SolrCloudExampleTest.testLoadDocsIntoGettingStartedCollection-seed#[6F145AE51E2E137C]) [    ] o.a.s.c.c.SolrZkClient makePath: /collections/control_collection
   [junit4]   2> 2411342 INFO  (TEST-SolrCloudExampleTest.testLoadDocsIntoGettingStartedCollection-seed#[6F145AE51E2E137C]) [    ] o.a.s.c.c.SolrZkClient makePath: /collections/control_collection/shards
   [junit4]   2> 2411345 INFO  (TEST-SolrCloudExampleTest.testLoadDocsIntoGettingStartedCollection-seed#[6F145AE51E2E137C]) [    ] o.a.s.c.AbstractZkTestCase put /Users/jenkins/workspace/Lucene-Solr-5.x-MacOSX/solr/core/src/test-files/solr/collection1/conf/solrconfig-tlog.xml to /configs/conf1/solrconfig.xml
   [junit4]   2> 2411966 INFO  (TEST-SolrCloudExampleTest.testLoadDocsIntoGettingStartedCollection-seed#[6F145AE51E2E137C]) [    ] o.a.s.c.c.SolrZkClient makePath: /configs/conf1/solrconfig.xml
   [junit4]   2> 2411971 INFO  (TEST-SolrCloudExampleTest.testLoadDocsIntoGettingStartedCollection-seed#[6F145AE51E2E137C]) [    ] o.a.s.c.AbstractZkTestCase put /Users/jenkins/workspace/Lucene-Solr-5.x-MacOSX/solr/core/src/test-files/solr/collection1/conf/schema.xml to /configs/conf1/schema.xml
   [junit4]   2> 2412252 INFO  (TEST-SolrCloudExampleTest.testLoadDocsIntoGettingStartedCollection-seed#[6F145AE51E2E137C]) [    ] o.a.s.c.c.SolrZkClient makePath: /configs/conf1/schema.xml
   [junit4]   2> 2412256 INFO  (TEST-SolrCloudExampleTest.testLoadDocsIntoGettingStartedCollection-seed#[6F145AE51E2E137C]) [    ] o.a.s.c.AbstractZkTestCase put /Users/jenkins/workspace/Lucene-Solr-5.x-MacOSX/solr/core/src/test-files/solr/collection1/conf/solrconfig.snippet.randomindexconfig.xml to /configs/conf1/solrconfig.snippet.randomindexconfig.xml
   [junit4]   2> 2412279 INFO  (TEST-SolrCloudExampleTest.testLoadDocsIntoGettingStartedCollection-seed#[6F145AE51E2E137C]) [    ] o.a.s.c.c.SolrZkClient makePath: /configs/conf1/solrconfig.snippet.randomindexconfig.xml
   [junit4]   2> 2412283 INFO  (TEST-SolrCloudExampleTest.testLoadDocsIntoGettingStartedCollection-seed#[6F145AE51E2E137C]) [    ] o.a.s.c.AbstractZkTestCase put /Users/jenkins/workspace/Lucene-Solr-5.x-MacOSX/solr/core/src/test-files/solr/collection1/conf/stopwords.txt to /configs/conf1/stopwords.txt
   [junit4]   2> 2412301 INFO  (TEST-SolrCloudExampleTest.testLoadDocsIntoGettingStartedCollection-seed#[6F145AE51E2E137C]) [    ] o.a.s.c.c.SolrZkClient makePath: /configs/conf1/stopwords.txt
   [junit4]   2> 2412304 INFO  (TEST-SolrCloudExampleTest.testLoadDocsIntoGettingStartedCollection-seed#[6F145AE51E2E137C]) [    ] o.a.s.c.AbstractZkTestCase put /Users/jenkins/workspace/Lucene-Solr-5.x-MacOSX/solr/core/src/test-files/solr/collection1/conf/protwords.txt to /configs/conf1/protwords.txt
   [junit4]   2> 2412318 INFO  (TEST-SolrCloudExampleTest.testLoadDocsIntoGettingStartedCollection-seed#[6F145AE51E2E137C]) [    ] o.a.s.c.c.SolrZkClient makePath: /configs/conf1/protwords.txt
   [junit4]   2> 2412321 INFO  (TEST-SolrCloudExampleTest.testLoadDocsIntoGettingStartedCollection-seed#[6F145AE51E2E137C]) [    ] o.a.s.c.AbstractZkTestCase put /Users/jenkins/workspace/Lucene-Solr-5.x-MacOSX/solr/core/src/test-files/solr/collection1/conf/currency.xml to /configs/conf1/currency.xml
   [junit4]   2> 2412332 INFO  (TEST-SolrCloudExampleTest.testLoadDocsIntoGettingStartedCollection-seed#[6F145AE51E2E137C]) [    ] o.a.s.c.c.SolrZkClient makePath: /configs/conf1/currency.xml
   [junit4]   2> 2412335 INFO  (TEST-SolrCloudExampleTest.testLoadDocsIntoGettingStartedCollection-seed#[6F145AE51E2E137C]) [    ] o.a.s.c.AbstractZkTestCase put /Users/jenkins/workspace/Lucene-Solr-5.x-MacOSX/solr/core/src/test-files/solr/collection1/conf/enumsConfig.xml to /configs/conf1/enumsConfig.xml
   [junit4]   2> 2412336 INFO  (TEST-SolrCloudExampleTest.testLoadDocsIntoGettingStartedCollection-seed#[6F145AE51E2E137C]) [    ] o.a.s.c.c.SolrZkClient makePath: /configs/conf1/enumsConfig.xml
   [junit4]   2> 2412340 INFO  (TEST-SolrCloudExampleTest.testLoadDocsIntoGettingStartedCollection-seed#[6F145AE51E2E137C]) [    ] o.a.s.c.AbstractZkTestCase put /Users/jenkins/workspace/Lucene-Solr-5.x-MacOSX/solr/core/src/test-files/solr/collection1/conf/open-exchange-rates.json to /configs/conf1/open-exchange-rates.json
   [junit4]   2> 2412361 INFO  (TEST-SolrCloudExampleTest.testLoadDocsIntoGettingStartedCollection-seed#[6F145AE51E2E137C]) [    ] o.a.s.c.c.SolrZkClient makePath: /configs/conf1/open-exchange-rates.json
   [junit4]   2> 2412365 INFO  (TEST-SolrCloudExampleTest.testLoadDocsIntoGettingStartedCollection-seed#[6F145AE51E2E137C]) [    ] o.a.s.c.AbstractZkTestCase put /Users/jenkins/workspace/Lucene-Solr-5.x-MacOSX/solr/core/src/test-files/solr/collection1/conf/mapping-ISOLatin1Accent.txt to /configs/conf1/mapping-ISOLatin1Accent.txt
   [junit4]   2> 2412385 INFO  (TEST-SolrCloudExampleTest.testLoadDocsIntoGettingStartedCollection-seed#[6F145AE51E2E137C]) [    ] o.a.s.c.c.SolrZkClient makePath: /configs/conf1/mapping-ISOLatin1Accent.txt
   [junit4]   2> 2412388 INFO  (TEST-SolrCloudExampleTest.testLoadDocsIntoGettingStartedCollection-seed#[6F145AE51E2E137C]) [    ] o.a.s.c.AbstractZkTestCase put /Users/jenkins/workspace/Lucene-Solr-5.x-MacOSX/solr/core/src/test-files/solr/collection1/conf/old_synonyms.txt to /configs/conf1/old_synonyms.txt
   [junit4]   2> 2412417 INFO  (TEST-SolrCloudExampleTest.testLoadDocsIntoGettingStartedCollection-seed#[6F145AE51E2E137C]) [    ] o.a.s.c.c.SolrZkClient makePath: /configs/conf1/old_synonyms.txt
   [junit4]   2> 2412421 INFO  (TEST-SolrCloudExampleTest.testLoadDocsIntoGettingStartedCollection-seed#[6F145AE51E2E137C]) [    ] o.a.s.c.AbstractZkTestCase put /Users/jenkins/workspace/Lucene-Solr-5.x-MacOSX/solr/core/src/test-files/solr/collection1/conf/synonyms.txt to /configs/conf1/synonyms.txt
   [junit4]   2> 2412433 INFO  (TEST-SolrCloudExampleTest.testLoadDocsIntoGettingStartedCollection-seed#[6F145AE51E2E137C]) [    ] o.a.s.c.c.SolrZkClient makePath: /configs/conf1/synonyms.txt
   [junit4]   2> 2415624 INFO  (TEST-SolrCloudExampleTest.testLoadDocsIntoGettingStartedCollection-seed#[6F145AE51E2E137C]) [    ] o.a.s.SolrTestCaseJ4 Writing core.properties file to /Users/jenkins/workspace/Lucene-Solr-5.x-MacOSX/solr/build/solr-core/test/J1/temp/solr.cloud.SolrCloudExampleTest_6F145AE51E2E137C-001/control-001/cores/collection1
   [junit4]   2> 2415626 INFO  (TEST-SolrCloudExampleTest.testLoadDocsIntoGettingStartedCollection-seed#[6F145AE51E2E137C]) [    ] o.e.j.s.Server jetty-9.2.13.v20150730
   [junit4]   2> 2415629 INFO  (TEST-SolrCloudExampleTest.testLoadDocsIntoGettingStartedCollection-seed#[6F145AE51E2E137C]) [    ] o.e.j.s.h.ContextHandler Started o.e.j.s.ServletContextHandler@a392b37{/_/wb,null,AVAILABLE}
   [junit4]   2> 2415629 INFO  (TEST-SolrCloudExampleTest.testLoadDocsIntoGettingStartedCollection-seed#[6F145AE51E2E137C]) [    ] o.e.j.s.ServerConnector Started ServerConnector@177ce0d7{HTTP/1.1}{127.0.0.1:60647}
   [junit4]   2> 2415630 INFO  (TEST-SolrCloudExampleTest.testLoadDocsIntoGettingStartedCollection-seed#[6F145AE51E2E137C]) [    ] o.e.j.s.Server Started @2422623ms
   [junit4]   2> 2415630 INFO  (TEST-SolrCloudExampleTest.testLoadDocsIntoGettingStartedCollection-seed#[6F145AE51E2E137C]) [    ] o.a.s.c.s.e.JettySolrRunner Jetty properties: {solr.data.dir=/Users/jenkins/workspace/Lucene-Solr-5.x-MacOSX/solr/build/solr-core/test/J1/temp/solr.cloud.SolrCloudExampleTest_6F145AE51E2E137C-001/tempDir-001/control/data, hostContext=/_/wb, hostPort=60647, coreRootDirectory=/Users/jenkins/workspace/Lucene-Solr-5.x-MacOSX/solr/build/solr-core/test/J1/../../../../../../../../../Users/jenkins/workspace/Lucene-Solr-5.x-MacOSX/solr/build/solr-core/test/J1/temp/solr.cloud.SolrCloudExampleTest_6F145AE51E2E137C-001/control-001/cores}
   [junit4]   2> 2415630 INFO  (TEST-SolrCloudExampleTest.testLoadDocsIntoGettingStartedCollection-seed#[6F145AE51E2E137C]) [    ] o.a.s.s.SolrDispatchFilter SolrDispatchFilter.init(): sun.misc.Launcher$AppClassLoader@74a14482
   [junit4]   2> 2415630 INFO  (TEST-SolrCloudExampleTest.testLoadDocsIntoGettingStartedCollection-seed#[6F145AE51E2E137C]) [    ] o.a.s.c.SolrResourceLoader new SolrResourceLoader for directory: '/Users/jenkins/workspace/Lucene-Solr-5.x-MacOSX/solr/build/solr-core/test/J1/../../../../../../../../../Users/jenkins/workspace/Lucene-Solr-5.x-MacOSX/solr/build/solr-core/test/J1/temp/solr.cloud.SolrCloudExampleTest_6F145AE51E2E137C-001/control-001/'
   [junit4]   2> 2415650 INFO  (TEST-SolrCloudExampleTest.testLoadDocsIntoGettingStartedCollection-seed#[6F145AE51E2E137C]) [    ] o.a.s.c.c.SolrZkClient Using default ZkCredentialsProvider
   [junit4]   2> 2415651 INFO  (TEST-SolrCloudExampleTest.testLoadDocsIntoGettingStartedCollection-seed#[6F145AE51E2E137C]) [    ] o.a.s.c.c.ConnectionManager Waiting for client to connect to ZooKeeper
   [junit4]   2> 2415653 INFO  (zkCallback-2535-thread-1) [    ] o.a.s.c.c.ConnectionManager Watcher org.apache.solr.common.cloud.ConnectionManager@7d19d516 name:ZooKeeperConnection Watcher:127.0.0.1:60644/solr got event WatchedEvent state:SyncConnected type:None path:null path:null type:None
   [junit4]   2> 2415653 INFO  (TEST-SolrCloudExampleTest.testLoadDocsIntoGettingStartedCollection-seed#[6F145AE51E2E137C]) [    ] o.a.s.c.c.ConnectionManager Client is connected to ZooKeeper
   [junit4]   2> 2415653 INFO  (TEST-SolrCloudExampleTest.testLoadDocsIntoGettingStartedCollection-seed#[6F145AE51E2E137C]) [    ] o.a.s.c.c.SolrZkClient Using default ZkACLProvider
   [junit4]   2> 2415655 INFO  (TEST-SolrCloudExampleTest.testLoadDocsIntoGettingStartedCollection-seed#[6F145AE51E2E137C]) [    ] o.a.s.s.SolrDispatchFilter Loading solr.xml from SolrHome (not found in ZooKeeper)
   [junit4]   2> 2415655 INFO  (TEST-SolrCloudExampleTest.testLoadDocsIntoGettingStartedCollection-seed#[6F145AE51E2E137C]) [    ] o.a.s.c.SolrXmlConfig Loading container configuration from /Users/jenkins/workspace/Lucene-Solr-5.x-MacOSX/solr/build/solr-core/test/J1/../../../../../../../../../Users/jenkins/workspace/Lucene-Solr-5.x-MacOSX/solr/build/solr-core/test/J1/temp/solr.cloud.SolrCloudExampleTest_6F145AE51E2E137C-001/control-001/solr.xml
   [junit4]   2> 2415660 INFO  (TEST-SolrCloudExampleTest.testLoadDocsIntoGettingStartedCollection-seed#[6F145AE51E2E137C]) [    ] o.a.s.c.CoresLocator Config-defined core root directory: /Users/jenkins/workspace/Lucene-Solr-5.x-MacOSX/solr/build/solr-core/test/J1/../../../../../../../../../Users/jenkins/workspace/Lucene-Solr-5.x-MacOSX/solr/build/solr-core/test/J1/temp/solr.cloud.SolrCloudExampleTest_6F145AE51E2E137C-001/control-001/cores
   [junit4]   2> 2415660 INFO  (TEST-SolrCloudExampleTest.testLoadDocsIntoGettingStartedCollection-seed#[6F145AE51E2E137C]) [    ] o.a.s.c.CoreContainer New CoreContainer 2064915273
   [junit4]   2> 2415660 INFO  (TEST-SolrCloudExampleTest.testLoadDocsIntoGettingStartedCollection-seed#[6F145AE51E2E137C]) [    ] o.a.s.c.CoreContainer Loading cores into CoreContainer [instanceDir=/Users/jenkins/workspace/Lucene-Solr-5.x-MacOSX/solr/build/solr-core/test/J1/../../../../../../../../../Users/jenkins/workspace/Lucene-Solr-5.x-MacOSX/solr/build/solr-core/test/J1/temp/solr.cloud.SolrCloudExampleTest_6F145AE51E2E137C-001/control-001/]
   [junit4]   2> 2415660 INFO  (TEST-SolrCloudExampleTest.testLoadDocsIntoGettingStartedCollection-seed#[6F145AE51E2E137C]) [    ] o.a.s.c.CoreContainer loading shared library: /Users/jenkins/workspace/Lucene-Solr-5.x-MacOSX/solr/build/solr-core/test/J1/../../../../../../../../../Users/jenkins/workspace/Lucene-Solr-5.x-MacOSX/solr/build/solr-core/test/J1/temp/solr.cloud.SolrCloudExampleTest_6F145AE51E2E137C-001/control-001/lib
   [junit4]   2> 2415661 WARN  (TEST-SolrCloudExampleTest.testLoadDocsIntoGettingStartedCollection-seed#[6F145AE51E2E137C]) [    ] o.a.s.c.SolrResourceLoader Can't find (or read) directory to add to classloader: lib (resolved as: /Users/jenkins/workspace/Lucene-Solr-5.x-MacOSX/solr/build/solr-core/test/J1/../../../../../../../../../Users/jenkins/workspace/Lucene-Solr-5.x-MacOSX/solr/build/solr-core/test/J1/temp/solr.cloud.SolrCloudExampleTest_6F145AE51E2E137C-001/control-001/lib).
   [junit4]   2> 2415668 INFO  (TEST-SolrCloudExampleTest.testLoadDocsIntoGettingStartedCollection-seed#[6F145AE51E2E137C]) [    ] o.a.s.h.c.HttpShardHandlerFactory created with socketTimeout : 90000,urlScheme : ,connTimeout : 15000,maxConnectionsPerHost : 20,maxConnections : 10000,corePoolSize : 0,maximumPoolSize : 2147483647,maxThreadIdleTime : 5,sizeOfQueue : -1,fairnessPolicy : false,useRetries : false,
   [junit4]   2> 2415669 INFO  (TEST-SolrCloudExampleTest.testLoadDocsIntoGettingStartedCollection-seed#[6F145AE51E2E137C]) [    ] o.a.s.u.UpdateShardHandler Creating UpdateShardHandler HTTP client with params: socketTimeout=340000&connTimeout=45000&retry=true
   [junit4]   2> 2415670 INFO  (TEST-SolrCloudExampleTest.testLoadDocsIntoGettingStartedCollection-seed#[6F145AE51E2E137C]) [    ] o.a.s.l.LogWatcher SLF4J impl is org.slf4j.impl.Log4jLoggerFactory
   [junit4]   2> 2415670 INFO  (TEST-SolrCloudExampleTest.testLoadDocsIntoGettingStartedCollection-seed#[6F145AE51E2E137C]) [    ] o.a.s.l.LogWatcher Registering Log Listener [Log4j (org.slf4j.impl.Log4jLoggerFactory)]
   [junit4]   2> 2415670 INFO  (TEST-SolrCloudExampleTest.testLoadDocsIntoGettingStartedCollection-seed#[6F145AE51E2E137C]) [    ] o.a.s.c.ZkContainer Zookeeper client=127.0.0.1:60644/solr
   [junit4]   2> 2415670 INFO  (TEST-SolrCloudExampleTest.testLoadDocsIntoGettingStartedCollection-seed#[6F145AE51E2E137C]) [    ] o.a.s.c.ZkController zkHost includes chroot
   [junit4]   2> 2415670 INFO  (TEST-SolrCloudExampleTest.testLoadDocsIntoGettingStartedCollection-seed#[6F145AE51E2E137C]) [    ] o.a.s.c.c.SolrZkClient Using default ZkCredentialsProvider
   [junit4]   2> 2415671 INFO  (TEST-SolrCloudExampleTest.testLoadDocsIntoGettingStartedCollection-seed#[6F145AE51E2E137C]) [    ] o.a.s.c.c.ConnectionManager Waiting for client to connect to ZooKeeper
   [junit4]   2> 2415672 INFO  (zkCallback-2537-thread-1) [    ] o.a.s.c.c.ConnectionManager Watcher org.apache.solr.common.cloud.ConnectionManager@5d0076f1 name:ZooKeeperConnection Watcher:127.0.0.1:60644 got event WatchedEvent state:SyncConnected type:None path:null path:null type:None
   [junit4]   2> 2415672 INFO  (TEST-SolrCloudExampleTest.testLoadDocsIntoGettingStartedCollection-seed#[6F145AE51E2E137C]) [    ] o.a.s.c.c.ConnectionManager Client is connected to ZooKeeper
   [junit4]   2> 2415673 INFO  (TEST-SolrCloudExampleTest.testLoadDocsIntoGettingStartedCollection-seed#[6F145AE51E2E137C]) [    ] o.a.s.c.c.SolrZkClient Using default ZkACLProvider
   [junit4]   2> 2415675 INFO  (TEST-SolrCloudExampleTest.testLoadDocsIntoGettingStartedCollection-seed#[6F145AE51E2E137C]) [n:127.0.0.1:60647__%2Fwb    ] o.a.s.c.c.ConnectionManager Waiting for client to connect to ZooKeeper
   [junit4]   2> 2415677 INFO  (zkCallback-2538-thread-1-processing-n:127.0.0.1:60647__%2Fwb) [n:127.0.0.1:60647__%2Fwb    ] o.a.s.c.c.ConnectionManager Watcher org.apache.solr.common.cloud.ConnectionManager@399ebdae name:ZooKeeperConnection Watcher:127.0.0.1:60644/solr got event WatchedEvent state:SyncConnected type:None path:null path:null type:None
   [junit4]   2> 2415677 INFO  (TEST-SolrCloudExampleTest.testLoadDocsIntoGettingStartedCollection-seed#[6F145AE51E2E137C]) [n:127.0.0.1:60647__%2Fwb    ] o.a.s.c.c.ConnectionManager Client is connected to ZooKeeper
   [junit4]   2> 2415679 INFO  (TEST-SolrCloudExampleTest.testLoadDocsIntoGettingStartedCollection-seed#[6F145AE51E2E137C]) [n:127.0.0.1:60647__%2Fwb    ] o.a.s.c.c.SolrZkClient makePath: /overseer/queue
   [junit4]   2> 2415682 INFO  (TEST-SolrCloudExampleTest.testLoadDocsIntoGettingStartedCollection-seed#[6F145AE51E2E137C]) [n:127.0.0.1:60647__%2Fwb    ] o.a.s.c.c.SolrZkClient makePath: /overseer/collection-queue-work
   [junit4]   2> 2415687 INFO  (TEST-SolrCloudExampleTest.testLoadDocsIntoGettingStartedCollection-seed#[6F145AE51E2E137C]) [n:127.0.0.1:60647__%2Fwb    ] o.a.s.c.c.SolrZkClient makePath: /overseer/collection-map-running
   [junit4]   2> 2415691 INFO  (TEST-SolrCloudExampleTest.testLoadDocsIntoGettingStartedCollection-seed#[6F145AE51E2E137C]) [n:127.0.0.1:60647__%2Fwb    ] o.a.s.c.c.SolrZkClient makePath: /overseer/collection-map-completed
   [junit4]   2> 2415695 INFO  (TEST-SolrCloudExampleTest.testLoadDocsIntoGettingStartedCollection-seed#[6F145AE51E2E137C]) [n:127.0.0.1:60647__%2Fwb    ] o.a.s.c.c.SolrZkClient makePath: /overseer/collection-map-failure
   [junit4]   2> 2415699 INFO  (TEST-SolrCloudExampleTest.testLoadDocsIntoGettingStartedCollection-seed#[6F145AE51E2E137C]) [n:127.0.0.1:60647__%2Fwb    ] o.a.s.c.c.SolrZkClient makePath: /live_nodes
   [junit4]   2> 2415702 INFO  (TEST-SolrCloudExampleTest.testLoadDocsIntoGettingStartedCollection-seed#[6F145AE51E2E137C]) [n:127.0.0.1:60647__%2Fwb    ] o.a.s.c.c.SolrZkClient makePath: /aliases.json
   [junit4]   2> 2415704 INFO  (TEST-SolrCloudExampleTest.testLoadDocsIntoGettingStartedCollection-seed#[6F145AE51E2E137C]) [n:127.0.0.1:60647__%2Fwb    ] o.a.s.c.c.SolrZkClient makePath: /clusterstate.json
   [junit4]   2> 2415706 INFO  (TEST-SolrCloudExampleTest.testLoadDocsIntoGettingStartedCollection-seed#[6F145AE51E2E137C]) [n:127.0.0.1:60647__%2Fwb    ] o.a.s.c.c.SolrZkClient makePath: /security.json
   [junit4]   2> 2415708 INFO  (TEST-SolrCloudExampleTest.testLoadDocsIntoGettingStartedCollection-seed#[6F145AE51E2E137C]) [n:127.0.0.1:60647__%2Fwb    ] o.a.s.c.ZkController Register node as live in ZooKeeper:/live_nodes/127.0.0.1:60647__%2Fwb
   [junit4]   2> 2415709 INFO  (TEST-SolrCloudExampleTest.testLoadDocsIntoGettingStartedCollection-seed#[6F145AE51E2E137C]) [n:127.0.0.1:60647__%2Fwb    ] o.a.s.c.c.SolrZkClient makePath: /live_nodes/127.0.0.1:60647__%2Fwb
   [junit4]   2> 2415712 INFO  (TEST-SolrCloudExampleTest.testLoadDocsIntoGettingStartedCollection-seed#[6F145AE51E2E137C]) [n:127.0.0.1:60647__%2Fwb    ] o.a.s.c.c.SolrZkClient makePath: /overseer_elect
   [junit4]   2> 2415714 INFO  (TEST-SolrCloudExampleTest.testLoadDocsIntoGettingStartedCollection-seed#[6F145AE51E2E137C]) [n:127.0.0.1:60647__%2Fwb    ] o.a.s.c.c.SolrZkClient makePath: /overseer_elect/election
   [junit4]   2> 2415716 INFO  (TEST-SolrCloudExampleTest.testLoadDocsIntoGettingStartedCollection-seed#[6F145AE51E2E137C]) [n:127.0.0.1:60647__%2Fwb    ] o.a.s.c.Overseer Overseer (id=null) closing
   [junit4]   2> 2415717 INFO  (TEST-SolrCloudExampleTest.testLoadDocsIntoGettingStartedCollection-seed#[6F145AE51E2E137C]) [n:127.0.0.1:60647__%2Fwb    ] o.a.s.c.LeaderElector Joined leadership election with path: /overseer_elect/election/94646337291943940-127.0.0.1:60647__%2Fwb-n_0000000000
   [junit4]   2> 2415718 INFO  (TEST-SolrCloudExampleTest.testLoadDocsIntoGettingStartedCollection-seed#[6F145AE51E2E137C]) [n:127.0.0.1:60647__%2Fwb    ] o.a.s.c.OverseerElectionContext I am going to be the leader 127.0.0.1:60647__%2Fwb
   [junit4]   2> 2415718 INFO  (TEST-SolrCloudExampleTest.testLoadDocsIntoGettingStartedCollection-seed#[6F145AE51E2E137C]) [n:127.0.0.1:60647__%2Fwb    ] o.a.s.c.c.SolrZkClient makePath: /overseer_elect/leader
   [junit4]   2> 2415720 INFO  (TEST-SolrCloudExampleTest.testLoadDocsIntoGettingStartedCollection-seed#[6F145AE51E2E137C]) [n:127.0.0.1:60647__%2Fwb    ] o.a.s.c.Overseer Overseer (id=94646337291943940-127.0.0.1:60647__%2Fwb-n_0000000000) starting
   [junit4]   2> 2415724 INFO  (TEST-SolrCloudExampleTest.testLoadDocsIntoGettingStartedCollection-seed#[6F145AE51E2E137C]) [n:127.0.0.1:60647__%2Fwb    ] o.a.s.c.c.SolrZkClient makePath: /overseer/queue-work
   [junit4]   2> 2415734 INFO  (TEST-SolrCloudExampleTest.testLoadDocsIntoGettingStartedCollection-seed#[6F145AE51E2E137C]) [n:127.0.0.1:60647__%2Fwb    ] o.a.s.c.OverseerAutoReplicaFailoverThread Starting OverseerAutoReplicaFailoverThread autoReplicaFailoverWorkLoopDelay=10000 autoReplicaFailoverWaitAfterExpiration=30000 autoReplicaFailoverBadNodeExpiration=60000
   [junit4]   2> 2415735 INFO  (OverseerCollectionConfigSetProcessor-94646337291943940-127.0.0.1:60647__%2Fwb-n_0000000000) [n:127.0.0.1:60647__%2Fwb    ] o.a.s.c.OverseerTaskProcessor Process current queue of overseer operations
   [junit4]   2> 2415735 INFO  (TEST-SolrCloudExampleTest.testLoadDocsIntoGettingStartedCollection-seed#[6F145AE51E2E137C]) [n:127.0.0.1:60647__%2Fwb    ] o.a.s.c.c.ZkStateReader Updating cluster state from ZooKeeper... 
   [junit4]   2> 2415736 INFO  (OverseerStateUpdate-94646337291943940-127.0.0.1:60647__%2Fwb-n_0000000000) [n:127.0.0.1:60647__%2Fwb    ] o.a.s.c.Overseer Starting to work on the main queue
   [junit4]   2> 2415750 INFO  (TEST-SolrCloudExampleTest.testLoadDocsIntoGettingStartedCollection-seed#[6F145AE51E2E137C]) [n:127.0.0.1:60647__%2Fwb    ] o.a.s.c.CoreContainer Security conf doesn't exist. Skipping setup for authorization module.
   [junit4]   2> 2415750 INFO  (TEST-SolrCloudExampleTest.testLoadDocsIntoGettingStartedCollection-seed#[6F145AE51E2E137C]) [n:127.0.0.1:60647__%2Fwb    ] o.a.s.c.CoreContainer No authentication plugin used.
   [junit4]   2> 2415752 INFO  (TEST-SolrCloudExampleTest.testLoadDocsIntoGettingStartedCollection-seed#[6F145AE51E2E137C]) [n:127.0.0.1:60647__%2Fwb    ] o.a.s.c.CoresLocator Looking for core definitions underneath /Users/jenkins/workspace/Lucene-Solr-5.x-MacOSX/solr/build/solr-core/test/J1/../../../../../../../../../Users/jenkins/workspace/Lucene-Solr-5.x-MacOSX/solr/build/solr-core/test/J1/temp/solr.cloud.SolrCloudExampleTest_6F145AE51E2E137C-001/control-001/cores
   [junit4]   2> 2415754 INFO  (TEST-SolrCloudExampleTest.testLoadDocsIntoGettingStartedCollection-seed#[6F145AE51E2E137C]) [n:127.0.0.1:60647__%2Fwb    ] o.a.s.c.SolrCore Created CoreDescriptor: {name=collection1, config=solrconfig.xml, transient=false, schema=schema.xml, loadOnStartup=true, configSetProperties=configsetprops.json, instanceDir=/Users/jenkins/workspace/Lucene-Solr-5.x-MacOSX/solr/build/solr-core/test/J1/../../../../../../../../../Users/jenkins/workspace/Lucene-Solr-5.x-MacOSX/solr/build/solr-core/test/J1/temp/solr.cloud.SolrCloudExampleTest_6F145AE51E2E137C-001/control-001/cores/collection1, collection=control_collection, absoluteInstDir=/Users/jenkins/workspace/Lucene-Solr-5.x-MacOSX/solr/build/solr-core/test/J1/../../../../../../../../../Users/jenkins/workspace/Lucene-Solr-5.x-MacOSX/solr/build/solr-core/test/J1/temp/solr.cloud.SolrCloudExampleTest_6F145AE51E2E137C-001/control-001/cores/collection1/, coreNodeName=, dataDir=data/, shard=}
   [junit4]   2> 2415754 INFO  (TEST-SolrCloudExampleTest.testLoadDocsIntoGettingStartedCollection-seed#[6F145AE51E2E137C]) [n:127.0.0.1:60647__%2Fwb    ] o.a.s.c.CoresLocator Found core collection1 in /Users/jenkins/workspace/Lucene-Solr-5.x-MacOSX/solr/build/solr-core/test/J1/../../../../../../../../../Users/jenkins/workspace/Lucene-Solr-5.x-MacOSX/solr/build/solr-core/test/J1/temp/solr.cloud.SolrCloudExampleTest_6F145AE51E2E137C-001/control-001/cores/collection1/
   [junit4]   2> 2415754 INFO  (TEST-SolrCloudExampleTest.testLoadDocsIntoGettingStartedCollection-seed#[6F145AE51E2E137C]) [n:127.0.0.1:60647__%2Fwb    ] o.a.s.c.CoresLocator Found 1 core definitions
   [junit4]   2> 2415755 INFO  (TEST-SolrCloudExampleTest.testLoadDocsIntoGettingStartedCollection-seed#[6F145AE51E2E137C]) [n:127.0.0.1:60647__%2Fwb    ] o.a.s.s.SolrDispatchFilter user.dir=/Users/jenkins/workspace/Lucene-Solr-5.x-MacOSX/solr/build/solr-core/test/J1
   [junit4]   2> 2415755 INFO  (TEST-SolrCloudExampleTest.testLoadDocsIntoGettingStartedCollection-seed#[6F145AE51E2E137C]) [n:127.0.0.1:60647__%2Fwb    ] o.a.s.s.SolrDispatchFilter SolrDispatchFilter.init() done
   [junit4]   2> 2415756 INFO  (coreLoadExecutor-8087-thread-1-processing-n:127.0.0.1:60647__%2Fwb) [n:127.0.0.1:60647__%2Fwb c:control_collection   x:collection1] o.a.s.c.ZkController publishing state=down
   [junit4]   2> 2415756 INFO  (coreLoadExecutor-8087-thread-1-processing-n:127.0.0.1:60647__%2Fwb) [n:127.0.0.1:60647__%2Fwb c:control_collection   x:collection1] o.a.s.c.ZkController numShards not found on descriptor - reading it from system property
   [junit4]   2> 2415759 INFO  (OverseerStateUpdate-94646337291943940-127.0.0.1:60647__%2Fwb-n_0000000000) [n:127.0.0.1:60647__%2Fwb    ] o.a.s.c.Overseer processMessage: queueSize: 1, message = {
   [junit4]   2>   "core":"collection1",
   [junit4]   2>   "roles":null,
   [junit4]   2>   "base_url":"http://127.0.0.1:60647/_/wb",
   [junit4]   2>   "node_name":"127.0.0.1:60647__%2Fwb",
   [junit4]   2>   "numShards":"1",
   [junit4]   2>   "state":"down",
   [junit4]   2>   "shard":null,
   [junit4]   2>   "collection":"control_collection",
   [junit4]   2>   "operation":"state"} current state version: 0
   [junit4]   2> 2415759 INFO  (coreLoadExecutor-8087-thread-1-processing-n:127.0.0.1:60647__%2Fwb) [n:127.0.0.1:60647__%2Fwb c:control_collection   x:collection1] o.a.s.c.ZkController look for our core node name
   [junit4]   2> 2415759 INFO  (OverseerStateUpdate-94646337291943940-127.0.0.1:60647__%2Fwb-n_0000000000) [n:127.0.0.1:60647__%2Fwb    ] o.a.s.c.o.ReplicaMutator Update state numShards=1 message={
   [junit4]   2>   "core":"collection1",
   [junit4]   2>   "roles":null,
   [junit4]   2>   "base_url":"http://127.0.0.1:60647/_/wb",
   [junit4]   2>   "node_name":"127.0.0.1:60647__%2Fwb",
   [junit4]   2>   "numShards":"1",
   [junit4]   2>   "state":"down",
   [junit4]   2>   "shard":null,
   [junit4]   2>   "collection":"control_collection",
   [junit4]   2>   "operation":"state"}
   [junit4]   2> 2415760 INFO  (OverseerStateUpdate-94646337291943940-127.0.0.1:60647__%2Fwb-n_0000000000) [n:127.0.0.1:60647__%2Fwb    ] o.a.s.c.o.ClusterStateMutator building a new cName: control_collection
   [junit4]   2> 2415761 INFO  (OverseerStateUpdate-94646337291943940-127.0.0.1:60647__%2Fwb-n_0000000000) [n:127.0.0.1:60647__%2Fwb    ] o.a.s.c.o.ReplicaMutator Assigning new node to shard shard=shard1
   [junit4]   2> 2415763 INFO  (zkCallback-2538-thread-1-processing-n:127.0.0.1:60647__%2Fwb) [n:127.0.0.1:60647__%2Fwb    ] o.a.s.c.c.ZkStateReader A cluster state change: WatchedEvent state:SyncConnected type:NodeDataChanged path:/clusterstate.json, has occurred - updating... (live nodes size: 1)
   [junit4]   2> 2416761 INFO  (coreLoadExecutor-8087-thread-1-processing-n:127.0.0.1:60647__%2Fwb) [n:127.0.0.1:60647__%2Fwb c:control_collection   x:collection1] o.a.s.c.ZkController waiting to find shard id in clusterstate for collection1
   [junit4]   2> 2416761 INFO  (coreLoadExecutor-8087-thread-1-processing-n:127.0.0.1:60647__%2Fwb) [n:127.0.0.1:60647__%2Fwb c:control_collection   x:collection1] o.a.s.c.ZkController Check for collection zkNode:control_collection
   [junit4]   2> 2416762 INFO  (coreLoadExecutor-8087-thread-1-processing-n:127.0.0.1:60647__%2Fwb) [n:127.0.0.1:60647__%2Fwb c:control_collection   x:collection1] o.a.s.c.ZkController Collection zkNode exists
   [junit4]   2> 2416762 INFO  (coreLoadExecutor-8087-thread-1-processing-n:127.0.0.1:60647__%2Fwb) [n:127.0.0.1:60647__%2Fwb c:control_collection   x:collection1] o.a.s.c.c.ZkStateReader Load collection config from:/collections/control_collection
   [junit4]   2> 2416763 INFO  (coreLoadExecutor-8087-thread-1-processing-n:127.0.0.1:60647__%2Fwb) [n:127.0.0.1:60647__%2Fwb c:control_collection   x:collection1] o.a.s.c.c.ZkStateReader path=/collections/control_collection configName=conf1 specified config exists in ZooKeeper
   [junit4]   2> 2416763 INFO  (coreLoadExecutor-8087-thread-1-processing-n:127.0.0.1:60647__%2Fwb) [n:127.0.0.1:60647__%2Fwb c:control_collection   x:collection1] o.a.s.c.SolrResourceLoader new SolrResourceLoader for directory: '/Users/jenkins/workspace/Lucene-Solr-5.x-MacOSX/solr/build/solr-core/test/J1/../../../../../../../../../Users/jenkins/workspace/Lucene-Solr-5.x-MacOSX/solr/build/solr-core/test/J1/temp/solr.cloud.SolrCloudExampleTest_6F145AE51E2E137C-001/control-001/cores/collection1/'
   [junit4]   2> 2416774 INFO  (coreLoadExecutor-8087-thread-1-processing-n:127.0.0.1:60647__%2Fwb) [n:127.0.0.1:60647__%2Fwb c:control_collection   x:collection1] o.a.s.c.Config loaded config solrconfig.xml with version 0 
   [junit4]   2> 2416780 INFO  (coreLoadExecutor-8087-thread-1-processing-n:127.0.0.1:60647__%2Fwb) [n:127.0.0.1:60647__%2Fwb c:control_collection   x:collection1] o.a.s.c.SolrConfig current version of requestparams : -1
   [junit4]   2> 2416782 INFO  (coreLoadExecutor-8087-thread-1-processing-n:127.0.0.1:60647__%2Fwb) [n:127.0.0.1:60647__%2Fwb c:control_collection   x:collection1] o.a.s.c.SolrConfig Using Lucene MatchVersion: 5.4.0
   [junit4]   2> 2416787 INFO  (coreLoadExecutor-8087-thread-1-processing-n:127.0.0.1:60647__%2Fwb) [n:127.0.0.1:60647__%2Fwb c:control_collection   x:collection1] o.a.s.c.Config Loaded SolrConfig: solrconfig.xml
   [junit4]   2> 2416788 INFO  (coreLoadExecutor-8087-thread-1-processing-n:127.0.0.1:60647__%2Fwb) [n:127.0.0.1:60647__%2Fwb c:control_collection   x:collection1] o.a.s.s.IndexSchema Reading Solr Schema from /configs/conf1/schema.xml
   [junit4]   2> 2416792 INFO  (coreLoadExecutor-8087-thread-1-processing-n:127.0.0.1:60647__%2Fwb) [n:127.0.0.1:60647__%2Fwb c:control_collection   x:collection1] o.a.s.s.IndexSchema [collection1] Schema name=test
   [junit4]   2> 2416851 INFO  (coreLoadExecutor-8087-thread-1-processing-n:127.0.0.1:60647__%2Fwb) [n:127.0.0.1:60647__%2Fwb c:control_collection   x:collection1] o.a.s.s.OpenExchangeRatesOrgProvider Initialized with rates=open-exchange-rates.json, refreshInterval=1440.
   [junit4]   2> 2416856 INFO  (coreLoadExecutor-8087-thread-1-processing-n:127.0.0.1:60647__%2Fwb) [n:127.0.0.1:60647__%2Fwb c:control_collection   x:collection1] o.a.s.s.IndexSchema default search field in schema is text
   [junit4]   2> 2416857 INFO  (coreLoadExecutor-8087-thread-1-processing-n:127.0.0.1:60647__%2Fwb) [n:127.0.0.1:60647__%2Fwb c:control_collection   x:collection1] o.a.s.s.IndexSchema unique key field: id
   [junit4]   2> 2416871 INFO  (coreLoadExecutor-8087-thread-1-processing-n:127.0.0.1:60647__%2Fwb) [n:127.0.0.1:60647__%2Fwb c:control_collection   x:collection1] o.a.s.s.FileExchangeRateProvider Reloading exchange rates from file currency.xml
   [junit4]   2> 2416874 INFO  (coreLoadExecutor-8087-thread-1-processing-n:127.0.0.1:60647__%2Fwb) [n:127.0.0.1:60647__%2Fwb c:control_collection   x:collection1] o.a.s.s.FileExchangeRateProvider Reloading exchange rates from file currency.xml
   [junit4]   2> 2416876 INFO  (coreLoadExecutor-8087-thread-1-processing-n:127.0.0.1:60647__%2Fwb) [n:127.0.0.1:60647__%2Fwb c:control_collection   x:collection1] o.a.s.s.OpenExchangeRatesOrgProvider Reloading exchange rates from open-exchange-rates.json
   [junit4]   2> 2416877 WARN  (coreLoadExecutor-8087-thread-1-processing-n:127.0.0.1:60647__%2Fwb) [n:127.0.0.1:60647__%2Fwb c:control_collection   x:collection1] o.a.s.s.OpenExchangeRatesOrgProvider Unknown key IMPORTANT NOTE
   [junit4]   2> 2416877 WARN  (coreLoadExecutor-8087-thread-1-processing-n:127.0.0.1:60647__%2Fwb) [n:127.0.0.1:60647__%2Fwb c:control_collection   x:collection1] o.a.s.s.OpenExchangeRatesOrgProvider Expected key, got STRING
   [junit4]   2> 2416877 INFO  (coreLoadExecutor-8087-thread-1-processing-n:127.0.0.1:60647__%2Fwb) [n:127.0.0.1:60647__%2Fwb c:control_collection   x:collection1] o.a.s.s.OpenExchangeRatesOrgProvider Reloading exchange rates from open-exchange-rates.json
   [junit4]   2> 2416878 WARN  (coreLoadExecutor-8087-thread-1-processing-n:127.0.0.1:60647__%2Fwb) [n:127.0.0.1:60647__%2Fwb c:control_collection   x:collection1] o.a.s.s.OpenExchangeRatesOrgProvider Unknown key IMPORTANT NOTE
   [junit4]   2> 2416879 WARN  (coreLoadExecutor-8087-thread-1-processing-n:127.0.0.1:60647__%2Fwb) [n:127.0.0.1:60647__%2Fwb c:control_collection   x:collection1] o.a.s.s.OpenExchangeRatesOrgProvider Expected key, got STRING
   [junit4]   2> 2416880 INFO  (coreLoadExecutor-8087-thread-1-processing-n:127.0.0.1:60647__%2Fwb) [n:127.0.0.1:60647__%2Fwb c:control_collection   x:collection1] o.a.s.c.ConfigSetProperties Did not find ConfigSet properties, assuming default properties: Can't find resource 'configsetprops.json' in classpath or '/configs/conf1', cwd=/Users/jenkins/workspace/Lucene-Solr-5.x-MacOSX/solr/build/solr-core/test/J1
   [junit4]   2> 2416881 INFO  (coreLoadExecutor-8087-thread-1-processing-n:127.0.0.1:60647__%2Fwb) [n:127.0.0.1:60647__%2Fwb c:control_collection   x:collection1] o.a.s.c.CoreContainer Creating SolrCore 'collection1' using configuration from collection control_collection
   [junit4]   2> 2416881 INFO  (coreLoadExecutor-8087-thread-1-processing-n:127.0.0.1:60647__%2Fwb) [n:127.0.0.1:60647__%2Fwb c:control_collection s:shard1 r:core_node1 x:collection1] o.a.s.c.SolrCore org.apache.solr.core.MockDirectoryFactory
   [junit4]   2> 2416881 INFO  (coreLoadExecutor-8087-thread-1-processing-n:127.0.0.1:60647__%2Fwb) [n:127.0.0.1:60647__%2Fwb c:control_collection s:shard1 r:core_node1 x:collection1] o.a.s.c.SolrCore [[collection1] ] Opening new SolrCore at [/Users/jenkins/workspace/Lucene-Solr-5.x-MacOSX/solr/build/solr-core/test/J1/../../../../../../../../../Users/jenkins/workspace/Lucene-Solr-5.x-MacOSX/solr/build/solr-core/test/J1/temp/solr.cloud.SolrCloudExampleTest_6F145AE51E2E137C-001/control-001/cores/collection1/], dataDir=[null]
   [junit4]   2> 2416881 INFO  (coreLoadExecutor-8087-thread-1-processing-n:127.0.0.1:60647__%2Fwb) [n:127.0.0.1:60647__%2Fwb c:control_collection s:shard1 r:core_node1 x:collection1] o.a.s.c.JmxMonitoredMap JMX monitoring is enabled. Adding Solr mbeans to JMX Server: com.sun.jmx.mbeanserver.JmxMBeanServer@6008951c
   [junit4]   2> 2416881 INFO  (coreLoadExecutor-8087-thread-1-processing-n:127.0.0.1:60647__%2Fwb) [n:127.0.0.1:60647__%2Fwb c:control_collection s:shard1 r:core_node1 x:collection1] o.a.s.c.CachingDirectoryFactory return new directory for /Users/jenkins/workspace/Lucene-Solr-5.x-MacOSX/solr/build/solr-core/test/J1/../../../../../../../../../Users/jenkins/workspace/Lucene-Solr-5.x-MacOSX/solr/build/solr-core/test/J1/temp/solr.cloud.SolrCloudExampleTest_6F145AE51E2E137C-001/control-001/cores/collection1/data
   [junit4]   2> 2416881 INFO  (coreLoadExecutor-8087-thread-1-processing-n:127.0.0.1:60647__%2Fwb) [n:127.0.0.1:60647__%2Fwb c:control_collection s:shard1 r:core_node1 x:collection1] o.a.s.c.SolrCore New index directory detected: old=null new=/Users/jenkins/workspace/Lucene-Solr-5.x-MacOSX/solr/build/solr-core/test/J1/../../../../../../../../../Users/jenkins/workspace/Lucene-Solr-5.x-MacOSX/solr/build/solr-core/test/J1/temp/solr.cloud.SolrCloudExampleTest_6F145AE51E2E137C-001/control-001/cores/collection1/data/index/
   [junit4]   2> 2416881 WARN  (coreLoadExecutor-8087-thread-1-processing-n:127.0.0.1:60647__%2Fwb) [n:127.0.0.1:60647__%2Fwb c:control_collection s:shard1 r:core_node1 x:collection1] o.a.s.c.SolrCore [collection1] Solr index directory '/Users/jenkins/workspace/Lucene-Solr-5.x-MacOSX/solr/build/solr-core/test/J1/../../../../../../../../../Users/jenkins/workspace/Lucene-Solr-5.x-MacOSX/solr/build/solr-core/test/J1/temp/solr.cloud.SolrCloudExampleTest_6F145AE51E2E137C-001/control-001/cores/collection1/data/index' doesn't exist. Creating new index...
   [junit4]   2> 2416882 INFO  (coreLoadExecutor-8087-thread-1-processing-n:127.0.0.1:60647__%2Fwb) [n:127.0.0.1:60647__%2Fwb c:control_collection s:shard1 r:core_node1 x:collection1] o.a.s.c.CachingDirectoryFactory return new directory for /Users/jenkins/workspace/Lucene-Solr-5.x-MacOSX/solr/build/solr-core/test/J1/../../../../../../../../../Users/jenkins/workspace/Lucene-Solr-5.x-MacOSX/solr/build/solr-core/test/J1/temp/solr.cloud.SolrCloudExampleTest_6F145AE51E2E137C-001/control-001/cores/collection1/data/index
   [junit4]   2> 2416882 INFO  (coreLoadExecutor-8087-thread-1-processing-n:127.0.0.1:60647__%2Fwb) [n:127.0.0.1:60647__%2Fwb c:control_collection s:shard1 r:core_node1 x:collection1] o.a.s.u.RandomMergePolicy RandomMergePolicy wrapping class org.apache.lucene.index.TieredMergePolicy: [TieredMergePolicy: maxMergeAtOnce=21, maxMergeAtOnceExplicit=38, maxMergedSegmentMB=88.689453125, floorSegmentMB=0.4033203125, forceMergeDeletesPctAllowed=15.874562206573836, segmentsPerTier=46.0, maxCFSSegmentSizeMB=8.796093022207999E12, noCFSRatio=0.31293020765475255
   [junit4]   2> 2416882 INFO  (coreLoadExecutor-8087-thread-1-processing-n:127.0.0.1:60647__%2Fwb) [n:127.0.0.1:60647__%2Fwb c:control_collection s:shard1 r:core_node1 x:collection1] o.a.s.c.SolrCore SolrDeletionPolicy.onCommit: commits: num=1
   [junit4]   2> 	commit{dir=MockDirectoryWrapper(RAMDirectory@e300533 lockFactory=org.apache.lucene.store.SingleInstanceLockFactory@488a1a0a),segFN=segments_1,generation=1}
   [junit4]   2> 2416882 INFO  (coreLoadExecutor-8087-thread-1-processing-n:127.0.0.1:60647__%2Fwb) [n:127.0.0.1:60647__%2Fwb c:control_collection s:shard1 r:core_node1 x:collection1] o.a.s.c.SolrCore newest commit generation = 1
   [junit4]   2> 2416883 INFO  (OldIndexDirectoryCleanupThreadForCore-collection1) [n:127.0.0.1:60647__%2Fwb c:control_collection s:shard1 r:core_node1 x:collection1] o.a.s.c.SolrCore Looking for old index directories to cleanup for core collection1 in /Users/jenkins/workspace/Lucene-Solr-5.x-MacOSX/solr/build/solr-core/test/J1/../../../../../../../../../Users/jenkins/workspace/Lucene-Solr-5.x-MacOSX/solr/build/solr-core/test/J1/temp/solr.cloud.SolrCloudExampleTest_6F145AE51E2E137C-001/control-001/cores/collection1/data/
   [junit4]   2> 2416883 WARN  (OldIndexDirectoryCleanupThreadForCore-collection1) [n:127.0.0.1:60647__%2Fwb c:control_collection s:shard1 r:core_node1 x:collection1] o.a.s.c.DirectoryFactory /Users/jenkins/workspace/Lucene-Solr-5.x-MacOSX/solr/build/solr-core/test/J1/../../../../../../../../../Users/jenkins/workspace/Lucene-Solr-5.x-MacOSX/solr/build/solr-core/test/J1/temp/solr.cloud.SolrCloudExampleTest_6F145AE51E2E137C-001/control-001/cores/collection1/data/ does not point to a valid data directory; skipping clean-up of old index directories.
   [junit4]   2> 2416886 INFO  (coreLoadExecutor-8087-thread-1-processing-n:127.0.0.1:60647__%2Fwb) [n:127.0.0.1:60647__%2Fwb c:control_collection s:shard1 r:core_node1 x:collection1] o.a.s.u.p.UpdateRequestProcessorChain creating updateRequestProcessorChain "nodistrib"
   [junit4]   2> 2416886 INFO  (coreLoadExecutor-8087-thread-1-processing-n:127.0.0.1:60647__%2Fwb) [n:127.0.0.1:60647__%2Fwb c:control_collection s:shard1 r:core_node1 x:collection1] o.a.s.u.p.UpdateRequestProcessorChain creating updateRequestProcessorChain "dedupe"
   [junit4]   2> 2416886 INFO  (coreLoadExecutor-8087-thread-1-processing-n:127.0.0.1:60647__%2Fwb) [n:127.0.0.1:60647__%2Fwb c:control_collection s:shard1 r:core_node1 x:collection1] o.a.s.u.p.UpdateRequestProcessorChain inserting DistributedUpdateProcessorFactory into updateRequestProcessorChain "dedupe"
   [junit4]   2> 2416886 INFO  (coreLoadExecutor-8087-thread-1-processing-n:127.0.0.1:60647__%2Fwb) [n:127.0.0.1:60647__%2Fwb c:control_collection s:shard1 r:core_node1 x:collection1] o.a.s.u.p.UpdateRequestProcessorChain creating updateRequestProcessorChain "stored_sig"
   [junit4]   2> 2416886 INFO  (coreLoadExecutor-8087-thread-1-processing-n:127.0.0.1:60647__%2Fwb) [n:127.0.0.1:60647__%2Fwb c:control_collection s:shard1 r:core_node1 x:collection1] o.a.s.u.p.UpdateRequestProcessorChain inserting DistributedUpdateProcessorFactory into updateRequestProcessorChain "stored_sig"
   [junit4]   2> 2416886 INFO  (coreLoadExecutor-8087-thread-1-processing-n:127.0.0.1:60647__%2Fwb) [n:127.0.0.1:60647__%2Fwb c:control_collection s:shard1 r:core_node1 x:collection1] o.a.s.u.p.UpdateRequestProcessorChain creating updateRequestProcessorChain "distrib-dup-test-chain-explicit"
   [junit4]   2> 2416887 INFO  (coreLoadExecutor-8087-thread-1-processing-n:127.0.0.1:60647__%2Fwb) [n:127.0.0.1:60647__%2Fwb c:control_collection s:shard1 r:core_node1 x:collection1] o.a.s.u.p.UpdateRequestProcessorChain creating updateRequestProcessorChain "distrib-dup-test-chain-implicit"
   [junit4]   2> 2416887 INFO  (coreLoadExecutor-8087-thread-1-processing-n:127.0.0.1:60647__%2Fwb) [n:127.0.0.1:60647__%2Fwb c:control_collection s:shard1 r:core_node1 x:collection1] o.a.s.u.p.UpdateRequestProcessorChain inserting DistributedUpdateProcessorFactory into updateRequestProcessorChain "distrib-dup-test-chain-implicit"
   [junit4]   2> 2416887 INFO  (coreLoadExecutor-8087-thread-1-processing-n:127.0.0.1:60647__%2Fwb) [n:127.0.0.1:60647__%2Fwb c:control_collection s:shard1 r:core_node1 x:collection1] o.a.s.c.SolrCore no updateRequestProcessorChain defined as default, creating implicit default
   [junit4]   2> 2416890 INFO  (coreLoadExecutor-8087-thread-1-processing-n:127.0.0.1:60647__%2Fwb) [n:127.0.0.1:60647__%2Fwb c:control_collection s:shard1 r:core_node1 x:collection1] o.a.s.h.l.XMLLoader xsltCacheLifetimeSeconds=60
   [junit4]   2> 2416891 INFO  (coreLoadExecutor-8087-thread-1-processing-n:127.0.0.1:60647__%2Fwb) [n:127.0.0.1:60647__%2Fwb c:control_collection s:shard1 r:core_node1 x:collection1] o.a.s.h.l.XMLLoader xsltCacheLifetimeSeconds=60
   [junit4]   2> 2416892 INFO  (coreLoadExecutor-8087-thread-1-processing-n:127.0.0.1:60647__%2Fwb) [n:127.0.0.1:60647__%2Fwb c:control_collection s:shard1 r:core_node1 x:collection1] o.a.s.h.l.XMLLoader xsltCacheLifetimeSeconds=60
   [junit4]   2> 2416892 INFO  (coreLoadExecutor-8087-thread-1-processing-n:127.0.0.1:60647__%2Fwb) [n:127.0.0.1:60647__%2Fwb c:control_collection s:shard1 r:core_node1 x:collection1] o.a.s.h.l.XMLLoader xsltCacheLifetimeSeconds=60
   [junit4]   2> 2416895 INFO  (coreLoadExecutor-8087-thread-1-processing-n:127.0.0.1:60647__%2Fwb) [n:127.0.0.1:60647__%2Fwb c:control_collection s:shard1 r:core_node1 x:collection1] o.a.s.c.RequestHandlers Registered paths: /admin/mbeans,standard,/update/csv,/update/json/docs,/admin/luke,/admin/segments,/get,/admin/system,/replication,/admin/properties,/config,/schema,/admin/plugins,/admin/logging,/update/json,/admin/threads,/admin/ping,/update,/admin/file
   [junit4]   2> 2416895 INFO  (coreLoadExecutor-8087-thread-1-processing-n:127.0.0.1:60647__%2Fwb) [n:127.0.0.1:60647__%2Fwb c:control_collection s:shard1 r:core_node1 x:collection1] o.a.s.c.SolrCore Using default statsCache cache: org.apache.solr.search.stats.LocalStatsCache
   [junit4]   2> 2416896 INFO  (coreLoadExecutor-8087-thread-1-processing-n:127.0.0.1:60647__%2Fwb) [n:127.0.0.1:60647__%2Fwb c:control_collection s:shard1 r:core_node1 x:collection1] o.a.s.u.UpdateHandler Using UpdateLog implementation: org.apache.solr.update.UpdateLog
   [junit4]   2> 2416896 INFO  (coreLoadExecutor-8087-thread-1-processing-n:127.0.0.1:60647__%2Fwb) [n:127.0.0.1:60647__%2Fwb c:control_collection s:shard1 r:core_node1 x:collection1] o.a.s.u.UpdateLog Initializing UpdateLog: dataDir= defaultSyncLevel=FLUSH numRecordsToKeep=100 maxNumLogsToKeep=10 numVersionBuckets=65536
   [junit4]   2> 2416897 INFO  (coreLoadExecutor-8087-thread-1-processing-n:127.0.0.1:60647__%2Fwb) [n:127.0.0.1:60647__%2Fwb c:control_collection s:shard1 r:core_node1 x:collection1] o.a.s.c.SolrCore Hard AutoCommit: disabled
   [junit4]   2> 2416897 INFO  (coreLoadExecutor-8087-thread-1-processing-n:127.0.0.1:60647__%2Fwb) [n:127.0.0.1:60647__%2Fwb c:control_collection s:shard1 r:core_node1 x:collection1] o.a.s.c.SolrCore Soft AutoCommit: disabled
   [junit4]   2> 2416898 INFO  (coreLoadExecutor-8087-thread-1-processing-n:127.0.0.1:60647__%2Fwb) [n:127.0.0.1:60647__%2Fwb c:control_collection s:shard1 r:core_node1 x:collection1] o.a.s.u.RandomMergePolicy RandomMergePolicy wrapping class org.apache.lucene.index.LogByteSizeMergePolicy: [LogByteSizeMergePolicy: minMergeSize=1677721, mergeFactor=42, maxMergeSize=2147483648, maxMergeSizeForForcedMerge=9223372036854775807, calibrateSizeByDeletes=true, maxMergeDocs=2147483647, maxCFSSegmentSizeMB=8.796093022207999E12, noCFSRatio=0.0]
   [junit4]   2> 2416898 INFO  (coreLoadExecutor-8087-thread-1-processing-n:127.0.0.1:60647__%2Fwb) [n:127.0.0.1:60647__%2Fwb c:control_collection s:shard1 r:core_node1 x:collection1] o.a.s.c.SolrCore SolrDeletionPolicy.onInit: commits: num=1
   [junit4]   2> 	commit{dir=MockDirectoryWrapper(RAMDirectory@e300533 lockFactory=org.apache.lucene.store.SingleInstanceLockFactory@488a1a0a),segFN=segments_1,generation=1}
   [junit4]   2> 2416898 INFO  (coreLoadExecutor-8087-thread-1-processing-n:127.0.0.1:60647__%2Fwb) [n:127.0.0.1:60647__%2Fwb c:control_collection s:shard1 r:core_node1 x:collection1] o.a.s.c.SolrCore newest commit generation = 1
   [junit4]   2> 2416898 INFO  (coreLoadExecutor-8087-thread-1-processing-n:127.0.0.1:60647__%2Fwb) [n:127.0.0.1:60647__%2Fwb c:control_collection s:shard1 r:core_node1 x:collection1] o.a.s.s.SolrIndexSearcher Opening Searcher@5ee21325[collection1] main
   [junit4]   2> 2416898 INFO  (coreLoadExecutor-8087-thread-1-processing-n:127.0.0.1:60647__%2Fwb) [n:127.0.0.1:60647__%2Fwb c:control_collection s:shard1 r:core_node1 x:collection1] o.a.s.c.c.ZkStateReader Load collection config from:/collections/control_collection
   [junit4]   2> 2416899 INFO  (coreLoadExecutor-8087-thread-1-processing-n:127.0.0.1:60647__%2Fwb) [n:127.0.0.1:60647__%2Fwb c:control_collection s:shard1 r:core_node1 x:collection1] o.a.s.c.c.ZkStateReader path=/collections/control_collection configName=conf1 specified config exists in ZooKeeper
   [junit4]   2> 2416899 INFO  (coreLoadExecutor-8087-thread-1-processing-n:127.0.0.1:60647__%2Fwb) [n:127.0.0.1:60647__%2Fwb c:control_collection s:shard1 r:core_node1 x:collection1] o.a.s.r.ManagedResourceStorage Setting up ZooKeeper-based storage for the RestManager with znodeBase: /configs/conf1
   [junit4]   2> 2416900 INFO  (coreLoadExecutor-8087-thread-1-processing-n:127.0.0.1:60647__%2Fwb) [n:127.0.0.1:60647__%2Fwb c:control_collection s:shard1 r:core_node1 x:collection1] o.a.s.r.ManagedResourceStorage Configured ZooKeeperStorageIO with znodeBase: /configs/conf1
   [junit4]   2> 2416900 INFO  (coreLoadExecutor-8087-thread-1-processing-n:127.0.0.1:60647__%2Fwb) [n:127.0.0.1:60647__%2Fwb c:control_collection s:shard1 r:core_node1 x:collection1] o.a.s.r.RestManager Initializing RestManager with initArgs: {}
   [junit4]   2> 2416900 INFO  (coreLoadExecutor-8087-thread-1-processing-n:127.0.0.1:60647__%2Fwb) [n:127.0.0.1:60647__%2Fwb c:control_collection s:shard1 r:core_node1 x:collection1] o.a.s.r.ManagedResourceStorage Reading _rest_managed.json using ZooKeeperStorageIO:path=/configs/conf1
   [junit4]   2> 2416901 INFO  (coreLoadExecutor-8087-thread-1-processing-n:127.0.0.1:60647__%2Fwb) [n:127.0.0.1:60647__%2Fwb c:control_collection s:shard1 r:core_node1 x:collection1] o.a.s.r.ManagedResourceStorage No data found for znode /configs/conf1/_rest_managed.json
   [junit4]   2> 2416901 INFO  (coreLoadExecutor-8087-thread-1-processing-n:127.0.0.1:60647__%2Fwb) [n:127.0.0.1:60647__%2Fwb c:control_collection s:shard1 r:core_node1 x:collection1] o.a.s.r.ManagedResourceStorage Loaded null at path _rest_managed.json using ZooKeeperStorageIO:path=/configs/conf1
   [junit4]   2> 2416901 INFO  (coreLoadExecutor-8087-thread-1-processing-n:127.0.0.1:60647__%2Fwb) [n:127.0.0.1:60647__%2Fwb c:control_collection s:shard1 r:core_node1 x:collection1] o.a.s.r.RestManager Initializing 0 registered ManagedResources
   [junit4]   2> 2416901 INFO  (coreLoadExecutor-8087-thread-1-processing-n:127.0.0.1:60647__%2Fwb) [n:127.0.0.1:60647__%2Fwb c:control_collection s:shard1 r:core_node1 x:collection1] o.a.s.h.ReplicationHandler Commits will be reserved for  10000
   [junit4]   2> 2416901 INFO  (searcherExecutor-8088-thread-1-processing-n:127.0.0.1:60647__%2Fwb x:collection1 s:shard1 c:control_collection r:core_node1) [n:127.0.0.1:60647__%2Fwb c:control_collection s:shard1 r:core_node1 x:collection1] o.a.s.c.SolrCore [collection1] Registered new searcher Searcher@5ee21325[collection1] main{ExitableDirectoryReader(UninvertingDirectoryReader())}
   [junit4]   2> 2416902 INFO  (coreLoadExecutor-8087-thread-1-processing-n:127.0.0.1:60647__%2Fwb) [n:127.0.0.1:60647__%2Fwb c:control_collection s:shard1 r:core_node1 x:collection1] o.a.s.u.UpdateLog Looking up max value of version field to seed version buckets
   [junit4]   2> 2416902 INFO  (coreLoadExecutor-8087-thread-1-processing-n:127.0.0.1:60647__%2Fwb) [n:127.0.0.1:60647__%2Fwb c:control_collection s:shard1 r:core_node1 x:collection1] o.a.s.u.VersionInfo Refreshing highest value of _version_ for 65536 version buckets from index
   [junit4]   2> 2416902 INFO  (coreLoadExecutor-8087-thread-1-processing-n:127.0.0.1:60647__%2Fwb) [n:127.0.0.1:60647__%2Fwb c:control_collection s:shard1 r:core_node1 x:collection1] o.a.s.u.VersionInfo No terms found for _version_, cannot seed version bucket highest value from index
   [junit4]   2> 2416902 INFO  (coreLoadExecutor-8087-thread-1-processing-n:127.0.0.1:60647__%2Fwb) [n:127.0.0.1:60647__%2Fwb c:control_collection s:shard1 r:core_node1 x:collection1] o.a.s.u.UpdateLog Could not find max version in index or recent updates, using new clock 1514341402627014656
   [junit4]   2> 2416903 INFO  (coreLoadExecutor-8087-thread-1-processing-n:127.0.0.1:60647__%2Fwb) [n:127.0.0.1:60647__%2Fwb c:control_collection s:shard1 r:core_node1 x:collection1] o.a.s.u.UpdateLog Took 1.0ms to seed version buckets with highest version 1514341402627014656
   [junit4]   2> 2416904 INFO  (coreLoadExecutor-8087-thread-1-processing-n:127.0.0.1:60647__%2Fwb) [n:127.0.0.1:60647__%2Fwb c:control_collection s:shard1 r:core_node1 x:collection1] o.a.s.c.ZkController watch zkdir /configs/conf1
   [junit4]   2> 2416904 INFO  (coreLoadExecutor-8087-thread-1-processing-n:127.0.0.1:60647__%2Fwb) [n:127.0.0.1:60647__%2Fwb c:control_collection s:shard1 r:core_node1 x:collection1] o.a.s.c.CoreContainer registering core: collection1
   [junit4]   2> 2416905 INFO  (coreZkRegister-8081-thread-1-processing-n:127.0.0.1:60647__%2Fwb x:collection1 s:shard1 c:control_collection r:core_node1) [n:127.0.0.1:60647__%2Fwb c:control_collection s:shard1 r:core_node1 x:collection1] o.a.s.c.ZkController Register replica - core:collection1 address:http://127.0.0.1:60647/_/wb collection:control_collection shard:shard1
   [junit4]   2> 2416906 INFO  (coreZkRegister-8081-thread-1-processing-n:127.0.0.1:60647__%2Fwb x:collection1 s:shard1 c:control_collection r:core_node1) [n:127.0.0.1:60647__%2Fwb c:control_collection s:shard1 r:core_node1 x:collection1] o.a.s.c.c.SolrZkClient makePath: /collections/control_collection/leader_elect/shard1/election
   [junit4]   2> 2416912 INFO  (coreZkRegister-8081-thread-1-processing-n:127.0.0.1:60647__%2Fwb x:collection1 s:shard1 c:control_collection r:core_node1) [n:127.0.0.1:60647__%2Fwb c:control_collection s:shard1 r:core_node1 x:collection1] o.a.s.c.LeaderElector Joined leadership election with path: /collections/control_collection/leader_elect/shard1/election/94646337291943940-core_node1-n_0000000000
   [junit4]   2> 2416913 INFO  (coreZkRegister-8081-thread-1-processing-n:127.0.0.1:60647__%2Fwb x:collection1 s:shard1 c:control_collection r:core_node1) [n:127.0.0.1:60647__%2Fwb c:control_collection s:shard1 r:core_node1 x:collection1] o.a.s.c.ShardLeaderElectionContext Running the leader process for shard shard1
   [junit4]   2> 2416916 INFO  (coreZkRegister-8081-thread-1-processing-n:127.0.0.1:60647__%2Fwb x:collection1 s:shard1 c:control_collection r:core_node1) [n:127.0.0.1:60647__%2Fwb c:control_collection s:shard1 r:core_node1 x:collection1] o.a.s.c.ShardLeaderElectionContext Enough replicas found to continue.
   [junit4]   2> 2416916 INFO  (coreZkRegister-8081-thread-1-processing-n:127.0.0.1:60647__%2Fwb x:collection1 s:shard1 c:control_collection r:core_node1) [n:127.0.0.1:60647__%2Fwb c:control_collection s:shard1 r:core_node1 x:collection1] o.a.s.c.ShardLeaderElectionContext I may be the new leader - try and sync
   [junit4]   2> 2416916 INFO  (coreZkRegister-8081-thread-1-processing-n:127.0.0.1:60647__%2Fwb x:collection1 s:shard1 c:control_collection r:core_node1) [n:127.0.0.1:60647__%2Fwb c:control_collection s:shard1 r:core_node1 x:collection1] o.a.s.c.SyncStrategy Sync replicas to http://127.0.0.1:60647/_/wb/collection1/
   [junit4]   2> 2416916 INFO  (coreZkRegister-8081-thread-1-processing-n:127.0.0.1:60647__%2Fwb x:collection1 s:shard1 c:control_collection r:core_node1) [n:127.0.0.1:60647__%2Fwb c:control_collection s:shard1 r:core_node1 x:collection1] o.a.s.c.SyncStrategy Sync Success - now sync replicas to me
   [junit4]   2> 2416916 INFO  (coreZkRegister-8081-thread-1-processing-n:127.0.0.1:60647__%2Fwb x:collection1 s:shard1 c:control_collection r:core_node1) [n:127.0.0.1:60647__%2Fwb c:control_collection s:shard1 r:core_node1 x:collection1] o.a.s.c.SyncStrategy http://127.0.0.1:60647/_/wb/collection1/ has no replicas
   [junit4]   2> 2416916 INFO  (coreZkRegister-8081-thread-1-processing-n:127.0.0.1:60647__%2Fwb x:collection1 s:shard1 c:control_collection r:core_node1) [n:127.0.0.1:60647__%2Fwb c:control_collection s:shard1 r:core_node1 x:collection1] o.a.s.c.ShardLeaderElectionContext I am the new leader: http://127.0.0.1:60647/_/wb/collection1/ shard1
   [junit4]   2> 2416917 INFO  (OverseerStateUpdate-94646337291943940-127.0.0.1:60647__%2Fwb-n_0000000000) [n:127.0.0.1:60647__%2Fwb    ] o.a.s.c.Overseer processMessage: queueSize: 1, message = {
   [junit4]   2>   "operation":"leader",
   [junit4]   2>   "shard":"shard1",
   [junit4]   2>   "collection":"control_collection"} current state version: 1
   [junit4]   2> 2416917 INFO  (coreZkRegister-8081-thread-1-processing-n:127.0.0.1:60647__%2Fwb x:collection1 s:shard1 c:control_collection r:core_node1) [n:127.0.0.1:60647__%2Fwb c:control_collection s:shard1 r:core_node1 x:collection1] o.a.s.c.c.SolrZkClient makePath: /collections/control_collection/leaders/shard1
   [junit4]   2> 2416923 INFO  (coreZkRegister-8081-thread-1-processing-n:127.0.0.1:60647__%2Fwb x:collection1 s:shard1 c:control_collection r:core_node1) [n:127.0.0.1:60647__%2Fwb c:control_collection s:shard1 r:core_node1 x:collection1] o.a.s.c.ShardLeaderElectionContextBase Creating leader registration node
   [junit4]   2> 2416927 INFO  (OverseerStateUpdate-94646337291943940-127.0.0.1:60647__%2Fwb-n_0000000000) [n:127.0.0.1:60647__%2Fwb    ] o.a.s.c.Overseer processMessage: queueSize: 1, message = {
   [junit4]   2>   "operation":"leader",
   [junit4]   2>   "shard":"shard1",
   [junit4]   2>   "collection":"control_collection",
   [junit4]   2>   "base_url":"http://127.0.0.1:60647/_/wb",
   [junit4]   2>   "core":"collection1",
   [junit4]   2>   "state":"active"} current state version: 1
   [junit4]   2> 2417031 INFO  (zkCallback-2538-thread-1-processing-n:127.0.0.1:60647__%2Fwb) [n:127.0.0.1:60647__%2Fwb    ] o.a.s.c.c.ZkStateReader A cluster state change: WatchedEvent state:SyncConnected type:NodeDataChanged path:/clusterstate.json, has occurred - updating... (live nodes size: 1)
   [junit4]   2> 2417080 INFO  (coreZkRegister-8081-thread-1-processing-n:127.0.0.1:60647__%2Fwb x:collection1 s:shard1 c:control_collection r:core_node1) [n:127.0.0.1:60647__%2Fwb c:control_collection s:shard1 r:core_node1 x:collection1] o.a.s.c.ZkController We are http://127.0.0.1:60647/_/wb/collection1/ and leader is http://127.0.0.1:60647/_/wb/collection1/
   [junit4]   2> 2417080 INFO  (coreZkRegister-8081-thread-1-processing-n:127.0.0.1:60647__%2Fwb x:collection1 s:shard1 c:control_collection r:core_node1) [n:127.0.0.1:60647__%2Fwb c:control_collection s:shard1 r:core_node1 x:collection1] o.a.s.c.ZkController No LogReplay needed for core=collection1 baseURL=http://127.0.0.1:60647/_/wb
   [junit4]   2> 2417081 INFO  (coreZkRegister-8081-thread-1-processing-n:127.0.0.1:60647__%2Fwb x:collection1 s:shard1 c:control_collection r:core_node1) [n:127.0.0.1:60647__%2Fwb c:control_collection s:shard1 r:core_node1 x:collection1] o.a.s.c.ZkController I am the leader, no recovery necessary
   [junit4]   2> 2417081 INFO  (coreZkRegister-8081-thread-1-processing-n:127.0.0.1:60647__%2Fwb x:collection1 s:shard1 c:control_collection r:core_node1) [n:127.0.0.1:60647__%2Fwb c:control_collection s:shard1 r:core_node1 x:collection1] o.a.s.c.ZkController publishing state=active
   [junit4]   2> 2417081 INFO  (coreZkRegister-8081-thread-1-processing-n:127.0.0.1:60647__%2Fwb x:collection1 s:shard1 c:control_collection r:core_node1) [n:127.0.0.1:60647__%2Fwb c:control_collection s:shard1 r:core_node1 x:collection1] o.a.s.c.ZkController numShards not found on descriptor - reading it from system property
   [junit4]   2> 2417084 INFO  (OverseerStateUpdate-94646337291943940-127.0.0.1:60647__%2Fwb-n_0000000000) [n:127.0.0.1:60647__%2Fwb    ] o.a.s.c.Overseer processMessage: queueSize: 1, message = {
   [junit4]   2>   "core":"collection1",
   [junit4]   2>   "core_node_name":"core_node1",
   [junit4]   2>   "roles":null,
   [junit4]   2>   "base_url":"http://127.0.0.1:60647/_/wb",
   [junit4]   2>   "node_name":"127.0.0.1:60647__%2Fwb",
   [junit4]   2>   "numShards":"1",
   [junit4]   2>   "state":"active",
   [junit4]   2>   "shard":"shard1",
   [junit4]   2>   "collection":"control_collection",
   [junit4]   2>   "operation":"state"} current state version: 2
   [junit4]   2> 2417085 INFO  (OverseerStateUpdate-94646337291943940-127.0.0.1:60647__%2Fwb-n_0000000000) [n:127.0.0.1:60647__%2Fwb    ] o.a.s.c.o.ReplicaMutator Update state numShards=1 message={
   [junit4]   2>   "core":"collection1",
   [junit4]   2>   "core_node_name":"core_node1",
   [junit4]   2>   "roles":null,
   [junit4]   2>   "base_url":"http://127.0.0.1:60647/_/wb",
   [junit4]   2>   "node_name":"127.0.0.1:60647__%2Fwb",
   [junit4]   2>   "numShards":"1",
   [junit4]   2>   "state":"active",
   [junit4]   2>   "shard":"shard1",
   [junit4]   2>   "collection":"control_collection",
   [junit4]   2>   "operation":"state"}
   [junit4]   2> 2417190 INFO  (zkCallback-2538-thread-1-processing-n:127.0.0.1:60647__%2Fwb) [n:127.0.0.1:60647__%2Fwb    ] o.a.s.c.c.ZkStateReader A cluster state change: WatchedEvent state:SyncConnected type:NodeDataChanged path:/clusterstate.json, has occurred - updating... (live nodes size: 1)
   [junit4]   2> 2417259 INFO  (TEST-SolrCloudExampleTest.testLoadDocsIntoGettingStartedCollection-seed#[6F145AE51E2E137C]) [    ] o.a.s.c.c.SolrZkClient Using default ZkCredentialsProvider
   [junit4]   2> 2417260 INFO  (TEST-SolrCloudExampleTest.testLoadDocsIntoGettingStartedCollection-seed#[6F145AE51E2E137C]) [    ] o.a.s.c.c.ConnectionManager Waiting for client to connect to ZooKeeper
   [junit4]   2> 2417261 INFO  (zkCallback-2540-thread-1) [    ] o.a.s.c.c.ConnectionManager Watcher org.apache.solr.common.cloud.ConnectionManager@265b4199 name:ZooKeeperConnection Watcher:127.0.0.1:60644/solr got event WatchedEvent state:SyncConnected type:None path:null path:null type:None
   [junit4]   2> 2417261 INFO  (TEST-SolrCloudExampleTest.testLoadDocsIntoGettingStartedCollection-seed#[6F145AE51E2E137C]) [    ] o.a.s.c.c.ConnectionManager Client is connected to ZooKeeper
   [junit4]   2> 2417262 INFO  (TEST-SolrCloudExampleTest.testLoadDocsIntoGettingStartedCollection-seed#[6F145AE51E2E137C]) [    ] o.a.s.c.c.SolrZkClient Using default ZkACLProvider
   [junit4]   2> 2417262 INFO  (TEST-SolrCloudExampleTest.testLoadDocsIntoGettingStartedCollection-seed#[6F145AE51E2E137C]) [    ] o.a.s.c.c.ZkStateReader Updating cluster state from ZooKeeper... 
   [junit4]   2> 2417267 INFO  (TEST-SolrCloudExampleTest.testLoadDocsIntoGettingStartedCollection-seed#[6F145AE51E2E137C]) [    ] o.a.s.c.ChaosMonkey monkey: init - expire sessions:false cause connection loss:false
   [junit4]   2> 2417477 INFO  (TEST-SolrCloudExampleTest.testLoadDocsIntoGettingStartedCollection-seed#[6F145AE51E2E137C]) [    ] o.a.s.SolrTestCaseJ4 Writing core.properties file to /Users/jenkins/workspace/Lucene-Solr-5.x-MacOSX/solr/build/solr-core/test/J1/temp/solr.cloud.SolrCloudExampleTest_6F145AE51E2E137C-001/shard-1-001/cores/collection1
   [junit4]   2> 2417479 INFO  (TEST-SolrCloudExampleTest.testLoadDocsIntoGettingStartedCollection-seed#[6F145AE51E2E137C]) [    ] o.a.s.c.AbstractFullDistribZkTestBase create jetty 1 in directory /Users/jenkins/workspace/Lucene-Solr-5.x-MacOSX/solr/build/solr-core/test/J1/temp/solr.cloud.SolrCloudExampleTest_6F145AE51E2E137C-001/shard-1-001
   [junit4]   2> 2417479 INFO  (TEST-SolrCloudExampleTest.testLoadDocsIntoGettingStartedCollection-seed#[6F145AE51E2E137C]) [    ] o.e.j.s.Server jetty-9.2.13.v20150730
   [junit4]   2> 2417482 INFO  (TEST-SolrCloudExampleTest.testLoadDocsIntoGettingStartedCollection-seed#[6F145AE51E2E137C]) [    ] o.e.j.s.h.ContextHandler Started o.e.j.s.ServletContextHandler@259cae66{/_/wb,null,AVAILABLE}
   [junit4]   2> 2417482 INFO  (TEST-SolrCloudExampleTest.testLoadDocsIntoGettingStartedCollection-seed#[6F145AE51E2E137C]) [    ] o.e.j.s.ServerConnector Started ServerConnector@51656749{HTTP/1.1}{127.0.0.1:60652}
   [junit4]   2> 2417482 INFO  (TEST-SolrCloudExampleTest.testLoadDocsIntoGettingStartedCollection-seed#[6F145AE51E2E137C]) [    ] o.e.j.s.Server Started @2424476ms
   [junit4]   2> 2417482 INFO  (TEST-SolrCloudExampleTest.testLoadDocsIntoGettingStartedCollection-seed#[6F145AE51E2E137C]) [    ] o.a.s.c.s.e.JettySolrRunner Jetty properties: {solr.data.dir=/Users/jenkins/workspace/Lucene-Solr-5.x-MacOSX/solr/build/solr-core/test/J1/temp/solr.cloud.SolrCloudExampleTest_6F145AE51E2E137C-001/tempDir-001/jetty1, solrconfig=solrconfig.xml, hostContext=/_/wb, hostPort=60652, coreRootDirectory=/Users/jenkins/workspace/Lucene-Solr-5.x-MacOSX/solr/build/solr-core/test/J1/../../../../../../../../../Users/jenkins/workspace/Lucene-Solr-5.x-MacOSX/solr/build/solr-core/test/J1/temp/solr.cloud.SolrCloudExampleTest_6F145AE51E2E137C-001/shard-1-001/cores}
   [junit4]   2> 2417483 INFO  (TEST-SolrCloudExampleTest.testLoadDocsIntoGettingStartedCollection-seed#[6F145AE51E2E137C]) [    ] o.a.s.s.SolrDispatchFilter SolrDispatchFilter.init(): sun.misc.Launcher$AppClassLoader@74a14482
   [junit4]   2> 2417483 INFO  (TEST-SolrCloudExampleTest.testLoadDocsIntoGettingStartedCollection-seed#[6F145AE51E2E137C]) [    ] o.a.s.c.SolrResourceLoader new SolrResourceLoader for directory: '/Users/jenkins/workspace/Lucene-Solr-5.x-MacOSX/solr/build/solr-core/test/J1/../../../../../../../../../Users/jenkins/workspace/Lucene-Solr-5.x-MacOSX/solr/build/solr-core/test/J1/temp/solr.cloud.SolrCloudExampleTest_6F145AE51E2E137C-001/shard-1-001/'
   [junit4]   2> 2417503 INFO  (TEST-SolrCloudExampleTest.testLoadDocsIntoGettingStartedCollection-seed#[6F145AE51E2E137C]) [    ] o.a.s.c.c.SolrZkClient Using default ZkCredentialsProvider
   [junit4]   2> 2417504 INFO  (TEST-SolrCloudExampleTest.testLoadDocsIntoGettingStartedCollection-seed#[6F145AE51E2E137C]) [    ] o.a.s.c.c.ConnectionManager Waiting for client to connect to ZooKeeper
   [junit4]   2> 2417505 INFO  (zkCallback-2541-thread-1) [    ] o.a.s.c.c.ConnectionManager Watcher org.apache.solr.common.cloud.ConnectionManager@408a0d3c name:ZooKeeperConnection Watcher:127.0.0.1:60644/solr got event WatchedEvent state:SyncConnected type:None path:null path:null type:None
   [junit4]   2> 2417505 INFO  (TEST-SolrCloudExampleTest.testLoadDocsIntoGettingStartedCollection-seed#[6F145AE51E2E137C]) [    ] o.a.s.c.c.ConnectionManager Client is connected to ZooKeeper
   [junit4]   2> 2417506 INFO  (TEST-SolrCloudExampleTest.testLoadDocsIntoGettingStartedCollection-seed#[6F145AE51E2E137C]) [    ] o.a.s.c.c.SolrZkClient Using default ZkACLProvider
   [junit4]   2> 2417507 INFO  (TEST-SolrCloudExampleTest.testLoadDocsIntoGettingStartedCollection-seed#[6F145AE51E2E137C]) [    ] o.a.s.s.SolrDispatchFilter Loading solr.xml from SolrHome (not found in ZooKeeper)
   [junit4]   2> 2417507 INFO  (TEST-SolrCloudExampleTest.testLoadDocsIntoGettingStartedCollection-seed#[6F145AE51E2E137C]) [    ] o.a.s.c.SolrXmlConfig Loading container configuration from /Users/jenkins/workspace/Lucene-Solr-5.x-MacOSX/solr/build/solr-core/test/J1/../../../../../../../../../Users/jenkins/workspace/Lucene-Solr-5.x-MacOSX/solr/build/solr-core/test/J1/temp/solr.cloud.SolrCloudExampleTest_6F145AE51E2E137C-001/shard-1-001/solr.xml
   [junit4]   2> 2417513 INFO  (TEST-SolrCloudExampleTest.testLoadDocsIntoGettingStartedCollection-seed#[6F145AE51E2E137C]) [    ] o.a.s.c.CoresLocator Config-defined core root directory: /Users/jenkins/workspace/Lucene-Solr-5.x-MacOSX/solr/build/solr-core/test/J1/../../../../../../../../../Users/jenkins/workspace/Lucene-Solr-5.x-MacOSX/solr/build/solr-core/test/J1/temp/solr.cloud.SolrCloudExampleTest_6F145AE51E2E137C-001/shard-1-001/cores
   [junit4]   2> 2417513 INFO  (TEST-SolrCloudExampleTest.testLoadDocsIntoGettingStartedCollection-seed#[6F145AE51E2E137C]) [    ] o.a.s.c.CoreContainer New CoreContainer 2123569227
   [junit4]   2> 2417513 INFO  (TEST-SolrCloudExampleTest.testLoadDocsIntoGettingStartedCollection-seed#[6F145AE51E2E137C]) [    ] o.a.s.c.CoreContainer Loading cores into CoreContainer [instanceDir=/Users/jenkins/workspace/Lucene-Solr-5.x-MacOSX/solr/build/solr-core/test/J1/../../../../../../../../../Users/jenkins/workspace/Lucene-Solr-5.x-MacOSX/solr/build/solr-core/test/J1/temp/solr.cloud.SolrCloudExampleTest_6F145AE51E2E137C-001/shard-1-001/]
   [junit4]   2> 2417513 INFO  (TEST-SolrCloudExampleTest.testLoadDocsIntoGettingStartedCollection-seed#[6F145AE51E2E137C]) [    ] o.a.s.c.CoreContainer loading shared library: /Users/jenkins/workspace/Lucene-Solr-5.x-MacOSX/solr/build/solr-core/test/J1/../../../../../../../../../Users/jenkins/workspace/Lucene-Solr-5.x-MacOSX/solr/build/solr-core/test/J1/temp/solr.cloud.SolrCloudExampleTest_6F145AE51E2E137C-001/shard-1-001/lib
   [junit4]   2> 2417514 WARN  (TEST-SolrCloudExampleTest.testLoadDocsIntoGettingStartedCollection-seed#[6F145AE51E2E137C]) [    ] o.a.s.c.SolrResourceLoader Can't find (or read) directory to add to classloader: lib (resolved as: /Users/jenkins/workspace/Lucene-Solr-5.x-MacOSX/solr/build/solr-core/test/J1/../../../../../../../../../Users/jenkins/workspace/Lucene-Solr-5.x-MacOSX/solr/build/solr-core/test/J1/temp/solr.cloud.SolrCloudExampleTest_6F145AE51E2E137C-001/shard-1-001/lib).
   [junit4]   2> 2417520 INFO  (TEST-SolrCloudExampleTest.testLoadDocsIntoGettingStartedCollection-seed#[6F145AE51E2E137C]) [    ] o.a.s.h.c.HttpShardHandlerFactory created with socketTimeout : 90000,urlScheme : ,connTimeout : 15000,maxConnectionsPerHost : 20,maxConnections : 10000,corePoolSize : 0,maximumPoolSize : 2147483647,maxThreadIdleTime : 5,sizeOfQueue : -1,fairnessPolicy : false,useRetries : false,
   [junit4]   2> 2417522 INFO  (TEST-SolrCloudExampleTest.testLoadDocsIntoGettingStartedCollection-seed#[6F145AE51E2E137C]) [    ] o.a.s.u.UpdateShardHandler Creating UpdateShardHandler HTTP client with params: socketTimeout=340000&connTimeout=45000&retry=true
   [junit4]   2> 2417522 INFO  (TEST-SolrCloudExampleTest.testLoadDocsIntoGettingStartedCollection-seed#[6F145AE51E2E137C]) [    ] o.a.s.l.LogWatcher SLF4J impl is org.slf4j.impl.Log4jLoggerFactory
   [junit4]   2> 2417522 INFO  (TEST-SolrCloudExampleTest.testLoadDocsIntoGettingStartedCollection-seed#[6F145AE51E2E137C]) [    ] o.a.s.l.LogWatcher Registering Log Listener [Log4j (org.slf4j.impl.Log4jLoggerFactory)]
   [junit4]   2> 2417522 INFO  (TEST-SolrCloudExampleTest.testLoadDocsIntoGettingStartedCollection-seed#[6F145AE51E2E137C]) [    ] o.a.s.c.ZkContainer Zookeeper client=127.0.0.1:60644/solr
   [junit4]   2> 2417522 INFO  (TEST-SolrCloudExampleTest.testLoadDocsIntoGettingStartedCollection-seed#[6F145AE51E2E137C]) [    ] o.a.s.c.ZkController zkHost includes chroot
   [junit4]   2> 2417522 INFO  (TEST-SolrCloudExampleTest.testLoadDocsIntoGettingStartedCollection-seed#[6F145AE51E2E137C]) [    ] o.a.s.c.c.SolrZkClient Using default ZkCredentialsProvider
   [junit4]   2> 2417523 INFO  (TEST-SolrCloudExampleTest.testLoadDocsIntoGettingStartedCollection-seed#[6F145AE51E2E137C]) [    ] o.a.s.c.c.ConnectionManager Waiting for client to connect to ZooKeeper
   [junit4]   2> 2417525 INFO  (zkCallback-2543-thread-1) [    ] o.a.s.c.c.ConnectionManager Watcher org.apache.solr.common.cloud.ConnectionManager@45d82c82 name:ZooKeeperConnection Watcher:127.0.0.1:60644 got event WatchedEvent state:SyncConnected type:None path:null path:null type:None
   [junit4]   2> 2417525 INFO  (TEST-SolrCloudExampleTest.testLoadDocsIntoGettingStartedCollection-seed#[6F145AE51E2E137C]) [    ] o.a.s.c.c.ConnectionManager Client is connected to ZooKeeper
   [junit4]   2> 2417525 INFO  (TEST-SolrCloudExampleTest.testLoadDocsIntoGettingStartedCollection-seed#[6F145AE51E2E137C]) [    ] o.a.s.c.c.SolrZkClient Using default ZkACLProvider
   [junit4]   2> 2417527 INFO  (TEST-SolrCloudExampleTest.testLoadDocsIntoGettingStartedCollection-seed#[6F145AE51E2E137C]) [n:127.0.0.1:60652__%2Fwb    ] o.a.s.c.c.ConnectionManager Waiting for client to connect to ZooKeeper
   [junit4]   2> 2417529 INFO  (zkCallback-2544-thread-1-processing-n:127.0.0.1:60652__%2Fwb) [n:127.0.0.1:60652__%2Fwb    ] o.a.s.c.c.ConnectionManager Watcher org.apache.solr.common.cloud.ConnectionManager@40c13aa2 name:ZooKeeperConnection Watcher:127.0.0.1:60644/solr got event WatchedEvent state:SyncConnected type:None path:null path:null type:None
   [junit4]   2> 2417529 INFO  (TEST-SolrCloudExampleTest.testLoadDocsIntoGettingStartedCollection-seed#[6F145AE51E2E137C]) [n:127.0.0.1:60652__%2Fwb    ] o.a.s.c.c.ConnectionManager Client is connected to ZooKeeper
   [junit4]   2> 2417539 INFO  (TEST-SolrCloudExampleTest.testLoadDocsIntoGettingStartedCollection-seed#[6F145AE51E2E137C]) [n:127.0.0.1:60652__%2Fwb    ] o.a.s.c.c.ZkStateReader Updating cluster state from ZooKeeper... 
   [junit4]   2> 2418550 INFO  (TEST-SolrCloudExampleTest.testLoadDocsIntoGettingStartedCollection-seed#[6F145AE51E2E137C]) [n:127.0.0.1:60652__%2Fwb    ] o.a.s.c.ZkController Register node as live in ZooKeeper:/live_nodes/127.0.0.1:60652__%2Fwb
   [junit4]   2> 2418550 INFO  (TEST-SolrCloudExampleTest.testLoadDocsIntoGettingStartedCollection-seed#[6F145AE51E2E137C]) [n:127.0.0.1:60652__%2Fwb    ] o.a.s.c.c.SolrZkClient makePath: /live_nodes/127.0.0.1:60652__%2Fwb
   [junit4]   2> 2418552 INFO  (zkCallback-2540-thread-1) [    ] o.a.s.c.c.ZkStateReader A live node change: WatchedEvent state:SyncConnected type:NodeChildrenChanged path:/live_nodes, has occurred - updating... (live nodes size: 1)
   [junit4]   2> 2418553 INFO  (zkCallback-2538-thread-1-processing-n:127.0.0.1:60647__%2Fwb) [n:127.0.0.1:60647__%2Fwb    ] o.a.s.c.c.ZkStateReader A live node change: WatchedEvent state:SyncConnected type:NodeChildrenChanged path:/live_nodes, has occurred - updating... (live nodes size: 1)
   [junit4]   2> 2418553 INFO  (zkCallback-2544-thread-1-processing-n:127.0.0.1:60652__%2Fwb) [n:127.0.0.1:60652__%2Fwb    ] o.a.s.c.c.ZkStateReader A live node change: WatchedEvent state:SyncConnected type:NodeChildrenChanged path:/live_nodes, has occurred - updating... (live nodes size: 1)
   [junit4]   2> 2418555 INFO  (TEST-SolrCloudExampleTest.testLoadDocsIntoGettingStartedCollection-seed#[6F145AE51E2E137C]) [n:127.0.0.1:60652__%2Fwb    ] o.a.s.c.Overseer Overseer (id=null) closing
   [junit4]   2> 2418556 INFO  (TEST-SolrCloudExampleTest.testLoadDocsIntoGettingStartedCollection-seed#[6F145AE51E2E137C]) [n:127.0.0.1:60652__%2Fwb    ] o.a.s.c.LeaderElector Joined leadership election with path: /overseer_elect/election/94646337291943944-127.0.0.1:60652__%2Fwb-n_0000000001
   [junit4]   2> 2418558 INFO  (TEST-SolrCloudExampleTest.testLoadDocsIntoGettingStartedCollection-seed#[6F145AE51E2E137C]) [n:127.0.0.1:60652__%2Fwb    ] o.a.s.c.LeaderElector Watching path /overseer_elect/election/94646337291943940-127.0.0.1:60647__%2Fwb-n_0000000000 to know if I could be the leader
   [junit4]   2> 2418569 INFO  (TEST-SolrCloudExampleTest.testLoadDocsIntoGettingStartedCollection-seed#[6F145AE51E2E137C]) [n:127.0.0.1:60652__%2Fwb    ] o.a.s.c.CoreContainer Security conf doesn't exist. Skipping setup for authorization module.
   [junit4]   2> 2418569 INFO  (TEST-SolrCloudExampleTest.testLoadDocsIntoGettingStartedCollection-seed#[6F145AE51E2E137C]) [n:127.0.0.1:60652__%2Fwb    ] o.a.s.c.CoreContainer No authentication plugin used.
   [junit4]   2> 2418705 INFO  (TEST-SolrCloudExampleTest.testLoadDocsIntoGettingStartedCollection-seed#[6F145AE51E2E137C]) [n:127.0.0.1:60652__%2Fwb    ] o.a.s.c.CoresLocator Looking for core definitions underneath /Users/jenkins/workspace/Lucene-Solr-5.x-MacOSX/solr/build/solr-core/test/J1/../../../../../../../../../Users/jenkins/workspace/Lucene-Solr-5.x-MacOSX/solr/build/solr-core/test/J1/temp/solr.cloud.SolrCloudExampleTest_6F145AE51E2E137C-001/shard-1-001/cores
   [junit4]   2> 2418706 INFO  (TEST-SolrCloudExampleTest.testLoadDocsIntoGettingStartedCollection-seed#[6F145AE51E2E137C]) [n:127.0.0.1:60652__%2Fwb    ] o.a.s.c.SolrCore Created CoreDescriptor: {name=collection1, config=solrconfig.xml, transient=false, schema=schema.xml, loadOnStartup=true, configSetProperties=configsetprops.json, instanceDir=/Users/jenkins/workspace/Lucene-Solr-5.x-MacOSX/solr/build/solr-core/test/J1/../../../../../../../../../Users/jenkins/workspace/Lucene-Solr-5.x-MacOSX/solr/build/solr-core/test/J1/temp/solr.cloud.SolrCloudExampleTest_6F145AE51E2E137C-001/shard-1-001/cores/collection1, collection=collection1, absoluteInstDir=/Users/jenkins/workspace/Lucene-Solr-5.x-MacOSX/solr/build/solr-core/test/J1/../../../../../../../../../Users/jenkins/workspace/Lucene-Solr-5.x-MacOSX/solr/build/solr-core/test/J1/temp/solr.cloud.SolrCloudExampleTest_6F145AE51E2E137C-001/shard-1-001/cores/collection1/, coreNodeName=, dataDir=data/, shard=}
   [junit4]   2> 2418706 INFO  (TEST-SolrCloudExampleTest.testLoadDocsIntoGettingStartedCollection-seed#[6F145AE51E2E137C]) [n:127.0.0.1:60652__%2Fwb    ] o.a.s.c.CoresLocator Found core collection1 in /Users/jenkins/workspace/Lucene-Solr-5.x-MacOSX/solr/build/solr-core/test/J1/../../../../../../../../../Users/jenkins/workspace/Lucene-Solr-5.x-MacOSX/solr/build/solr-core/test/J1/temp/solr.cloud.SolrCloudExampleTest_6F145AE51E2E137C-001/shard-1-001/cores/collection1/
   [junit4]   2> 2418706 INFO  (TEST-SolrCloudExampleTest.testLoadDocsIntoGettingStartedCollection-seed#[6F145AE51E2E137C]) [n:127.0.0.1:60652__%2Fwb    ] o.a.s.c.CoresLocator Found 1 core definitions
   [junit4]   2> 2418708 INFO  (TEST-SolrCloudExampleTest.testLoadDocsIntoGettingStartedCollection-seed#[6F145AE51E2E137C]) [n:127.0.0.1:60652__%2Fwb    ] o.a.s.s.SolrDispatchFilter user.dir=/Users/jenkins/workspace/Lucene-Solr-5.x-MacOSX/solr/build/solr-core/test/J1
   [junit4]   2> 2418708 INFO  (TEST-SolrCloudExampleTest.testLoadDocsIntoGettingStartedCollection-seed#[6F145AE51E2E137C]) [n:127.0.0.1:60652__%2Fwb    ] o.a.s.s.SolrDispatchFilter SolrDispatchFilter.init() done
   [junit4]   2> 2418708 INFO  (coreLoadExecutor-8098-thread-1-processing-n:127.0.0.1:60652__%2Fwb) [n:127.0.0.1:60652__%2Fwb c:collection1   x:collection1] o.a.s.c.ZkController publishing state=down
   [junit4]   2> 2418708 INFO  (coreLoadExecutor-8098-thread-1-processing-n:127.0.0.1:60652__%2Fwb) [n:127.0.0.1:60652__%2Fwb c:collection1   x:collection1] o.a.s.c.ZkController numShards not found on descriptor - reading it from system property
   [junit4]   2> 2418711 INFO  (coreLoadExecutor-8098-thread-1-processing-n:127.0.0.1:60652__%2Fwb) [n:127.0.0.1:60652__%2Fwb c:collection1   x:collection1] o.a.s.c.ZkController look for our core node name
   [junit4]   2> 2418712 INFO  (OverseerStateUpdate-94646337291943940-127.0.0.1:60647__%2Fwb-n_0000000000) [n:127.0.0.1:60647__%2Fwb    ] o.a.s.c.Overseer processMessage: queueSize: 1, message = {
   [junit4]   2>   "core":"collection1",
   [junit4]   2>   "roles":null,
   [junit4]   2>   "base_url":"http://127.0.0.1:60652/_/wb",
   [junit4]   2>   "node_name":"127.0.0.1:60652__%2Fwb",
   [junit4]   2>   "numShards":"2",
   [junit4]   2>   "state":"down",
   [junit4]   2>   "shard":null,
   [junit4]   2>   "collection":"collection1",
   [junit4]   2>   "operation":"state"} current state version: 3
   [junit4]   2> 2418712 INFO  (OverseerStateUpdate-94646337291943940-127.0.0.1:60647__%2Fwb-n_0000000000) [n:127.0.0.1:60647__%2Fwb    ] o.a.s.c.o.ReplicaMutator Update state numShards=2 message={
   [junit4]   2>   "core":"collection1",
   [junit4]   2>   "roles":null,
   [junit4]   2>   "base_url":"http://127.0.0.1:60652/_/wb",
   [junit4]   2>   "node_name":"127.0.0.1:60652__%2Fwb",
   [junit4]   2>   "numShards":"2",
   [junit4]   2>   "state":"down",
   [junit4]   2>   "shard":null,
   [junit4]   2>   "collection":"collection1",
   [junit4]   2>   "operation":"state"}
   [junit4]   2> 2418712 INFO  (OverseerStateUpdate-94646337291943940-127.0.0.1:60647__%2Fwb-n_0000000000) [n:127.0.0.1:60647__%2Fwb    ] o.a.s.c.o.ClusterStateMutator building a new cName: collection1
   [junit4]   2> 2418712 INFO  (OverseerStateUpdate-94646337291943940-127.0.0.1:60647__%2Fwb-n_0000000000) [n:127.0.0.1:60647__%2Fwb    ] o.a.s.c.o.ReplicaMutator Assigning new node to shard shard=shard2
   [junit4]   2> 2418714 INFO  (zkCallback-2538-thread-1-processing-n:127.0.0.1:60647__%2Fwb) [n:127.0.0.1:60647__%2Fwb    ] o.a.s.c.c.ZkStateReader A cluster state change: WatchedEvent state:SyncConnected type:NodeDataChanged path:/clusterstate.json, has occurred - updating... (live nodes size: 2)
   [junit4]   2> 2418714 INFO  (zkCallback-2540-thread-1) [    ] o.a.s.c.c.ZkStateReader A cluster state change: WatchedEvent state:SyncConnected type:NodeDataChanged path:/clusterstate.json, has occurred - updating... (live nodes size: 2)
   [junit4]   2> 2418714 INFO  (zkCallback-2544-thread-1-processing-n:127.0.0.1:60652__%2Fwb) [n:127.0.0.1:60652__%2Fwb    ] o.a.s.c.c.ZkStateReader A cluster state change: WatchedEvent state:SyncConnected type:NodeDataChanged path:/clusterstate.json, has occurred - updating... (live nodes size: 2)
   [junit4]   2> 2419713 INFO  (coreLoadExecutor-8098-thread-1-processing-n:127.0.0.1:60652__%2Fwb) [n:127.0.0.1:60652__%2Fwb c:collection1   x:collection1] o.a.s.c.ZkController waiting to find shard id in clusterstate for collection1
   [junit4]   2> 2419713 INFO  (coreLoadExecutor-8098-thread-1-processing-n:127.0.0.1:60652__%2Fwb) [n:127.0.0.1:60652__%2Fwb c:collection1   x:collection1] o.a.s.c.ZkController Check for collection zkNode:collection1
   [junit4]   2> 2419714 INFO  (coreLoadExecutor-8098-thread-1-processing-n:127.0.0.1:60652__%2Fwb) [n:127.0.0.1:60652__%2Fwb c:collection1   x:collection1] o.a.s.c.ZkController Collection zkNode exists
   [junit4]   2> 2419714 INFO  (coreLoadExecutor-8098-thread-1-processing-n:127.0.0.1:60652__%2Fwb) [n:127.0.0.1:60652__%2Fwb c:collection1   x:collection1] o.a.s.c.c.ZkStateReader Load collection config from:/collections/collection1
   [junit4]   2> 2419715 INFO  (coreLoadExecutor-8098-thread-1-processing-n:127.0.0.1:60652__%2Fwb) [n:127.0.0.1:60652__%2Fwb c:collection1   x:collection1] o.a.s.c.c.ZkStateReader path=/collections/collection1 configName=conf1 specified config exists in ZooKeeper
   [junit4]   2> 2419715 INFO  (coreLoadExecutor-8098-thread-1-processing-n:127.0.0.1:60652__%2Fwb) [n:127.0.0.1:60652__%2Fwb c:collection1   x:collection1] o.a.s.c.SolrResourceLoader new SolrResourceLoader for directory: '/Users/jenkins/workspace/Lucene-Solr-5.x-MacOSX/solr/build/solr-core/test/J1/../../../../../../../../../Users/jenkins/workspace/Lucene-Solr-5.x-MacOSX/solr/build/solr-core/test/J1/temp/solr.cloud.SolrCloudExampleTest_6F145AE51E2E137C-001/shard-1-001/cores/collection1/'
   [junit4]   2> 2419728 INFO  (coreLoadExecutor-8098-thread-1-processing-n:127.0.0.1:60652__%2Fwb) [n:127.0.0.1:60652__%2Fwb c:collection1   x:collection1] o.a.s.c.Config loaded config solrconfig.xml with version 0 
   [junit4]   2> 2419733 INFO  (coreLoadExecutor-8098-thread-1-processing-n:127.0.0.1:60652__%2Fwb) [n:127.0.0.1:60652__%2Fwb c:collection1   x:collection1] o.a.s.c.SolrConfig current version of requestparams : -1
   [junit4]   2> 2419735 INFO  (coreLoadExecutor-8098-thread-1-processing-n:127.0.0.1:60652__%2Fwb) [n:127.0.0.1:60652__%2Fwb c:collection1   x:collection1] o.a.s.c.SolrConfig Using Lucene MatchVersion: 5.4.0
   [junit4]   2> 2419751 INFO  (coreLoadExecutor-8098-thread-1-processing-n:127.0.0.1:60652__%2Fwb) [n:127.0.0.1:60652__%2Fwb c:collection1   x:collection1] o.a.s.c.Config Loaded SolrConfig: solrconfig.xml
   [junit4]   2> 2419753 INFO  (coreLoadExecutor-8098-thread-1-processing-n:127.0.0.1:60652__%2Fwb) [n:127.0.0.1:60652__%2Fwb c:collection1   x:collection1] o.a.s.s.IndexSchema Reading Solr Schema from /configs/conf1/schema.xml
   [junit4]   2> 2419756 INFO  (coreLoadExecutor-8098-thread-1-processing-n:127.0.0.1:60652__%2Fwb) [n:127.0.0.1:60652__%2Fwb c:collection1   x:collection1] o.a.s.s.IndexSchema [collection1] Schema name=test
   [junit4]   2> 2419807 INFO  (coreLoadExecutor-8098-thread-1-processing-n:127.0.0.1:60652__%2Fwb) [n:127.0.0.1:60652__%2Fwb c:collection1   x:collection1] o.a.s.s.OpenExchangeRatesOrgProvider Initialized with rates=open-exchange-rates.json, refreshInterval=1440.
   [junit4]   2> 2419824 INFO  (coreLoadExecutor-8098-thread-1-processing-n:127.0.0.1:60652__%2Fwb) [n:127.0.0.1:60652__%2Fwb c:collection1   x:collection1] 

[...truncated too long message...]

er Stopped o.e.j.s.ServletContextHandler@17398d07{/_/wb,null,UNAVAILABLE}
   [junit4]   2> 2458751 INFO  (TEST-SolrCloudExampleTest.testLoadDocsIntoGettingStartedCollection-seed#[6F145AE51E2E137C]) [n:127.0.0.1:60665__%2Fwb c:collection1 s:shard1 r:core_node4 x:collection1] o.a.s.c.ZkTestServer connecting to 127.0.0.1:60644 60644
   [junit4]   2> 2458778 INFO  (Thread-6073) [    ] o.a.s.c.ZkTestServer connecting to 127.0.0.1:60644 60644
   [junit4]   2> 2459959 WARN  (Thread-6073) [    ] o.a.s.c.ZkTestServer Watch limit violations: 
   [junit4]   2> Maximum concurrent create/delete watches above limit:
   [junit4]   2> 
   [junit4]   2> 	9	/solr/aliases.json
   [junit4]   2> 	9	/solr/configs/gettingstarted/managed-schema
   [junit4]   2> 	9	/solr/configs/gettingstarted
   [junit4]   2> 	5	/solr/security.json
   [junit4]   2> 	5	/solr/configs/conf1
   [junit4]   2> 
   [junit4]   2> Maximum concurrent data watches above limit:
   [junit4]   2> 
   [junit4]   2> 	9	/solr/clusterstate.json
   [junit4]   2> 	4	/solr/collections/gettingstarted/state.json
   [junit4]   2> 
   [junit4]   2> Maximum concurrent children watches above limit:
   [junit4]   2> 
   [junit4]   2> 	9	/solr/live_nodes
   [junit4]   2> 	9	/solr/collections
   [junit4]   2> 	4	/solr/overseer/collection-queue-work
   [junit4]   2> 	3	/solr/overseer/queue
   [junit4]   2> 
   [junit4]   2> NOTE: reproduce with: ant test  -Dtestcase=SolrCloudExampleTest -Dtests.method=testLoadDocsIntoGettingStartedCollection -Dtests.seed=6F145AE51E2E137C -Dtests.slow=true -Dtests.locale=es -Dtests.timezone=America/Virgin -Dtests.asserts=true -Dtests.file.encoding=UTF-8
   [junit4] FAILURE 49.0s J1 | SolrCloudExampleTest.testLoadDocsIntoGettingStartedCollection <<<
   [junit4]    > Throwable #1: java.lang.AssertionError: Delete action failed!
   [junit4]    > 	at __randomizedtesting.SeedInfo.seed([6F145AE51E2E137C:7C77688A2F41AADA]:0)
   [junit4]    > 	at org.apache.solr.cloud.SolrCloudExampleTest.doTestDeleteAction(SolrCloudExampleTest.java:169)
   [junit4]    > 	at org.apache.solr.cloud.SolrCloudExampleTest.testLoadDocsIntoGettingStartedCollection(SolrCloudExampleTest.java:145)
   [junit4]    > 	at org.apache.solr.BaseDistributedSearchTestCase$ShardsRepeatRule$ShardsFixedStatement.callStatement(BaseDistributedSearchTestCase.java:963)
   [junit4]    > 	at org.apache.solr.BaseDistributedSearchTestCase$ShardsRepeatRule$ShardsStatement.evaluate(BaseDistributedSearchTestCase.java:938)
   [junit4]    > 	at java.lang.Thread.run(Thread.java:745)
   [junit4]   2> 2460217 INFO  (SUITE-SolrCloudExampleTest-seed#[6F145AE51E2E137C]-worker) [n:127.0.0.1:60665__%2Fwb c:collection1 s:shard1 r:core_node4 x:collection1] o.a.s.SolrTestCaseJ4 ###deleteCore
   [junit4]   2> NOTE: leaving temporary files on disk at: /Users/jenkins/workspace/Lucene-Solr-5.x-MacOSX/solr/build/solr-core/test/J1/temp/solr.cloud.SolrCloudExampleTest_6F145AE51E2E137C-001
   [junit4]   2> NOTE: test params are: codec=Asserting(Lucene53): {}, docValues:{}, sim=RandomSimilarityProvider(queryNorm=false,coord=crazy): {}, locale=es, timezone=America/Virgin
   [junit4]   2> NOTE: Mac OS X 10.8.5 x86_64/Oracle Corporation 1.8.0_60 (64-bit)/cpus=3,threads=1,free=110841256,total=518979584
   [junit4]   2> NOTE: All tests run in this JVM: [TestOrdValues, TestJsonRequest, DistributedSuggestComponentTest, LukeRequestHandlerTest, AddSchemaFieldsUpdateProcessorFactoryTest, DistributedQueryComponentOptimizationTest, SecurityConfHandlerTest, BigEndianAscendingWordDeserializerTest, CursorPagingTest, ZkStateReaderTest, HdfsRecoverLeaseTest, TestSolr4Spatial2, RequestLoggingTest, TestSolrDeletionPolicy2, TestSchemaVersionResource, SpellCheckComponentTest, TestLRUStatsCache, DefaultValueUpdateProcessorTest, ResponseHeaderTest, TestRecovery, TestLeaderInitiatedRecoveryThread, SolrIndexSplitterTest, LeaderElectionIntegrationTest, TestBM25SimilarityFactory, URLClassifyProcessorTest, DirectUpdateHandlerOptimizeTest, TestCrossCoreJoin, MinimalSchemaTest, CacheHeaderTest, BinaryUpdateRequestHandlerTest, TestManagedSchemaFieldResource, TestConfigSetImmutable, CollectionStateFormat2Test, TestSortingResponseWriter, DistanceUnitsTest, ChaosMonkeySafeLeaderTest, TestUtils, TestBinaryResponseWriter, TestFastOutputStream, TestWriterPerf, TestSolrQueryParserDefaultOperatorResource, SuggesterTest, TestBinaryField, TestSuggestSpellingConverter, TestSolrCoreProperties, HdfsSyncSliceTest, TestCryptoKeys, SpatialRPTFieldTypeTest, SolrInfoMBeanTest, TriLevelCompositeIdRoutingTest, TestOmitPositions, OpenExchangeRatesOrgProviderTest, CoreAdminRequestStatusTest, IgnoreCommitOptimizeUpdateProcessorFactoryTest, HdfsRecoveryZkTest, ResponseLogComponentTest, TestMiniSolrCloudCluster, TestRecoveryHdfs, TestValueSourceCache, SolrPluginUtilsTest, TestConfigReload, RAMDirectoryFactoryTest, UUIDFieldTest, TestJoin, TestSchemaSimilarityResource, QueryParsingTest, SmileWriterTest, DistributedFacetPivotSmallTest, CSVRequestHandlerTest, TestDefaultSimilarityFactory, IndexSchemaRuntimeFieldTest, TestDynamicFieldResource, TestReload, OpenCloseCoreStressTest, DeleteShardTest, WordBreakSolrSpellCheckerTest, SuggesterWFSTTest, SynonymTokenizerTest, ZkSolrClientTest, StatsComponentTest, DistributedFacetPivotWhiteBoxTest, TestFieldSortValues, TestStressUserVersions, TestCoreDiscovery, SolrCoreCheckLockOnStartupTest, BasicFunctionalityTest, TestQuerySenderListener, TestSolrConfigHandlerCloud, TestCloudSchemaless, TestSolrDynamicMBean, TimeZoneUtilsTest, CloudExitableDirectoryReaderTest, TestBadConfig, TestAddFieldRealTimeGet, BitVectorTest, TestFuzzyAnalyzedSuggestions, TestSolrCLIRunExample, SortByFunctionTest, FullSolrCloudDistribCmdsTest, TestPivotHelperCode, TestFreeTextSuggestions, TestPKIAuthenticationPlugin, TestIntervalFaceting, TestCopyFieldCollectionResource, ShowFileRequestHandlerTest, TestMinMaxOnMultiValuedField, MergeStrategyTest, RuleEngineTest, SuggestComponentTest, BadCopyFieldTest, TestHighFrequencyDictionaryFactory, TestFiltering, TestObjectReleaseTracker, TestSolr4Spatial, DebugComponentTest, SignatureUpdateProcessorFactoryTest, TestUniqueKeyFieldResource, TestRealTimeGet, SolrXmlInZkTest, BlockCacheTest, TestPHPSerializedResponseWriter, TestDistributedStatsComponentCardinality, TestShardHandlerFactory, DirectSolrConnectionTest, HighlighterConfigTest, EchoParamsTest, TestComplexPhraseQParserPlugin, AddBlockUpdateTest, TestTrie, TestClusterStateMutator, NumericFieldsTest, BasicDistributedZk2Test, CollectionsAPIDistributedZkTest, OverseerTest, BasicZkTest, RecoveryZkTest, TestReplicationHandler, ClusterStateUpdateTest, TestRandomFaceting, LeaderElectionTest, TestZkChroot, TestRandomDVFaceting, ShardRoutingCustomTest, AutoCommitTest, TestDistributedGrouping, TestFaceting, TestHashPartitioner, TermVectorComponentDistributedTest, ZkControllerTest, TestStressVersions, DistributedTermsComponentTest, TestCoreContainer, SolrCoreTest, TestGroupingSearch, BadIndexSchemaTest, ConvertedLegacyTest, TestLazyCores, CurrencyFieldOpenExchangeTest, SpellCheckCollatorTest, CoreAdminHandlerTest, TestFoldingMultitermQuery, TestStressLucene, PolyFieldTest, SchemaVersionSpecificBehaviorTest, FieldMutatingUpdateProcessorTest, QueryEqualityTest, DistanceFunctionTest, XsltUpdateRequestHandlerTest, TestQueryUtils, DirectSolrSpellCheckerTest, TestQueryTypes, XmlUpdateRequestHandlerTest, PathHierarchyTokenizerFactoryTest, TestIndexingPerformance, FieldAnalysisRequestHandlerTest, TestArbitraryIndexDir, LoggingHandlerTest, IndexSchemaTest, ReturnFieldsTest, TestCSVResponseWriter, TestPartialUpdateDeduplication, SearchHandlerTest, TestLFUCache, MultiTermTest, TestConfig, OutputWriterTest, ExternalFileFieldSortTest, TestPostingsSolrHighlighter, NotRequiredUniqueKeyTest, SpellPossibilityIteratorTest, TestCharFilters, TestXIncludeConfig, TestSweetSpotSimilarityFactory, TestPerFieldSimilarity, TestLMJelinekMercerSimilarityFactory, TestIBSimilarityFactory, TestFastWriter, ResourceLoaderTest, TestFastLRUCache, DateMathParserTest, ChaosMonkeyNothingIsSafeTest, CollectionReloadTest, DeleteInactiveReplicaTest, DeleteLastCustomShardedReplicaTest, DeleteReplicaTest, DistribCursorPagingTest, DistribDocExpirationUpdateProcessorTest, DistribJoinFromCollectionTest, HttpPartitionTest, OutOfBoxZkACLAndCredentialsProvidersTest, OverriddenZkACLAndCredentialsProvidersTest, OverseerCollectionConfigSetProcessorTest, OverseerRolesTest, OverseerStatusTest, RecoveryAfterSoftCommitTest, RemoteQueryErrorTest, ReplicationFactorTest, SSLMigrationTest, SaslZkACLProviderTest, SharedFSAutoReplicaFailoverTest, SharedFSAutoReplicaFailoverUtilsTest, SimpleCollectionCreateDeleteTest, SolrCloudExampleTest]
   [junit4] Completed [425/540] on J1 in 49.02s, 1 test, 1 failure <<< FAILURES!

[...truncated 369 lines...]
BUILD FAILED
/Users/jenkins/workspace/Lucene-Solr-5.x-MacOSX/build.xml:785: The following error occurred while executing this line:
/Users/jenkins/workspace/Lucene-Solr-5.x-MacOSX/build.xml:729: The following error occurred while executing this line:
/Users/jenkins/workspace/Lucene-Solr-5.x-MacOSX/build.xml:59: The following error occurred while executing this line:
/Users/jenkins/workspace/Lucene-Solr-5.x-MacOSX/solr/build.xml:233: The following error occurred while executing this line:
/Users/jenkins/workspace/Lucene-Solr-5.x-MacOSX/solr/common-build.xml:526: The following error occurred while executing this line:
/Users/jenkins/workspace/Lucene-Solr-5.x-MacOSX/lucene/common-build.xml:1452: The following error occurred while executing this line:
/Users/jenkins/workspace/Lucene-Solr-5.x-MacOSX/lucene/common-build.xml:1006: There were test failures: 540 suites (7 ignored), 2130 tests, 1 failure, 76 ignored (34 assumptions) [seed: 6F145AE51E2E137C]

Total time: 72 minutes 1 second
Build step 'Invoke Ant' marked build as failure
Archiving artifacts
[WARNINGS] Skipping publisher since build result is FAILURE
Recording test results
Email was triggered for: Failure - Any
Sending email for trigger: Failure - Any



Mime
View raw message