lucene-dev mailing list archives

Site index · List index
Message view « Date » · « Thread »
Top « Date » · « Thread »
From Policeman Jenkins Server <jenk...@thetaphi.de>
Subject [JENKINS] Lucene-Solr-trunk-Solaris (64bit/jdk1.8.0) - Build # 98 - Still Failing!
Date Mon, 05 Oct 2015 10:00:21 GMT
Build: http://jenkins.thetaphi.de/job/Lucene-Solr-trunk-Solaris/98/
Java: 64bit/jdk1.8.0 -XX:-UseCompressedOops -XX:+UseG1GC

1 tests failed.
FAILED:  org.apache.solr.update.AutoCommitTest.testCommitWithin

Error Message:
Exception during query

Stack Trace:
java.lang.RuntimeException: Exception during query
	at __randomizedtesting.SeedInfo.seed([C60E3B425E9B57F0:7CDC543ADDB5B9E5]:0)
	at org.apache.solr.SolrTestCaseJ4.assertQ(SolrTestCaseJ4.java:765)
	at org.apache.solr.update.AutoCommitTest.testCommitWithin(AutoCommitTest.java:321)
	at sun.reflect.NativeMethodAccessorImpl.invoke0(Native Method)
	at sun.reflect.NativeMethodAccessorImpl.invoke(NativeMethodAccessorImpl.java:62)
	at sun.reflect.DelegatingMethodAccessorImpl.invoke(DelegatingMethodAccessorImpl.java:43)
	at java.lang.reflect.Method.invoke(Method.java:497)
	at com.carrotsearch.randomizedtesting.RandomizedRunner.invoke(RandomizedRunner.java:1665)
	at com.carrotsearch.randomizedtesting.RandomizedRunner$8.evaluate(RandomizedRunner.java:864)
	at com.carrotsearch.randomizedtesting.RandomizedRunner$9.evaluate(RandomizedRunner.java:900)
	at com.carrotsearch.randomizedtesting.RandomizedRunner$10.evaluate(RandomizedRunner.java:914)
	at com.carrotsearch.randomizedtesting.rules.SystemPropertiesRestoreRule$1.evaluate(SystemPropertiesRestoreRule.java:57)
	at org.apache.lucene.util.TestRuleSetupTeardownChained$1.evaluate(TestRuleSetupTeardownChained.java:50)
	at org.apache.lucene.util.AbstractBeforeAfterRule$1.evaluate(AbstractBeforeAfterRule.java:46)
	at org.apache.lucene.util.TestRuleThreadAndTestName$1.evaluate(TestRuleThreadAndTestName.java:49)
	at org.apache.lucene.util.TestRuleIgnoreAfterMaxFailures$1.evaluate(TestRuleIgnoreAfterMaxFailures.java:65)
	at org.apache.lucene.util.TestRuleMarkFailure$1.evaluate(TestRuleMarkFailure.java:48)
	at com.carrotsearch.randomizedtesting.rules.StatementAdapter.evaluate(StatementAdapter.java:36)
	at com.carrotsearch.randomizedtesting.ThreadLeakControl$StatementRunner.run(ThreadLeakControl.java:367)
	at com.carrotsearch.randomizedtesting.ThreadLeakControl.forkTimeoutingTask(ThreadLeakControl.java:809)
	at com.carrotsearch.randomizedtesting.ThreadLeakControl$3.evaluate(ThreadLeakControl.java:460)
	at com.carrotsearch.randomizedtesting.RandomizedRunner.runSingleTest(RandomizedRunner.java:873)
	at com.carrotsearch.randomizedtesting.RandomizedRunner$5.evaluate(RandomizedRunner.java:775)
	at com.carrotsearch.randomizedtesting.RandomizedRunner$6.evaluate(RandomizedRunner.java:809)
	at com.carrotsearch.randomizedtesting.RandomizedRunner$7.evaluate(RandomizedRunner.java:820)
	at com.carrotsearch.randomizedtesting.rules.StatementAdapter.evaluate(StatementAdapter.java:36)
	at com.carrotsearch.randomizedtesting.rules.SystemPropertiesRestoreRule$1.evaluate(SystemPropertiesRestoreRule.java:57)
	at org.apache.lucene.util.AbstractBeforeAfterRule$1.evaluate(AbstractBeforeAfterRule.java:46)
	at com.carrotsearch.randomizedtesting.rules.StatementAdapter.evaluate(StatementAdapter.java:36)
	at org.apache.lucene.util.TestRuleStoreClassName$1.evaluate(TestRuleStoreClassName.java:42)
	at com.carrotsearch.randomizedtesting.rules.NoShadowingOrOverridesOnMethodsRule$1.evaluate(NoShadowingOrOverridesOnMethodsRule.java:39)
	at com.carrotsearch.randomizedtesting.rules.NoShadowingOrOverridesOnMethodsRule$1.evaluate(NoShadowingOrOverridesOnMethodsRule.java:39)
	at com.carrotsearch.randomizedtesting.rules.StatementAdapter.evaluate(StatementAdapter.java:36)
	at com.carrotsearch.randomizedtesting.rules.StatementAdapter.evaluate(StatementAdapter.java:36)
	at com.carrotsearch.randomizedtesting.rules.StatementAdapter.evaluate(StatementAdapter.java:36)
	at org.apache.lucene.util.TestRuleAssertionsRequired$1.evaluate(TestRuleAssertionsRequired.java:54)
	at org.apache.lucene.util.TestRuleMarkFailure$1.evaluate(TestRuleMarkFailure.java:48)
	at org.apache.lucene.util.TestRuleIgnoreAfterMaxFailures$1.evaluate(TestRuleIgnoreAfterMaxFailures.java:65)
	at org.apache.lucene.util.TestRuleIgnoreTestSuites$1.evaluate(TestRuleIgnoreTestSuites.java:55)
	at com.carrotsearch.randomizedtesting.rules.StatementAdapter.evaluate(StatementAdapter.java:36)
	at com.carrotsearch.randomizedtesting.ThreadLeakControl$StatementRunner.run(ThreadLeakControl.java:367)
	at java.lang.Thread.run(Thread.java:745)
Caused by: java.lang.RuntimeException: REQUEST FAILED: xpath=//result[@numFound=1]
	xml response was: <?xml version="1.0" encoding="UTF-8"?>
<response>
<lst name="responseHeader"><int name="status">0</int><int name="QTime">0</int></lst><result name="response" numFound="0" start="0"></result>
</response>

	request was:q=id:529&qt=standard&start=0&rows=20&version=2.2
	at org.apache.solr.SolrTestCaseJ4.assertQ(SolrTestCaseJ4.java:758)
	... 40 more




Build Log:
[...truncated 10005 lines...]
   [junit4] Suite: org.apache.solr.update.AutoCommitTest
   [junit4]   2> Creating dataDir: /export/home/jenkins/workspace/Lucene-Solr-trunk-Solaris/solr/build/solr-core/test/J1/temp/solr.update.AutoCommitTest_C60E3B425E9B57F0-001/init-core-data-001
   [junit4]   2> 1762928 INFO  (SUITE-AutoCommitTest-seed#[C60E3B425E9B57F0]-worker) [    ] o.a.s.SolrTestCaseJ4 Randomized ssl (false) and clientAuth (false)
   [junit4]   2> 1762928 INFO  (SUITE-AutoCommitTest-seed#[C60E3B425E9B57F0]-worker) [    ] o.a.s.SolrTestCaseJ4 ####initCore
   [junit4]   2> 1762928 INFO  (SUITE-AutoCommitTest-seed#[C60E3B425E9B57F0]-worker) [    ] o.a.s.c.SolrResourceLoader new SolrResourceLoader for directory: '/export/home/jenkins/workspace/Lucene-Solr-trunk-Solaris/solr/core/src/test-files/solr/collection1/'
   [junit4]   2> 1762929 INFO  (SUITE-AutoCommitTest-seed#[C60E3B425E9B57F0]-worker) [    ] o.a.s.c.SolrResourceLoader Adding 'file:/export/home/jenkins/workspace/Lucene-Solr-trunk-Solaris/solr/core/src/test-files/solr/collection1/lib/classes/' to classloader
   [junit4]   2> 1762929 INFO  (SUITE-AutoCommitTest-seed#[C60E3B425E9B57F0]-worker) [    ] o.a.s.c.SolrResourceLoader Adding 'file:/export/home/jenkins/workspace/Lucene-Solr-trunk-Solaris/solr/core/src/test-files/solr/collection1/lib/README' to classloader
   [junit4]   2> 1762951 INFO  (SUITE-AutoCommitTest-seed#[C60E3B425E9B57F0]-worker) [    ] o.a.s.c.SolrConfig current version of requestparams : -1
   [junit4]   2> 1762962 INFO  (SUITE-AutoCommitTest-seed#[C60E3B425E9B57F0]-worker) [    ] o.a.s.c.SolrConfig Using Lucene MatchVersion: 6.0.0
   [junit4]   2> 1762993 INFO  (SUITE-AutoCommitTest-seed#[C60E3B425E9B57F0]-worker) [    ] o.a.s.c.Config Loaded SolrConfig: solrconfig.xml
   [junit4]   2> 1762994 INFO  (SUITE-AutoCommitTest-seed#[C60E3B425E9B57F0]-worker) [    ] o.a.s.s.IndexSchema Reading Solr Schema from /export/home/jenkins/workspace/Lucene-Solr-trunk-Solaris/solr/core/src/test-files/solr/collection1/conf/schema.xml
   [junit4]   2> 1763000 INFO  (SUITE-AutoCommitTest-seed#[C60E3B425E9B57F0]-worker) [    ] o.a.s.s.IndexSchema [null] Schema name=test
   [junit4]   2> 1763128 INFO  (SUITE-AutoCommitTest-seed#[C60E3B425E9B57F0]-worker) [    ] o.a.s.s.OpenExchangeRatesOrgProvider Initialized with rates=open-exchange-rates.json, refreshInterval=1440.
   [junit4]   2> 1763135 INFO  (SUITE-AutoCommitTest-seed#[C60E3B425E9B57F0]-worker) [    ] o.a.s.s.IndexSchema default search field in schema is text
   [junit4]   2> 1763137 INFO  (SUITE-AutoCommitTest-seed#[C60E3B425E9B57F0]-worker) [    ] o.a.s.s.IndexSchema unique key field: id
   [junit4]   2> 1763141 INFO  (SUITE-AutoCommitTest-seed#[C60E3B425E9B57F0]-worker) [    ] o.a.s.s.FileExchangeRateProvider Reloading exchange rates from file currency.xml
   [junit4]   2> 1763142 INFO  (SUITE-AutoCommitTest-seed#[C60E3B425E9B57F0]-worker) [    ] o.a.s.s.FileExchangeRateProvider Reloading exchange rates from file currency.xml
   [junit4]   2> 1763144 INFO  (SUITE-AutoCommitTest-seed#[C60E3B425E9B57F0]-worker) [    ] o.a.s.s.OpenExchangeRatesOrgProvider Reloading exchange rates from open-exchange-rates.json
   [junit4]   2> 1763144 WARN  (SUITE-AutoCommitTest-seed#[C60E3B425E9B57F0]-worker) [    ] o.a.s.s.OpenExchangeRatesOrgProvider Unknown key IMPORTANT NOTE
   [junit4]   2> 1763144 WARN  (SUITE-AutoCommitTest-seed#[C60E3B425E9B57F0]-worker) [    ] o.a.s.s.OpenExchangeRatesOrgProvider Expected key, got STRING
   [junit4]   2> 1763144 INFO  (SUITE-AutoCommitTest-seed#[C60E3B425E9B57F0]-worker) [    ] o.a.s.s.OpenExchangeRatesOrgProvider Reloading exchange rates from open-exchange-rates.json
   [junit4]   2> 1763145 WARN  (SUITE-AutoCommitTest-seed#[C60E3B425E9B57F0]-worker) [    ] o.a.s.s.OpenExchangeRatesOrgProvider Unknown key IMPORTANT NOTE
   [junit4]   2> 1763145 WARN  (SUITE-AutoCommitTest-seed#[C60E3B425E9B57F0]-worker) [    ] o.a.s.s.OpenExchangeRatesOrgProvider Expected key, got STRING
   [junit4]   2> 1763145 INFO  (SUITE-AutoCommitTest-seed#[C60E3B425E9B57F0]-worker) [    ] o.a.s.c.SolrResourceLoader JNDI not configured for solr (NoInitialContextEx)
   [junit4]   2> 1763145 INFO  (SUITE-AutoCommitTest-seed#[C60E3B425E9B57F0]-worker) [    ] o.a.s.c.SolrResourceLoader using system property solr.solr.home: /export/home/jenkins/workspace/Lucene-Solr-trunk-Solaris/solr/core/src/test-files/solr
   [junit4]   2> 1763145 INFO  (SUITE-AutoCommitTest-seed#[C60E3B425E9B57F0]-worker) [    ] o.a.s.c.SolrResourceLoader new SolrResourceLoader for directory: '/export/home/jenkins/workspace/Lucene-Solr-trunk-Solaris/solr/core/src/test-files/solr/'
   [junit4]   2> 1763159 INFO  (SUITE-AutoCommitTest-seed#[C60E3B425E9B57F0]-worker) [    ] o.a.s.c.CoreContainer New CoreContainer 1178012444
   [junit4]   2> 1763159 INFO  (SUITE-AutoCommitTest-seed#[C60E3B425E9B57F0]-worker) [    ] o.a.s.c.CoreContainer Loading cores into CoreContainer [instanceDir=/export/home/jenkins/workspace/Lucene-Solr-trunk-Solaris/solr/core/src/test-files/solr/]
   [junit4]   2> 1763159 INFO  (SUITE-AutoCommitTest-seed#[C60E3B425E9B57F0]-worker) [    ] o.a.s.c.CoreContainer loading shared library: /export/home/jenkins/workspace/Lucene-Solr-trunk-Solaris/solr/core/src/test-files/solr/lib
   [junit4]   2> 1763159 WARN  (SUITE-AutoCommitTest-seed#[C60E3B425E9B57F0]-worker) [    ] o.a.s.c.SolrResourceLoader Can't find (or read) directory to add to classloader: lib (resolved as: /export/home/jenkins/workspace/Lucene-Solr-trunk-Solaris/solr/core/src/test-files/solr/lib).
   [junit4]   2> 1763166 INFO  (SUITE-AutoCommitTest-seed#[C60E3B425E9B57F0]-worker) [    ] o.a.s.h.c.HttpShardHandlerFactory created with socketTimeout : 600000,connTimeout : 60000,maxConnectionsPerHost : 20,maxConnections : 10000,corePoolSize : 0,maximumPoolSize : 2147483647,maxThreadIdleTime : 5,sizeOfQueue : -1,fairnessPolicy : false,useRetries : false,
   [junit4]   2> 1763168 INFO  (SUITE-AutoCommitTest-seed#[C60E3B425E9B57F0]-worker) [    ] o.a.s.u.UpdateShardHandler Creating UpdateShardHandler HTTP client with params: socketTimeout=30000&connTimeout=30000&retry=true
   [junit4]   2> 1763168 INFO  (SUITE-AutoCommitTest-seed#[C60E3B425E9B57F0]-worker) [    ] o.a.s.l.LogWatcher SLF4J impl is org.slf4j.impl.Log4jLoggerFactory
   [junit4]   2> 1763168 INFO  (SUITE-AutoCommitTest-seed#[C60E3B425E9B57F0]-worker) [    ] o.a.s.l.LogWatcher Registering Log Listener [Log4j (org.slf4j.impl.Log4jLoggerFactory)]
   [junit4]   2> 1763168 INFO  (SUITE-AutoCommitTest-seed#[C60E3B425E9B57F0]-worker) [    ] o.a.s.c.CoreContainer Security conf doesn't exist. Skipping setup for authorization module.
   [junit4]   2> 1763168 INFO  (SUITE-AutoCommitTest-seed#[C60E3B425E9B57F0]-worker) [    ] o.a.s.c.CoreContainer No authentication plugin used.
   [junit4]   2> 1763169 INFO  (SUITE-AutoCommitTest-seed#[C60E3B425E9B57F0]-worker) [    ] o.a.s.c.SolrCore Created CoreDescriptor: {name=collection1, config=solrconfig.xml, transient=false, schema=schema.xml, loadOnStartup=true, configSetProperties=configsetprops.json, instanceDir=collection1, collection=collection1, absoluteInstDir=/export/home/jenkins/workspace/Lucene-Solr-trunk-Solaris/solr/core/src/test-files/solr/collection1/, dataDir=/export/home/jenkins/workspace/Lucene-Solr-trunk-Solaris/solr/build/solr-core/test/J1/temp/solr.update.AutoCommitTest_C60E3B425E9B57F0-001/init-core-data-001, shard=shard1}
   [junit4]   2> 1763170 INFO  (coreLoadExecutor-5443-thread-1) [    ] o.a.s.c.SolrResourceLoader new SolrResourceLoader for directory: '/export/home/jenkins/workspace/Lucene-Solr-trunk-Solaris/solr/core/src/test-files/solr/collection1/'
   [junit4]   2> 1763170 INFO  (coreLoadExecutor-5443-thread-1) [    ] o.a.s.c.SolrResourceLoader Adding 'file:/export/home/jenkins/workspace/Lucene-Solr-trunk-Solaris/solr/core/src/test-files/solr/collection1/lib/classes/' to classloader
   [junit4]   2> 1763170 INFO  (coreLoadExecutor-5443-thread-1) [    ] o.a.s.c.SolrResourceLoader Adding 'file:/export/home/jenkins/workspace/Lucene-Solr-trunk-Solaris/solr/core/src/test-files/solr/collection1/lib/README' to classloader
   [junit4]   2> 1763217 INFO  (coreLoadExecutor-5443-thread-1) [    ] o.a.s.c.SolrConfig current version of requestparams : -1
   [junit4]   2> 1763233 INFO  (coreLoadExecutor-5443-thread-1) [    ] o.a.s.c.SolrConfig Using Lucene MatchVersion: 6.0.0
   [junit4]   2> 1763257 INFO  (coreLoadExecutor-5443-thread-1) [    ] o.a.s.c.Config Loaded SolrConfig: solrconfig.xml
   [junit4]   2> 1763258 INFO  (coreLoadExecutor-5443-thread-1) [    ] o.a.s.s.IndexSchema Reading Solr Schema from /export/home/jenkins/workspace/Lucene-Solr-trunk-Solaris/solr/core/src/test-files/solr/collection1/conf/schema.xml
   [junit4]   2> 1763262 INFO  (coreLoadExecutor-5443-thread-1) [    ] o.a.s.s.IndexSchema [collection1] Schema name=test
   [junit4]   2> 1763381 INFO  (coreLoadExecutor-5443-thread-1) [    ] o.a.s.s.OpenExchangeRatesOrgProvider Initialized with rates=open-exchange-rates.json, refreshInterval=1440.
   [junit4]   2> 1763387 INFO  (coreLoadExecutor-5443-thread-1) [    ] o.a.s.s.IndexSchema default search field in schema is text
   [junit4]   2> 1763388 INFO  (coreLoadExecutor-5443-thread-1) [    ] o.a.s.s.IndexSchema unique key field: id
   [junit4]   2> 1763392 INFO  (coreLoadExecutor-5443-thread-1) [    ] o.a.s.s.FileExchangeRateProvider Reloading exchange rates from file currency.xml
   [junit4]   2> 1763394 INFO  (coreLoadExecutor-5443-thread-1) [    ] o.a.s.s.FileExchangeRateProvider Reloading exchange rates from file currency.xml
   [junit4]   2> 1763396 INFO  (coreLoadExecutor-5443-thread-1) [    ] o.a.s.s.OpenExchangeRatesOrgProvider Reloading exchange rates from open-exchange-rates.json
   [junit4]   2> 1763396 WARN  (coreLoadExecutor-5443-thread-1) [    ] o.a.s.s.OpenExchangeRatesOrgProvider Unknown key IMPORTANT NOTE
   [junit4]   2> 1763396 WARN  (coreLoadExecutor-5443-thread-1) [    ] o.a.s.s.OpenExchangeRatesOrgProvider Expected key, got STRING
   [junit4]   2> 1763396 INFO  (coreLoadExecutor-5443-thread-1) [    ] o.a.s.s.OpenExchangeRatesOrgProvider Reloading exchange rates from open-exchange-rates.json
   [junit4]   2> 1763396 WARN  (coreLoadExecutor-5443-thread-1) [    ] o.a.s.s.OpenExchangeRatesOrgProvider Unknown key IMPORTANT NOTE
   [junit4]   2> 1763396 WARN  (coreLoadExecutor-5443-thread-1) [    ] o.a.s.s.OpenExchangeRatesOrgProvider Expected key, got STRING
   [junit4]   2> 1763398 INFO  (coreLoadExecutor-5443-thread-1) [    ] o.a.s.c.ConfigSetProperties Did not find ConfigSet properties, assuming default properties: Can't find resource 'configsetprops.json' in classpath or '/export/home/jenkins/workspace/Lucene-Solr-trunk-Solaris/solr/core/src/test-files/solr/collection1/conf'
   [junit4]   2> 1763398 INFO  (coreLoadExecutor-5443-thread-1) [    ] o.a.s.c.CoreContainer Creating SolrCore 'collection1' using configuration from instancedir /export/home/jenkins/workspace/Lucene-Solr-trunk-Solaris/solr/core/src/test-files/solr/collection1/
   [junit4]   2> 1763398 INFO  (coreLoadExecutor-5443-thread-1) [    x:collection1] o.a.s.c.SolrCore org.apache.solr.core.MockDirectoryFactory
   [junit4]   2> 1763398 INFO  (coreLoadExecutor-5443-thread-1) [    x:collection1] o.a.s.c.SolrCore [[collection1] ] Opening new SolrCore at [/export/home/jenkins/workspace/Lucene-Solr-trunk-Solaris/solr/core/src/test-files/solr/collection1/], dataDir=[null]
   [junit4]   2> 1763398 INFO  (coreLoadExecutor-5443-thread-1) [    x:collection1] o.a.s.c.JmxMonitoredMap JMX monitoring is enabled. Adding Solr mbeans to JMX Server: com.sun.jmx.mbeanserver.JmxMBeanServer@55ad3782
   [junit4]   2> 1763399 INFO  (coreLoadExecutor-5443-thread-1) [    x:collection1] o.a.s.c.CachingDirectoryFactory return new directory for /export/home/jenkins/workspace/Lucene-Solr-trunk-Solaris/solr/build/solr-core/test/J1/temp/solr.update.AutoCommitTest_C60E3B425E9B57F0-001/init-core-data-001
   [junit4]   2> 1763399 INFO  (coreLoadExecutor-5443-thread-1) [    x:collection1] o.a.s.c.SolrCore New index directory detected: old=null new=/export/home/jenkins/workspace/Lucene-Solr-trunk-Solaris/solr/build/solr-core/test/J1/temp/solr.update.AutoCommitTest_C60E3B425E9B57F0-001/init-core-data-001/index/
   [junit4]   2> 1763399 WARN  (coreLoadExecutor-5443-thread-1) [    x:collection1] o.a.s.c.SolrCore [collection1] Solr index directory '/export/home/jenkins/workspace/Lucene-Solr-trunk-Solaris/solr/build/solr-core/test/J1/temp/solr.update.AutoCommitTest_C60E3B425E9B57F0-001/init-core-data-001/index' doesn't exist. Creating new index...
   [junit4]   2> 1763399 INFO  (coreLoadExecutor-5443-thread-1) [    x:collection1] o.a.s.c.CachingDirectoryFactory return new directory for /export/home/jenkins/workspace/Lucene-Solr-trunk-Solaris/solr/build/solr-core/test/J1/temp/solr.update.AutoCommitTest_C60E3B425E9B57F0-001/init-core-data-001/index
   [junit4]   2> 1763399 INFO  (coreLoadExecutor-5443-thread-1) [    x:collection1] o.a.s.u.RandomMergePolicy RandomMergePolicy wrapping class org.apache.lucene.index.LogByteSizeMergePolicy: [LogByteSizeMergePolicy: minMergeSize=1677721, mergeFactor=24, maxMergeSize=2147483648, maxMergeSizeForForcedMerge=9223372036854775807, calibrateSizeByDeletes=true, maxMergeDocs=2147483647, maxCFSSegmentSizeMB=8.796093022207999E12, noCFSRatio=0.0]
   [junit4]   2> 1763400 INFO  (coreLoadExecutor-5443-thread-1) [    x:collection1] o.a.s.c.SolrCore SolrDeletionPolicy.onCommit: commits: num=1
   [junit4]   2> 	commit{dir=MockDirectoryWrapper(RAMDirectory@49de5e36 lockFactory=org.apache.lucene.store.SingleInstanceLockFactory@3a6ed236),segFN=segments_1,generation=1}
   [junit4]   2> 1763400 INFO  (coreLoadExecutor-5443-thread-1) [    x:collection1] o.a.s.c.SolrCore newest commit generation = 1
   [junit4]   2> 1763401 INFO  (OldIndexDirectoryCleanupThreadForCore-collection1) [    x:collection1] o.a.s.c.SolrCore Looking for old index directories to cleanup for core collection1 in /export/home/jenkins/workspace/Lucene-Solr-trunk-Solaris/solr/build/solr-core/test/J1/temp/solr.update.AutoCommitTest_C60E3B425E9B57F0-001/init-core-data-001/
   [junit4]   2> 1763405 INFO  (coreLoadExecutor-5443-thread-1) [    x:collection1] o.a.s.u.p.UpdateRequestProcessorChain creating updateRequestProcessorChain "dedupe"
   [junit4]   2> 1763405 INFO  (coreLoadExecutor-5443-thread-1) [    x:collection1] o.a.s.u.p.UpdateRequestProcessorChain inserting DistributedUpdateProcessorFactory into updateRequestProcessorChain "dedupe"
   [junit4]   2> 1763405 INFO  (coreLoadExecutor-5443-thread-1) [    x:collection1] o.a.s.u.p.UpdateRequestProcessorChain creating updateRequestProcessorChain "dedupe-allfields"
   [junit4]   2> 1763405 INFO  (coreLoadExecutor-5443-thread-1) [    x:collection1] o.a.s.u.p.UpdateRequestProcessorChain inserting DistributedUpdateProcessorFactory into updateRequestProcessorChain "dedupe-allfields"
   [junit4]   2> 1763406 INFO  (coreLoadExecutor-5443-thread-1) [    x:collection1] o.a.s.u.p.UpdateRequestProcessorChain creating updateRequestProcessorChain "stored_sig"
   [junit4]   2> 1763406 INFO  (coreLoadExecutor-5443-thread-1) [    x:collection1] o.a.s.u.p.UpdateRequestProcessorChain inserting DistributedUpdateProcessorFactory into updateRequestProcessorChain "stored_sig"
   [junit4]   2> 1763406 INFO  (coreLoadExecutor-5443-thread-1) [    x:collection1] o.a.s.u.p.UpdateRequestProcessorChain creating updateRequestProcessorChain "uniq-fields"
   [junit4]   2> 1763406 INFO  (coreLoadExecutor-5443-thread-1) [    x:collection1] o.a.s.u.p.UpdateRequestProcessorChain inserting DistributedUpdateProcessorFactory into updateRequestProcessorChain "uniq-fields"
   [junit4]   2> 1763406 INFO  (coreLoadExecutor-5443-thread-1) [    x:collection1] o.a.s.u.p.UpdateRequestProcessorChain creating updateRequestProcessorChain "distrib-dup-test-chain-explicit"
   [junit4]   2> 1763406 INFO  (coreLoadExecutor-5443-thread-1) [    x:collection1] o.a.s.u.p.UpdateRequestProcessorChain creating updateRequestProcessorChain "distrib-dup-test-chain-implicit"
   [junit4]   2> 1763406 INFO  (coreLoadExecutor-5443-thread-1) [    x:collection1] o.a.s.u.p.UpdateRequestProcessorChain inserting DistributedUpdateProcessorFactory into updateRequestProcessorChain "distrib-dup-test-chain-implicit"
   [junit4]   2> 1763406 INFO  (coreLoadExecutor-5443-thread-1) [    x:collection1] o.a.s.c.SolrCore no updateRequestProcessorChain defined as default, creating implicit default
   [junit4]   2> 1763409 INFO  (coreLoadExecutor-5443-thread-1) [    x:collection1] o.a.s.h.l.XMLLoader xsltCacheLifetimeSeconds=60
   [junit4]   2> 1763410 INFO  (coreLoadExecutor-5443-thread-1) [    x:collection1] o.a.s.h.l.XMLLoader xsltCacheLifetimeSeconds=60
   [junit4]   2> 1763412 INFO  (coreLoadExecutor-5443-thread-1) [    x:collection1] o.a.s.h.l.XMLLoader xsltCacheLifetimeSeconds=60
   [junit4]   2> 1763414 INFO  (coreLoadExecutor-5443-thread-1) [    x:collection1] o.a.s.h.l.XMLLoader xsltCacheLifetimeSeconds=60
   [junit4]   2> 1763418 INFO  (coreLoadExecutor-5443-thread-1) [    x:collection1] o.a.s.c.PluginBag requestHandler : 'lazy' created with startup=lazy 
   [junit4]   2> 1763420 INFO  (coreLoadExecutor-5443-thread-1) [    x:collection1] o.a.s.c.RequestHandlers Registered paths: /admin/mbeans,standard,spellCheckCompRH,lazy,/update/json/docs,/admin/luke,spellCheckWithWordbreak_Direct,tvrh,/get,/admin/properties,/update/json,mltrh,/admin/threads,/search-facet-def,/update/csv,/search-facet-invariants,/admin/segments,spellCheckCompRH1,/mlt,/admin/system,/replication,dismax,defaults,/config,/schema,/admin/plugins,/admin/logging,spellCheckWithWordbreak,mock,/admin/ping,/update,/admin/file,/terms,spellCheckCompRH_Direct,/debug/dump
   [junit4]   2> 1763421 WARN  (coreLoadExecutor-5443-thread-1) [    x:collection1] o.a.s.c.SolrCore solrconfig.xml uses deprecated <admin/gettableFiles>, Please update your config to use the ShowFileRequestHandler.
   [junit4]   2> 1763422 INFO  (coreLoadExecutor-5443-thread-1) [    x:collection1] o.a.s.c.SolrCore Using default statsCache cache: org.apache.solr.search.stats.LocalStatsCache
   [junit4]   2> 1763423 INFO  (coreLoadExecutor-5443-thread-1) [    x:collection1] o.a.s.u.UpdateHandler Using UpdateLog implementation: org.apache.solr.update.UpdateLog
   [junit4]   2> 1763423 INFO  (coreLoadExecutor-5443-thread-1) [    x:collection1] o.a.s.u.UpdateLog Initializing UpdateLog: dataDir= defaultSyncLevel=FLUSH numRecordsToKeep=100 maxNumLogsToKeep=10 numVersionBuckets=65536
   [junit4]   2> 1763425 INFO  (coreLoadExecutor-5443-thread-1) [    x:collection1] o.a.s.c.SolrCore Hard AutoCommit: disabled
   [junit4]   2> 1763425 INFO  (coreLoadExecutor-5443-thread-1) [    x:collection1] o.a.s.c.SolrCore Soft AutoCommit: disabled
   [junit4]   2> 1763425 INFO  (coreLoadExecutor-5443-thread-1) [    x:collection1] o.a.s.u.RandomMergePolicy RandomMergePolicy wrapping class org.apache.lucene.index.TieredMergePolicy: [TieredMergePolicy: maxMergeAtOnce=37, maxMergeAtOnceExplicit=15, maxMergedSegmentMB=99.55859375, floorSegmentMB=1.3798828125, forceMergeDeletesPctAllowed=13.027217099700088, segmentsPerTier=41.0, maxCFSSegmentSizeMB=8.796093022207999E12, noCFSRatio=1.0
   [junit4]   2> 1763425 INFO  (coreLoadExecutor-5443-thread-1) [    x:collection1] o.a.s.c.SolrCore SolrDeletionPolicy.onInit: commits: num=1
   [junit4]   2> 	commit{dir=MockDirectoryWrapper(RAMDirectory@49de5e36 lockFactory=org.apache.lucene.store.SingleInstanceLockFactory@3a6ed236),segFN=segments_1,generation=1}
   [junit4]   2> 1763425 INFO  (coreLoadExecutor-5443-thread-1) [    x:collection1] o.a.s.c.SolrCore newest commit generation = 1
   [junit4]   2> 1763426 INFO  (coreLoadExecutor-5443-thread-1) [    x:collection1] o.a.s.s.SolrIndexSearcher Opening Searcher@2d0420e4[collection1] main
   [junit4]   2> 1763426 INFO  (coreLoadExecutor-5443-thread-1) [    x:collection1] o.a.s.r.RestManager Initializing RestManager with initArgs: {storageIO=org.apache.solr.rest.ManagedResourceStorage$InMemoryStorageIO}
   [junit4]   2> 1763426 INFO  (coreLoadExecutor-5443-thread-1) [    x:collection1] o.a.s.r.ManagedResourceStorage Reading _rest_managed.json using InMemoryStorage
   [junit4]   2> 1763426 INFO  (coreLoadExecutor-5443-thread-1) [    x:collection1] o.a.s.r.RestManager Initializing 0 registered ManagedResources
   [junit4]   2> 1763426 INFO  (coreLoadExecutor-5443-thread-1) [    x:collection1] o.a.s.h.c.SpellCheckComponent Initializing spell checkers
   [junit4]   2> 1763483 INFO  (coreLoadExecutor-5443-thread-1) [    x:collection1] o.a.s.s.DirectSolrSpellChecker init: {name=direct,classname=DirectSolrSpellChecker,field=lowerfilt,minQueryLength=3}
   [junit4]   2> 1763648 INFO  (coreLoadExecutor-5443-thread-1) [    x:collection1] o.a.s.h.ReplicationHandler Commits will be reserved for  10000
   [junit4]   2> 1763648 INFO  (searcherExecutor-5444-thread-1-processing-x:collection1) [    x:collection1] o.a.s.h.c.SpellCheckComponent Loading spell index for spellchecker: default
   [junit4]   2> 1763649 INFO  (searcherExecutor-5444-thread-1-processing-x:collection1) [    x:collection1] o.a.s.h.c.SpellCheckComponent Loading spell index for spellchecker: direct
   [junit4]   2> 1763649 INFO  (coreLoadExecutor-5443-thread-1) [    x:collection1] o.a.s.u.UpdateLog Looking up max value of version field to seed version buckets
   [junit4]   2> 1763649 INFO  (searcherExecutor-5444-thread-1-processing-x:collection1) [    x:collection1] o.a.s.h.c.SpellCheckComponent Loading spell index for spellchecker: wordbreak
   [junit4]   2> 1763649 INFO  (searcherExecutor-5444-thread-1-processing-x:collection1) [    x:collection1] o.a.s.h.c.SpellCheckComponent Loading spell index for spellchecker: multipleFields
   [junit4]   2> 1763649 INFO  (coreLoadExecutor-5443-thread-1) [    x:collection1] o.a.s.u.VersionInfo Refreshing highest value of _version_ for 65536 version buckets from index
   [junit4]   2> 1763650 INFO  (coreLoadExecutor-5443-thread-1) [    x:collection1] o.a.s.u.VersionInfo No terms found for _version_, cannot seed version bucket highest value from index
   [junit4]   2> 1763650 INFO  (coreLoadExecutor-5443-thread-1) [    x:collection1] o.a.s.u.UpdateLog Could not find max version in index or recent updates, using new clock 1514183428277272576
   [junit4]   2> 1763650 INFO  (searcherExecutor-5444-thread-1-processing-x:collection1) [    x:collection1] o.a.s.h.c.SpellCheckComponent Loading spell index for spellchecker: jarowinkler
   [junit4]   2> 1763651 INFO  (searcherExecutor-5444-thread-1-processing-x:collection1) [    x:collection1] o.a.s.h.c.SpellCheckComponent Loading spell index for spellchecker: external
   [junit4]   2> 1763651 INFO  (searcherExecutor-5444-thread-1-processing-x:collection1) [    x:collection1] o.a.s.h.c.SpellCheckComponent Loading spell index for spellchecker: freq
   [junit4]   2> 1763652 INFO  (coreLoadExecutor-5443-thread-1) [    x:collection1] o.a.s.u.UpdateLog Took 2.0ms to seed version buckets with highest version 1514183428277272576
   [junit4]   2> 1763652 INFO  (coreLoadExecutor-5443-thread-1) [    x:collection1] o.a.s.c.CoreContainer registering core: collection1
   [junit4]   2> 1763652 INFO  (searcherExecutor-5444-thread-1-processing-x:collection1) [    x:collection1] o.a.s.h.c.SpellCheckComponent Loading spell index for spellchecker: fqcn
   [junit4]   2> 1763654 INFO  (SUITE-AutoCommitTest-seed#[C60E3B425E9B57F0]-worker) [    ] o.a.s.SolrTestCaseJ4 ####initCore end
   [junit4]   2> 1763658 INFO  (TEST-AutoCommitTest.testMaxDocs-seed#[C60E3B425E9B57F0]) [    ] o.a.s.SolrTestCaseJ4 ###Starting testMaxDocs
   [junit4]   2> 1763658 INFO  (searcherExecutor-5444-thread-1-processing-x:collection1) [    x:collection1] o.a.s.h.c.SpellCheckComponent Loading spell index for spellchecker: perDict
   [junit4]   2> 1763659 INFO  (searcherExecutor-5444-thread-1-processing-x:collection1) [    x:collection1] o.a.s.c.SolrCore [collection1] Registered new searcher Searcher@2d0420e4[collection1] main{ExitableDirectoryReader(UninvertingDirectoryReader())}
   [junit4]   2> 1763661 INFO  (TEST-AutoCommitTest.testMaxDocs-seed#[C60E3B425E9B57F0]) [    ] o.a.s.u.p.LogUpdateProcessor [collection1] webapp=null path=null params={} {deleteByQuery=*:* (-1514183428286709760)} 0 2
   [junit4]   2> 1763662 INFO  (TEST-AutoCommitTest.testMaxDocs-seed#[C60E3B425E9B57F0]) [    ] o.a.s.c.SolrResourceLoader new SolrResourceLoader for directory: '/export/home/jenkins/workspace/Lucene-Solr-trunk-Solaris/solr/core/src/test-files/solr/collection1/'
   [junit4]   2> 1763663 INFO  (TEST-AutoCommitTest.testMaxDocs-seed#[C60E3B425E9B57F0]) [    ] o.a.s.c.SolrResourceLoader Adding 'file:/export/home/jenkins/workspace/Lucene-Solr-trunk-Solaris/solr/core/src/test-files/solr/collection1/lib/classes/' to classloader
   [junit4]   2> 1763663 INFO  (TEST-AutoCommitTest.testMaxDocs-seed#[C60E3B425E9B57F0]) [    ] o.a.s.c.SolrResourceLoader Adding 'file:/export/home/jenkins/workspace/Lucene-Solr-trunk-Solaris/solr/core/src/test-files/solr/collection1/lib/README' to classloader
   [junit4]   2> 1763691 INFO  (TEST-AutoCommitTest.testMaxDocs-seed#[C60E3B425E9B57F0]) [    ] o.a.s.c.SolrConfig current version of requestparams : -1
   [junit4]   2> 1763704 INFO  (TEST-AutoCommitTest.testMaxDocs-seed#[C60E3B425E9B57F0]) [    ] o.a.s.c.SolrConfig Using Lucene MatchVersion: 6.0.0
   [junit4]   2> 1763727 INFO  (TEST-AutoCommitTest.testMaxDocs-seed#[C60E3B425E9B57F0]) [    ] o.a.s.c.Config Loaded SolrConfig: solrconfig.xml
   [junit4]   2> 1763728 INFO  (TEST-AutoCommitTest.testMaxDocs-seed#[C60E3B425E9B57F0]) [    ] o.a.s.s.IndexSchema Reading Solr Schema from /export/home/jenkins/workspace/Lucene-Solr-trunk-Solaris/solr/core/src/test-files/solr/collection1/conf/schema.xml
   [junit4]   2> 1763733 INFO  (TEST-AutoCommitTest.testMaxDocs-seed#[C60E3B425E9B57F0]) [    ] o.a.s.s.IndexSchema [collection1] Schema name=test
   [junit4]   2> 1763851 INFO  (TEST-AutoCommitTest.testMaxDocs-seed#[C60E3B425E9B57F0]) [    ] o.a.s.s.OpenExchangeRatesOrgProvider Initialized with rates=open-exchange-rates.json, refreshInterval=1440.
   [junit4]   2> 1763858 INFO  (TEST-AutoCommitTest.testMaxDocs-seed#[C60E3B425E9B57F0]) [    ] o.a.s.s.IndexSchema default search field in schema is text
   [junit4]   2> 1763859 INFO  (TEST-AutoCommitTest.testMaxDocs-seed#[C60E3B425E9B57F0]) [    ] o.a.s.s.IndexSchema unique key field: id
   [junit4]   2> 1763863 INFO  (TEST-AutoCommitTest.testMaxDocs-seed#[C60E3B425E9B57F0]) [    ] o.a.s.s.FileExchangeRateProvider Reloading exchange rates from file currency.xml
   [junit4]   2> 1763864 INFO  (TEST-AutoCommitTest.testMaxDocs-seed#[C60E3B425E9B57F0]) [    ] o.a.s.s.FileExchangeRateProvider Reloading exchange rates from file currency.xml
   [junit4]   2> 1763866 INFO  (TEST-AutoCommitTest.testMaxDocs-seed#[C60E3B425E9B57F0]) [    ] o.a.s.s.OpenExchangeRatesOrgProvider Reloading exchange rates from open-exchange-rates.json
   [junit4]   2> 1763866 WARN  (TEST-AutoCommitTest.testMaxDocs-seed#[C60E3B425E9B57F0]) [    ] o.a.s.s.OpenExchangeRatesOrgProvider Unknown key IMPORTANT NOTE
   [junit4]   2> 1763866 WARN  (TEST-AutoCommitTest.testMaxDocs-seed#[C60E3B425E9B57F0]) [    ] o.a.s.s.OpenExchangeRatesOrgProvider Expected key, got STRING
   [junit4]   2> 1763866 INFO  (TEST-AutoCommitTest.testMaxDocs-seed#[C60E3B425E9B57F0]) [    ] o.a.s.s.OpenExchangeRatesOrgProvider Reloading exchange rates from open-exchange-rates.json
   [junit4]   2> 1763866 WARN  (TEST-AutoCommitTest.testMaxDocs-seed#[C60E3B425E9B57F0]) [    ] o.a.s.s.OpenExchangeRatesOrgProvider Unknown key IMPORTANT NOTE
   [junit4]   2> 1763866 WARN  (TEST-AutoCommitTest.testMaxDocs-seed#[C60E3B425E9B57F0]) [    ] o.a.s.s.OpenExchangeRatesOrgProvider Expected key, got STRING
   [junit4]   2> 1763867 INFO  (TEST-AutoCommitTest.testMaxDocs-seed#[C60E3B425E9B57F0]) [    ] o.a.s.c.ConfigSetProperties Did not find ConfigSet properties, assuming default properties: Can't find resource 'configsetprops.json' in classpath or '/export/home/jenkins/workspace/Lucene-Solr-trunk-Solaris/solr/core/src/test-files/solr/collection1/conf'
   [junit4]   2> 1763867 INFO  (TEST-AutoCommitTest.testMaxDocs-seed#[C60E3B425E9B57F0]) [    ] o.a.s.c.CoreContainer Reloading SolrCore 'collection1' using configuration from instancedir /export/home/jenkins/workspace/Lucene-Solr-trunk-Solaris/solr/core/src/test-files/solr/collection1/
   [junit4]   2> 1763867 INFO  (TEST-AutoCommitTest.testMaxDocs-seed#[C60E3B425E9B57F0]) [    x:collection1] o.a.s.c.SolrCore [[collection1] ] Opening new SolrCore at [/export/home/jenkins/workspace/Lucene-Solr-trunk-Solaris/solr/core/src/test-files/solr/collection1/], dataDir=[/export/home/jenkins/workspace/Lucene-Solr-trunk-Solaris/solr/build/solr-core/test/J1/temp/solr.update.AutoCommitTest_C60E3B425E9B57F0-001/init-core-data-001/]
   [junit4]   2> 1763867 INFO  (TEST-AutoCommitTest.testMaxDocs-seed#[C60E3B425E9B57F0]) [    x:collection1] o.a.s.c.JmxMonitoredMap JMX monitoring is enabled. Adding Solr mbeans to JMX Server: com.sun.jmx.mbeanserver.JmxMBeanServer@55ad3782
   [junit4]   2> 1763868 INFO  (TEST-AutoCommitTest.testMaxDocs-seed#[C60E3B425E9B57F0]) [    x:collection1] o.a.s.c.SolrCore New index directory detected: old=null new=/export/home/jenkins/workspace/Lucene-Solr-trunk-Solaris/solr/build/solr-core/test/J1/temp/solr.update.AutoCommitTest_C60E3B425E9B57F0-001/init-core-data-001/index/
   [junit4]   2> 1763869 INFO  (OldIndexDirectoryCleanupThreadForCore-collection1) [    x:collection1] o.a.s.c.SolrCore Looking for old index directories to cleanup for core collection1 in /export/home/jenkins/workspace/Lucene-Solr-trunk-Solaris/solr/build/solr-core/test/J1/temp/solr.update.AutoCommitTest_C60E3B425E9B57F0-001/init-core-data-001/
   [junit4]   2> 1763872 INFO  (TEST-AutoCommitTest.testMaxDocs-seed#[C60E3B425E9B57F0]) [    x:collection1] o.a.s.u.p.UpdateRequestProcessorChain creating updateRequestProcessorChain "dedupe"
   [junit4]   2> 1763872 INFO  (TEST-AutoCommitTest.testMaxDocs-seed#[C60E3B425E9B57F0]) [    x:collection1] o.a.s.u.p.UpdateRequestProcessorChain inserting DistributedUpdateProcessorFactory into updateRequestProcessorChain "dedupe"
   [junit4]   2> 1763872 INFO  (TEST-AutoCommitTest.testMaxDocs-seed#[C60E3B425E9B57F0]) [    x:collection1] o.a.s.u.p.UpdateRequestProcessorChain creating updateRequestProcessorChain "dedupe-allfields"
   [junit4]   2> 1763872 INFO  (TEST-AutoCommitTest.testMaxDocs-seed#[C60E3B425E9B57F0]) [    x:collection1] o.a.s.u.p.UpdateRequestProcessorChain inserting DistributedUpdateProcessorFactory into updateRequestProcessorChain "dedupe-allfields"
   [junit4]   2> 1763872 INFO  (TEST-AutoCommitTest.testMaxDocs-seed#[C60E3B425E9B57F0]) [    x:collection1] o.a.s.u.p.UpdateRequestProcessorChain creating updateRequestProcessorChain "stored_sig"
   [junit4]   2> 1763872 INFO  (TEST-AutoCommitTest.testMaxDocs-seed#[C60E3B425E9B57F0]) [    x:collection1] o.a.s.u.p.UpdateRequestProcessorChain inserting DistributedUpdateProcessorFactory into updateRequestProcessorChain "stored_sig"
   [junit4]   2> 1763872 INFO  (TEST-AutoCommitTest.testMaxDocs-seed#[C60E3B425E9B57F0]) [    x:collection1] o.a.s.u.p.UpdateRequestProcessorChain creating updateRequestProcessorChain "uniq-fields"
   [junit4]   2> 1763872 INFO  (TEST-AutoCommitTest.testMaxDocs-seed#[C60E3B425E9B57F0]) [    x:collection1] o.a.s.u.p.UpdateRequestProcessorChain inserting DistributedUpdateProcessorFactory into updateRequestProcessorChain "uniq-fields"
   [junit4]   2> 1763872 INFO  (TEST-AutoCommitTest.testMaxDocs-seed#[C60E3B425E9B57F0]) [    x:collection1] o.a.s.u.p.UpdateRequestProcessorChain creating updateRequestProcessorChain "distrib-dup-test-chain-explicit"
   [junit4]   2> 1763873 INFO  (TEST-AutoCommitTest.testMaxDocs-seed#[C60E3B425E9B57F0]) [    x:collection1] o.a.s.u.p.UpdateRequestProcessorChain creating updateRequestProcessorChain "distrib-dup-test-chain-implicit"
   [junit4]   2> 1763873 INFO  (TEST-AutoCommitTest.testMaxDocs-seed#[C60E3B425E9B57F0]) [    x:collection1] o.a.s.u.p.UpdateRequestProcessorChain inserting DistributedUpdateProcessorFactory into updateRequestProcessorChain "distrib-dup-test-chain-implicit"
   [junit4]   2> 1763873 INFO  (TEST-AutoCommitTest.testMaxDocs-seed#[C60E3B425E9B57F0]) [    x:collection1] o.a.s.c.SolrCore no updateRequestProcessorChain defined as default, creating implicit default
   [junit4]   2> 1763874 INFO  (TEST-AutoCommitTest.testMaxDocs-seed#[C60E3B425E9B57F0]) [    x:collection1] o.a.s.h.l.XMLLoader xsltCacheLifetimeSeconds=60
   [junit4]   2> 1763876 INFO  (TEST-AutoCommitTest.testMaxDocs-seed#[C60E3B425E9B57F0]) [    x:collection1] o.a.s.h.l.XMLLoader xsltCacheLifetimeSeconds=60
   [junit4]   2> 1763877 INFO  (TEST-AutoCommitTest.testMaxDocs-seed#[C60E3B425E9B57F0]) [    x:collection1] o.a.s.h.l.XMLLoader xsltCacheLifetimeSeconds=60
   [junit4]   2> 1763879 INFO  (TEST-AutoCommitTest.testMaxDocs-seed#[C60E3B425E9B57F0]) [    x:collection1] o.a.s.h.l.XMLLoader xsltCacheLifetimeSeconds=60
   [junit4]   2> 1763883 INFO  (TEST-AutoCommitTest.testMaxDocs-seed#[C60E3B425E9B57F0]) [    x:collection1] o.a.s.c.PluginBag requestHandler : 'lazy' created with startup=lazy 
   [junit4]   2> 1763885 INFO  (TEST-AutoCommitTest.testMaxDocs-seed#[C60E3B425E9B57F0]) [    x:collection1] o.a.s.c.RequestHandlers Registered paths: /admin/mbeans,standard,spellCheckCompRH,lazy,/update/json/docs,/admin/luke,spellCheckWithWordbreak_Direct,tvrh,/get,/admin/properties,/update/json,mltrh,/admin/threads,/search-facet-def,/update/csv,/search-facet-invariants,/admin/segments,spellCheckCompRH1,/mlt,/admin/system,/replication,dismax,defaults,/config,/schema,/admin/plugins,/admin/logging,spellCheckWithWordbreak,mock,/admin/ping,/update,/admin/file,/terms,spellCheckCompRH_Direct,/debug/dump
   [junit4]   2> 1763886 WARN  (TEST-AutoCommitTest.testMaxDocs-seed#[C60E3B425E9B57F0]) [    x:collection1] o.a.s.c.SolrCore solrconfig.xml uses deprecated <admin/gettableFiles>, Please update your config to use the ShowFileRequestHandler.
   [junit4]   2> 1763886 INFO  (TEST-AutoCommitTest.testMaxDocs-seed#[C60E3B425E9B57F0]) [    x:collection1] o.a.s.c.SolrCore Using default statsCache cache: org.apache.solr.search.stats.LocalStatsCache
   [junit4]   2> 1763886 INFO  (TEST-AutoCommitTest.testMaxDocs-seed#[C60E3B425E9B57F0]) [    x:collection1] o.a.s.c.SolrCore Hard AutoCommit: disabled
   [junit4]   2> 1763886 INFO  (TEST-AutoCommitTest.testMaxDocs-seed#[C60E3B425E9B57F0]) [    x:collection1] o.a.s.c.SolrCore Soft AutoCommit: disabled
   [junit4]   2> 1763887 INFO  (TEST-AutoCommitTest.testMaxDocs-seed#[C60E3B425E9B57F0]) [    x:collection1] o.a.s.s.SolrIndexSearcher Opening Searcher@5e7d823e[collection1] main
   [junit4]   2> 1763887 INFO  (TEST-AutoCommitTest.testMaxDocs-seed#[C60E3B425E9B57F0]) [    x:collection1] o.a.s.r.RestManager Initializing RestManager with initArgs: {storageIO=org.apache.solr.rest.ManagedResourceStorage$InMemoryStorageIO}
   [junit4]   2> 1763887 INFO  (TEST-AutoCommitTest.testMaxDocs-seed#[C60E3B425E9B57F0]) [    x:collection1] o.a.s.r.ManagedResourceStorage Reading _rest_managed.json using InMemoryStorage
   [junit4]   2> 1763887 INFO  (TEST-AutoCommitTest.testMaxDocs-seed#[C60E3B425E9B57F0]) [    x:collection1] o.a.s.r.RestManager Initializing 0 registered ManagedResources
   [junit4]   2> 1763887 INFO  (TEST-AutoCommitTest.testMaxDocs-seed#[C60E3B425E9B57F0]) [    x:collection1] o.a.s.h.c.SpellCheckComponent Initializing spell checkers
   [junit4]   2> 1763888 INFO  (TEST-AutoCommitTest.testMaxDocs-seed#[C60E3B425E9B57F0]) [    x:collection1] o.a.s.s.DirectSolrSpellChecker init: {name=direct,classname=DirectSolrSpellChecker,field=lowerfilt,minQueryLength=3}
   [junit4]   2> 1763891 INFO  (TEST-AutoCommitTest.testMaxDocs-seed#[C60E3B425E9B57F0]) [    x:collection1] o.a.s.h.ReplicationHandler Commits will be reserved for  10000
   [junit4]   2> 1763891 INFO  (searcherExecutor-5449-thread-1-processing-x:collection1) [    x:collection1] o.a.s.h.c.SpellCheckComponent Loading spell index for spellchecker: default
   [junit4]   2> 1763892 INFO  (searcherExecutor-5449-thread-1-processing-x:collection1) [    x:collection1] o.a.s.h.c.SpellCheckComponent Loading spell index for spellchecker: direct
   [junit4]   2> 1763892 INFO  (searcherExecutor-5449-thread-1-processing-x:collection1) [    x:collection1] o.a.s.h.c.SpellCheckComponent Loading spell index for spellchecker: wordbreak
   [junit4]   2> 1763892 INFO  (searcherExecutor-5449-thread-1-processing-x:collection1) [    x:collection1] o.a.s.h.c.SpellCheckComponent Loading spell index for spellchecker: multipleFields
   [junit4]   2> 1763893 INFO  (searcherExecutor-5449-thread-1-processing-x:collection1) [    x:collection1] o.a.s.h.c.SpellCheckComponent Loading spell index for spellchecker: jarowinkler
   [junit4]   2> 1763893 INFO  (TEST-AutoCommitTest.testMaxDocs-seed#[C60E3B425E9B57F0]) [    x:collection1] o.a.s.u.UpdateLog Looking up max value of version field to seed version buckets
   [junit4]   2> 1763893 INFO  (TEST-AutoCommitTest.testMaxDocs-seed#[C60E3B425E9B57F0]) [    x:collection1] o.a.s.u.VersionInfo Refreshing highest value of _version_ for 65536 version buckets from index
   [junit4]   2> 1763893 INFO  (TEST-AutoCommitTest.testMaxDocs-seed#[C60E3B425E9B57F0]) [    x:collection1] o.a.s.u.VersionInfo No terms found for _version_, cannot seed version bucket highest value from index
   [junit4]   2> 1763894 INFO  (searcherExecutor-5449-thread-1-processing-x:collection1) [    x:collection1] o.a.s.h.c.SpellCheckComponent Loading spell index for spellchecker: external
   [junit4]   2> 1763894 INFO  (searcherExecutor-5449-thread-1-processing-x:collection1) [    x:collection1] o.a.s.h.c.SpellCheckComponent Loading spell index for spellchecker: freq
   [junit4]   2> 1763894 INFO  (searcherExecutor-5449-thread-1-processing-x:collection1) [    x:collection1] o.a.s.h.c.SpellCheckComponent Loading spell index for spellchecker: fqcn
   [junit4]   2> 1763895 INFO  (searcherExecutor-5449-thread-1-processing-x:collection1) [    x:collection1] o.a.s.h.c.SpellCheckComponent Loading spell index for spellchecker: perDict
   [junit4]   2> 1763896 INFO  (TEST-AutoCommitTest.testMaxDocs-seed#[C60E3B425E9B57F0]) [    x:collection1] o.a.s.u.UpdateLog Took 2.0ms to seed version buckets with highest version 1514183428286709760
   [junit4]   2> 1763896 INFO  (searcherExecutor-5449-thread-1-processing-x:collection1) [    x:collection1] o.a.s.c.SolrCore [collection1] Registered new searcher Searcher@5e7d823e[collection1] main{ExitableDirectoryReader(UninvertingDirectoryReader())}
   [junit4]   2> 1763896 INFO  (TEST-AutoCommitTest.testMaxDocs-seed#[C60E3B425E9B57F0]) [    x:collection1] o.a.s.u.DefaultSolrCoreState Closing old IndexWriter... core=collection1
   [junit4]   2> 1763896 INFO  (TEST-AutoCommitTest.testMaxDocs-seed#[C60E3B425E9B57F0]) [    x:collection1] o.a.s.u.RandomMergePolicy RandomMergePolicy wrapping class org.apache.lucene.index.LogByteSizeMergePolicy: [LogByteSizeMergePolicy: minMergeSize=1677721, mergeFactor=2, maxMergeSize=2147483648, maxMergeSizeForForcedMerge=9223372036854775807, calibrateSizeByDeletes=true, maxMergeDocs=2147483647, maxCFSSegmentSizeMB=8.796093022207999E12, noCFSRatio=1.0]
   [junit4]   2> 1763897 INFO  (TEST-AutoCommitTest.testMaxDocs-seed#[C60E3B425E9B57F0]) [    x:collection1] o.a.s.c.SolrCore SolrDeletionPolicy.onInit: commits: num=1
   [junit4]   2> 	commit{dir=MockDirectoryWrapper(RAMDirectory@49de5e36 lockFactory=org.apache.lucene.store.SingleInstanceLockFactory@3a6ed236),segFN=segments_1,generation=1}
   [junit4]   2> 1763897 INFO  (TEST-AutoCommitTest.testMaxDocs-seed#[C60E3B425E9B57F0]) [    x:collection1] o.a.s.c.SolrCore newest commit generation = 1
   [junit4]   2> 1763897 INFO  (TEST-AutoCommitTest.testMaxDocs-seed#[C60E3B425E9B57F0]) [    x:collection1] o.a.s.u.DefaultSolrCoreState New IndexWriter is ready to be used.
   [junit4]   2> 1763898 INFO  (TEST-AutoCommitTest.testMaxDocs-seed#[C60E3B425E9B57F0]) [    x:collection1] o.a.s.s.SolrIndexSearcher Opening Searcher@28eeebc1[collection1] main
   [junit4]   2> 1763898 INFO  (TEST-AutoCommitTest.testMaxDocs-seed#[C60E3B425E9B57F0]) [    x:collection1] o.a.s.c.CoreContainer replacing core: collection1
   [junit4]   2> 1763898 INFO  (TEST-AutoCommitTest.testMaxDocs-seed#[C60E3B425E9B57F0]) [    x:collection1] o.a.s.c.SolrCore [collection1]  CLOSING SolrCore org.apache.solr.core.SolrCore@7610adc4
   [junit4]   2> 1763898 INFO  (TEST-AutoCommitTest.testMaxDocs-seed#[C60E3B425E9B57F0]) [    x:collection1] o.a.s.u.UpdateHandler closing DirectUpdateHandler2{commits=0,autocommits=0,soft autocommits=0,optimizes=0,rollbacks=0,expungeDeletes=0,docsPending=0,adds=0,deletesById=0,deletesByQuery=1,errors=0,cumulative_adds=0,cumulative_deletesById=0,cumulative_deletesByQuery=1,cumulative_errors=0,transaction_logs_total_size=0,transaction_logs_total_number=0}
   [junit4]   2> 1763898 INFO  (TEST-AutoCommitTest.testMaxDocs-seed#[C60E3B425E9B57F0]) [    x:collection1] o.a.s.c.SolrCore [collection1] Closing main searcher on request.
   [junit4]   2> 1763898 INFO  (searcherExecutor-5449-thread-1-processing-x:collection1) [    x:collection1] o.a.s.c.SolrCore [collection1] Registered new searcher Searcher@28eeebc1[collection1] main{ExitableDirectoryReader(UninvertingDirectoryReader())}
   [junit4]   2> 1763911 INFO  (TEST-AutoCommitTest.testMaxDocs-seed#[C60E3B425E9B57F0]) [    x:collection1] o.a.s.u.p.LogUpdateProcessor [collection1] {add=[0 (1514183428549902336)]} 0 1
   [junit4]   2> 1763914 INFO  (TEST-AutoCommitTest.testMaxDocs-seed#[C60E3B425E9B57F0]) [    x:collection1] o.a.s.u.p.LogUpdateProcessor [collection1] {add=[1 (1514183428551999488)]} 0 3
   [junit4]   2> 1763914 INFO  (TEST-AutoCommitTest.testMaxDocs-seed#[C60E3B425E9B57F0]) [    x:collection1] o.a.s.u.p.LogUpdateProcessor [collection1] {add=[2 (1514183428554096640)]} 0 4
   [junit4]   2> 1763914 INFO  (TEST-AutoCommitTest.testMaxDocs-seed#[C60E3B425E9B57F0]) [    x:collection1] o.a.s.u.p.LogUpdateProcessor [collection1] {add=[3 (1514183428554096641)]} 0 4
   [junit4]   2> 1763917 INFO  (TEST-AutoCommitTest.testMaxDocs-seed#[C60E3B425E9B57F0]) [    x:collection1] o.a.s.u.p.LogUpdateProcessor [collection1] {add=[4 (1514183428557242368)]} 0 7
   [junit4]   2> 1763917 INFO  (TEST-AutoCommitTest.testMaxDocs-seed#[C60E3B425E9B57F0]) [    x:collection1] o.a.s.u.p.LogUpdateProcessor [collection1] {add=[5 (1514183428557242369)]} 0 7
   [junit4]   2> 1763918 INFO  (TEST-AutoCommitTest.testMaxDocs-seed#[C60E3B425E9B57F0]) [    x:collection1] o.a.s.u.p.LogUpdateProcessor [collection1] {add=[6 (1514183428558290944)]} 0 7
   [junit4]   2> 1763918 INFO  (TEST-AutoCommitTest.testMaxDocs-seed#[C60E3B425E9B57F0]) [    x:collection1] o.a.s.u.p.LogUpdateProcessor [collection1] {add=[7 (1514183428558290945)]} 0 7
   [junit4]   2> 1763918 INFO  (TEST-AutoCommitTest.testMaxDocs-seed#[C60E3B425E9B57F0]) [    x:collection1] o.a.s.u.p.LogUpdateProcessor [collection1] {add=[8 (1514183428558290946)]} 0 8
   [junit4]   2> 1763918 INFO  (TEST-AutoCommitTest.testMaxDocs-seed#[C60E3B425E9B57F0]) [    x:collection1] o.a.s.u.p.LogUpdateProcessor [collection1] {add=[9 (1514183428558290947)]} 0 8
   [junit4]   2> 1763919 INFO  (TEST-AutoCommitTest.testMaxDocs-seed#[C60E3B425E9B57F0]) [    x:collection1] o.a.s.u.p.LogUpdateProcessor [collection1] {add=[10 (1514183428559339520)]} 0 8
   [junit4]   2> 1763919 INFO  (TEST-AutoCommitTest.testMaxDocs-seed#[C60E3B425E9B57F0]) [    x:collection1] o.a.s.u.p.LogUpdateProcessor [collection1] {add=[11 (1514183428559339521)]} 0 8
   [junit4]   2> 1763919 INFO  (TEST-AutoCommitTest.testMaxDocs-seed#[C60E3B425E9B57F0]) [    x:collection1] o.a.s.u.p.LogUpdateProcessor [collection1] {add=[12 (1514183428559339522)]} 0 9
   [junit4]   2> 1763919 INFO  (TEST-AutoCommitTest.testMaxDocs-seed#[C60E3B425E9B57F0]) [    x:collection1] o.a.s.u.p.LogUpdateProcessor [collection1] {add=[13 (1514183428559339523)]} 0 9
   [junit4]   2> 1763920 INFO  (TEST-AutoCommitTest.testMaxDocs-seed#[C60E3B425E9B57F0]) [    x:collection1] o.a.s.c.S.Request [collection1] webapp=null path=null params={q=id:1&qt=standard&start=0&rows=20&version=2.2} hits=0 status=0 QTime=1 
   [junit4]   2> 1763922 INFO  (TEST-AutoCommitTest.testMaxDocs-seed#[C60E3B425E9B57F0]) [    x:collection1] o.a.s.u.p.LogUpdateProcessor [collection1] {add=[14 (1514183428561436672)]} 0 12
   [junit4]   2> 1763927 INFO  (commitScheduler-5452-thread-1) [    x:collection1] o.a.s.u.UpdateHandler start commit{,optimize=false,openSearcher=true,waitSearcher=true,expungeDeletes=false,softCommit=true,prepareCommit=false}
   [junit4]   2> 1763936 INFO  (commitScheduler-5452-thread-1) [    x:collection1] o.a.s.s.SolrIndexSearcher Opening Searcher@5ebb9d9c[collection1] main
   [junit4]   2> 1763937 INFO  (commitScheduler-5452-thread-1) [    x:collection1] o.a.s.u.UpdateHandler end_commit_flush
   [junit4]   2> 1763938 INFO  (searcherExecutor-5449-thread-1-processing-x:collection1) [    x:collection1] o.a.s.c.SolrCore [collection1] Registered new searcher Searcher@5ebb9d9c[collection1] main{ExitableDirectoryReader(UninvertingDirectoryReader(Uninverting(_0(6.0.0):C15)))}
   [junit4]   2> 1764174 INFO  (TEST-AutoCommitTest.testMaxDocs-seed#[C60E3B425E9B57F0]) [    x:collection1] o.a.s.u.p.LogUpdateProcessor [collection1] {add=[15 (1514183428825677824)]} 0 264
   [junit4]   2> 1764174 INFO  (TEST-AutoCommitTest.testMaxDocs-seed#[C60E3B425E9B57F0]) [    x:collection1] o.a.s.c.S.Request [collection1] webapp=null path=null params={q=id:14&qt=standard&start=0&rows=20&version=2.2} hits=1 status=0 QTime=0 
   [junit4]   2> 1764175 INFO  (TEST-AutoCommitTest.testMaxDocs-seed#[C60E3B425E9B57F0]) [    x:collection1] o.a.s.c.S.Request [collection1] webapp=null path=null params={q=id:15&qt=standard&start=0&rows=20&version=2.2} hits=0 status=0 QTime=0 
   [junit4]   2> 1764175 INFO  (TEST-AutoCommitTest.testMaxDocs-seed#[C60E3B425E9B57F0]) [    x:collection1] o.a.s.SolrTestCaseJ4 ###Ending testMaxDocs
   [junit4]   2> 1764179 INFO  (TEST-AutoCommitTest.testCommitWithin-seed#[C60E3B425E9B57F0]) [    x:collection1] o.a.s.SolrTestCaseJ4 ###Starting testCommitWithin
   [junit4]   2> 1764184 INFO  (TEST-AutoCommitTest.testCommitWithin-seed#[C60E3B425E9B57F0]) [    x:collection1] o.a.s.s.SolrIndexSearcher Opening Searcher@63b05d7b[collection1] realtime
   [junit4]   2> 1764185 INFO  (TEST-AutoCommitTest.testCommitWithin-seed#[C60E3B425E9B57F0]) [    x:collection1] o.a.s.u.p.LogUpdateProcessor [collection1] webapp=null path=null params={} {deleteByQuery=*:* (-1514183428831969280)} 0 5
   [junit4]   2> 1764185 INFO  (TEST-AutoCommitTest.testCommitWithin-seed#[C60E3B425E9B57F0]) [    x:collection1] o.a.s.c.SolrResourceLoader new SolrResourceLoader for directory: '/export/home/jenkins/workspace/Lucene-Solr-trunk-Solaris/solr/core/src/test-files/solr/collection1/'
   [junit4]   2> 1764185 INFO  (TEST-AutoCommitTest.testCommitWithin-seed#[C60E3B425E9B57F0]) [    x:collection1] o.a.s.c.SolrResourceLoader Adding 'file:/export/home/jenkins/workspace/Lucene-Solr-trunk-Solaris/solr/core/src/test-files/solr/collection1/lib/classes/' to classloader
   [junit4]   2> 1764185 INFO  (TEST-AutoCommitTest.testCommitWithin-seed#[C60E3B425E9B57F0]) [    x:collection1] o.a.s.c.SolrResourceLoader Adding 'file:/export/home/jenkins/workspace/Lucene-Solr-trunk-Solaris/solr/core/src/test-files/solr/collection1/lib/README' to classloader
   [junit4]   2> 1764202 INFO  (TEST-AutoCommitTest.testCommitWithin-seed#[C60E3B425E9B57F0]) [    x:collection1] o.a.s.c.SolrConfig current version of requestparams : -1
   [junit4]   2> 1764214 INFO  (TEST-AutoCommitTest.testCommitWithin-seed#[C60E3B425E9B57F0]) [    x:collection1] o.a.s.c.SolrConfig Using Lucene MatchVersion: 6.0.0
   [junit4]   2> 1764258 INFO  (TEST-AutoCommitTest.testCommitWithin-seed#[C60E3B425E9B57F0]) [    x:collection1] o.a.s.c.Config Loaded SolrConfig: solrconfig.xml
   [junit4]   2> 1764258 INFO  (TEST-AutoCommitTest.testCommitWithin-seed#[C60E3B425E9B57F0]) [    x:collection1] o.a.s.s.IndexSchema Reading Solr Schema from /export/home/jenkins/workspace/Lucene-Solr-trunk-Solaris/solr/core/src/test-files/solr/collection1/conf/schema.xml
   [junit4]   2> 1764262 INFO  (TEST-AutoCommitTest.testCommitWithin-seed#[C60E3B425E9B57F0]) [    x:collection1] o.a.s.s.IndexSchema [collection1] Schema name=test
   [junit4]   2> 1764351 INFO  (TEST-AutoCommitTest.testCommitWithin-seed#[C60E3B425E9B57F0]) [    x:collection1] o.a.s.s.OpenExchangeRatesOrgProvider Initialized with rates=open-exchange-rates.json, refreshInterval=1440.
   [junit4]   2> 1764371 INFO  (TEST-AutoCommitTest.testCommitWithin-seed#[C60E3B425E9B57F0]) [    x:collection1] o.a.s.s.IndexSchema default search field in schema is text
   [junit4]   2> 1764373 INFO  (TEST-AutoCommitTest.testCommitWithin-seed#[C60E3B425E9B57F0]) [    x:collection1] o.a.s.s.IndexSchema unique key field: id
   [junit4]   2> 1764376 INFO  (TEST-AutoCommitTest.testCommitWithin-seed#[C60E3B425E9B57F0]) [    x:collection1] o.a.s.s.FileExchangeRateProvider Reloading exchange rates from file currency.xml
   [junit4]   2> 1764378 INFO  (TEST-AutoCommitTest.testCommitWithin-seed#[C60E3B425E9B57F0]) [    x:collection1] o.a.s.s.FileExchangeRateProvider Reloading exchange rates from file currency.xml
   [junit4]   2> 1764380 INFO  (TEST-AutoCommitTest.testCommitWithin-seed#[C60E3B425E9B57F0]) [    x:collection1] o.a.s.s.OpenExchangeRatesOrgProvider Reloading exchange rates from open-exchange-rates.json
   [junit4]   2> 1764380 WARN  (TEST-AutoCommitTest.testCommitWithin-seed#[C60E3B425E9B57F0]) [    x:collection1] o.a.s.s.OpenExchangeRatesOrgProvider Unknown key IMPORTANT NOTE
   [junit4]   2> 1764380 WARN  (TEST-AutoCommitTest.testCommitWithin-seed#[C60E3B425E9B57F0]) [    x:collection1] o.a.s.s.OpenExchangeRatesOrgProvider Expected key, got STRING
   [junit4]   2> 1764380 INFO  (TEST-AutoCommitTest.testCommitWithin-seed#[C60E3B425E9B57F0]) [    x:collection1] o.a.s.s.OpenExchangeRatesOrgProvider Reloading exchange rates from open-exchange-rates.json
   [junit4]   2> 1764380 WARN  (TEST-AutoCommitTest.testCommitWithin-seed#[C60E3B425E9B57F0]) [    x:collection1] o.a.s.s.OpenExchangeRatesOrgProvider Unknown key IMPORTANT NOTE
   [junit4]   2> 1764380 WARN  (TEST-AutoCommitTest.testCommitWithin-seed#[C60E3B425E9B57F0]) [    x:collection1] o.a.s.s.OpenExchangeRatesOrgProvider Expected key, got STRING
   [junit4]   2> 1764381 INFO  (TEST-AutoCommitTest.testCommitWithin-seed#[C60E3B425E9B57F0]) [    x:collection1] o.a.s.c.ConfigSetProperties Did not find ConfigSet properties, assuming default properties: Can't find resource 'configsetprops.json' in classpath or '/export/home/jenkins/workspace/Lucene-Solr-trunk-Solaris/solr/core/src/test-files/solr/collection1/conf'
   [junit4]   2> 1764381 INFO  (TEST-AutoCommitTest.testCommitWithin-seed#[C60E3B425E9B57F0]) [    x:collection1] o.a.s.c.CoreContainer Reloading SolrCore 'collection1' using configuration from instancedir /export/home/jenkins/workspace/Lucene-Solr-trunk-Solaris/solr/core/src/test-files/solr/collection1/
   [junit4]   2> 1764381 INFO  (TEST-AutoCommitTest.testCommitWithin-seed#[C60E3B425E9B57F0]) [    x:collection1] o.a.s.c.SolrCore [[collection1] ] Opening new SolrCore at [/export/home/jenkins/workspace/Lucene-Solr-trunk-Solaris/solr/core/src/test-files/solr/collection1/], dataDir=[/export/home/jenkins/workspace/Lucene-Solr-trunk-Solaris/solr/build/solr-core/test/J1/temp/solr.update.AutoCommitTest_C60E3B425E9B57F0-001/init-core-data-001/]
   [junit4]   2> 1764381 INFO  (TEST-AutoCommitTest.testCommitWithin-seed#[C60E3B425E9B57F0]) [    x:collection1] o.a.s.c.JmxMonitoredMap JMX monitoring is enabled. Adding Solr mbeans to JMX Server: com.sun.jmx.mbeanserver.JmxMBeanServer@55ad3782
   [junit4]   2> 1764382 INFO  (TEST-AutoCommitTest.testCommitWithin-seed#[C60E3B425E9B57F0]) [    x:collection1] o.a.s.c.SolrCore New index directory detected: old=null new=/export/home/jenkins/workspace/Lucene-Solr-trunk-Solaris/solr/build/solr-core/test/J1/temp/solr.update.AutoCommitTest_C60E3B425E9B57F0-001/init-core-data-001/index/
   [junit4]   2> 1764382 INFO  (OldIndexDirectoryCleanupThreadForCore-collection1) [    x:collection1] o.a.s.c.SolrCore Looking for old index directories to cleanup for core collection1 in /export/home/jenkins/workspace/Lucene-Solr-trunk-Solaris/solr/build/solr-core/test/J1/temp/solr.update.AutoCommitTest_C60E3B425E9B57F0-001/init-core-data-001/
   [junit4]   2> 1764386 INFO  (TEST-AutoCommitTest.testCommitWithin-seed#[C60E3B425E9B57F0]) [    x:collection1] o.a.s.u.p.UpdateRequestProcessorChain creating updateRequestProcessorChain "dedupe"
   [junit4]   2> 1764386 INFO  (TEST-AutoCommitTest.testCommitWithin-seed#[C60E3B425E9B57F0]) [    x:collection1] o.a.s.u.p.UpdateRequestProcessorChain inserting DistributedUpdateProcessorFactory into updateRequestProcessorChain "dedupe"
   [junit4]   2> 1764386 INFO  (TEST-AutoCommitTest.testCommitWithin-seed#[C60E3B425E9B57F0]) [    x:collection1] o.a.s.u.p.UpdateRequestProcessorChain creating updateRequestProcessorChain "dedupe-allfields"
   [junit4]   2> 1764386 INFO  (TEST-AutoCommitTest.testCommitWithin-seed#[C60E3B425E9B57F0]) [    x:collection1] o.a.s.u.p.UpdateRequestProcessorChain inserting DistributedUpdateProcessorFactory into updateRequestProcessorChain "dedupe-allfields"
   [junit4]   2> 1764387 INFO  (TEST-AutoCommitTest.testCommitWithin-seed#[C60E3B425E9B57F0]) [    x:collection1] o.a.s.u.p.UpdateRequestProcessorChain creating updateRequestProcessorChain "stored_sig"
   [junit4]   2> 1764387 INFO  (TEST-AutoCommitTest.testCommitWithin-seed#[C60E3B425E9B57F0]) [    x:collection1] o.a.s.u.p.UpdateRequestProcessorChain inserting DistributedUpdateProcessorFactory into updateRequestProcessorChain "stored_sig"
   [junit4]   2> 1764387 INFO  (TEST-AutoCommitTest.testCommitWithin-seed#[C60E3B425E9B57F0]) [    x:collection1] o.a.s.u.p.UpdateRequestProcessorChain creating updateRequestProcessorChain "uniq-fields"
   [junit4]   2> 1764387 INFO  (TEST-AutoCommitTest.testCommitWithin-seed#[C60E3B425E9B57F0]) [    x:collection1] o.a.s.u.p.UpdateRequestProcessorChain inserting DistributedUpdateProcessorFactory into updateRequestProcessorChain "uniq-fields"
   [junit4]   2> 1764387 INFO  (TEST-AutoCommitTest.testCommitWithin-seed#[C60E3B425E9B57F0]) [    x:collection1] o.a.s.u.p.UpdateRequestProcessorChain creating updateRequestProcessorChain "distrib-dup-test-chain-explicit"
   [junit4]   2> 1764387 INFO  (TEST-AutoCommitTest.testCommitWithin-seed#[C60E3B425E9B57F0]) [    x:collection1] o.a.s.u.p.UpdateRequestProcessorChain creating updateRequestProcessorChain "distrib-dup-test-chain-implicit"
   [junit4]   2> 1764387 INFO  (TEST-AutoCommitTest.testCommitWithin-seed#[C60E3B425E9B57F0]) [    x:collection1] o.a.s.u.p.UpdateRequestProcessorChain inserting DistributedUpdateProcessorFactory into updateRequestProcessorChain "distrib-dup-test-chain-implicit"
   [junit4]   2> 1764387 INFO  (TEST-AutoCommitTest.testCommitWithin-seed#[C60E3B425E9B57F0]) [    x:collection1] o.a.s.c.SolrCore no updateRequestProcessorChain defined as default, creating implicit default
   [junit4]   2> 1764388 INFO  (TEST-AutoCommitTest.testCommitWithin-seed#[C60E3B425E9B57F0]) [    x:collection1] o.a.s.h.l.XMLLoader xsltCacheLifetimeSeconds=60
   [junit4]   2> 1764389 INFO  (TEST-AutoCommitTest.testCommitWithin-seed#[C60E3B425E9B57F0]) [    x:collection1] o.a.s.h.l.XMLLoader xsltCacheLifetimeSeconds=60
   [junit4]   2> 1764391 INFO  (TEST-AutoCommitTest.testCommitWithin-seed#[C60E3B425E9B57F0]) [    x:collection1] o.a.s.h.l.XMLLoader xsltCacheLifetimeSeconds=60
   [junit4]   2> 1764392 INFO  (TEST-AutoCommitTest.testCommitWithin-seed#[C60E3B425E9B57F0]) [    x:collection1] o.a.s.h.l.XMLLoader xsltCacheLifetimeSeconds=60
   [junit4]   2> 1764397 INFO  (TEST-AutoCommitTest.testCommitWithin-seed#[C60E3B425E9B57F0]) [    x:collection1] o.a.s.c.PluginBag requestHandler : 'lazy' created with startup=lazy 
   [junit4]   2> 1764399 INFO  (TEST-AutoCommitTest.testCommitWithin-seed#[C60E3B425E9B57F0]) [    x:collection1] o.a.s.c.RequestHandlers Registered paths: /admin/mbeans,standard,spellCheckCompRH,lazy,/update/json/docs,/admin/luke,spellCheckWithWordbreak_Direct,tvrh,/get,/admin/properties,/update/json,mltrh,/admin/threads,/search-facet-def,/update/csv,/search-facet-invariants,/admin/segments,spellCheckCompRH1,/mlt,/admin/system,/replication,dismax,defaults,/config,/schema,/admin/plugins,/admin/logging,spellCheckWithWordbreak,mock,/admin/ping,/update,/admin/file,/terms,spellCheckCompRH_Direct,/debug/dump
   [junit4]   2> 1764399 WARN  (TEST-AutoCommitTest.testCommitWithin-seed#[C60E3B425E9B57F0]) [    x:collection1] o.a.s.c.SolrCore solrconfig.xml uses deprecated <admin/gettableFiles>, Please update your config to use the ShowFileRequestHandler.
   [junit4]   2> 1764400 INFO  (TEST-AutoCommitTest.testCommitWithin-seed#[C60E3B425E9B57F0]) [    x:collection1] o.a.s.c.SolrCore Using default statsCache cache: org.apache.solr.search.stats.LocalStatsCache
   [junit4]   2> 1764400 INFO  (TEST-AutoCommitTest.testCommitWithin-seed#[C60E3B425E9B57F0]) [    x:collection1] o.a.s.c.SolrCore Hard AutoCommit: disabled
   [junit4]   2> 1764400 INFO  (TEST-AutoCommitTest.testCommitWithin-seed#[C60E3B425E9B57F0]) [    x:collection1] o.a.s.c.SolrCore Soft AutoCommit: disabled
   [junit4]   2> 1764400 INFO  (TEST-AutoCommitTest.testCommitWithin-seed#[C60E3B425E9B57F0]) [    x:collection1] o.a.s.s.SolrIndexSearcher Opening Searcher@5ec1f042[collection1] main
   [junit4]   2> 1764401 INFO  (TEST-AutoCommitTest.testCommitWithin-seed#[C60E3B425E9B57F0]) [    x:collection1] o.a.s.r.RestManager Initializing RestManager with initArgs: {storageIO=org.apache.solr.rest.ManagedResourceStorage$InMemoryStorageIO}
   [junit4]   2> 1764401 INFO  (TEST-AutoCommitTest.testCommitWithin-seed#[C60E3B425E9B57F0]) [    x:collection1] o.a.s.r.ManagedResourceStorage Reading _rest_managed.json using InMemoryStorage
   [junit4]   2> 1764401 INFO  (TEST-AutoCommitTest.testCommitWithin-seed#[C60E3B425E9B57F0]) [    x:collection1] o.a.s.r.RestManager Initializing 0 registered ManagedResources
   [junit4]   2> 1764401 INFO  (TEST-AutoCommitTest.testCommitWithin-seed#[C60E3B425E9B57F0]) [    x:collection1] o.a.s.h.c.SpellCheckComponent Initializing spell checkers
   [junit4]   2> 1764401 INFO  (TEST-AutoCommitTest.testCommitWithin-seed#[C60E3B425E9B57F0]) [    x:collection1] o.a.s.s.DirectSolrSpellChecker init: {name=direct,classname=DirectSolrSpellChecker,field=lowerfilt,minQueryLength=3}
   [junit4]   2> 1764417 INFO  (TEST-AutoCommitTest.testCommitWithin-seed#[C60E3B425E9B57F0]) [    x:collection1] o.a.s.h.ReplicationHandler Commits will be reserved for  10000
   [junit4]   2> 1764417 INFO  (searcherExecutor-5453-thread-1-processing-x:collection1) [    x:collection1] o.a.s.h.c.SpellCheckComponent Loading spell index for spellchecker: default
   [junit4]   2> 1764417 INFO  (searcherExecutor-5453-thread-1-processing-x:collection1) [    x:collection1] o.a.s.h.c.SpellCheckComponent Loading spell index for spellchecker: direct
   [junit4]   2> 1764417 INFO  (searcherExecutor-5453-thread-1-processing-x:collection1) [    x:collection1] o.a.s.h.c.SpellCheckComponent Loading spell index for spellchecker: wordbreak
   [junit4]   2> 1764417 INFO  (searcherExecutor-5453-thread-1-processing-x:collection1) [    x:collection1] o.a.s.h.c.SpellCheckComponent Loading spell index for spellchecker: multipleFields
   [junit4]   2> 1764419 INFO  (searcherExecutor-5453-thread-1-processing-x:collection1) [    x:collection1] o.a.s.h.c.SpellCheckComponent Loading spell index for spellchecker: jarowinkler
   [junit4]   2> 1764420 INFO  (searcherExecutor-5453-thread-1-processing-x:collection1) [    x:collection1] o.a.s.h.c.SpellCheckComponent Loading spell index for spellchecker: external
   [junit4]   2> 1764421 INFO  (searcherExecutor-5453-thread-1-processing-x:collection1) [    x:collection1] o.a.s.h.c.SpellCheckComponent Loading spell index for spellchecker: freq
   [junit4]   2> 1764421 INFO  (searcherExecutor-5453-thread-1-processing-x:collection1) [    x:collection1] o.a.s.h.c.SpellCheckComponent Loading spell index for spellchecker: fqcn
   [junit4]   2> 1764422 INFO  (searcherExecutor-5453-thread-1-processing-x:collection1) [    x:collection1] o.a.s.h.c.SpellCheckComponent Loading spell index for spellchecker: perDict
   [junit4]   2> 1764425 INFO  (TEST-AutoCommitTest.testCommitWithin-seed#[C60E3B425E9B57F0]) [    x:collection1] o.a.s.u.UpdateLog Looking up max value of version field to seed version buckets
   [junit4]   2> 1764425 INFO  (TEST-AutoCommitTest.testCommitWithin-seed#[C60E3B425E9B57F0]) [    x:collection1] o.a.s.u.VersionInfo Refreshing highest value of _version_ for 65536 version buckets from index
   [junit4]   2> 1764425 INFO  (TEST-AutoCommitTest.testCommitWithin-seed#[C60E3B425E9B57F0]) [    x:collection1] o.a.s.u.VersionInfo No terms found for _version_, cannot seed version bucket highest value from index
   [junit4]   2> 1764429 INFO  (TEST-AutoCommitTest.testCommitWithin-seed#[C60E3B425E9B57F0]) [    x:collection1] o.a.s.u.UpdateLog Took 3.0ms to seed version buckets with highest version 1514183428831969280
   [junit4]   2> 1764429 INFO  (TEST-AutoCommitTest.testCommitWithin-seed#[C60E3B425E9B57F0]) [    x:collection1] o.a.s.u.DefaultSolrCoreState Closing old IndexWriter... core=collection1
   [junit4]   2> 1764429 INFO  (TEST-AutoCommitTest.testCommitWithin-seed#[C60E3B425E9B57F0]) [    x:collection1] o.a.s.c.SolrCore SolrDeletionPolicy.onCommit: commits: num=2
   [junit4]   2> 	commit{dir=MockDirectoryWrapper(RAMDirectory@49de5e36 lockFactory=org.apache.lucene.store.SingleInstanceLockFactory@3a6ed236),segFN=segments_1,generation=1}
   [junit4]   2> 	commit{dir=MockDirectoryWrapper(RAMDirectory@49de5e36 lockFactory=org.apache.lucene.store.SingleInstanceLockFactory@3a6ed236),segFN=segments_2,generation=2}
   [junit4]   2> 1764429 INFO  (TEST-AutoCommitTest.testCommitWithin-seed#[C60E3B425E9B57F0]) [    x:collection1] o.a.s.c.SolrCore newest commit generation = 2
   [junit4]   2> 1764430 INFO  (searcherExecutor-5453-thread-1-processing-x:collection1) [    x:collection1] o.a.s.c.SolrCore [collection1] Registered new searcher Searcher@5ec1f042[collection1] main{ExitableDirectoryReader(UninvertingDirectoryReader())}
   [junit4]   2> 1764430 INFO  (TEST-AutoCommitTest.testCommitWithin-seed#[C60E3B425E9B57F0]) [    x:collection1] o.a.s.u.RandomMergePolicy RandomMergePolicy wrapping class org.apache.lucene.index.LogDocMergePolicy: [LogDocMergePolicy: minMergeSize=1000, mergeFactor=23, maxMergeSize=9223372036854775807, maxMergeSizeForForcedMerge=9223372036854775807, calibrateSizeByDeletes=true, maxMergeDocs=2147483647, maxCFSSegmentSizeMB=8.796093022207999E12, noCFSRatio=0.21782461085914565]
   [junit4]   2> 1764431 INFO  (TEST-AutoCommitTest.testCommitWithin-seed#[C60E3B425E9B57F0]) [    x:collection1] o.a.s.c.SolrCore SolrDeletionPolicy.onInit: commits: num=1
   [junit4]   2> 	commit{dir=MockDirectoryWrapper(RAMDirectory@49de5e36 lockFactory=org.apache.lucene.store.SingleInstanceLockFactory@3a6ed236),segFN=segments_2,generation=2}
   [junit4]   2> 1764433 INFO  (TEST-AutoCommitTest.testCommitWithin-seed#[C60E3B425E9B57F0]) [    x:collection1] o.a.s.c.SolrCore newest commit generation = 2
   [junit4]   2> 1764433 INFO  (TEST-AutoCommitTest.testCommitWithin-seed#[C60E3B425E9B57F0]) [    x:collection1] o.a.s.u.DefaultSolrCoreState New IndexWriter is ready to be used.
   [junit4]   2> 1764433 INFO  (TEST-AutoCommitTest.testCommitWithin-seed#[C60E3B425E9B57F0]) [    x:collection1] o.a.s.s.SolrIndexSearcher Opening Searcher@5d5b7e17[collection1] main
   [junit4]   2> 1764433 INFO  (TEST-AutoCommitTest.testCommitWithin-seed#[C60E3B425E9B57F0]) [    x:collection1] o.a.s.c.CoreContainer replacing core: collection1
   [junit4]   2> 1764433 INFO  (TEST-AutoCommitTest.testCommitWithin-seed#[C60E3B425E9B57F0]) [    x:collection1] o.a.s.c.SolrCore [collection1]  CLOSING SolrCore org.apache.solr.core.SolrCore@5877f7c2
   [junit4]   2> 1764433 INFO  (TEST-AutoCommitTest.testCommitWithin-seed#[C60E3B425E9B57F0]) [    x:collection1] o.a.s.u.UpdateHandler closing DirectUpdateHandler2{commits=1,autocommits=0,soft autocommit maxDocs=14,soft autocommits=1,optimizes=0,rollbacks=0,expungeDeletes=0,docsPending=16,adds=1,deletesById=0,deletesByQuery=1,errors=0,cumulative_adds=16,cumulative_deletesById=0,cumulative_deletesByQuery=1,cumulative_errors=0,transaction_logs_total_size=0,transaction_logs_total_number=0}
   [junit4]   2> 1764434 INFO  (TEST-AutoCommitTest.testCommitWithin-seed#[C60E3B425E9B57F0]) [    x:collection1] o.a.s.c.SolrCore [collection1] Closing main searcher on request.
   [junit4]   2> 1764443 INFO  (searcherExecutor-5453-thread-1-processing-x:collection1) [    x:collection1] o.a.s.c.SolrCore [collection1] Registered new searcher Searcher@5d5b7e17[collection1] main{ExitableDirectoryReader(UninvertingDirectoryReader())}
   [junit4]   2> 1764444 INFO  (TEST-AutoCommitTest.testCommitWithin-seed#[C60E3B425E9B57F0]) [    x:collection1] o.a.s.u.p.LogUpdateProcessor [collection1] {add=[529 (1514183429107744768)]} 0 2
   [junit4]   2> 1764445 INFO  (TEST-AutoCommitTest.testCommitWithin-seed#[C60E3B425E9B57F0]) [    x:collection1] o.a.s.c.S.Request [collection1] webapp=null path=null params={q=id:529&qt=standard&start=0&rows=20&version=2.2} hits=0 status=0 QTime=0 
   [junit4]   2> 1764445 INFO  (TEST-AutoCommitTest.testCommitWithin-seed#[C60E3B425E9B57F0]) [    x:collection1] o.a.s.u.p.LogUpdateProcessor [collection1] {add=[530 (1514183429110890496)]} 0 3
   [junit4]   2> 1764446 INFO  (TEST-AutoCommitTest.testCommitWithin-seed#[C60E3B425E9B57F0]) [    x:collection1] o.a.s.c.S.Request [collection1] webapp=null path=null params={q=id:530&qt=standard&start=0&rows=20&version=2.2} hits=0 status=0 QTime=0 
   [junit4]   2> 1764447 INFO  (TEST-AutoCommitTest.testCommitWithin-seed#[C60E3B425E9B57F0]) [    x:collection1] o.a.s.u.p.LogUpdateProcessor [collection1] {delete=[529 (-1514183429111939072)]} 0 4
   [junit4]   2> 1764447 INFO  (TEST-AutoCommitTest.testCommitWithin-seed#[C60E3B425E9B57F0]) [    x:collection1] o.a.s.c.S.Request [collection1] webapp=null path=null params={q=id:529&qt=standard&start=0&rows=20&version=2.2} hits=0 status=0 QTime=0 
   [junit4]   2> 1764447 ERROR (TEST-AutoCommitTest.testCommitWithin-seed#[C60E3B425E9B57F0]) [    x:collection1] o.a.s.SolrTestCaseJ4 REQUEST FAILED: xpath=//result[@numFound=1]
   [junit4]   2> 	xml response was: <?xml version="1.0" encoding="UTF-8"?>
   [junit4]   2> <response>
   [junit4]   2> <lst name="responseHeader"><int name="status">0</int><int name="QTime">0</int></lst><result name="response" numFound="0" start="0"></result>
   [junit4]   2> </response>
   [junit4]   2> 
   [junit4]   2> 	request was:q=id:529&qt=standard&start=0&rows=20&version=2.2
   [junit4]   2> 1764448 ERROR (TEST-AutoCommitTest.testCommitWithin-seed#[C60E3B425E9B57F0]) [    x:collection1] o.a.s.SolrTestCaseJ4 REQUEST FAILED: q=id:529&qt=standard&start=0&rows=20&version=2.2:java.lang.RuntimeException: REQUEST FAILED: xpath=//result[@numFound=1]
   [junit4]   2> 	xml response was: <?xml version="1.0" encoding="UTF-8"?>
   [junit4]   2> <response>
   [junit4]   2> <lst name="responseHeader"><int name="status">0</int><int name="QTime">0</int></lst><result name="response" numFound="0" start="0"></result>
   [junit4]   2> </response>
   [junit4]   2> 
   [junit4]   2> 	request was:q=id:529&qt=standard&start=0&rows=20&version=2.2
   [junit4]   2> 	at org.apache.solr.SolrTestCaseJ4.assertQ(SolrTestCaseJ4.java:758)
   [junit4]   2> 	at org.apache.solr.update.AutoCommitTest.testCommitWithin(AutoCommitTest.java:321)
   [junit4]   2> 	at sun.reflect.NativeMethodAccessorImpl.invoke0(Native Method)
   [junit4]   2> 	at sun.reflect.NativeMethodAccessorImpl.invoke(NativeMethodAccessorImpl.java:62)
   [junit4]   2> 	at sun.reflect.DelegatingMethodAccessorImpl.invoke(DelegatingMethodAccessorImpl.java:43)
   [junit4]   2> 	at java.lang.reflect.Method.invoke(Method.java:497)
   [junit4]   2> 	at com.carrotsearch.randomizedtesting.RandomizedRunner.invoke(RandomizedRunner.java:1665)
   [junit4]   2> 	at com.carrotsearch.randomizedtesting.RandomizedRunner$8.evaluate(RandomizedRunner.java:864)
   [junit4]   2> 	at com.carrotsearch.randomizedtesting.RandomizedRunner$9.evaluate(RandomizedRunner.java:900)
   [junit4]   2> 	at com.carrotsearch.randomizedtesting.RandomizedRunner$10.evaluate(RandomizedRunner.java:914)
   [junit4]   2> 	at com.carrotsearch.randomizedtesting.rules.SystemPropertiesRestoreRule$1.evaluate(SystemPropertiesRestoreRule.java:57)
   [junit4]   2> 	at org.apache.lucene.util.TestRuleSetupTeardownChained$1.evaluate(TestRuleSetupTeardownChained.java:50)
   [junit4]   2> 	at org.apache.lucene.util.AbstractBeforeAfterRule$1.evaluate(AbstractBeforeAfterRule.java:46)
   [junit4]   2> 	at org.apache.lucene.util.TestRuleThreadAndTestName$1.evaluate(TestRuleThreadAndTestName.java:49)
   [junit4]   2> 	at org.apache.lucene.util.TestRuleIgnoreAfterMaxFailures$1.evaluate(TestRuleIgnoreAfterMaxFailures.java:65)
   [junit4]   2> 	at org.apache.lucene.util.TestRuleMarkFailure$1.evaluate(TestRuleMarkFailure.java:48)
   [junit4]   2> 	at com.carrotsearch.randomizedtesting.rules.StatementAdapter.evaluate(StatementAdapter.java:36)
   [junit4]   2> 	at com.carrotsearch.randomizedtesting.ThreadLeakControl$StatementRunner.run(ThreadLeakControl.java:367)
   [junit4]   2> 	at com.carrotsearch.randomizedtesting.ThreadLeakControl.forkTimeoutingTask(ThreadLeakControl.java:809)
   [junit4]   2> 	at com.carrotsearch.randomizedtesting.ThreadLeakControl$3.evaluate(ThreadLeakControl.java:460)
   [junit4]   2> 	at com.carrotsearch.randomizedtesting.RandomizedRunner.runSingleTest(RandomizedRunner.java:873)
   [junit4]   2> 	at com.carrotsearch.randomizedtesting.RandomizedRunner$5.evaluate(RandomizedRunner.java:775)
   [junit4]   2> 	at com.carrotsearch.randomizedtesting.RandomizedRunner$6.evaluate(RandomizedRunner.java:809)
   [junit4]   2> 	at com.carrotsearch.randomizedtesting.RandomizedRunner$7.evaluate(RandomizedRunner.java:820)
   [junit4]   2> 	at com.carrotsearch.randomizedtesting.rules.StatementAdapter.evaluate(StatementAdapter.java:36)
   [junit4]   2> 	at com.carrotsearch.randomizedtesting.rules.SystemPropertiesRestoreRule$1.evaluate(SystemPropertiesRestoreRule.java:57)
   [junit4]   2> 	at org.apache.lucene.util.AbstractBeforeAfterRule$1.evaluate(AbstractBeforeAfterRule.java:46)
   [junit4]   2> 	at com.carrotsearch.randomizedtesting.rules.StatementAdapter.evaluate(StatementAdapter.java:36)
   [junit4]   2> 	at org.apache.lucene.util.TestRuleStoreClassName$1.evaluate(TestRuleStoreClassName.java:42)
   [junit4]   2> 	at com.carrotsearch.randomizedtesting.rules.NoShadowingOrOverridesOnMethodsRule$1.evaluate(NoShadowingOrOverridesOnMethodsRule.java:39)
   [junit4]   2> 	at com.carrotsearch.randomizedtesting.rules.NoShadowingOrOverridesOnMethodsRule$1.evaluate(NoShadowingOrOverridesOnMethodsRule.java:39)
   [junit4]   2> 	at com.carrotsearch.randomizedtesting.rules.StatementAdapter.evaluate(StatementAdapter.java:36)
   [junit4]   2> 	at com.carrotsearch.randomizedtesting.rules.StatementAdapter.evaluate(StatementAdapter.java:36)
   [junit4]   2> 	at com.carrotsearch.randomizedtesting.rules.StatementAdapter.evaluate(StatementAdapter.java:36)
   [junit4]   2> 	at org.apache.lucene.util.TestRuleAssertionsRequired$1.evaluate(TestRuleAssertionsRequired.java:54)
   [junit4]   2> 	at org.apache.lucene.util.TestRuleMarkFailure$1.evaluate(TestRuleMarkFailure.java:48)
   [junit4]   2> 	at org.apache.lucene.util.TestRuleIgnoreAfterMaxFailures$1.evaluate(TestRuleIgnoreAfterMaxFailures.java:65)
   [junit4]   2> 	at org.apache.lucene.util.TestRuleIgnoreTestSuites$1.evaluate(TestRuleIgnoreTestSuites.java:55)
   [junit4]   2> 	at com.carrotsearch.randomizedtesting.rules.StatementAdapter.evaluate(StatementAdapter.java:36)
   [junit4]   2> 	at com.carrotsearch.randomizedtesting.ThreadLeakControl$StatementRunner.run(ThreadLeakControl.java:367)
   [junit4]   2> 	at java.lang.Thread.run(Thread.java:745)
   [junit4]   2> 
   [junit4]   2> 1764448 INFO  (TEST-AutoCommitTest.testCommitWithin-seed#[C60E3B425E9B57F0]) [    x:collection1] o.a.s.SolrTestCaseJ4 ###Ending testCommitWithin
   [junit4]   2> NOTE: reproduce with: ant test  -Dtestcase=AutoCommitTest -Dtests.method=testCommitWithin -Dtests.seed=C60E3B425E9B57F0 -Dtests.slow=true -Dtests.locale=sl -Dtests.timezone=Asia/Chungking -Dtests.asserts=true -Dtests.file.encoding=US-ASCII
   [junit4] ERROR   0.28s J1 | AutoCommitTest.testCommitWithin <<<
   [junit4]    > Throwable #1: java.lang.RuntimeException: Exception during query
   [junit4]    > 	at __randomizedtesting.SeedInfo.seed([C60E3B425E9B57F0:7CDC543ADDB5B9E5]:0)
   [junit4]    > 	at org.apache.solr.SolrTestCaseJ4.assertQ(SolrTestCaseJ4.java:765)
   [junit4]    > 	at org.apache.solr.update.AutoCommitTest.testCommitWithin(AutoCommitTest.java:321)
   [junit4]    > 	at java.lang.Thread.run(Thread.java:745)
   [junit4]    > Caused by: java.lang.RuntimeException: REQUEST FAILED: xpath=//result[@numFound=1]
   [junit4]    > 	xml response was: <?xml version="1.0" encoding="UTF-8"?>
   [junit4]    > <response>
   [junit4]    > <lst name="responseHeader"><int name="status">0</int><int name="QTime">0</int></lst><result name="response" numFound="0" start="0"></result>
   [junit4]    > </response>
   [junit4]    > 	request was:q=id:529&qt=standard&start=0&rows=20&version=2.2
   [junit4]    > 	at org.apache.solr.SolrTestCaseJ4.assertQ(SolrTestCaseJ4.java:758)
   [junit4]    > 	... 40 more
   [junit4]   2> 1764458 INFO  (TEST-AutoCommitTest.testMaxTime-seed#[C60E3B425E9B57F0]) [    x:collection1] o.a.s.SolrTestCaseJ4 ###Starting testMaxTime
   [junit4]   2> 1764462 INFO  (TEST-AutoCommitTest.testMaxTime-seed#[C60E3B425E9B57F0]) [    x:collection1] o.a.s.s.SolrIndexSearcher Opening Searcher@3fbaa686[collection1] realtime
   [junit4]   2> 1764462 INFO  (TEST-AutoCommitTest.testMaxTime-seed#[C60E3B425E9B57F0]) [    x:collection1] o.a.s.u.p.LogUpdateProcessor [collection1] webapp=null path=null params={} {deleteByQuery=*:* (-1514183429124521984)} 0 3
   [junit4]   2> 1764462 INFO  (TEST-AutoCommitTest.testMaxTime-seed#[C60E3B425E9B57F0]) [    x:collection1] o.a.s.c.SolrResourceLoader new SolrResourceLoader for directory: '/export/home/jenkins/workspace/Lucene-Solr-trunk-Solaris/solr/core/src/test-files/solr/collection1/'
   [junit4]   2> 1764463 INFO  (TEST-AutoCommitTest.testMaxTime-seed#[C60E3B425E9B57F0]) [    x:collection1] o.a.s.c.SolrResourceLoader Adding 'file:/export/home/jenkins/workspace/Lucene-Solr-trunk-Solaris/solr/core/src/test-files/solr/collection1/lib/classes/' to classloader
   [junit4]   2> 1764463 INFO  (TEST-AutoCommitTest.testMaxTime-seed#[C60E3B425E9B57F0]) [    x:collection1] o.a.s.c.SolrResourceLoader Adding 'file:/export/home/jenkins/workspace/Lucene-Solr-trunk-Solaris/solr/core/src/test-files/solr/collection1/lib/README' to classloader
   [junit4]   2> 1764483 INFO  (TEST-AutoCommitTest.testMaxTime-seed#[C60E3B425E9B57F0]) [    x:collection1] o.a.s.c.SolrConfig current version of requestparams : -1
   [junit4]   2> 1764495 INFO  (TEST-AutoCommitTest.testMaxTime-seed#[C60E3B425E9B57F0]) [    x:collection1] o.a.s.c.SolrConfig Using Lucene MatchVersion: 6.0.0
   [junit4]   2> 1764515 INFO  (TEST-AutoCommitTest.testMaxTime-seed#[C60E3B425E9B57F0]) [    x:collection1] o.a.s.c.Config Loaded SolrConfig: solrconfig.xml
   [junit4]   2> 1764516 INFO  (TEST-AutoCommitTest.testMaxTime-seed#[C60E3B425E9B57F0]) [    x:collection1] o.a.s.s.IndexSchema Reading Solr Schema from /export/home/jenkins/workspace/Lucene-Solr-trunk-Solaris/solr/core/src/test-files/solr/collection1/conf/schema.xml
   [junit4]   2> 1764520 INFO  (TEST-AutoCommitTest.testMaxTime-seed#[C60E3B425E9B57F0]) [    x:collection1] o.a.s.s.IndexSchema [collection1] Schema name=test
   [junit4]   2> 1764617 INFO  (TEST-AutoCommitTest.testMaxTime-seed#[C60E3B425E9B57F0]) [    x:collection1] o.a.s.s.OpenExchangeRatesOrgProvider Initialized with rates=open-exchange-rates.json, refreshInterval=1440.
   [junit4]   2> 1764626 INFO  (TEST-AutoCommitTest.testMaxTime-seed#[C60E3B425E9B57F0]) [    x:collection1] o.a.s.s.IndexSchema default search field in schema is text
   [junit4]   2> 1764633 INFO  (TEST-AutoCommitTest.testMaxTime-seed#[C60E3B425E9B57F0]) [    x:collection1] o.a.s.s.IndexSchema unique key field: id
   [junit4]   2> 1764642 INFO  (TEST-AutoCommitTest.testMaxTime-seed#[C60E3B425E9B57F0]) [    x:collection1] o.a.s.s.FileExchangeRateProvider Reloading exchange rates from file currency.xml
   [junit4]   2> 1764644 INFO  (TEST-AutoCommitTest.testMaxTime-seed#[C60E3B425E9B57F0]) [    x:collection1] o.a.s.s.FileExchangeRateProvider Reloading exchange rates from file currency.xml
   [junit4]   2> 1764645 INFO  (TEST-AutoCommitTest.testMaxTime-seed#[C60E3B425E9B57F0]) [    x:collection1] o.a.s.s.OpenExchangeRatesOrgProvider Reloading exchange rates from open-exchange-rates.json
   [junit4]   2> 1764646 WARN  (TEST-AutoCommitTest.testMaxTime-seed#[C60E3B425E9B57F0]) [    x:collection1] o.a.s.s.OpenExchangeRatesOrgProvider Unknown key IMPORTANT NOTE
   [junit4]   2> 1764646 WARN  (TEST-AutoCommitTest.testMaxTime-seed#[C60E3B425E9B57F0]) [    x:collection1] o.a.s.s.OpenExchangeRatesOrgProvider Expected key, got STRING
   [junit4]   2> 1764646 INFO  (TEST-AutoCommitTest.testMaxTime-seed#[C60E3B425E9B57F0]) [    x:collection1] o.a.s.s.OpenExchangeRatesOrgProvider Reloading exchange rates from open-exchange-rates.json
   [junit4]   2> 1764646 WARN  (TEST-AutoCommitTest.testMaxTime-seed#[C60E3B425E9B57F0]) [    x:collection1] o.a.s.s.OpenExchangeRatesOrgProvider Unknown key IMPORTANT NOTE
   [junit4]   2> 1764646 WARN  (TEST-AutoCommitTest.testMaxTime-seed#[C60E3B425E9B57F0]) [    x:collection1] o.a.s.s.OpenExchangeRatesOrgProvider Expected key, got STRING
   [junit4]   2> 1764647 INFO  (TEST-AutoCommitTest.testMaxTime-seed#[C60E3B425E9B57F0]) [    x:collection1] o.a.s.c.ConfigSetProperties Did not find ConfigSet properties, assuming default properties: Can't find resource 'configsetprops.json' in classpath or '/export/home/jenkins/workspace/Lucene-Solr-trunk-Solaris/solr/core/src/test-files/solr/collection1/conf'
   [junit4]   2> 1764647 INFO  (TEST-AutoCommitTest.testMaxTime-seed#[C60E3B425E9B57F0]) [    x:collection1] o.a.s.c.CoreContainer Reloading SolrCore 'collection1' using configuration from instancedir /export/home/jenkins/workspace/Lucene-Solr-trunk-Solaris/solr/core/src/test-files/solr/collection1/
   [junit4]   2> 1764647 INFO  (TEST-AutoCommitTest.testMaxTime-seed#[C60E3B425E9B57F0]) [    x:collection1] o.a.s.c.SolrCore [[collection1] ] Opening new SolrCore at [/export/home/jenkins/workspace/Lucene-Solr-trunk-Solaris/solr/core/src/test-files/solr/collection1/], dataDir=[/export/home/jenkins/workspace/Lucene-Solr-trunk-Solaris/solr/build/solr-core/test/J1/temp/solr.update.AutoCommitTest_C60E3B425E9B57F0-001/init-core-data-001/]
   [junit4]   2> 1764647 INFO  (TEST-AutoCommitTest.testMaxTime-seed#[C60E3B425E9B57F0]) [    x:collection1] o.a.s.c.JmxMonitoredMap JMX monitoring is enabled. Adding Solr mbeans to JMX Server: com.sun.jmx.mbeanserver.JmxMBeanServer@55ad3782
   [junit4]   2> 1764647 INFO  (TEST-AutoCommitTest.testMaxTime-seed#[C60E3B425E9B57F0]) [    x:collection1] o.a.s.c.SolrCore New index directory detected: old=null new=/export/home/jenkins/workspace/Lucene-Solr-trunk-Solaris/solr/build/solr-core/test/J1/temp/solr.update.AutoCommitTest_C60E3B425E9B57F0-001/init-core-data-001/index/
   [junit4]   2> 1764647 INFO  (OldIndexDirectoryCleanupThreadForCore-collection1) [    x:collection1] o.a.s.c.SolrCore Looking for old index directories to cleanup for core collection1 in /export/home/jenkins/workspace/Lucene-Solr-trunk-Solaris/solr/build/solr-core/test/J1/temp/solr.update.AutoCommitTest_C60E3B425E9B57F0-001/init-core-data-001/
   [junit4]   2> 1764652 INFO  (TEST-AutoCommitTest.testMaxTime-seed#[C60E3B425E9B57F0]) [    x:collection1] o.a.s.u.p.UpdateRequestProcessorChain creating updateRequestProcessorChain "dedupe"
   [junit4]   2> 1764652 INFO  (TEST-AutoCommitTest.testMaxTime-seed#[C60E3B425E9B57F0]) [    x:collection1] o.a.s.u.p.UpdateRequestProcessorChain inserting DistributedUpdateProcessorFactory into updateRequestProcessorChain "dedupe"
   [junit4]   2> 1764652 INFO  (TEST-AutoCommitTest.testMaxTime-seed#[C60E3B425E9B57F0]) [    x:collection1] o.a.s.u.p.UpdateRequestProcessorChain creating updateRequestProcessorChain "dedupe-allfields"
   [junit4]   2> 1764652 INFO  (TEST-AutoCommitTest.testMaxTime-seed#[C60E3B425E9B57F0]) [    x:collection1] o.a.s.u.p.UpdateRequestProcessorChain inserting DistributedUpdateProcessorFactory into updateRequestProcessorChain "dedupe-allfields"
   [junit4]   2> 1764652 INFO  (TEST-AutoCommitTest.testMaxTime-seed#[C60E3B425E9B57F0]) [    x:collection1] o.a.s.u.p.UpdateRequestProcessorChain creating updateRequestProcessorChain "stored_sig"
   [junit4]   2> 1764652 INFO  (TEST-AutoCommitTest.testMaxTime-seed#[C60E3B425E9B57F0]) [    x:collection1] o.a.s.u.p.UpdateRequestProcessorChain inserting DistributedUpdateProcessorFactory into updateRequestProcessorChain "stored_sig"
   [junit4]   2> 1764652 INFO  (TEST-AutoCommitTest.testMaxTime-seed#[C60E3B425E9B57F0]) [    x:collection1] o.a.s.u.p.UpdateRequestProcessorChain creating updateRequestProcessorChain "uniq-fields"
   [junit4]   2> 1764652 INFO  (TEST-AutoCommitTest.testMaxTime-seed#[C60E3B425E9B57F0]) [    x:collection1] o.a.s.u.p.UpdateRequestProcessorChain inserting DistributedUpdateProcessorFactory into updateRequestProcessorChain "uniq-fields"
   [junit4]   2> 1764652 INFO  (TEST-AutoCommitTest.testMaxTime-seed#[C60E3B425E9B57F0]) [    x:collection1] o.a.s.u.p.UpdateRequestProcessorChain creating updateRequestProcessorChain "distrib-dup-test-chain-explicit"
   [junit4]   2> 1764652 INFO  (TEST-AutoCommitTest.testMaxTime-seed#[C60E3B425E9B57F0]) [    x:collection1] o.a.s.u.p.UpdateRequestProcessorChain creating updateRequestProcessorChain "distrib-dup-test-chain-implicit"
   [junit4]   2> 1764653 INFO  (TEST-AutoCommitTest.testMaxTime-seed#[C60E3B425E9B57F0]) [    x:collection1] o.a.s.u.p.UpdateRequestProcessorChain inserting DistributedUpdateProcessorFactory into updateRequestProcessorChain "distrib-dup-test-chain-implicit"
   [junit4]   2> 1764653 INFO  (TEST-AutoCommitTest.testMaxTime-seed#[C60E3B425E9B57F0]) [    x:collection1] o.a.s.c.SolrCore no updateRequestProcessorChain defined as default, creating implicit default
   [junit4]   2> 1764654 INFO  (TEST-AutoCommitTest.testMaxTime-seed#[C60E3B425E9B57F0]) [    x:collection1] o.a.s.h.l.XMLLoader xsltCacheLifetimeSeconds=60
   [junit4]   2> 1764655 INFO  (TEST-AutoCommitTest.testMaxTime-seed#[C60E3B425E9B57F0]) [    x:collection1] o.a.s.h.l.XMLLoader xsltCacheLifetimeSeconds=60
   [junit4]   2> 1764656 INFO  (TEST-AutoCommitTest.testMaxTime-seed#[C60E3B425E9B57F0]) [    x:collection1] o.a.s.h.l.XMLLoader xsltCacheLifetimeSeconds=60
   [junit4]   2> 1764657 INFO  (TEST-AutoCommitTest.testMaxTime-seed#[C60E3B425E9B57F0]) [    x:collection1] o.a.s.h.l.XMLLoader xsltCacheLifetimeSeconds=60
   [junit4]   2> 1764663 INFO  (TEST-AutoCommitTest.testMaxTime-seed#[C60E3B425E9B57F0]) [    x:collection1] o.a.s.c.PluginBag requestHandler : 'lazy' created with startup=lazy 
   [junit4]   2> 1764665 INFO  (TEST-AutoCommitTest.testMaxTime-seed#[C60E3B425E9B57F0]) [    x:collection1] o.a.s.c.RequestHandlers Registered paths: /admin/mbeans,standard,spellCheckCompRH,lazy,/update/json/docs,/admin/luke,spellCheckWithWordbreak_Direct,tvrh,/get,/admin/properties,/update/json,mltrh,/admin/threads,/search-facet-def,/update/csv,/search-facet-invariants,/admin/segments,spellCheckCompRH1,/mlt,/admin/system,/replication,dismax,defaults,/config,/schema,/admin/plugins,/admin/logging,spellCheckWithWordbreak,mock,/admin/ping,/update,/admin/file,/terms,spellCheckCompRH_Direct,/debug/dump
   [junit4]   2> 1764666 WARN  (TEST-AutoCommitTest.testMaxTime-seed#[C60E3B425E9B57F0]) [    x:collection1] o.a.s.c.SolrCore solrconfig.xml uses deprecated <admin/gettableFiles>, Please update your config to use the ShowFileRequestHandler.
   [junit4]   2> 1764666 INFO  (TEST-AutoCommitTest.testMaxTime-seed#[C60E3B425E9B57F0]) [    x:collection1] o.a.s.c.SolrCore Using default statsCache cache: org.apache.solr.search.stats.LocalStatsCache
   [junit4]   2> 1764666 INFO  (TEST-AutoCommitTest.testMaxTime-seed#[C60E3B425E9B57F0]) [    x:collection1] o.a.s.c.SolrCore Hard AutoCommit: disabled
   [junit4]   2> 1764667 INFO  (TEST-AutoCommitTest.testMaxTime-seed#[C60E3B425E9B57F0]) [    x:collection1] o.a.s.c.SolrCore Soft AutoCommit: disabled
   [junit4]   2> 1764667 INFO  (TEST-AutoCommitTest.testMaxTime-seed#[C60E3B425E9B57F0]) [    x:collection1] o.a.s.s.SolrIndexSearcher Opening Searcher@3dbdf54e[collection1] main
   [junit4]   2> 1764667 INFO  (TEST-AutoCommitTest.testMa

[...truncated too long message...]

33052487680)]} 0 3518
   [junit4]   2> 1768205 INFO  (TEST-AutoCommitTest.testMaxTime-seed#[C60E3B425E9B57F0]) [    x:collection1] o.a.s.c.S.Request [collection1] webapp=null path=null params={q=id:500&qt=standard&start=0&rows=20&version=2.2} hits=1 status=0 QTime=0 
   [junit4]   2> 1768206 INFO  (TEST-AutoCommitTest.testMaxTime-seed#[C60E3B425E9B57F0]) [    x:collection1] o.a.s.SolrTestCaseJ4 ###Ending testMaxTime
   [junit4]   2> 1768206 INFO  (SUITE-AutoCommitTest-seed#[C60E3B425E9B57F0]-worker) [    x:collection1] o.a.s.SolrTestCaseJ4 ###deleteCore
   [junit4]   2> 1768206 INFO  (SUITE-AutoCommitTest-seed#[C60E3B425E9B57F0]-worker) [    x:collection1] o.a.s.c.CoreContainer Shutting down CoreContainer instance=1178012444
   [junit4]   2> 1768206 INFO  (SUITE-AutoCommitTest-seed#[C60E3B425E9B57F0]-worker) [    x:collection1] o.a.s.c.SolrCore [collection1]  CLOSING SolrCore org.apache.solr.core.SolrCore@3266d579
   [junit4]   2> 1768207 INFO  (SUITE-AutoCommitTest-seed#[C60E3B425E9B57F0]-worker) [    x:collection1] o.a.s.u.UpdateHandler closing DirectUpdateHandler2{commits=3,autocommits=0,soft autocommit maxTime=1000ms,soft autocommits=3,optimizes=0,rollbacks=0,expungeDeletes=0,docsPending=14,adds=1,deletesById=0,deletesByQuery=0,errors=0,cumulative_adds=14,cumulative_deletesById=1,cumulative_deletesByQuery=0,cumulative_errors=0,transaction_logs_total_size=0,transaction_logs_total_number=0}
   [junit4]   2> 1768207 INFO  (SUITE-AutoCommitTest-seed#[C60E3B425E9B57F0]-worker) [    x:collection1] o.a.s.u.SolrCoreState Closing SolrCoreState
   [junit4]   2> 1768207 INFO  (SUITE-AutoCommitTest-seed#[C60E3B425E9B57F0]-worker) [    x:collection1] o.a.s.u.DefaultSolrCoreState SolrCoreState ref count has reached 0 - closing IndexWriter
   [junit4]   2> 1768207 INFO  (SUITE-AutoCommitTest-seed#[C60E3B425E9B57F0]-worker) [    x:collection1] o.a.s.u.DefaultSolrCoreState closing IndexWriter with IndexWriterCloser
   [junit4]   2> 1768207 INFO  (SUITE-AutoCommitTest-seed#[C60E3B425E9B57F0]-worker) [    x:collection1] o.a.s.u.UpdateHandler Committing on IndexWriter close.
   [junit4]   2> 1768211 INFO  (SUITE-AutoCommitTest-seed#[C60E3B425E9B57F0]-worker) [    x:collection1] o.a.s.c.SolrCore SolrDeletionPolicy.onCommit: commits: num=2
   [junit4]   2> 	commit{dir=MockDirectoryWrapper(RAMDirectory@49de5e36 lockFactory=org.apache.lucene.store.SingleInstanceLockFactory@3a6ed236),segFN=segments_3,generation=3}
   [junit4]   2> 	commit{dir=MockDirectoryWrapper(RAMDirectory@49de5e36 lockFactory=org.apache.lucene.store.SingleInstanceLockFactory@3a6ed236),segFN=segments_4,generation=4}
   [junit4]   2> 1768211 INFO  (SUITE-AutoCommitTest-seed#[C60E3B425E9B57F0]-worker) [    x:collection1] o.a.s.c.SolrCore newest commit generation = 4
   [junit4]   2> 1768212 INFO  (SUITE-AutoCommitTest-seed#[C60E3B425E9B57F0]-worker) [    x:collection1] o.a.s.c.SolrCore [collection1] Closing main searcher on request.
   [junit4]   2> 1768224 INFO  (SUITE-AutoCommitTest-seed#[C60E3B425E9B57F0]-worker) [    x:collection1] o.a.s.c.CachingDirectoryFactory Closing MockDirectoryFactory - 2 directories currently being tracked
   [junit4]   2> 1768224 INFO  (SUITE-AutoCommitTest-seed#[C60E3B425E9B57F0]-worker) [    x:collection1] o.a.s.c.CachingDirectoryFactory looking to close /export/home/jenkins/workspace/Lucene-Solr-trunk-Solaris/solr/build/solr-core/test/J1/temp/solr.update.AutoCommitTest_C60E3B425E9B57F0-001/init-core-data-001 [CachedDir<<refCount=0;path=/export/home/jenkins/workspace/Lucene-Solr-trunk-Solaris/solr/build/solr-core/test/J1/temp/solr.update.AutoCommitTest_C60E3B425E9B57F0-001/init-core-data-001;done=false>>]
   [junit4]   2> 1768224 INFO  (SUITE-AutoCommitTest-seed#[C60E3B425E9B57F0]-worker) [    x:collection1] o.a.s.c.CachingDirectoryFactory Closing directory: /export/home/jenkins/workspace/Lucene-Solr-trunk-Solaris/solr/build/solr-core/test/J1/temp/solr.update.AutoCommitTest_C60E3B425E9B57F0-001/init-core-data-001
   [junit4]   2> 1768224 INFO  (SUITE-AutoCommitTest-seed#[C60E3B425E9B57F0]-worker) [    x:collection1] o.a.s.c.CachingDirectoryFactory looking to close /export/home/jenkins/workspace/Lucene-Solr-trunk-Solaris/solr/build/solr-core/test/J1/temp/solr.update.AutoCommitTest_C60E3B425E9B57F0-001/init-core-data-001/index [CachedDir<<refCount=0;path=/export/home/jenkins/workspace/Lucene-Solr-trunk-Solaris/solr/build/solr-core/test/J1/temp/solr.update.AutoCommitTest_C60E3B425E9B57F0-001/init-core-data-001/index;done=false>>]
   [junit4]   2> 1768224 INFO  (SUITE-AutoCommitTest-seed#[C60E3B425E9B57F0]-worker) [    x:collection1] o.a.s.c.CachingDirectoryFactory Closing directory: /export/home/jenkins/workspace/Lucene-Solr-trunk-Solaris/solr/build/solr-core/test/J1/temp/solr.update.AutoCommitTest_C60E3B425E9B57F0-001/init-core-data-001/index
   [junit4]   2> NOTE: leaving temporary files on disk at: /export/home/jenkins/workspace/Lucene-Solr-trunk-Solaris/solr/build/solr-core/test/J1/temp/solr.update.AutoCommitTest_C60E3B425E9B57F0-001
   [junit4]   2> NOTE: test params are: codec=Asserting(Lucene53), sim=ClassicSimilarity, locale=sl, timezone=Asia/Chungking
   [junit4]   2> NOTE: SunOS 5.11 amd64/Oracle Corporation 1.8.0_60 (64-bit)/cpus=3,threads=1,free=180486472,total=536870912
   [junit4]   2> NOTE: All tests run in this JVM: [TestComplexPhraseQParserPlugin, TestJsonRequest, TestManagedSchemaFieldResource, TestBinaryResponseWriter, ResponseHeaderTest, TestInitQParser, RulesTest, TestSuggestSpellingConverter, PKIAuthenticationIntegrationTest, TestCollationField, HdfsRecoveryZkTest, FieldMutatingUpdateProcessorTest, ResponseLogComponentTest, DirectUpdateHandlerOptimizeTest, BigEndianAscendingWordDeserializerTest, MultiThreadedOCPTest, TestCharFilters, FileBasedSpellCheckerTest, BitVectorTest, ExplicitHLLTest, CursorMarkTest, TestSimpleQParserPlugin, SolrCoreCheckLockOnStartupTest, OpenCloseCoreStressTest, TestQuerySenderListener, SpellCheckComponentTest, TestScoreJoinQPNoScore, ShardSplitTest, TestOmitPositions, TestCoreDiscovery, CdcrReplicationHandlerTest, DataDrivenBlockJoinTest, NoCacheHeaderTest, HdfsWriteToMultipleCollectionsTest, TestHashQParserPlugin, VMParamsZkACLAndCredentialsProvidersTest, EnumFieldTest, DefaultValueUpdateProcessorTest, TestMiniSolrCloudClusterSSL, BasicZkTest, SmileWriterTest, TestSQLHandler, TestSolrDeletionPolicy2, TestJoin, SaslZkACLProviderTest, TestUniqueKeyFieldResource, TestDistributedGrouping, TestConfigSetsAPIExclusivity, OutputWriterTest, SuggesterWFSTTest, DebugComponentTest, BadCopyFieldTest, IndexSchemaRuntimeFieldTest, TestLeaderElectionZkExpiry, TestBadConfig, SuggesterTSTTest, RemoteQueryErrorTest, TestUtils, SpellPossibilityIteratorTest, SliceStateTest, TestPerFieldSimilarity, CollectionsAPIDistributedZkTest, TestDefaultSimilarityFactory, TestShardHandlerFactory, SecurityConfHandlerTest, TestConfigSetImmutable, UniqFieldsUpdateProcessorFactoryTest, HdfsBasicDistributedZk2Test, TestOverriddenPrefixQueryForCustomFieldType, TestQueryTypes, TestFieldResource, TestRealTimeGet, RequestHandlersTest, TestConfigSetsAPI, TestFreeTextSuggestions, SimpleCollectionCreateDeleteTest, FieldAnalysisRequestHandlerTest, TestBM25SimilarityFactory, DistributedFacetPivotLargeTest, HdfsDirectoryTest, ZkStateReaderTest, TestFieldCollectionResource, TestReversedWildcardFilterFactory, TestRawResponseWriter, UpdateRequestProcessorFactoryTest, PrimUtilsTest, SortByFunctionTest, SolrPluginUtilsTest, TestSolr4Spatial2, LeaderElectionIntegrationTest, SpatialHeatmapFacetsTest, DeleteShardTest, TestRecoveryHdfs, TestShortCircuitedRequests, SparseHLLTest, SearchHandlerTest, TestSolrConfigHandlerCloud, SolrCloudExampleTest, StressHdfsTest, TestHdfsUpdateLog, TestExceedMaxTermLength, HdfsBasicDistributedZkTest, TestFiltering, DistanceUnitsTest, DistribCursorPagingTest, SuggesterTest, CdcrRequestHandlerTest, DistributedDebugComponentTest, TestExpandComponent, PreAnalyzedFieldTest, HighlighterMaxOffsetTest, TestStressUserVersions, CloudExitableDirectoryReaderTest, DistributedQueryComponentOptimizationTest, ZkSolrClientTest, ShardRoutingCustomTest, HdfsSyncSliceTest, TestJettySolrRunner, TestFastOutputStream, TestZkChroot, TestIntervalFaceting, TestRandomFaceting, TestInfoStreamLogging, PreAnalyzedUpdateProcessorTest, LoggingHandlerTest, UUIDFieldTest, DateMathParserTest, TestMiniSolrCloudClusterBase, ConcurrentDeleteAndCreateCollectionTest, TestSchemaVersionResource, TestConfigOverlay, TestConfigSetProperties, CopyFieldTest, BasicDistributedZk2Test, OverseerTest, FullSolrCloudDistribCmdsTest, ClusterStateUpdateTest, LeaderElectionTest, AutoCommitTest]
   [junit4] Completed [285/547] on J1 in 5.33s, 3 tests, 1 error <<< FAILURES!

[...truncated 814 lines...]
BUILD FAILED
/export/home/jenkins/workspace/Lucene-Solr-trunk-Solaris/build.xml:775: The following error occurred while executing this line:
/export/home/jenkins/workspace/Lucene-Solr-trunk-Solaris/build.xml:719: The following error occurred while executing this line:
/export/home/jenkins/workspace/Lucene-Solr-trunk-Solaris/build.xml:59: The following error occurred while executing this line:
/export/home/jenkins/workspace/Lucene-Solr-trunk-Solaris/solr/build.xml:233: The following error occurred while executing this line:
/export/home/jenkins/workspace/Lucene-Solr-trunk-Solaris/solr/common-build.xml:516: The following error occurred while executing this line:
/export/home/jenkins/workspace/Lucene-Solr-trunk-Solaris/lucene/common-build.xml:1432: The following error occurred while executing this line:
/export/home/jenkins/workspace/Lucene-Solr-trunk-Solaris/lucene/common-build.xml:987: There were test failures: 547 suites (8 ignored), 2146 tests, 1 error, 48 ignored (36 assumptions) [seed: C60E3B425E9B57F0]

Total time: 72 minutes 39 seconds
Build step 'Invoke Ant' marked build as failure
Archiving artifacts
[WARNINGS] Skipping publisher since build result is FAILURE
Recording test results
Email was triggered for: Failure - Any
Sending email for trigger: Failure - Any



Mime
View raw message