Build: http://jenkins.thetaphi.de/job/Lucene-Solr-5.x-MacOSX/2702/ Java: 64bit/jdk1.8.0 -XX:-UseCompressedOops -XX:+UseG1GC 1 tests failed. FAILED: org.apache.solr.cloud.TestReplicaProperties.test Error Message: No live SolrServers available to handle this request:[http://127.0.0.1:56918, http://127.0.0.1:56927, http://127.0.0.1:56904, http://127.0.0.1:56913, http://127.0.0.1:56922] Stack Trace: org.apache.solr.client.solrj.SolrServerException: No live SolrServers available to handle this request:[http://127.0.0.1:56918, http://127.0.0.1:56927, http://127.0.0.1:56904, http://127.0.0.1:56913, http://127.0.0.1:56922] at __randomizedtesting.SeedInfo.seed([D0B5585D42450E30:58E16787ECB963C8]:0) at org.apache.solr.client.solrj.impl.LBHttpSolrClient.request(LBHttpSolrClient.java:352) at org.apache.solr.client.solrj.impl.CloudSolrClient.sendRequest(CloudSolrClient.java:1099) at org.apache.solr.client.solrj.impl.CloudSolrClient.requestWithRetryOnStaleState(CloudSolrClient.java:870) at org.apache.solr.client.solrj.impl.CloudSolrClient.request(CloudSolrClient.java:806) at org.apache.solr.client.solrj.SolrClient.request(SolrClient.java:1220) at org.apache.solr.cloud.ReplicaPropertiesBase.doPropertyAction(ReplicaPropertiesBase.java:51) at org.apache.solr.cloud.TestReplicaProperties.clusterAssignPropertyTest(TestReplicaProperties.java:183) at org.apache.solr.cloud.TestReplicaProperties.test(TestReplicaProperties.java:70) at sun.reflect.NativeMethodAccessorImpl.invoke0(Native Method) at sun.reflect.NativeMethodAccessorImpl.invoke(NativeMethodAccessorImpl.java:62) at sun.reflect.DelegatingMethodAccessorImpl.invoke(DelegatingMethodAccessorImpl.java:43) at java.lang.reflect.Method.invoke(Method.java:497) at com.carrotsearch.randomizedtesting.RandomizedRunner.invoke(RandomizedRunner.java:1665) at com.carrotsearch.randomizedtesting.RandomizedRunner$8.evaluate(RandomizedRunner.java:864) at com.carrotsearch.randomizedtesting.RandomizedRunner$9.evaluate(RandomizedRunner.java:900) at com.carrotsearch.randomizedtesting.RandomizedRunner$10.evaluate(RandomizedRunner.java:914) at org.apache.solr.BaseDistributedSearchTestCase$ShardsRepeatRule$ShardsFixedStatement.callStatement(BaseDistributedSearchTestCase.java:963) at org.apache.solr.BaseDistributedSearchTestCase$ShardsRepeatRule$ShardsStatement.evaluate(BaseDistributedSearchTestCase.java:938) at com.carrotsearch.randomizedtesting.rules.SystemPropertiesRestoreRule$1.evaluate(SystemPropertiesRestoreRule.java:57) at org.apache.lucene.util.TestRuleSetupTeardownChained$1.evaluate(TestRuleSetupTeardownChained.java:50) at org.apache.lucene.util.AbstractBeforeAfterRule$1.evaluate(AbstractBeforeAfterRule.java:46) at org.apache.lucene.util.TestRuleThreadAndTestName$1.evaluate(TestRuleThreadAndTestName.java:49) at org.apache.lucene.util.TestRuleIgnoreAfterMaxFailures$1.evaluate(TestRuleIgnoreAfterMaxFailures.java:65) at org.apache.lucene.util.TestRuleMarkFailure$1.evaluate(TestRuleMarkFailure.java:48) at com.carrotsearch.randomizedtesting.rules.StatementAdapter.evaluate(StatementAdapter.java:36) at com.carrotsearch.randomizedtesting.ThreadLeakControl$StatementRunner.run(ThreadLeakControl.java:367) at com.carrotsearch.randomizedtesting.ThreadLeakControl.forkTimeoutingTask(ThreadLeakControl.java:809) at com.carrotsearch.randomizedtesting.ThreadLeakControl$3.evaluate(ThreadLeakControl.java:460) at com.carrotsearch.randomizedtesting.RandomizedRunner.runSingleTest(RandomizedRunner.java:873) at com.carrotsearch.randomizedtesting.RandomizedRunner$5.evaluate(RandomizedRunner.java:775) at com.carrotsearch.randomizedtesting.RandomizedRunner$6.evaluate(RandomizedRunner.java:809) at com.carrotsearch.randomizedtesting.RandomizedRunner$7.evaluate(RandomizedRunner.java:820) at com.carrotsearch.randomizedtesting.rules.StatementAdapter.evaluate(StatementAdapter.java:36) at com.carrotsearch.randomizedtesting.rules.SystemPropertiesRestoreRule$1.evaluate(SystemPropertiesRestoreRule.java:57) at org.apache.lucene.util.AbstractBeforeAfterRule$1.evaluate(AbstractBeforeAfterRule.java:46) at com.carrotsearch.randomizedtesting.rules.StatementAdapter.evaluate(StatementAdapter.java:36) at org.apache.lucene.util.TestRuleStoreClassName$1.evaluate(TestRuleStoreClassName.java:42) at com.carrotsearch.randomizedtesting.rules.NoShadowingOrOverridesOnMethodsRule$1.evaluate(NoShadowingOrOverridesOnMethodsRule.java:39) at com.carrotsearch.randomizedtesting.rules.NoShadowingOrOverridesOnMethodsRule$1.evaluate(NoShadowingOrOverridesOnMethodsRule.java:39) at com.carrotsearch.randomizedtesting.rules.StatementAdapter.evaluate(StatementAdapter.java:36) at com.carrotsearch.randomizedtesting.rules.StatementAdapter.evaluate(StatementAdapter.java:36) at com.carrotsearch.randomizedtesting.rules.StatementAdapter.evaluate(StatementAdapter.java:36) at org.apache.lucene.util.TestRuleAssertionsRequired$1.evaluate(TestRuleAssertionsRequired.java:54) at org.apache.lucene.util.TestRuleMarkFailure$1.evaluate(TestRuleMarkFailure.java:48) at org.apache.lucene.util.TestRuleIgnoreAfterMaxFailures$1.evaluate(TestRuleIgnoreAfterMaxFailures.java:65) at org.apache.lucene.util.TestRuleIgnoreTestSuites$1.evaluate(TestRuleIgnoreTestSuites.java:55) at com.carrotsearch.randomizedtesting.rules.StatementAdapter.evaluate(StatementAdapter.java:36) at com.carrotsearch.randomizedtesting.ThreadLeakControl$StatementRunner.run(ThreadLeakControl.java:367) at java.lang.Thread.run(Thread.java:745) Caused by: org.apache.solr.client.solrj.impl.HttpSolrClient$RemoteSolrException: Error from server at http://127.0.0.1:56927: Expected mime type application/octet-stream but got text/html. Error 500

HTTP ERROR: 500

Problem accessing /admin/collections. Reason:

    {trace=java.lang.AssertionError
	at org.apache.solr.common.util.ByteUtils.UTF8toUTF16(ByteUtils.java:42)
	at org.apache.solr.common.util.ByteUtils.UTF8toUTF16(ByteUtils.java:70)
	at org.apache.solr.common.util.Utils.fromJSON(Utils.java:97)
	at org.apache.solr.common.cloud.ZkNodeProps.load(ZkNodeProps.java:81)
	at org.apache.solr.cloud.OverseerTaskQueue.containsTaskWithRequestId(OverseerTaskQueue.java:66)
	at org.apache.solr.handler.admin.CollectionsHandler.overseerCollectionQueueContains(CollectionsHandler.java:256)
	at org.apache.solr.handler.admin.CollectionsHandler.handleResponse(CollectionsHandler.java:211)
	at org.apache.solr.handler.admin.CollectionsHandler.handleResponse(CollectionsHandler.java:191)
	at org.apache.solr.handler.admin.RebalanceLeaders.rejoinElection(RebalanceLeaders.java:270)
	at org.apache.solr.handler.admin.RebalanceLeaders.ensurePreferredIsLeader(RebalanceLeaders.java:188)
	at org.apache.solr.handler.admin.RebalanceLeaders.execute(RebalanceLeaders.java:95)
	at org.apache.solr.handler.admin.CollectionsHandler$CollectionOperation$23.call(CollectionsHandler.java:685)
	at org.apache.solr.handler.admin.CollectionsHandler.handleRequestBody(CollectionsHandler.java:166)
	at org.apache.solr.handler.RequestHandlerBase.handleRequest(RequestHandlerBase.java:151)
	at org.apache.solr.servlet.HttpSolrCall.handleAdminRequest(HttpSolrCall.java:673)
	at org.apache.solr.servlet.HttpSolrCall.call(HttpSolrCall.java:441)
	at org.apache.solr.servlet.SolrDispatchFilter.doFilter(SolrDispatchFilter.java:220)
	at org.apache.solr.servlet.SolrDispatchFilter.doFilter(SolrDispatchFilter.java:179)
	at org.eclipse.jetty.servlet.ServletHandler$CachedChain.doFilter(ServletHandler.java:1652)
	at org.apache.solr.client.solrj.embedded.JettySolrRunner$DebugFilter.doFilter(JettySolrRunner.java:109)
	at org.eclipse.jetty.servlet.ServletHandler$CachedChain.doFilter(ServletHandler.java:1652)
	at org.eclipse.jetty.servlets.UserAgentFilter.doFilter(UserAgentFilter.java:83)
	at org.eclipse.jetty.servlets.GzipFilter.doFilter(GzipFilter.java:364)
	at org.eclipse.jetty.servlet.ServletHandler$CachedChain.doFilter(ServletHandler.java:1652)
	at org.eclipse.jetty.servlet.ServletHandler.doHandle(ServletHandler.java:585)
	at org.eclipse.jetty.server.session.SessionHandler.doHandle(SessionHandler.java:221)
	at org.eclipse.jetty.server.handler.ContextHandler.doHandle(ContextHandler.java:1127)
	at org.eclipse.jetty.servlet.ServletHandler.doScope(ServletHandler.java:515)
	at org.eclipse.jetty.server.session.SessionHandler.doScope(SessionHandler.java:185)
	at org.eclipse.jetty.server.handler.ContextHandler.doScope(ContextHandler.java:1061)
	at org.eclipse.jetty.server.handler.ScopedHandler.handle(ScopedHandler.java:141)
	at org.eclipse.jetty.server.handler.HandlerWrapper.handle(HandlerWrapper.java:97)
	at org.eclipse.jetty.server.Server.handle(Server.java:499)
	at org.eclipse.jetty.server.HttpChannel.handle(HttpChannel.java:310)
	at org.eclipse.jetty.server.HttpConnection.onFillable(HttpConnection.java:257)
	at org.eclipse.jetty.io.AbstractConnection$2.run(AbstractConnection.java:540)
	at org.eclipse.jetty.util.thread.QueuedThreadPool.runJob(QueuedThreadPool.java:635)
	at org.eclipse.jetty.util.thread.QueuedThreadPool$3.run(QueuedThreadPool.java:555)
	at java.lang.Thread.run(Thread.java:745)
,code=500}


Powered by Jetty:// at org.apache.solr.client.solrj.impl.HttpSolrClient.executeMethod(HttpSolrClient.java:543) at org.apache.solr.client.solrj.impl.HttpSolrClient.request(HttpSolrClient.java:241) at org.apache.solr.client.solrj.impl.HttpSolrClient.request(HttpSolrClient.java:230) at org.apache.solr.client.solrj.impl.LBHttpSolrClient.doRequest(LBHttpSolrClient.java:372) at org.apache.solr.client.solrj.impl.LBHttpSolrClient.request(LBHttpSolrClient.java:341) ... 48 more Build Log: [...truncated 10932 lines...] [junit4] Suite: org.apache.solr.cloud.TestReplicaProperties [junit4] 2> Creating dataDir: /Users/jenkins/workspace/Lucene-Solr-5.x-MacOSX/solr/build/solr-core/test/J0/temp/solr.cloud.TestReplicaProperties_D0B5585D42450E30-001/init-core-data-001 [junit4] 2> 2425724 INFO (SUITE-TestReplicaProperties-seed#[D0B5585D42450E30]-worker) [ ] o.a.s.SolrTestCaseJ4 Randomized ssl (false) and clientAuth (false) [junit4] 2> 2425724 INFO (SUITE-TestReplicaProperties-seed#[D0B5585D42450E30]-worker) [ ] o.a.s.BaseDistributedSearchTestCase Setting hostContext system property: / [junit4] 2> 2425726 INFO (TEST-TestReplicaProperties.test-seed#[D0B5585D42450E30]) [ ] o.a.s.c.ZkTestServer STARTING ZK TEST SERVER [junit4] 2> 2425727 INFO (Thread-6475) [ ] o.a.s.c.ZkTestServer client port:0.0.0.0/0.0.0.0:0 [junit4] 2> 2425727 INFO (Thread-6475) [ ] o.a.s.c.ZkTestServer Starting server [junit4] 2> 2425828 INFO (TEST-TestReplicaProperties.test-seed#[D0B5585D42450E30]) [ ] o.a.s.c.ZkTestServer start zk server on port:56901 [junit4] 2> 2425828 INFO (TEST-TestReplicaProperties.test-seed#[D0B5585D42450E30]) [ ] o.a.s.c.c.SolrZkClient Using default ZkCredentialsProvider [junit4] 2> 2425829 INFO (TEST-TestReplicaProperties.test-seed#[D0B5585D42450E30]) [ ] o.a.s.c.c.ConnectionManager Waiting for client to connect to ZooKeeper [junit4] 2> 2425837 INFO (zkCallback-1953-thread-1) [ ] o.a.s.c.c.ConnectionManager Watcher org.apache.solr.common.cloud.ConnectionManager@4be95968 name:ZooKeeperConnection Watcher:127.0.0.1:56901 got event WatchedEvent state:SyncConnected type:None path:null path:null type:None [junit4] 2> 2425838 INFO (TEST-TestReplicaProperties.test-seed#[D0B5585D42450E30]) [ ] o.a.s.c.c.ConnectionManager Client is connected to ZooKeeper [junit4] 2> 2425841 INFO (TEST-TestReplicaProperties.test-seed#[D0B5585D42450E30]) [ ] o.a.s.c.c.SolrZkClient Using default ZkACLProvider [junit4] 2> 2425842 INFO (TEST-TestReplicaProperties.test-seed#[D0B5585D42450E30]) [ ] o.a.s.c.c.SolrZkClient makePath: /solr [junit4] 2> 2425856 INFO (TEST-TestReplicaProperties.test-seed#[D0B5585D42450E30]) [ ] o.a.s.c.c.SolrZkClient Using default ZkCredentialsProvider [junit4] 2> 2425859 INFO (TEST-TestReplicaProperties.test-seed#[D0B5585D42450E30]) [ ] o.a.s.c.c.ConnectionManager Waiting for client to connect to ZooKeeper [junit4] 2> 2425863 INFO (zkCallback-1954-thread-1) [ ] o.a.s.c.c.ConnectionManager Watcher org.apache.solr.common.cloud.ConnectionManager@2ecd4229 name:ZooKeeperConnection Watcher:127.0.0.1:56901/solr got event WatchedEvent state:SyncConnected type:None path:null path:null type:None [junit4] 2> 2425863 INFO (TEST-TestReplicaProperties.test-seed#[D0B5585D42450E30]) [ ] o.a.s.c.c.ConnectionManager Client is connected to ZooKeeper [junit4] 2> 2425864 INFO (TEST-TestReplicaProperties.test-seed#[D0B5585D42450E30]) [ ] o.a.s.c.c.SolrZkClient Using default ZkACLProvider [junit4] 2> 2425864 INFO (TEST-TestReplicaProperties.test-seed#[D0B5585D42450E30]) [ ] o.a.s.c.c.SolrZkClient makePath: /collections/collection1 [junit4] 2> 2425870 INFO (TEST-TestReplicaProperties.test-seed#[D0B5585D42450E30]) [ ] o.a.s.c.c.SolrZkClient makePath: /collections/collection1/shards [junit4] 2> 2425874 INFO (TEST-TestReplicaProperties.test-seed#[D0B5585D42450E30]) [ ] o.a.s.c.c.SolrZkClient makePath: /collections/control_collection [junit4] 2> 2425877 INFO (TEST-TestReplicaProperties.test-seed#[D0B5585D42450E30]) [ ] o.a.s.c.c.SolrZkClient makePath: /collections/control_collection/shards [junit4] 2> 2425881 INFO (TEST-TestReplicaProperties.test-seed#[D0B5585D42450E30]) [ ] o.a.s.c.AbstractZkTestCase put /Users/jenkins/workspace/Lucene-Solr-5.x-MacOSX/solr/core/src/test-files/solr/collection1/conf/solrconfig-tlog.xml to /configs/conf1/solrconfig.xml [junit4] 2> 2425882 INFO (TEST-TestReplicaProperties.test-seed#[D0B5585D42450E30]) [ ] o.a.s.c.c.SolrZkClient makePath: /configs/conf1/solrconfig.xml [junit4] 2> 2425887 INFO (TEST-TestReplicaProperties.test-seed#[D0B5585D42450E30]) [ ] o.a.s.c.AbstractZkTestCase put /Users/jenkins/workspace/Lucene-Solr-5.x-MacOSX/solr/core/src/test-files/solr/collection1/conf/schema15.xml to /configs/conf1/schema.xml [junit4] 2> 2425887 INFO (TEST-TestReplicaProperties.test-seed#[D0B5585D42450E30]) [ ] o.a.s.c.c.SolrZkClient makePath: /configs/conf1/schema.xml [junit4] 2> 2425891 INFO (TEST-TestReplicaProperties.test-seed#[D0B5585D42450E30]) [ ] o.a.s.c.AbstractZkTestCase put /Users/jenkins/workspace/Lucene-Solr-5.x-MacOSX/solr/core/src/test-files/solr/collection1/conf/solrconfig.snippet.randomindexconfig.xml to /configs/conf1/solrconfig.snippet.randomindexconfig.xml [junit4] 2> 2425891 INFO (TEST-TestReplicaProperties.test-seed#[D0B5585D42450E30]) [ ] o.a.s.c.c.SolrZkClient makePath: /configs/conf1/solrconfig.snippet.randomindexconfig.xml [junit4] 2> 2425895 INFO (TEST-TestReplicaProperties.test-seed#[D0B5585D42450E30]) [ ] o.a.s.c.AbstractZkTestCase put /Users/jenkins/workspace/Lucene-Solr-5.x-MacOSX/solr/core/src/test-files/solr/collection1/conf/stopwords.txt to /configs/conf1/stopwords.txt [junit4] 2> 2425895 INFO (TEST-TestReplicaProperties.test-seed#[D0B5585D42450E30]) [ ] o.a.s.c.c.SolrZkClient makePath: /configs/conf1/stopwords.txt [junit4] 2> 2425899 INFO (TEST-TestReplicaProperties.test-seed#[D0B5585D42450E30]) [ ] o.a.s.c.AbstractZkTestCase put /Users/jenkins/workspace/Lucene-Solr-5.x-MacOSX/solr/core/src/test-files/solr/collection1/conf/protwords.txt to /configs/conf1/protwords.txt [junit4] 2> 2425900 INFO (TEST-TestReplicaProperties.test-seed#[D0B5585D42450E30]) [ ] o.a.s.c.c.SolrZkClient makePath: /configs/conf1/protwords.txt [junit4] 2> 2425904 INFO (TEST-TestReplicaProperties.test-seed#[D0B5585D42450E30]) [ ] o.a.s.c.AbstractZkTestCase put /Users/jenkins/workspace/Lucene-Solr-5.x-MacOSX/solr/core/src/test-files/solr/collection1/conf/currency.xml to /configs/conf1/currency.xml [junit4] 2> 2425904 INFO (TEST-TestReplicaProperties.test-seed#[D0B5585D42450E30]) [ ] o.a.s.c.c.SolrZkClient makePath: /configs/conf1/currency.xml [junit4] 2> 2425908 INFO (TEST-TestReplicaProperties.test-seed#[D0B5585D42450E30]) [ ] o.a.s.c.AbstractZkTestCase put /Users/jenkins/workspace/Lucene-Solr-5.x-MacOSX/solr/core/src/test-files/solr/collection1/conf/enumsConfig.xml to /configs/conf1/enumsConfig.xml [junit4] 2> 2425908 INFO (TEST-TestReplicaProperties.test-seed#[D0B5585D42450E30]) [ ] o.a.s.c.c.SolrZkClient makePath: /configs/conf1/enumsConfig.xml [junit4] 2> 2425912 INFO (TEST-TestReplicaProperties.test-seed#[D0B5585D42450E30]) [ ] o.a.s.c.AbstractZkTestCase put /Users/jenkins/workspace/Lucene-Solr-5.x-MacOSX/solr/core/src/test-files/solr/collection1/conf/open-exchange-rates.json to /configs/conf1/open-exchange-rates.json [junit4] 2> 2425913 INFO (TEST-TestReplicaProperties.test-seed#[D0B5585D42450E30]) [ ] o.a.s.c.c.SolrZkClient makePath: /configs/conf1/open-exchange-rates.json [junit4] 2> 2425916 INFO (TEST-TestReplicaProperties.test-seed#[D0B5585D42450E30]) [ ] o.a.s.c.AbstractZkTestCase put /Users/jenkins/workspace/Lucene-Solr-5.x-MacOSX/solr/core/src/test-files/solr/collection1/conf/mapping-ISOLatin1Accent.txt to /configs/conf1/mapping-ISOLatin1Accent.txt [junit4] 2> 2425917 INFO (TEST-TestReplicaProperties.test-seed#[D0B5585D42450E30]) [ ] o.a.s.c.c.SolrZkClient makePath: /configs/conf1/mapping-ISOLatin1Accent.txt [junit4] 2> 2425921 INFO (TEST-TestReplicaProperties.test-seed#[D0B5585D42450E30]) [ ] o.a.s.c.AbstractZkTestCase put /Users/jenkins/workspace/Lucene-Solr-5.x-MacOSX/solr/core/src/test-files/solr/collection1/conf/old_synonyms.txt to /configs/conf1/old_synonyms.txt [junit4] 2> 2425921 INFO (TEST-TestReplicaProperties.test-seed#[D0B5585D42450E30]) [ ] o.a.s.c.c.SolrZkClient makePath: /configs/conf1/old_synonyms.txt [junit4] 2> 2425924 INFO (TEST-TestReplicaProperties.test-seed#[D0B5585D42450E30]) [ ] o.a.s.c.AbstractZkTestCase put /Users/jenkins/workspace/Lucene-Solr-5.x-MacOSX/solr/core/src/test-files/solr/collection1/conf/synonyms.txt to /configs/conf1/synonyms.txt [junit4] 2> 2425925 INFO (TEST-TestReplicaProperties.test-seed#[D0B5585D42450E30]) [ ] o.a.s.c.c.SolrZkClient makePath: /configs/conf1/synonyms.txt [junit4] 2> 2426176 INFO (TEST-TestReplicaProperties.test-seed#[D0B5585D42450E30]) [ ] o.a.s.SolrTestCaseJ4 Writing core.properties file to /Users/jenkins/workspace/Lucene-Solr-5.x-MacOSX/solr/build/solr-core/test/J0/temp/solr.cloud.TestReplicaProperties_D0B5585D42450E30-001/control-001/cores/collection1 [junit4] 2> 2426178 INFO (TEST-TestReplicaProperties.test-seed#[D0B5585D42450E30]) [ ] o.e.j.s.Server jetty-9.2.13.v20150730 [junit4] 2> 2426181 INFO (TEST-TestReplicaProperties.test-seed#[D0B5585D42450E30]) [ ] o.e.j.s.h.ContextHandler Started o.e.j.s.ServletContextHandler@228268a7{/,null,AVAILABLE} [junit4] 2> 2426181 INFO (TEST-TestReplicaProperties.test-seed#[D0B5585D42450E30]) [ ] o.e.j.s.ServerConnector Started ServerConnector@5da6c083{HTTP/1.1}{127.0.0.1:56904} [junit4] 2> 2426181 INFO (TEST-TestReplicaProperties.test-seed#[D0B5585D42450E30]) [ ] o.e.j.s.Server Started @2430507ms [junit4] 2> 2426181 INFO (TEST-TestReplicaProperties.test-seed#[D0B5585D42450E30]) [ ] o.a.s.c.s.e.JettySolrRunner Jetty properties: {solr.data.dir=/Users/jenkins/workspace/Lucene-Solr-5.x-MacOSX/solr/build/solr-core/test/J0/temp/solr.cloud.TestReplicaProperties_D0B5585D42450E30-001/tempDir-001/control/data, hostContext=/, hostPort=56904, coreRootDirectory=/Users/jenkins/workspace/Lucene-Solr-5.x-MacOSX/solr/build/solr-core/test/J0/temp/solr.cloud.TestReplicaProperties_D0B5585D42450E30-001/control-001/cores} [junit4] 2> 2426182 INFO (TEST-TestReplicaProperties.test-seed#[D0B5585D42450E30]) [ ] o.a.s.s.SolrDispatchFilter SolrDispatchFilter.init(): sun.misc.Launcher$AppClassLoader@74a14482 [junit4] 2> 2426182 INFO (TEST-TestReplicaProperties.test-seed#[D0B5585D42450E30]) [ ] o.a.s.c.SolrResourceLoader new SolrResourceLoader for directory: '/Users/jenkins/workspace/Lucene-Solr-5.x-MacOSX/solr/build/solr-core/test/J0/temp/solr.cloud.TestReplicaProperties_D0B5585D42450E30-001/control-001/' [junit4] 2> 2426212 INFO (TEST-TestReplicaProperties.test-seed#[D0B5585D42450E30]) [ ] o.a.s.c.c.SolrZkClient Using default ZkCredentialsProvider [junit4] 2> 2426213 INFO (TEST-TestReplicaProperties.test-seed#[D0B5585D42450E30]) [ ] o.a.s.c.c.ConnectionManager Waiting for client to connect to ZooKeeper [junit4] 2> 2426215 INFO (zkCallback-1955-thread-1) [ ] o.a.s.c.c.ConnectionManager Watcher org.apache.solr.common.cloud.ConnectionManager@615aa83b name:ZooKeeperConnection Watcher:127.0.0.1:56901/solr got event WatchedEvent state:SyncConnected type:None path:null path:null type:None [junit4] 2> 2426215 INFO (TEST-TestReplicaProperties.test-seed#[D0B5585D42450E30]) [ ] o.a.s.c.c.ConnectionManager Client is connected to ZooKeeper [junit4] 2> 2426216 INFO (TEST-TestReplicaProperties.test-seed#[D0B5585D42450E30]) [ ] o.a.s.c.c.SolrZkClient Using default ZkACLProvider [junit4] 2> 2426218 INFO (TEST-TestReplicaProperties.test-seed#[D0B5585D42450E30]) [ ] o.a.s.s.SolrDispatchFilter Loading solr.xml from SolrHome (not found in ZooKeeper) [junit4] 2> 2426218 INFO (TEST-TestReplicaProperties.test-seed#[D0B5585D42450E30]) [ ] o.a.s.c.SolrXmlConfig Loading container configuration from /Users/jenkins/workspace/Lucene-Solr-5.x-MacOSX/solr/build/solr-core/test/J0/temp/solr.cloud.TestReplicaProperties_D0B5585D42450E30-001/control-001/solr.xml [junit4] 2> 2426233 INFO (TEST-TestReplicaProperties.test-seed#[D0B5585D42450E30]) [ ] o.a.s.c.CoresLocator Config-defined core root directory: /Users/jenkins/workspace/Lucene-Solr-5.x-MacOSX/solr/build/solr-core/test/J0/temp/solr.cloud.TestReplicaProperties_D0B5585D42450E30-001/control-001/cores [junit4] 2> 2426233 INFO (TEST-TestReplicaProperties.test-seed#[D0B5585D42450E30]) [ ] o.a.s.c.CoreContainer New CoreContainer 311745922 [junit4] 2> 2426233 INFO (TEST-TestReplicaProperties.test-seed#[D0B5585D42450E30]) [ ] o.a.s.c.CoreContainer Loading cores into CoreContainer [instanceDir=/Users/jenkins/workspace/Lucene-Solr-5.x-MacOSX/solr/build/solr-core/test/J0/temp/solr.cloud.TestReplicaProperties_D0B5585D42450E30-001/control-001/] [junit4] 2> 2426233 INFO (TEST-TestReplicaProperties.test-seed#[D0B5585D42450E30]) [ ] o.a.s.c.CoreContainer loading shared library: /Users/jenkins/workspace/Lucene-Solr-5.x-MacOSX/solr/build/solr-core/test/J0/temp/solr.cloud.TestReplicaProperties_D0B5585D42450E30-001/control-001/lib [junit4] 2> 2426234 WARN (TEST-TestReplicaProperties.test-seed#[D0B5585D42450E30]) [ ] o.a.s.c.SolrResourceLoader Can't find (or read) directory to add to classloader: lib (resolved as: /Users/jenkins/workspace/Lucene-Solr-5.x-MacOSX/solr/build/solr-core/test/J0/temp/solr.cloud.TestReplicaProperties_D0B5585D42450E30-001/control-001/lib). [junit4] 2> 2426243 INFO (TEST-TestReplicaProperties.test-seed#[D0B5585D42450E30]) [ ] o.a.s.h.c.HttpShardHandlerFactory created with socketTimeout : 90000,urlScheme : ,connTimeout : 15000,maxConnectionsPerHost : 20,maxConnections : 10000,corePoolSize : 0,maximumPoolSize : 2147483647,maxThreadIdleTime : 5,sizeOfQueue : -1,fairnessPolicy : false,useRetries : false, [junit4] 2> 2426247 INFO (TEST-TestReplicaProperties.test-seed#[D0B5585D42450E30]) [ ] o.a.s.u.UpdateShardHandler Creating UpdateShardHandler HTTP client with params: socketTimeout=340000&connTimeout=45000&retry=true [junit4] 2> 2426248 INFO (TEST-TestReplicaProperties.test-seed#[D0B5585D42450E30]) [ ] o.a.s.l.LogWatcher SLF4J impl is org.slf4j.impl.Log4jLoggerFactory [junit4] 2> 2426248 INFO (TEST-TestReplicaProperties.test-seed#[D0B5585D42450E30]) [ ] o.a.s.l.LogWatcher Registering Log Listener [Log4j (org.slf4j.impl.Log4jLoggerFactory)] [junit4] 2> 2426248 INFO (TEST-TestReplicaProperties.test-seed#[D0B5585D42450E30]) [ ] o.a.s.c.ZkContainer Zookeeper client=127.0.0.1:56901/solr [junit4] 2> 2426248 INFO (TEST-TestReplicaProperties.test-seed#[D0B5585D42450E30]) [ ] o.a.s.c.ZkController zkHost includes chroot [junit4] 2> 2426248 INFO (TEST-TestReplicaProperties.test-seed#[D0B5585D42450E30]) [ ] o.a.s.c.c.SolrZkClient Using default ZkCredentialsProvider [junit4] 2> 2426249 INFO (TEST-TestReplicaProperties.test-seed#[D0B5585D42450E30]) [ ] o.a.s.c.c.ConnectionManager Waiting for client to connect to ZooKeeper [junit4] 2> 2426250 INFO (zkCallback-1957-thread-1) [ ] o.a.s.c.c.ConnectionManager Watcher org.apache.solr.common.cloud.ConnectionManager@72734e45 name:ZooKeeperConnection Watcher:127.0.0.1:56901 got event WatchedEvent state:SyncConnected type:None path:null path:null type:None [junit4] 2> 2426251 INFO (TEST-TestReplicaProperties.test-seed#[D0B5585D42450E30]) [ ] o.a.s.c.c.ConnectionManager Client is connected to ZooKeeper [junit4] 2> 2426251 INFO (TEST-TestReplicaProperties.test-seed#[D0B5585D42450E30]) [ ] o.a.s.c.c.SolrZkClient Using default ZkACLProvider [junit4] 2> 2426254 INFO (TEST-TestReplicaProperties.test-seed#[D0B5585D42450E30]) [n:127.0.0.1:56904_ ] o.a.s.c.c.ConnectionManager Waiting for client to connect to ZooKeeper [junit4] 2> 2426255 INFO (zkCallback-1958-thread-1-processing-n:127.0.0.1:56904_) [n:127.0.0.1:56904_ ] o.a.s.c.c.ConnectionManager Watcher org.apache.solr.common.cloud.ConnectionManager@1d8d076b name:ZooKeeperConnection Watcher:127.0.0.1:56901/solr got event WatchedEvent state:SyncConnected type:None path:null path:null type:None [junit4] 2> 2426255 INFO (TEST-TestReplicaProperties.test-seed#[D0B5585D42450E30]) [n:127.0.0.1:56904_ ] o.a.s.c.c.ConnectionManager Client is connected to ZooKeeper [junit4] 2> 2426261 INFO (TEST-TestReplicaProperties.test-seed#[D0B5585D42450E30]) [n:127.0.0.1:56904_ ] o.a.s.c.c.SolrZkClient makePath: /overseer/queue [junit4] 2> 2426266 INFO (TEST-TestReplicaProperties.test-seed#[D0B5585D42450E30]) [n:127.0.0.1:56904_ ] o.a.s.c.c.SolrZkClient makePath: /overseer/collection-queue-work [junit4] 2> 2426273 INFO (TEST-TestReplicaProperties.test-seed#[D0B5585D42450E30]) [n:127.0.0.1:56904_ ] o.a.s.c.c.SolrZkClient makePath: /overseer/collection-map-running [junit4] 2> 2426278 INFO (TEST-TestReplicaProperties.test-seed#[D0B5585D42450E30]) [n:127.0.0.1:56904_ ] o.a.s.c.c.SolrZkClient makePath: /overseer/collection-map-completed [junit4] 2> 2426284 INFO (TEST-TestReplicaProperties.test-seed#[D0B5585D42450E30]) [n:127.0.0.1:56904_ ] o.a.s.c.c.SolrZkClient makePath: /overseer/collection-map-failure [junit4] 2> 2426289 INFO (TEST-TestReplicaProperties.test-seed#[D0B5585D42450E30]) [n:127.0.0.1:56904_ ] o.a.s.c.c.SolrZkClient makePath: /live_nodes [junit4] 2> 2426292 INFO (TEST-TestReplicaProperties.test-seed#[D0B5585D42450E30]) [n:127.0.0.1:56904_ ] o.a.s.c.c.SolrZkClient makePath: /aliases.json [junit4] 2> 2426295 INFO (TEST-TestReplicaProperties.test-seed#[D0B5585D42450E30]) [n:127.0.0.1:56904_ ] o.a.s.c.c.SolrZkClient makePath: /clusterstate.json [junit4] 2> 2426298 INFO (TEST-TestReplicaProperties.test-seed#[D0B5585D42450E30]) [n:127.0.0.1:56904_ ] o.a.s.c.c.SolrZkClient makePath: /security.json [junit4] 2> 2426300 INFO (TEST-TestReplicaProperties.test-seed#[D0B5585D42450E30]) [n:127.0.0.1:56904_ ] o.a.s.c.ZkController Register node as live in ZooKeeper:/live_nodes/127.0.0.1:56904_ [junit4] 2> 2426301 INFO (TEST-TestReplicaProperties.test-seed#[D0B5585D42450E30]) [n:127.0.0.1:56904_ ] o.a.s.c.c.SolrZkClient makePath: /live_nodes/127.0.0.1:56904_ [junit4] 2> 2426306 INFO (TEST-TestReplicaProperties.test-seed#[D0B5585D42450E30]) [n:127.0.0.1:56904_ ] o.a.s.c.c.SolrZkClient makePath: /overseer_elect [junit4] 2> 2426309 INFO (TEST-TestReplicaProperties.test-seed#[D0B5585D42450E30]) [n:127.0.0.1:56904_ ] o.a.s.c.c.SolrZkClient makePath: /overseer_elect/election [junit4] 2> 2426312 INFO (TEST-TestReplicaProperties.test-seed#[D0B5585D42450E30]) [n:127.0.0.1:56904_ ] o.a.s.c.Overseer Overseer (id=null) closing [junit4] 2> 2426313 INFO (TEST-TestReplicaProperties.test-seed#[D0B5585D42450E30]) [n:127.0.0.1:56904_ ] o.a.s.c.LeaderElector Joined leadership election with path: /overseer_elect/election/94576559722856452-127.0.0.1:56904_-n_0000000000 [junit4] 2> 2426313 INFO (TEST-TestReplicaProperties.test-seed#[D0B5585D42450E30]) [n:127.0.0.1:56904_ ] o.a.s.c.OverseerElectionContext I am going to be the leader 127.0.0.1:56904_ [junit4] 2> 2426313 INFO (TEST-TestReplicaProperties.test-seed#[D0B5585D42450E30]) [n:127.0.0.1:56904_ ] o.a.s.c.c.SolrZkClient makePath: /overseer_elect/leader [junit4] 2> 2426316 INFO (TEST-TestReplicaProperties.test-seed#[D0B5585D42450E30]) [n:127.0.0.1:56904_ ] o.a.s.c.Overseer Overseer (id=94576559722856452-127.0.0.1:56904_-n_0000000000) starting [junit4] 2> 2426321 INFO (TEST-TestReplicaProperties.test-seed#[D0B5585D42450E30]) [n:127.0.0.1:56904_ ] o.a.s.c.c.SolrZkClient makePath: /overseer/queue-work [junit4] 2> 2426334 INFO (TEST-TestReplicaProperties.test-seed#[D0B5585D42450E30]) [n:127.0.0.1:56904_ ] o.a.s.c.OverseerAutoReplicaFailoverThread Starting OverseerAutoReplicaFailoverThread autoReplicaFailoverWorkLoopDelay=10000 autoReplicaFailoverWaitAfterExpiration=30000 autoReplicaFailoverBadNodeExpiration=60000 [junit4] 2> 2426335 INFO (OverseerCollectionConfigSetProcessor-94576559722856452-127.0.0.1:56904_-n_0000000000) [n:127.0.0.1:56904_ ] o.a.s.c.OverseerTaskProcessor Process current queue of overseer operations [junit4] 2> 2426335 INFO (TEST-TestReplicaProperties.test-seed#[D0B5585D42450E30]) [n:127.0.0.1:56904_ ] o.a.s.c.c.ZkStateReader Updating cluster state from ZooKeeper... [junit4] 2> 2426335 INFO (OverseerStateUpdate-94576559722856452-127.0.0.1:56904_-n_0000000000) [n:127.0.0.1:56904_ ] o.a.s.c.Overseer Starting to work on the main queue [junit4] 2> 2426363 INFO (TEST-TestReplicaProperties.test-seed#[D0B5585D42450E30]) [n:127.0.0.1:56904_ ] o.a.s.c.CoreContainer Security conf doesn't exist. Skipping setup for authorization module. [junit4] 2> 2426364 INFO (TEST-TestReplicaProperties.test-seed#[D0B5585D42450E30]) [n:127.0.0.1:56904_ ] o.a.s.c.CoreContainer No authentication plugin used. [junit4] 2> 2426367 INFO (TEST-TestReplicaProperties.test-seed#[D0B5585D42450E30]) [n:127.0.0.1:56904_ ] o.a.s.c.CoresLocator Looking for core definitions underneath /Users/jenkins/workspace/Lucene-Solr-5.x-MacOSX/solr/build/solr-core/test/J0/temp/solr.cloud.TestReplicaProperties_D0B5585D42450E30-001/control-001/cores [junit4] 2> 2426368 INFO (TEST-TestReplicaProperties.test-seed#[D0B5585D42450E30]) [n:127.0.0.1:56904_ ] o.a.s.c.SolrCore Created CoreDescriptor: {name=collection1, config=solrconfig.xml, transient=false, schema=schema.xml, loadOnStartup=true, configSetProperties=configsetprops.json, instanceDir=/Users/jenkins/workspace/Lucene-Solr-5.x-MacOSX/solr/build/solr-core/test/J0/temp/solr.cloud.TestReplicaProperties_D0B5585D42450E30-001/control-001/cores/collection1, collection=control_collection, absoluteInstDir=/Users/jenkins/workspace/Lucene-Solr-5.x-MacOSX/solr/build/solr-core/test/J0/temp/solr.cloud.TestReplicaProperties_D0B5585D42450E30-001/control-001/cores/collection1/, coreNodeName=, dataDir=data/, shard=} [junit4] 2> 2426369 INFO (TEST-TestReplicaProperties.test-seed#[D0B5585D42450E30]) [n:127.0.0.1:56904_ ] o.a.s.c.CoresLocator Found core collection1 in /Users/jenkins/workspace/Lucene-Solr-5.x-MacOSX/solr/build/solr-core/test/J0/temp/solr.cloud.TestReplicaProperties_D0B5585D42450E30-001/control-001/cores/collection1/ [junit4] 2> 2426369 INFO (TEST-TestReplicaProperties.test-seed#[D0B5585D42450E30]) [n:127.0.0.1:56904_ ] o.a.s.c.CoresLocator Found 1 core definitions [junit4] 2> 2426371 INFO (TEST-TestReplicaProperties.test-seed#[D0B5585D42450E30]) [n:127.0.0.1:56904_ ] o.a.s.s.SolrDispatchFilter user.dir=/Users/jenkins/workspace/Lucene-Solr-5.x-MacOSX/solr/build/solr-core/test/J0 [junit4] 2> 2426371 INFO (TEST-TestReplicaProperties.test-seed#[D0B5585D42450E30]) [n:127.0.0.1:56904_ ] o.a.s.s.SolrDispatchFilter SolrDispatchFilter.init() done [junit4] 2> 2426371 INFO (coreLoadExecutor-7753-thread-1-processing-n:127.0.0.1:56904_) [n:127.0.0.1:56904_ c:control_collection x:collection1] o.a.s.c.ZkController publishing state=down [junit4] 2> 2426371 INFO (coreLoadExecutor-7753-thread-1-processing-n:127.0.0.1:56904_) [n:127.0.0.1:56904_ c:control_collection x:collection1] o.a.s.c.ZkController numShards not found on descriptor - reading it from system property [junit4] 2> 2426375 INFO (OverseerStateUpdate-94576559722856452-127.0.0.1:56904_-n_0000000000) [n:127.0.0.1:56904_ ] o.a.s.c.Overseer processMessage: queueSize: 1, message = { [junit4] 2> "core":"collection1", [junit4] 2> "roles":null, [junit4] 2> "base_url":"http://127.0.0.1:56904", [junit4] 2> "node_name":"127.0.0.1:56904_", [junit4] 2> "numShards":"1", [junit4] 2> "state":"down", [junit4] 2> "shard":null, [junit4] 2> "collection":"control_collection", [junit4] 2> "operation":"state"} current state version: 0 [junit4] 2> 2426375 INFO (coreLoadExecutor-7753-thread-1-processing-n:127.0.0.1:56904_) [n:127.0.0.1:56904_ c:control_collection x:collection1] o.a.s.c.ZkController look for our core node name [junit4] 2> 2426375 INFO (OverseerStateUpdate-94576559722856452-127.0.0.1:56904_-n_0000000000) [n:127.0.0.1:56904_ ] o.a.s.c.o.ReplicaMutator Update state numShards=1 message={ [junit4] 2> "core":"collection1", [junit4] 2> "roles":null, [junit4] 2> "base_url":"http://127.0.0.1:56904", [junit4] 2> "node_name":"127.0.0.1:56904_", [junit4] 2> "numShards":"1", [junit4] 2> "state":"down", [junit4] 2> "shard":null, [junit4] 2> "collection":"control_collection", [junit4] 2> "operation":"state"} [junit4] 2> 2426376 INFO (OverseerStateUpdate-94576559722856452-127.0.0.1:56904_-n_0000000000) [n:127.0.0.1:56904_ ] o.a.s.c.o.ClusterStateMutator building a new cName: control_collection [junit4] 2> 2426377 INFO (OverseerStateUpdate-94576559722856452-127.0.0.1:56904_-n_0000000000) [n:127.0.0.1:56904_ ] o.a.s.c.o.ReplicaMutator Assigning new node to shard shard=shard1 [junit4] 2> 2426380 INFO (zkCallback-1958-thread-1-processing-n:127.0.0.1:56904_) [n:127.0.0.1:56904_ ] o.a.s.c.c.ZkStateReader A cluster state change: WatchedEvent state:SyncConnected type:NodeDataChanged path:/clusterstate.json, has occurred - updating... (live nodes size: 1) [junit4] 2> 2427377 INFO (coreLoadExecutor-7753-thread-1-processing-n:127.0.0.1:56904_) [n:127.0.0.1:56904_ c:control_collection x:collection1] o.a.s.c.ZkController waiting to find shard id in clusterstate for collection1 [junit4] 2> 2427377 INFO (coreLoadExecutor-7753-thread-1-processing-n:127.0.0.1:56904_) [n:127.0.0.1:56904_ c:control_collection x:collection1] o.a.s.c.ZkController Check for collection zkNode:control_collection [junit4] 2> 2427378 INFO (coreLoadExecutor-7753-thread-1-processing-n:127.0.0.1:56904_) [n:127.0.0.1:56904_ c:control_collection x:collection1] o.a.s.c.ZkController Collection zkNode exists [junit4] 2> 2427378 INFO (coreLoadExecutor-7753-thread-1-processing-n:127.0.0.1:56904_) [n:127.0.0.1:56904_ c:control_collection x:collection1] o.a.s.c.c.ZkStateReader Load collection config from:/collections/control_collection [junit4] 2> 2427379 INFO (coreLoadExecutor-7753-thread-1-processing-n:127.0.0.1:56904_) [n:127.0.0.1:56904_ c:control_collection x:collection1] o.a.s.c.c.ZkStateReader path=/collections/control_collection configName=conf1 specified config exists in ZooKeeper [junit4] 2> 2427379 INFO (coreLoadExecutor-7753-thread-1-processing-n:127.0.0.1:56904_) [n:127.0.0.1:56904_ c:control_collection x:collection1] o.a.s.c.SolrResourceLoader new SolrResourceLoader for directory: '/Users/jenkins/workspace/Lucene-Solr-5.x-MacOSX/solr/build/solr-core/test/J0/temp/solr.cloud.TestReplicaProperties_D0B5585D42450E30-001/control-001/cores/collection1/' [junit4] 2> 2427397 INFO (coreLoadExecutor-7753-thread-1-processing-n:127.0.0.1:56904_) [n:127.0.0.1:56904_ c:control_collection x:collection1] o.a.s.c.Config loaded config solrconfig.xml with version 0 [junit4] 2> 2427407 INFO (coreLoadExecutor-7753-thread-1-processing-n:127.0.0.1:56904_) [n:127.0.0.1:56904_ c:control_collection x:collection1] o.a.s.c.SolrConfig current version of requestparams : -1 [junit4] 2> 2427412 INFO (coreLoadExecutor-7753-thread-1-processing-n:127.0.0.1:56904_) [n:127.0.0.1:56904_ c:control_collection x:collection1] o.a.s.c.SolrConfig Using Lucene MatchVersion: 5.4.0 [junit4] 2> 2427421 INFO (coreLoadExecutor-7753-thread-1-processing-n:127.0.0.1:56904_) [n:127.0.0.1:56904_ c:control_collection x:collection1] o.a.s.c.Config Loaded SolrConfig: solrconfig.xml [junit4] 2> 2427423 INFO (coreLoadExecutor-7753-thread-1-processing-n:127.0.0.1:56904_) [n:127.0.0.1:56904_ c:control_collection x:collection1] o.a.s.s.IndexSchema Reading Solr Schema from /configs/conf1/schema.xml [junit4] 2> 2427428 INFO (coreLoadExecutor-7753-thread-1-processing-n:127.0.0.1:56904_) [n:127.0.0.1:56904_ c:control_collection x:collection1] o.a.s.s.IndexSchema [collection1] Schema name=test [junit4] 2> 2427530 INFO (coreLoadExecutor-7753-thread-1-processing-n:127.0.0.1:56904_) [n:127.0.0.1:56904_ c:control_collection x:collection1] o.a.s.s.IndexSchema default search field in schema is text [junit4] 2> 2427531 INFO (coreLoadExecutor-7753-thread-1-processing-n:127.0.0.1:56904_) [n:127.0.0.1:56904_ c:control_collection x:collection1] o.a.s.s.IndexSchema unique key field: id [junit4] 2> 2427531 INFO (coreLoadExecutor-7753-thread-1-processing-n:127.0.0.1:56904_) [n:127.0.0.1:56904_ c:control_collection x:collection1] o.a.s.s.FileExchangeRateProvider Reloading exchange rates from file currency.xml [junit4] 2> 2427535 INFO (coreLoadExecutor-7753-thread-1-processing-n:127.0.0.1:56904_) [n:127.0.0.1:56904_ c:control_collection x:collection1] o.a.s.s.FileExchangeRateProvider Reloading exchange rates from file currency.xml [junit4] 2> 2427573 INFO (coreLoadExecutor-7753-thread-1-processing-n:127.0.0.1:56904_) [n:127.0.0.1:56904_ c:control_collection x:collection1] o.a.s.c.ConfigSetProperties Did not find ConfigSet properties, assuming default properties: Can't find resource 'configsetprops.json' in classpath or '/configs/conf1', cwd=/Users/jenkins/workspace/Lucene-Solr-5.x-MacOSX/solr/build/solr-core/test/J0 [junit4] 2> 2427573 INFO (coreLoadExecutor-7753-thread-1-processing-n:127.0.0.1:56904_) [n:127.0.0.1:56904_ c:control_collection x:collection1] o.a.s.c.CoreContainer Creating SolrCore 'collection1' using configuration from collection control_collection [junit4] 2> 2427573 INFO (coreLoadExecutor-7753-thread-1-processing-n:127.0.0.1:56904_) [n:127.0.0.1:56904_ c:control_collection s:shard1 r:core_node1 x:collection1] o.a.s.c.SolrCore org.apache.solr.core.MockDirectoryFactory [junit4] 2> 2427574 INFO (coreLoadExecutor-7753-thread-1-processing-n:127.0.0.1:56904_) [n:127.0.0.1:56904_ c:control_collection s:shard1 r:core_node1 x:collection1] o.a.s.c.SolrCore [[collection1] ] Opening new SolrCore at [/Users/jenkins/workspace/Lucene-Solr-5.x-MacOSX/solr/build/solr-core/test/J0/temp/solr.cloud.TestReplicaProperties_D0B5585D42450E30-001/control-001/cores/collection1/], dataDir=[null] [junit4] 2> 2427574 INFO (coreLoadExecutor-7753-thread-1-processing-n:127.0.0.1:56904_) [n:127.0.0.1:56904_ c:control_collection s:shard1 r:core_node1 x:collection1] o.a.s.c.JmxMonitoredMap JMX monitoring is enabled. Adding Solr mbeans to JMX Server: com.sun.jmx.mbeanserver.JmxMBeanServer@19c28557 [junit4] 2> 2427574 INFO (coreLoadExecutor-7753-thread-1-processing-n:127.0.0.1:56904_) [n:127.0.0.1:56904_ c:control_collection s:shard1 r:core_node1 x:collection1] o.a.s.c.CachingDirectoryFactory return new directory for /Users/jenkins/workspace/Lucene-Solr-5.x-MacOSX/solr/build/solr-core/test/J0/temp/solr.cloud.TestReplicaProperties_D0B5585D42450E30-001/control-001/cores/collection1/data [junit4] 2> 2427574 INFO (coreLoadExecutor-7753-thread-1-processing-n:127.0.0.1:56904_) [n:127.0.0.1:56904_ c:control_collection s:shard1 r:core_node1 x:collection1] o.a.s.c.SolrCore New index directory detected: old=null new=/Users/jenkins/workspace/Lucene-Solr-5.x-MacOSX/solr/build/solr-core/test/J0/temp/solr.cloud.TestReplicaProperties_D0B5585D42450E30-001/control-001/cores/collection1/data/index/ [junit4] 2> 2427575 WARN (coreLoadExecutor-7753-thread-1-processing-n:127.0.0.1:56904_) [n:127.0.0.1:56904_ c:control_collection s:shard1 r:core_node1 x:collection1] o.a.s.c.SolrCore [collection1] Solr index directory '/Users/jenkins/workspace/Lucene-Solr-5.x-MacOSX/solr/build/solr-core/test/J0/temp/solr.cloud.TestReplicaProperties_D0B5585D42450E30-001/control-001/cores/collection1/data/index' doesn't exist. Creating new index... [junit4] 2> 2427575 INFO (coreLoadExecutor-7753-thread-1-processing-n:127.0.0.1:56904_) [n:127.0.0.1:56904_ c:control_collection s:shard1 r:core_node1 x:collection1] o.a.s.c.CachingDirectoryFactory return new directory for /Users/jenkins/workspace/Lucene-Solr-5.x-MacOSX/solr/build/solr-core/test/J0/temp/solr.cloud.TestReplicaProperties_D0B5585D42450E30-001/control-001/cores/collection1/data/index [junit4] 2> 2427575 INFO (coreLoadExecutor-7753-thread-1-processing-n:127.0.0.1:56904_) [n:127.0.0.1:56904_ c:control_collection s:shard1 r:core_node1 x:collection1] o.a.s.u.RandomMergePolicy RandomMergePolicy wrapping class org.apache.lucene.index.LogByteSizeMergePolicy: [LogByteSizeMergePolicy: minMergeSize=1677721, mergeFactor=14, maxMergeSize=2147483648, maxMergeSizeForForcedMerge=9223372036854775807, calibrateSizeByDeletes=false, maxMergeDocs=2147483647, maxCFSSegmentSizeMB=8.796093022207999E12, noCFSRatio=0.8836325760451983] [junit4] 2> 2427575 INFO (coreLoadExecutor-7753-thread-1-processing-n:127.0.0.1:56904_) [n:127.0.0.1:56904_ c:control_collection s:shard1 r:core_node1 x:collection1] o.a.s.c.SolrCore SolrDeletionPolicy.onCommit: commits: num=1 [junit4] 2> commit{dir=MockDirectoryWrapper(RAMDirectory@3bce7bf1 lockFactory=org.apache.lucene.store.SingleInstanceLockFactory@254cf08f),segFN=segments_1,generation=1} [junit4] 2> 2427576 INFO (coreLoadExecutor-7753-thread-1-processing-n:127.0.0.1:56904_) [n:127.0.0.1:56904_ c:control_collection s:shard1 r:core_node1 x:collection1] o.a.s.c.SolrCore newest commit generation = 1 [junit4] 2> 2427576 INFO (OldIndexDirectoryCleanupThreadForCore-collection1) [n:127.0.0.1:56904_ c:control_collection s:shard1 r:core_node1 x:collection1] o.a.s.c.SolrCore Looking for old index directories to cleanup for core collection1 in /Users/jenkins/workspace/Lucene-Solr-5.x-MacOSX/solr/build/solr-core/test/J0/temp/solr.cloud.TestReplicaProperties_D0B5585D42450E30-001/control-001/cores/collection1/data/ [junit4] 2> 2427577 WARN (OldIndexDirectoryCleanupThreadForCore-collection1) [n:127.0.0.1:56904_ c:control_collection s:shard1 r:core_node1 x:collection1] o.a.s.c.DirectoryFactory /Users/jenkins/workspace/Lucene-Solr-5.x-MacOSX/solr/build/solr-core/test/J0/temp/solr.cloud.TestReplicaProperties_D0B5585D42450E30-001/control-001/cores/collection1/data/ does not point to a valid data directory; skipping clean-up of old index directories. [junit4] 2> 2427580 INFO (coreLoadExecutor-7753-thread-1-processing-n:127.0.0.1:56904_) [n:127.0.0.1:56904_ c:control_collection s:shard1 r:core_node1 x:collection1] o.a.s.u.p.UpdateRequestProcessorChain creating updateRequestProcessorChain "nodistrib" [junit4] 2> 2427580 INFO (coreLoadExecutor-7753-thread-1-processing-n:127.0.0.1:56904_) [n:127.0.0.1:56904_ c:control_collection s:shard1 r:core_node1 x:collection1] o.a.s.u.p.UpdateRequestProcessorChain creating updateRequestProcessorChain "dedupe" [junit4] 2> 2427580 INFO (coreLoadExecutor-7753-thread-1-processing-n:127.0.0.1:56904_) [n:127.0.0.1:56904_ c:control_collection s:shard1 r:core_node1 x:collection1] o.a.s.u.p.UpdateRequestProcessorChain inserting DistributedUpdateProcessorFactory into updateRequestProcessorChain "dedupe" [junit4] 2> 2427580 INFO (coreLoadExecutor-7753-thread-1-processing-n:127.0.0.1:56904_) [n:127.0.0.1:56904_ c:control_collection s:shard1 r:core_node1 x:collection1] o.a.s.u.p.UpdateRequestProcessorChain creating updateRequestProcessorChain "stored_sig" [junit4] 2> 2427580 INFO (coreLoadExecutor-7753-thread-1-processing-n:127.0.0.1:56904_) [n:127.0.0.1:56904_ c:control_collection s:shard1 r:core_node1 x:collection1] o.a.s.u.p.UpdateRequestProcessorChain inserting DistributedUpdateProcessorFactory into updateRequestProcessorChain "stored_sig" [junit4] 2> 2427580 INFO (coreLoadExecutor-7753-thread-1-processing-n:127.0.0.1:56904_) [n:127.0.0.1:56904_ c:control_collection s:shard1 r:core_node1 x:collection1] o.a.s.u.p.UpdateRequestProcessorChain creating updateRequestProcessorChain "distrib-dup-test-chain-explicit" [junit4] 2> 2427581 INFO (coreLoadExecutor-7753-thread-1-processing-n:127.0.0.1:56904_) [n:127.0.0.1:56904_ c:control_collection s:shard1 r:core_node1 x:collection1] o.a.s.u.p.UpdateRequestProcessorChain creating updateRequestProcessorChain "distrib-dup-test-chain-implicit" [junit4] 2> 2427581 INFO (coreLoadExecutor-7753-thread-1-processing-n:127.0.0.1:56904_) [n:127.0.0.1:56904_ c:control_collection s:shard1 r:core_node1 x:collection1] o.a.s.u.p.UpdateRequestProcessorChain inserting DistributedUpdateProcessorFactory into updateRequestProcessorChain "distrib-dup-test-chain-implicit" [junit4] 2> 2427581 INFO (coreLoadExecutor-7753-thread-1-processing-n:127.0.0.1:56904_) [n:127.0.0.1:56904_ c:control_collection s:shard1 r:core_node1 x:collection1] o.a.s.c.SolrCore no updateRequestProcessorChain defined as default, creating implicit default [junit4] 2> 2427586 INFO (coreLoadExecutor-7753-thread-1-processing-n:127.0.0.1:56904_) [n:127.0.0.1:56904_ c:control_collection s:shard1 r:core_node1 x:collection1] o.a.s.h.l.XMLLoader xsltCacheLifetimeSeconds=60 [junit4] 2> 2427587 INFO (coreLoadExecutor-7753-thread-1-processing-n:127.0.0.1:56904_) [n:127.0.0.1:56904_ c:control_collection s:shard1 r:core_node1 x:collection1] o.a.s.h.l.XMLLoader xsltCacheLifetimeSeconds=60 [junit4] 2> 2427590 INFO (coreLoadExecutor-7753-thread-1-processing-n:127.0.0.1:56904_) [n:127.0.0.1:56904_ c:control_collection s:shard1 r:core_node1 x:collection1] o.a.s.h.l.XMLLoader xsltCacheLifetimeSeconds=60 [junit4] 2> 2427591 INFO (coreLoadExecutor-7753-thread-1-processing-n:127.0.0.1:56904_) [n:127.0.0.1:56904_ c:control_collection s:shard1 r:core_node1 x:collection1] o.a.s.h.l.XMLLoader xsltCacheLifetimeSeconds=60 [junit4] 2> 2427595 INFO (coreLoadExecutor-7753-thread-1-processing-n:127.0.0.1:56904_) [n:127.0.0.1:56904_ c:control_collection s:shard1 r:core_node1 x:collection1] o.a.s.c.RequestHandlers Registered paths: /admin/mbeans,standard,/update/csv,/update/json/docs,/admin/luke,/admin/segments,/get,/admin/system,/replication,/admin/properties,/config,/schema,/admin/plugins,/admin/logging,/update/json,/admin/threads,/admin/ping,/update,/admin/file [junit4] 2> 2427595 INFO (coreLoadExecutor-7753-thread-1-processing-n:127.0.0.1:56904_) [n:127.0.0.1:56904_ c:control_collection s:shard1 r:core_node1 x:collection1] o.a.s.c.SolrCore Using default statsCache cache: org.apache.solr.search.stats.LocalStatsCache [junit4] 2> 2427596 INFO (coreLoadExecutor-7753-thread-1-processing-n:127.0.0.1:56904_) [n:127.0.0.1:56904_ c:control_collection s:shard1 r:core_node1 x:collection1] o.a.s.u.UpdateHandler Using UpdateLog implementation: org.apache.solr.update.UpdateLog [junit4] 2> 2427596 INFO (coreLoadExecutor-7753-thread-1-processing-n:127.0.0.1:56904_) [n:127.0.0.1:56904_ c:control_collection s:shard1 r:core_node1 x:collection1] o.a.s.u.UpdateLog Initializing UpdateLog: dataDir= defaultSyncLevel=FLUSH numRecordsToKeep=100 maxNumLogsToKeep=10 numVersionBuckets=65536 [junit4] 2> 2427598 INFO (coreLoadExecutor-7753-thread-1-processing-n:127.0.0.1:56904_) [n:127.0.0.1:56904_ c:control_collection s:shard1 r:core_node1 x:collection1] o.a.s.c.SolrCore Hard AutoCommit: disabled [junit4] 2> 2427599 INFO (coreLoadExecutor-7753-thread-1-processing-n:127.0.0.1:56904_) [n:127.0.0.1:56904_ c:control_collection s:shard1 r:core_node1 x:collection1] o.a.s.c.SolrCore Soft AutoCommit: disabled [junit4] 2> 2427599 INFO (coreLoadExecutor-7753-thread-1-processing-n:127.0.0.1:56904_) [n:127.0.0.1:56904_ c:control_collection s:shard1 r:core_node1 x:collection1] o.a.s.u.RandomMergePolicy RandomMergePolicy wrapping class org.apache.lucene.index.LogDocMergePolicy: [LogDocMergePolicy: minMergeSize=1000, mergeFactor=25, maxMergeSize=9223372036854775807, maxMergeSizeForForcedMerge=9223372036854775807, calibrateSizeByDeletes=true, maxMergeDocs=2147483647, maxCFSSegmentSizeMB=8.796093022207999E12, noCFSRatio=0.6895218518532426] [junit4] 2> 2427599 INFO (coreLoadExecutor-7753-thread-1-processing-n:127.0.0.1:56904_) [n:127.0.0.1:56904_ c:control_collection s:shard1 r:core_node1 x:collection1] o.a.s.c.SolrCore SolrDeletionPolicy.onInit: commits: num=1 [junit4] 2> commit{dir=MockDirectoryWrapper(RAMDirectory@3bce7bf1 lockFactory=org.apache.lucene.store.SingleInstanceLockFactory@254cf08f),segFN=segments_1,generation=1} [junit4] 2> 2427599 INFO (coreLoadExecutor-7753-thread-1-processing-n:127.0.0.1:56904_) [n:127.0.0.1:56904_ c:control_collection s:shard1 r:core_node1 x:collection1] o.a.s.c.SolrCore newest commit generation = 1 [junit4] 2> 2427599 INFO (coreLoadExecutor-7753-thread-1-processing-n:127.0.0.1:56904_) [n:127.0.0.1:56904_ c:control_collection s:shard1 r:core_node1 x:collection1] o.a.s.s.SolrIndexSearcher Opening Searcher@4f34fd22[collection1] main [junit4] 2> 2427600 INFO (coreLoadExecutor-7753-thread-1-processing-n:127.0.0.1:56904_) [n:127.0.0.1:56904_ c:control_collection s:shard1 r:core_node1 x:collection1] o.a.s.c.c.ZkStateReader Load collection config from:/collections/control_collection [junit4] 2> 2427602 INFO (coreLoadExecutor-7753-thread-1-processing-n:127.0.0.1:56904_) [n:127.0.0.1:56904_ c:control_collection s:shard1 r:core_node1 x:collection1] o.a.s.c.c.ZkStateReader path=/collections/control_collection configName=conf1 specified config exists in ZooKeeper [junit4] 2> 2427602 INFO (coreLoadExecutor-7753-thread-1-processing-n:127.0.0.1:56904_) [n:127.0.0.1:56904_ c:control_collection s:shard1 r:core_node1 x:collection1] o.a.s.r.ManagedResourceStorage Setting up ZooKeeper-based storage for the RestManager with znodeBase: /configs/conf1 [junit4] 2> 2427602 INFO (coreLoadExecutor-7753-thread-1-processing-n:127.0.0.1:56904_) [n:127.0.0.1:56904_ c:control_collection s:shard1 r:core_node1 x:collection1] o.a.s.r.ManagedResourceStorage Configured ZooKeeperStorageIO with znodeBase: /configs/conf1 [junit4] 2> 2427602 INFO (coreLoadExecutor-7753-thread-1-processing-n:127.0.0.1:56904_) [n:127.0.0.1:56904_ c:control_collection s:shard1 r:core_node1 x:collection1] o.a.s.r.RestManager Initializing RestManager with initArgs: {} [junit4] 2> 2427603 INFO (coreLoadExecutor-7753-thread-1-processing-n:127.0.0.1:56904_) [n:127.0.0.1:56904_ c:control_collection s:shard1 r:core_node1 x:collection1] o.a.s.r.ManagedResourceStorage Reading _rest_managed.json using ZooKeeperStorageIO:path=/configs/conf1 [junit4] 2> 2427603 INFO (coreLoadExecutor-7753-thread-1-processing-n:127.0.0.1:56904_) [n:127.0.0.1:56904_ c:control_collection s:shard1 r:core_node1 x:collection1] o.a.s.r.ManagedResourceStorage No data found for znode /configs/conf1/_rest_managed.json [junit4] 2> 2427603 INFO (coreLoadExecutor-7753-thread-1-processing-n:127.0.0.1:56904_) [n:127.0.0.1:56904_ c:control_collection s:shard1 r:core_node1 x:collection1] o.a.s.r.ManagedResourceStorage Loaded null at path _rest_managed.json using ZooKeeperStorageIO:path=/configs/conf1 [junit4] 2> 2427604 INFO (coreLoadExecutor-7753-thread-1-processing-n:127.0.0.1:56904_) [n:127.0.0.1:56904_ c:control_collection s:shard1 r:core_node1 x:collection1] o.a.s.r.RestManager Initializing 0 registered ManagedResources [junit4] 2> 2427604 INFO (coreLoadExecutor-7753-thread-1-processing-n:127.0.0.1:56904_) [n:127.0.0.1:56904_ c:control_collection s:shard1 r:core_node1 x:collection1] o.a.s.h.ReplicationHandler Commits will be reserved for 10000 [junit4] 2> 2427604 INFO (searcherExecutor-7754-thread-1-processing-n:127.0.0.1:56904_ x:collection1 s:shard1 c:control_collection r:core_node1) [n:127.0.0.1:56904_ c:control_collection s:shard1 r:core_node1 x:collection1] o.a.s.c.SolrCore [collection1] Registered new searcher Searcher@4f34fd22[collection1] main{ExitableDirectoryReader(UninvertingDirectoryReader())} [junit4] 2> 2427604 INFO (coreLoadExecutor-7753-thread-1-processing-n:127.0.0.1:56904_) [n:127.0.0.1:56904_ c:control_collection s:shard1 r:core_node1 x:collection1] o.a.s.u.UpdateLog Looking up max value of version field to seed version buckets [junit4] 2> 2427604 INFO (coreLoadExecutor-7753-thread-1-processing-n:127.0.0.1:56904_) [n:127.0.0.1:56904_ c:control_collection s:shard1 r:core_node1 x:collection1] o.a.s.u.VersionInfo Refreshing highest value of _version_ for 65536 version buckets from index [junit4] 2> 2427605 INFO (coreLoadExecutor-7753-thread-1-processing-n:127.0.0.1:56904_) [n:127.0.0.1:56904_ c:control_collection s:shard1 r:core_node1 x:collection1] o.a.s.u.VersionInfo No terms found for _version_, cannot seed version bucket highest value from index [junit4] 2> 2427605 INFO (coreLoadExecutor-7753-thread-1-processing-n:127.0.0.1:56904_) [n:127.0.0.1:56904_ c:control_collection s:shard1 r:core_node1 x:collection1] o.a.s.u.UpdateLog Could not find max version in index or recent updates, using new clock 1513224957531783168 [junit4] 2> 2427607 INFO (coreLoadExecutor-7753-thread-1-processing-n:127.0.0.1:56904_) [n:127.0.0.1:56904_ c:control_collection s:shard1 r:core_node1 x:collection1] o.a.s.u.UpdateLog Took 2.0ms to seed version buckets with highest version 1513224957531783168 [junit4] 2> 2427607 INFO (coreLoadExecutor-7753-thread-1-processing-n:127.0.0.1:56904_) [n:127.0.0.1:56904_ c:control_collection s:shard1 r:core_node1 x:collection1] o.a.s.c.ZkController watch zkdir /configs/conf1 [junit4] 2> 2427608 INFO (coreLoadExecutor-7753-thread-1-processing-n:127.0.0.1:56904_) [n:127.0.0.1:56904_ c:control_collection s:shard1 r:core_node1 x:collection1] o.a.s.c.CoreContainer registering core: collection1 [junit4] 2> 2427609 INFO (coreZkRegister-7747-thread-1-processing-n:127.0.0.1:56904_ x:collection1 s:shard1 c:control_collection r:core_node1) [n:127.0.0.1:56904_ c:control_collection s:shard1 r:core_node1 x:collection1] o.a.s.c.ZkController Register replica - core:collection1 address:http://127.0.0.1:56904 collection:control_collection shard:shard1 [junit4] 2> 2427610 INFO (coreZkRegister-7747-thread-1-processing-n:127.0.0.1:56904_ x:collection1 s:shard1 c:control_collection r:core_node1) [n:127.0.0.1:56904_ c:control_collection s:shard1 r:core_node1 x:collection1] o.a.s.c.c.SolrZkClient makePath: /collections/control_collection/leader_elect/shard1/election [junit4] 2> 2427618 INFO (coreZkRegister-7747-thread-1-processing-n:127.0.0.1:56904_ x:collection1 s:shard1 c:control_collection r:core_node1) [n:127.0.0.1:56904_ c:control_collection s:shard1 r:core_node1 x:collection1] o.a.s.c.LeaderElector Joined leadership election with path: /collections/control_collection/leader_elect/shard1/election/94576559722856452-core_node1-n_0000000000 [junit4] 2> 2427619 INFO (coreZkRegister-7747-thread-1-processing-n:127.0.0.1:56904_ x:collection1 s:shard1 c:control_collection r:core_node1) [n:127.0.0.1:56904_ c:control_collection s:shard1 r:core_node1 x:collection1] o.a.s.c.ShardLeaderElectionContext Running the leader process for shard shard1 [junit4] 2> 2427622 INFO (coreZkRegister-7747-thread-1-processing-n:127.0.0.1:56904_ x:collection1 s:shard1 c:control_collection r:core_node1) [n:127.0.0.1:56904_ c:control_collection s:shard1 r:core_node1 x:collection1] o.a.s.c.ShardLeaderElectionContext Enough replicas found to continue. [junit4] 2> 2427622 INFO (coreZkRegister-7747-thread-1-processing-n:127.0.0.1:56904_ x:collection1 s:shard1 c:control_collection r:core_node1) [n:127.0.0.1:56904_ c:control_collection s:shard1 r:core_node1 x:collection1] o.a.s.c.ShardLeaderElectionContext I may be the new leader - try and sync [junit4] 2> 2427622 INFO (coreZkRegister-7747-thread-1-processing-n:127.0.0.1:56904_ x:collection1 s:shard1 c:control_collection r:core_node1) [n:127.0.0.1:56904_ c:control_collection s:shard1 r:core_node1 x:collection1] o.a.s.c.SyncStrategy Sync replicas to http://127.0.0.1:56904/collection1/ [junit4] 2> 2427622 INFO (coreZkRegister-7747-thread-1-processing-n:127.0.0.1:56904_ x:collection1 s:shard1 c:control_collection r:core_node1) [n:127.0.0.1:56904_ c:control_collection s:shard1 r:core_node1 x:collection1] o.a.s.c.SyncStrategy Sync Success - now sync replicas to me [junit4] 2> 2427622 INFO (coreZkRegister-7747-thread-1-processing-n:127.0.0.1:56904_ x:collection1 s:shard1 c:control_collection r:core_node1) [n:127.0.0.1:56904_ c:control_collection s:shard1 r:core_node1 x:collection1] o.a.s.c.SyncStrategy http://127.0.0.1:56904/collection1/ has no replicas [junit4] 2> 2427622 INFO (coreZkRegister-7747-thread-1-processing-n:127.0.0.1:56904_ x:collection1 s:shard1 c:control_collection r:core_node1) [n:127.0.0.1:56904_ c:control_collection s:shard1 r:core_node1 x:collection1] o.a.s.c.ShardLeaderElectionContext I am the new leader: http://127.0.0.1:56904/collection1/ shard1 [junit4] 2> 2427622 INFO (OverseerStateUpdate-94576559722856452-127.0.0.1:56904_-n_0000000000) [n:127.0.0.1:56904_ ] o.a.s.c.Overseer processMessage: queueSize: 1, message = { [junit4] 2> "operation":"leader", [junit4] 2> "shard":"shard1", [junit4] 2> "collection":"control_collection"} current state version: 1 [junit4] 2> 2427623 INFO (coreZkRegister-7747-thread-1-processing-n:127.0.0.1:56904_ x:collection1 s:shard1 c:control_collection r:core_node1) [n:127.0.0.1:56904_ c:control_collection s:shard1 r:core_node1 x:collection1] o.a.s.c.c.SolrZkClient makePath: /collections/control_collection/leaders/shard1 [junit4] 2> 2427628 INFO (coreZkRegister-7747-thread-1-processing-n:127.0.0.1:56904_ x:collection1 s:shard1 c:control_collection r:core_node1) [n:127.0.0.1:56904_ c:control_collection s:shard1 r:core_node1 x:collection1] o.a.s.c.ShardLeaderElectionContextBase Creating leader registration node [junit4] 2> 2427633 INFO (OverseerStateUpdate-94576559722856452-127.0.0.1:56904_-n_0000000000) [n:127.0.0.1:56904_ ] o.a.s.c.Overseer processMessage: queueSize: 1, message = { [junit4] 2> "operation":"leader", [junit4] 2> "shard":"shard1", [junit4] 2> "collection":"control_collection", [junit4] 2> "base_url":"http://127.0.0.1:56904", [junit4] 2> "core":"collection1", [junit4] 2> "state":"active"} current state version: 1 [junit4] 2> 2427738 INFO (zkCallback-1958-thread-1-processing-n:127.0.0.1:56904_) [n:127.0.0.1:56904_ ] o.a.s.c.c.ZkStateReader A cluster state change: WatchedEvent state:SyncConnected type:NodeDataChanged path:/clusterstate.json, has occurred - updating... (live nodes size: 1) [junit4] 2> 2427788 INFO (coreZkRegister-7747-thread-1-processing-n:127.0.0.1:56904_ x:collection1 s:shard1 c:control_collection r:core_node1) [n:127.0.0.1:56904_ c:control_collection s:shard1 r:core_node1 x:collection1] o.a.s.c.ZkController We are http://127.0.0.1:56904/collection1/ and leader is http://127.0.0.1:56904/collection1/ [junit4] 2> 2427788 INFO (coreZkRegister-7747-thread-1-processing-n:127.0.0.1:56904_ x:collection1 s:shard1 c:control_collection r:core_node1) [n:127.0.0.1:56904_ c:control_collection s:shard1 r:core_node1 x:collection1] o.a.s.c.ZkController No LogReplay needed for core=collection1 baseURL=http://127.0.0.1:56904 [junit4] 2> 2427788 INFO (coreZkRegister-7747-thread-1-processing-n:127.0.0.1:56904_ x:collection1 s:shard1 c:control_collection r:core_node1) [n:127.0.0.1:56904_ c:control_collection s:shard1 r:core_node1 x:collection1] o.a.s.c.ZkController I am the leader, no recovery necessary [junit4] 2> 2427788 INFO (coreZkRegister-7747-thread-1-processing-n:127.0.0.1:56904_ x:collection1 s:shard1 c:control_collection r:core_node1) [n:127.0.0.1:56904_ c:control_collection s:shard1 r:core_node1 x:collection1] o.a.s.c.ZkController publishing state=active [junit4] 2> 2427788 INFO (coreZkRegister-7747-thread-1-processing-n:127.0.0.1:56904_ x:collection1 s:shard1 c:control_collection r:core_node1) [n:127.0.0.1:56904_ c:control_collection s:shard1 r:core_node1 x:collection1] o.a.s.c.ZkController numShards not found on descriptor - reading it from system property [junit4] 2> 2427791 INFO (OverseerStateUpdate-94576559722856452-127.0.0.1:56904_-n_0000000000) [n:127.0.0.1:56904_ ] o.a.s.c.Overseer processMessage: queueSize: 1, message = { [junit4] 2> "core":"collection1", [junit4] 2> "core_node_name":"core_node1", [junit4] 2> "roles":null, [junit4] 2> "base_url":"http://127.0.0.1:56904", [junit4] 2> "node_name":"127.0.0.1:56904_", [junit4] 2> "numShards":"1", [junit4] 2> "state":"active", [junit4] 2> "shard":"shard1", [junit4] 2> "collection":"control_collection", [junit4] 2> "operation":"state"} current state version: 2 [junit4] 2> 2427793 INFO (OverseerStateUpdate-94576559722856452-127.0.0.1:56904_-n_0000000000) [n:127.0.0.1:56904_ ] o.a.s.c.o.ReplicaMutator Update state numShards=1 message={ [junit4] 2> "core":"collection1", [junit4] 2> "core_node_name":"core_node1", [junit4] 2> "roles":null, [junit4] 2> "base_url":"http://127.0.0.1:56904", [junit4] 2> "node_name":"127.0.0.1:56904_", [junit4] 2> "numShards":"1", [junit4] 2> "state":"active", [junit4] 2> "shard":"shard1", [junit4] 2> "collection":"control_collection", [junit4] 2> "operation":"state"} [junit4] 2> 2427876 INFO (TEST-TestReplicaProperties.test-seed#[D0B5585D42450E30]) [ ] o.a.s.c.c.SolrZkClient Using default ZkCredentialsProvider [junit4] 2> 2427877 INFO (TEST-TestReplicaProperties.test-seed#[D0B5585D42450E30]) [ ] o.a.s.c.c.ConnectionManager Waiting for client to connect to ZooKeeper [junit4] 2> 2427878 INFO (zkCallback-1960-thread-1) [ ] o.a.s.c.c.ConnectionManager Watcher org.apache.solr.common.cloud.ConnectionManager@5744f333 name:ZooKeeperConnection Watcher:127.0.0.1:56901/solr got event WatchedEvent state:SyncConnected type:None path:null path:null type:None [junit4] 2> 2427878 INFO (TEST-TestReplicaProperties.test-seed#[D0B5585D42450E30]) [ ] o.a.s.c.c.ConnectionManager Client is connected to ZooKeeper [junit4] 2> 2427878 INFO (TEST-TestReplicaProperties.test-seed#[D0B5585D42450E30]) [ ] o.a.s.c.c.SolrZkClient Using default ZkACLProvider [junit4] 2> 2427878 INFO (TEST-TestReplicaProperties.test-seed#[D0B5585D42450E30]) [ ] o.a.s.c.c.ZkStateReader Updating cluster state from ZooKeeper... [junit4] 2> 2427884 INFO (TEST-TestReplicaProperties.test-seed#[D0B5585D42450E30]) [ ] o.a.s.c.ChaosMonkey monkey: init - expire sessions:false cause connection loss:false [junit4] 2> 2427898 INFO (zkCallback-1958-thread-1-processing-n:127.0.0.1:56904_) [n:127.0.0.1:56904_ ] o.a.s.c.c.ZkStateReader A cluster state change: WatchedEvent state:SyncConnected type:NodeDataChanged path:/clusterstate.json, has occurred - updating... (live nodes size: 1) [junit4] 2> 2427898 INFO (zkCallback-1960-thread-1) [ ] o.a.s.c.c.ZkStateReader A cluster state change: WatchedEvent state:SyncConnected type:NodeDataChanged path:/clusterstate.json, has occurred - updating... (live nodes size: 1) [junit4] 2> 2428120 INFO (TEST-TestReplicaProperties.test-seed#[D0B5585D42450E30]) [ ] o.a.s.SolrTestCaseJ4 Writing core.properties file to /Users/jenkins/workspace/Lucene-Solr-5.x-MacOSX/solr/build/solr-core/test/J0/temp/solr.cloud.TestReplicaProperties_D0B5585D42450E30-001/shard-1-001/cores/collection1 [junit4] 2> 2428121 INFO (TEST-TestReplicaProperties.test-seed#[D0B5585D42450E30]) [ ] o.a.s.c.AbstractFullDistribZkTestBase create jetty 1 in directory /Users/jenkins/workspace/Lucene-Solr-5.x-MacOSX/solr/build/solr-core/test/J0/temp/solr.cloud.TestReplicaProperties_D0B5585D42450E30-001/shard-1-001 [junit4] 2> 2428122 INFO (TEST-TestReplicaProperties.test-seed#[D0B5585D42450E30]) [ ] o.e.j.s.Server jetty-9.2.13.v20150730 [junit4] 2> 2428125 INFO (TEST-TestReplicaProperties.test-seed#[D0B5585D42450E30]) [ ] o.e.j.s.h.ContextHandler Started o.e.j.s.ServletContextHandler@44896bd3{/,null,AVAILABLE} [junit4] 2> 2428126 INFO (TEST-TestReplicaProperties.test-seed#[D0B5585D42450E30]) [ ] o.e.j.s.ServerConnector Started ServerConnector@fb44802{HTTP/1.1}{127.0.0.1:56913} [junit4] 2> 2428126 INFO (TEST-TestReplicaProperties.test-seed#[D0B5585D42450E30]) [ ] o.e.j.s.Server Started @2432452ms [junit4] 2> 2428126 INFO (TEST-TestReplicaProperties.test-seed#[D0B5585D42450E30]) [ ] o.a.s.c.s.e.JettySolrRunner Jetty properties: {solr.data.dir=/Users/jenkins/workspace/Lucene-Solr-5.x-MacOSX/solr/build/solr-core/test/J0/temp/solr.cloud.TestReplicaProperties_D0B5585D42450E30-001/tempDir-001/jetty1, solrconfig=solrconfig.xml, hostContext=/, hostPort=56913, coreRootDirectory=/Users/jenkins/workspace/Lucene-Solr-5.x-MacOSX/solr/build/solr-core/test/J0/temp/solr.cloud.TestReplicaProperties_D0B5585D42450E30-001/shard-1-001/cores} [junit4] 2> 2428126 INFO (TEST-TestReplicaProperties.test-seed#[D0B5585D42450E30]) [ ] o.a.s.s.SolrDispatchFilter SolrDispatchFilter.init(): sun.misc.Launcher$AppClassLoader@74a14482 [junit4] 2> 2428126 INFO (TEST-TestReplicaProperties.test-seed#[D0B5585D42450E30]) [ ] o.a.s.c.SolrResourceLoader new SolrResourceLoader for directory: '/Users/jenkins/workspace/Lucene-Solr-5.x-MacOSX/solr/build/solr-core/test/J0/temp/solr.cloud.TestReplicaProperties_D0B5585D42450E30-001/shard-1-001/' [junit4] 2> 2428146 INFO (TEST-TestReplicaProperties.test-seed#[D0B5585D42450E30]) [ ] o.a.s.c.c.SolrZkClient Using default ZkCredentialsProvider [junit4] 2> 2428147 INFO (TEST-TestReplicaProperties.test-seed#[D0B5585D42450E30]) [ ] o.a.s.c.c.ConnectionManager Waiting for client to connect to ZooKeeper [junit4] 2> 2428148 INFO (zkCallback-1961-thread-1) [ ] o.a.s.c.c.ConnectionManager Watcher org.apache.solr.common.cloud.ConnectionManager@45fbac1b name:ZooKeeperConnection Watcher:127.0.0.1:56901/solr got event WatchedEvent state:SyncConnected type:None path:null path:null type:None [junit4] 2> 2428148 INFO (TEST-TestReplicaProperties.test-seed#[D0B5585D42450E30]) [ ] o.a.s.c.c.ConnectionManager Client is connected to ZooKeeper [junit4] 2> 2428149 INFO (TEST-TestReplicaProperties.test-seed#[D0B5585D42450E30]) [ ] o.a.s.c.c.SolrZkClient Using default ZkACLProvider [junit4] 2> 2428151 INFO (TEST-TestReplicaProperties.test-seed#[D0B5585D42450E30]) [ ] o.a.s.s.SolrDispatchFilter Loading solr.xml from SolrHome (not found in ZooKeeper) [junit4] 2> 2428151 INFO (TEST-TestReplicaProperties.test-seed#[D0B5585D42450E30]) [ ] o.a.s.c.SolrXmlConfig Loading container configuration from /Users/jenkins/workspace/Lucene-Solr-5.x-MacOSX/solr/build/solr-core/test/J0/temp/solr.cloud.TestReplicaProperties_D0B5585D42450E30-001/shard-1-001/solr.xml [junit4] 2> 2428156 INFO (TEST-TestReplicaProperties.test-seed#[D0B5585D42450E30]) [ ] o.a.s.c.CoresLocator Config-defined core root directory: /Users/jenkins/workspace/Lucene-Solr-5.x-MacOSX/solr/build/solr-core/test/J0/temp/solr.cloud.TestReplicaProperties_D0B5585D42450E30-001/shard-1-001/cores [junit4] 2> 2428156 INFO (TEST-TestReplicaProperties.test-seed#[D0B5585D42450E30]) [ ] o.a.s.c.CoreContainer New CoreContainer 1589067658 [junit4] 2> 2428156 INFO (TEST-TestReplicaProperties.test-seed#[D0B5585D42450E30]) [ ] o.a.s.c.CoreContainer Loading cores into CoreContainer [instanceDir=/Users/jenkins/workspace/Lucene-Solr-5.x-MacOSX/solr/build/solr-core/test/J0/temp/solr.cloud.TestReplicaProperties_D0B5585D42450E30-001/shard-1-001/] [junit4] 2> 2428157 INFO (TEST-TestReplicaProperties.test-seed#[D0B5585D42450E30]) [ ] o.a.s.c.CoreContainer loading shared library: /Users/jenkins/workspace/Lucene-Solr-5.x-MacOSX/solr/build/solr-core/test/J0/temp/solr.cloud.TestReplicaProperties_D0B5585D42450E30-001/shard-1-001/lib [junit4] 2> 2428157 WARN (TEST-TestReplicaProperties.test-seed#[D0B5585D42450E30]) [ ] o.a.s.c.SolrResourceLoader Can't find (or read) directory to add to classloader: lib (resolved as: /Users/jenkins/workspace/Lucene-Solr-5.x-MacOSX/solr/build/solr-core/test/J0/temp/solr.cloud.TestReplicaProperties_D0B5585D42450E30-001/shard-1-001/lib). [junit4] 2> 2428164 INFO (TEST-TestReplicaProperties.test-seed#[D0B5585D42450E30]) [ ] o.a.s.h.c.HttpShardHandlerFactory created with socketTimeout : 90000,urlScheme : ,connTimeout : 15000,maxConnectionsPerHost : 20,maxConnections : 10000,corePoolSize : 0,maximumPoolSize : 2147483647,maxThreadIdleTime : 5,sizeOfQueue : -1,fairnessPolicy : false,useRetries : false, [junit4] 2> 2428166 INFO (TEST-TestReplicaProperties.test-seed#[D0B5585D42450E30]) [ ] o.a.s.u.UpdateShardHandler Creating UpdateShardHandler HTTP client with params: socketTimeout=340000&connTimeout=45000&retry=true [junit4] 2> 2428166 INFO (TEST-TestReplicaProperties.test-seed#[D0B5585D42450E30]) [ ] o.a.s.l.LogWatcher SLF4J impl is org.slf4j.impl.Log4jLoggerFactory [junit4] 2> 2428166 INFO (TEST-TestReplicaProperties.test-seed#[D0B5585D42450E30]) [ ] o.a.s.l.LogWatcher Registering Log Listener [Log4j (org.slf4j.impl.Log4jLoggerFactory)] [junit4] 2> 2428166 INFO (TEST-TestReplicaProperties.test-seed#[D0B5585D42450E30]) [ ] o.a.s.c.ZkContainer Zookeeper client=127.0.0.1:56901/solr [junit4] 2> 2428166 INFO (TEST-TestReplicaProperties.test-seed#[D0B5585D42450E30]) [ ] o.a.s.c.ZkController zkHost includes chroot [junit4] 2> 2428166 INFO (TEST-TestReplicaProperties.test-seed#[D0B5585D42450E30]) [ ] o.a.s.c.c.SolrZkClient Using default ZkCredentialsProvider [junit4] 2> 2428167 INFO (TEST-TestReplicaProperties.test-seed#[D0B5585D42450E30]) [ ] o.a.s.c.c.ConnectionManager Waiting for client to connect to ZooKeeper [junit4] 2> 2428169 INFO (zkCallback-1963-thread-1) [ ] o.a.s.c.c.ConnectionManager Watcher org.apache.solr.common.cloud.ConnectionManager@4b5be85b name:ZooKeeperConnection Watcher:127.0.0.1:56901 got event WatchedEvent state:SyncConnected type:None path:null path:null type:None [junit4] 2> 2428169 INFO (TEST-TestReplicaProperties.test-seed#[D0B5585D42450E30]) [ ] o.a.s.c.c.ConnectionManager Client is connected to ZooKeeper [junit4] 2> 2428169 INFO (TEST-TestReplicaProperties.test-seed#[D0B5585D42450E30]) [ ] o.a.s.c.c.SolrZkClient Using default ZkACLProvider [junit4] 2> 2428172 INFO (TEST-TestReplicaProperties.test-seed#[D0B5585D42450E30]) [n:127.0.0.1:56913_ ] o.a.s.c.c.ConnectionManager Waiting for client to connect to ZooKeeper [junit4] 2> 2428173 INFO (zkCallback-1964-thread-1-processing-n:127.0.0.1:56913_) [n:127.0.0.1:56913_ ] o.a.s.c.c.ConnectionManager Watcher org.apache.solr.common.cloud.ConnectionManager@696ed8ff name:ZooKeeperConnection Watcher:127.0.0.1:56901/solr got event WatchedEvent state:SyncConnected type:None path:null path:null type:None [junit4] 2> 2428173 INFO (TEST-TestReplicaProperties.test-seed#[D0B5585D42450E30]) [n:127.0.0.1:56913_ ] o.a.s.c.c.ConnectionManager Client is connected to ZooKeeper [junit4] 2> 2428183 INFO (TEST-TestReplicaProperties.test-seed#[D0B5585D42450E30]) [n:127.0.0.1:56913_ ] o.a.s.c.c.ZkStateReader Updating cluster state from ZooKeeper... [junit4] 2> 2429197 INFO (TEST-TestReplicaProperties.test-seed#[D0B5585D42450E30]) [n:127.0.0.1:56913_ ] o.a.s.c.ZkController Register node as live in ZooKeeper:/live_nodes/127.0.0.1:56913_ [junit4] 2> 2429197 INFO (TEST-TestReplicaProperties.test-seed#[D0B5585D42450E30]) [n:127.0.0.1:56913_ ] o.a.s.c.c.SolrZkClient makePath: /live_nodes/127.0.0.1:56913_ [junit4] 2> 2429199 INFO (zkCallback-1964-thread-1-processing-n:127.0.0.1:56913_) [n:127.0.0.1:56913_ ] o.a.s.c.c.ZkStateReader A live node change: WatchedEvent state:SyncConnected type:NodeChildrenChanged path:/live_nodes, has occurred - updating... (live nodes size: 1) [junit4] 2> 2429199 INFO (zkCallback-1958-thread-1-processing-n:127.0.0.1:56904_) [n:127.0.0.1:56904_ ] o.a.s.c.c.ZkStateReader A live node change: WatchedEvent state:SyncConnected type:NodeChildrenChanged path:/live_nodes, has occurred - updating... (live nodes size: 1) [junit4] 2> 2429200 INFO (zkCallback-1960-thread-1) [ ] o.a.s.c.c.ZkStateReader A live node change: WatchedEvent state:SyncConnected type:NodeChildrenChanged path:/live_nodes, has occurred - updating... (live nodes size: 1) [junit4] 2> 2429202 INFO (TEST-TestReplicaProperties.test-seed#[D0B5585D42450E30]) [n:127.0.0.1:56913_ ] o.a.s.c.Overseer Overseer (id=null) closing [junit4] 2> 2429203 INFO (TEST-TestReplicaProperties.test-seed#[D0B5585D42450E30]) [n:127.0.0.1:56913_ ] o.a.s.c.LeaderElector Joined leadership election with path: /overseer_elect/election/94576559722856456-127.0.0.1:56913_-n_0000000001 [junit4] 2> 2429204 INFO (TEST-TestReplicaProperties.test-seed#[D0B5585D42450E30]) [n:127.0.0.1:56913_ ] o.a.s.c.LeaderElector Watching path /overseer_elect/election/94576559722856452-127.0.0.1:56904_-n_0000000000 to know if I could be the leader [junit4] 2> 2429212 INFO (TEST-TestReplicaProperties.test-seed#[D0B5585D42450E30]) [n:127.0.0.1:56913_ ] o.a.s.c.CoreContainer Security conf doesn't exist. Skipping setup for authorization module. [junit4] 2> 2429212 INFO (TEST-TestReplicaProperties.test-seed#[D0B5585D42450E30]) [n:127.0.0.1:56913_ ] o.a.s.c.CoreContainer No authentication plugin used. [junit4] 2> 2429213 INFO (TEST-TestReplicaProperties.test-seed#[D0B5585D42450E30]) [n:127.0.0.1:56913_ ] o.a.s.c.CoresLocator Looking for core definitions underneath /Users/jenkins/workspace/Lucene-Solr-5.x-MacOSX/solr/build/solr-core/test/J0/temp/solr.cloud.TestReplicaProperties_D0B5585D42450E30-001/shard-1-001/cores [junit4] 2> 2429214 INFO (TEST-TestReplicaProperties.test-seed#[D0B5585D42450E30]) [n:127.0.0.1:56913_ ] o.a.s.c.SolrCore Created CoreDescriptor: {name=collection1, config=solrconfig.xml, transient=false, schema=schema.xml, loadOnStartup=true, configSetProperties=configsetprops.json, instanceDir=/Users/jenkins/workspace/Lucene-Solr-5.x-MacOSX/solr/build/solr-core/test/J0/temp/solr.cloud.TestReplicaProperties_D0B5585D42450E30-001/shard-1-001/cores/collection1, collection=collection1, absoluteInstDir=/Users/jenkins/workspace/Lucene-Solr-5.x-MacOSX/solr/build/solr-core/test/J0/temp/solr.cloud.TestReplicaProperties_D0B5585D42450E30-001/shard-1-001/cores/collection1/, coreNodeName=, dataDir=data/, shard=} [junit4] 2> 2429214 INFO (TEST-TestReplicaProperties.test-seed#[D0B5585D42450E30]) [n:127.0.0.1:56913_ ] o.a.s.c.CoresLocator Found core collection1 in /Users/jenkins/workspace/Lucene-Solr-5.x-MacOSX/solr/build/solr-core/test/J0/temp/solr.cloud.TestReplicaProperties_D0B5585D42450E30-001/shard-1-001/cores/collection1/ [junit4] 2> 2429214 INFO (TEST-TestReplicaProperties.test-seed#[D0B5585D42450E30]) [n:127.0.0.1:56913_ ] o.a.s.c.CoresLocator Found 1 core definitions [junit4] 2> 2429216 INFO (TEST-TestReplicaProperties.test-seed#[D0B5585D42450E30]) [n:127.0.0.1:56913_ ] o.a.s.s.SolrDispatchFilter user.dir=/Users/jenkins/workspace/Lucene-Solr-5.x-MacOSX/solr/build/solr-core/test/J0 [junit4] 2> 2429216 INFO (TEST-TestReplicaProperties.test-seed#[D0B5585D42450E30]) [n:127.0.0.1:56913_ ] o.a.s.s.SolrDispatchFilter SolrDispatchFilter.init() done [junit4] 2> 2429216 INFO (coreLoadExecutor-7764-thread-1-processing-n:127.0.0.1:56913_) [n:127.0.0.1:56913_ c:collection1 x:collection1] o.a.s.c.ZkController publishing state=down [junit4] 2> 2429216 INFO (coreLoadExecutor-7764-thread-1-processing-n:127.0.0.1:56913_) [n:127.0.0.1:56913_ c:collection1 x:collection1] o.a.s.c.ZkController numShards not found on descriptor - reading it from system property [junit4] 2> 2429219 INFO (coreLoadExecutor-7764-thread-1-processing-n:127.0.0.1:56913_) [n:127.0.0.1:56913_ c:collection1 x:collection1] o.a.s.c.ZkController look for our core node name [junit4] 2> 2429219 INFO (OverseerStateUpdate-94576559722856452-127.0.0.1:56904_-n_0000000000) [n:127.0.0.1:56904_ ] o.a.s.c.Overseer processMessage: queueSize: 1, message = { [junit4] 2> "core":"collection1", [junit4] 2> "roles":null, [junit4] 2> "base_url":"http://127.0.0.1:56913", [junit4] 2> "node_name":"127.0.0.1:56913_", [junit4] 2> "numShards":"2", [junit4] 2> "state":"down", [junit4] 2> "shard":null, [junit4] 2> "collection":"collection1", [junit4] 2> "operation":"state"} current state version: 3 [junit4] 2> 2429220 INFO (OverseerStateUpdate-94576559722856452-127.0.0.1:56904_-n_0000000000) [n:127.0.0.1:56904_ ] o.a.s.c.o.ReplicaMutator Update state numShards=2 message={ [junit4] 2> "core":"collection1", [junit4] 2> "roles":null, [junit4] 2> "base_url":"http://127.0.0.1:56913", [junit4] 2> "node_name":"127.0.0.1:56913_", [junit4] 2> "numShards":"2", [junit4] 2> "state":"down", [junit4] 2> "shard":null, [junit4] 2> "collection":"collection1", [junit4] 2> "operation":"state"} [junit4] 2> 2429220 INFO (OverseerStateUpdate-94576559722856452-127.0.0.1:56904_-n_0000000000) [n:127.0.0.1:56904_ ] o.a.s.c.o.ClusterStateMutator building a new cName: collection1 [junit4] 2> 2429220 INFO (OverseerStateUpdate-94576559722856452-127.0.0.1:56904_-n_0000000000) [n:127.0.0.1:56904_ ] o.a.s.c.o.ReplicaMutator Assigning new node to shard shard=shard2 [junit4] 2> 2429326 INFO (zkCallback-1960-thread-1) [ ] o.a.s.c.c.ZkStateReader A cluster state change: WatchedEvent state:SyncConnected type:NodeDataChanged path:/clusterstate.json, has occurred - updating... (live nodes size: 2) [junit4] 2> 2429326 INFO (zkCallback-1964-thread-1-processing-n:127.0.0.1:56913_) [n:127.0.0.1:56913_ ] o.a.s.c.c.ZkStateReader A cluster state change: WatchedEvent state:SyncConnected type:NodeDataChanged path:/clusterstate.json, has occurred - updating... (live nodes size: 2) [junit4] 2> 2429326 INFO (zkCallback-1958-thread-1-processing-n:127.0.0.1:56904_) [n:127.0.0.1:56904_ ] o.a.s.c.c.ZkStateReader A cluster state change: WatchedEvent state:SyncConnected type:NodeDataChanged path:/clusterstate.json, has occurred - updating... (live nodes size: 2) [junit4] 2> 2430221 INFO (coreLoadExecutor-7764-thread-1-processing-n:127.0.0.1:56913_) [n:127.0.0.1:56913_ c:collection1 x:collection1] o.a.s.c.ZkController waiting to find shard id in clusterstate for collection1 [junit4] 2> 2430221 INFO (coreLoadExecutor-7764-thread-1-processing-n:127.0.0.1:56913_) [n:127.0.0.1:56913_ c:collection1 x:collection1] o.a.s.c.ZkController Check for collection zkNode:collection1 [junit4] 2> 2430222 INFO (coreLoadExecutor-7764-thread-1-processing-n:127.0.0.1:56913_) [n:127.0.0.1:56913_ c:collection1 x:collection1] o.a.s.c.ZkController Collection zkNode exists [junit4] 2> 2430222 INFO (coreLoadExecutor-7764-thread-1-processing-n:127.0.0.1:56913_) [n:127.0.0.1:56913_ c:collection1 x:collection1] o.a.s.c.c.ZkStateReader Load collection config from:/collections/collection1 [junit4] 2> 2430223 INFO (coreLoadExecutor-7764-thread-1-processing-n:127.0.0.1:56913_) [n:127.0.0.1:56913_ c:collection1 x:collection1] o.a.s.c.c.ZkStateReader path=/collections/collection1 configName=conf1 specified config exists in ZooKeeper [junit4] 2> 2430223 INFO (coreLoadExecutor-7764-thread-1-processing-n:127.0.0.1:56913_) [n:127.0.0.1:56913_ c:collection1 x:collection1] o.a.s.c.SolrResourceLoader new SolrResourceLoader for directory: '/Users/jenkins/workspace/Lucene-Solr-5.x-MacOSX/solr/build/solr-core/test/J0/temp/solr.cloud.TestReplicaProperties_D0B5585D42450E30-001/shard-1-001/cores/collection1/' [junit4] 2> 2430241 INFO (coreLoadExecutor-7764-thread-1-processing-n:127.0.0.1:56913_) [n:127.0.0.1:56913_ c:collection1 x:collection1] o.a.s.c.Config loaded config solrconfig.xml with version 0 [junit4] 2> 2430247 INFO (coreLoadExecutor-7764-thread-1-processing-n:127.0.0.1:56913_) [n:127.0.0.1:56913_ c:collection1 x:collection1] o.a.s.c.SolrConfig current version of requestparams : -1 [junit4] 2> 2430252 INFO (coreLoadExecutor-7764-thread-1-processing-n:127.0.0.1:56913_) [n:127.0.0.1:56913_ c:collection1 x:collection1] o.a.s.c.SolrConfig Using Lucene MatchVersion: 5.4.0 [junit4] 2> 2430263 INFO (coreLoadExecutor-7764-thread-1-processing-n:127.0.0.1:56913_) [n:127.0.0.1:56913_ c:collection1 x:collection1] o.a.s.c.Config Loaded SolrConfig: solrconfig.xml [junit4] 2> 2430265 INFO (coreLoadExecutor-7764-thread-1-processing-n:127.0.0.1:56913_) [n:127.0.0.1:56913_ c:collection1 x:collection1] o.a.s.s.IndexSchema Reading Solr Schema from /configs/conf1/schema.xml [junit4] 2> 2430271 INFO (coreLoadExecutor-7764-thread-1-processing-n:127.0.0.1:56913_) [n:127.0.0.1:56913_ c:collection1 x:collection1] o.a.s.s.IndexSchema [collection1] Schema name=test [junit4] 2> 2430386 INFO (coreLoadExecutor-7764-thread-1-processing-n:127.0.0.1:56913_) [n:127.0.0.1:56913_ c:collection1 x:collection1] o.a.s.s.IndexSchema default search field in schema is text [junit4] 2> 2430388 INFO (coreLoadExecutor-7764-thread-1-processing-n:127.0.0.1:56913_) [n:127.0.0.1:56913_ c:collection1 x:collection1] o.a.s.s.IndexSchema unique key field: id [junit4] 2> 2430388 INFO (coreLoadExecutor-7764-thread-1-processing-n:127.0.0.1:56913_) [n:127.0.0.1:56913_ c:collection1 x:collection1] o.a.s.s.FileExchangeRateProvider Reloading exchange rates from file currency.xml [junit4] 2> 2430393 INFO (coreLoadExecutor-7764-thread-1-processing-n:127.0.0.1:56913_) [n:127.0.0.1:56913_ c:collection1 x:collection1] o.a.s.s.FileExchangeRateProvider Reloading exchange rates from file currency.xml [junit4] 2> 2430463 INFO (coreLoadExecutor-7764-thread-1-processing-n:127.0.0.1:56913_) [n:127.0.0.1:56913_ c:collection1 x:collection1] o.a.s.c.ConfigSetProperties Did not find ConfigSet properties, assuming default properties: Can't find resource 'configsetprops.json' in classpath or '/configs/conf1', cwd=/Users/jenkins/workspace/Lucene-Solr-5.x-MacOSX/solr/build/solr-core/test/J0 [junit4] 2> 2430463 INFO (coreLoadExecutor-7764-thread-1-processing-n:127.0.0.1:56913_) [n:127.0.0.1:56913_ c:collection1 x:collection1] o.a.s.c.CoreContainer Creating SolrCore 'collection1' using configuration from collection collection1 [junit4] 2> 2430463 INFO (coreLoadExecutor-7764-thread-1-processing-n:127.0.0.1:56913_) [n:127.0.0.1:56913_ c:collection1 s:shard2 r:core_node1 x:collection1] o.a.s.c.SolrCore org.apache.solr.core.MockDirectoryFactory [junit4] 2> 2430463 INFO (coreLoadExecutor-7764-thread-1-processing-n:127.0.0.1:56913_) [n:127.0.0.1:56913_ c:collection1 s:shard2 r:core_node1 x:collection1] o.a.s.c.SolrCore [[collection1] ] Opening new SolrCore at [/Users/jenkins/workspace/Lucene-Solr-5.x-MacOSX/solr/build/solr-core/test/J0/temp/solr.cloud.TestReplicaProperties_D0B5585D42450E30-001/shard-1-001/cores/collection1/], dataDir=[null] [junit4] 2> 2430463 INFO (coreLoadExecutor-7764-thread-1-processing-n:127.0.0.1:56913_) [n:127.0.0.1:56913_ c:collection1 s:shard2 r:core_node1 x:collection1] o.a.s.c.JmxMonitoredMap JMX monitoring is enabled. Adding Solr mbeans to JMX Server: com.sun.jmx.mbeanserver.JmxMBeanServer@19c28557 [junit4] 2> 2430464 INFO (coreLoadExecutor-7764-thread-1-processing-n:127.0.0.1:56913_) [n:127.0.0.1:56913_ c:collection1 s:shard2 r:core_node1 x:collection1] o.a.s.c.CachingDirectoryFactory return new directory for /Users/jenkins/workspace/Lucene-Solr-5.x-MacOSX/solr/build/solr-core/test/J0/temp/solr.cloud.TestReplicaProperties_D0B5585D42450E30-001/shard-1-001/cores/collection1/data [junit4] 2> 2430464 INFO (coreLoadExecutor-7764-thread-1-processing-n:127.0.0.1:56913_) [n:127.0.0.1:56913_ c:collection1 s:shard2 r:core_node1 x:collection1] o.a.s.c.SolrCore New index directory detected: old=null new=/Users/jenkins/workspace/Lucene-Solr-5.x-MacOSX/solr/build/solr-core/test/J0/temp/solr.cloud.TestReplicaProperties_D0B5585D42450E30-001/shard-1-001/cores/collection1/data/index/ [junit4] 2> 2430464 WARN (coreLoadExecutor-7764-thread-1-processing-n:127.0.0.1:56913_) [n:127.0.0.1:56913_ c:collection1 s:shard2 r:core_node1 x:collection1] o.a.s.c.SolrCore [collection1] Solr index directory '/Users/jenkins/workspace/Lucene-Solr-5.x-MacOSX/solr/build/solr-core/test/J0/temp/solr.cloud.TestReplicaProperties_D0B5585D42450E30-001/shard-1-001/cores/collection1/data/index' doesn't exist. Creating new index... [junit4] 2> 2430465 INFO (coreLoadExecutor-7764-thread-1-processing-n:127.0.0.1:56913_) [n:127.0.0.1:56913_ c:collection1 s:shard2 r:core_node1 x:collection1] o.a.s.c.CachingDirectoryFactory return new directory for /Users/jenkins/workspace/Lucene-Solr-5.x-MacOSX/solr/build/solr-core/test/J0/temp/solr.cloud.TestReplicaProperties_D0B5585D42450E30-001/shard-1-001/cores/collection1/data/index [junit4] 2> 2430465 INFO (coreLoadExecutor-7764-thread-1-processing-n:127.0.0.1:56913_) [n:127.0.0.1:56913_ c:collection1 s:shard2 r:core_node1 x:collection1] o.a.s.u.RandomMergePolicy RandomMergePolicy wrapping class org.apache.lucene.index.LogByteSizeMergePolicy: [LogByteSizeMergePolicy: minMergeSize=1677721, mergeFactor=14, maxMergeSize=2147483648, maxMergeSizeForForcedMerge=9223372036854775807, calibrateSizeByDeletes=false, maxMergeDocs=2147483647, maxCFSSegmentSizeMB=8.796093022207999E12, noCFSRatio=0.8836325760451983] [junit4] 2> 2430465 INFO (coreLoadExecutor-7764-thread-1-processing-n:127.0.0.1:56913_) [n:127.0.0.1:56913_ c:collection1 s:shard2 r:core_node1 x:collection1] o.a.s.c.SolrCore SolrDeletionPolicy.onCommit: commits: num=1 [junit4] 2> commit{dir=MockDirectoryWrapper(RAMDirectory@63453c93 lockFactory=org.apache.lucene.store.SingleInstanceLockFactory@6657f1f8),segFN=segments_1,generation=1} [junit4] 2> 2430465 INFO (coreLoadExecutor-7764-thread-1-processing-n:127.0.0.1:56913_) [n:127.0.0.1:56913_ c:collection1 s:shard2 r:core_node1 x:collection1] o.a.s.c.SolrCore newest commit generation = 1 [junit4] 2> 2430466 INFO (OldIndexDirectoryCleanupThreadForCore-collection1) [n:127.0.0.1:56913_ c:collection1 s:shard2 r:core_node1 x:collection1] o.a.s.c.SolrCore Looking for old index directories to cleanup for core collection1 in /Users/jenkins/workspace/Lucene-Solr-5.x-MacOSX/solr/build/solr-core/test/J0/temp/solr.cloud.TestReplicaProperties_D0B5585D42450E30-001/shard-1-001/cores/collection1/data/ [junit4] 2> 2430466 WARN (OldIndexDirectoryCleanupThreadForCore-collection1) [n:127.0.0.1:56913_ c:collection1 s:shard2 r:core_node1 x:collection1] o.a.s.c.DirectoryFactory /Users/jenkins/workspace/Lucene-Solr-5.x-MacOSX/solr/build/solr-core/test/J0/temp/solr.cloud.TestReplicaProperties_D0B5585D42450E30-001/shard-1-001/cores/collection1/data/ does not point to a valid data directory; skipping clean-up of old index directories. [junit4] 2> 2430470 INFO (coreLoadExecutor-7764-thread-1-processing-n:127.0.0.1:56913_) [n:127.0.0.1:56913_ c:collection1 s:shard2 r:core_node1 x:collection1] o.a.s.u.p.UpdateRequestProcessorChain creating updateRequestProcessorChain "nodistrib" [junit4] 2> 2430470 INFO (coreLoadExecutor-7764-thread-1-processing-n:127.0.0.1:56913_) [n:127.0.0.1:56913_ c:collection1 s:shard2 r:core_node1 x:collection1] o.a.s.u.p.UpdateRequestProcessorChain creating updateRequestProcessorChain "dedupe" [junit4] 2> 2430470 INFO (coreLoadExecutor-7764-thread-1-processing-n:127.0.0.1:56913_) [n:127.0.0.1:56913_ c:collection1 s:shard2 r:core_node1 x:collection1] o.a.s.u.p.UpdateRequestProcessorChain inserting DistributedUpdateProcessorFactory into updateRequestProcessorChain "dedupe" [junit4] 2> 2430470 INFO (coreLoadExecutor-7764-thread-1-processing-n:127.0.0.1:56913_) [n:127.0.0.1:56913_ c:collection1 s:shard2 r:core_node1 x:collection1] o.a.s.u.p.UpdateRequestProcessorChain creating updateRequestProcessorChain "stored_sig" [junit4] 2> 2430470 INFO (coreLoadExecutor-7764-thread-1-processing-n:127.0.0.1:56913_) [n:127.0.0.1:56913_ c:collection1 s:shard2 r:core_node1 x:collection1] o.a [...truncated too long message...] spatchFilter.doFilter(SolrDispatchFilter.java:179) [junit4] > at org.eclipse.jetty.servlet.ServletHandler$CachedChain.doFilter(ServletHandler.java:1652) [junit4] > at org.apache.solr.client.solrj.embedded.JettySolrRunner$DebugFilter.doFilter(JettySolrRunner.java:109) [junit4] > at org.eclipse.jetty.servlet.ServletHandler$CachedChain.doFilter(ServletHandler.java:1652) [junit4] > at org.eclipse.jetty.servlets.UserAgentFilter.doFilter(UserAgentFilter.java:83) [junit4] > at org.eclipse.jetty.servlets.GzipFilter.doFilter(GzipFilter.java:364) [junit4] > at org.eclipse.jetty.servlet.ServletHandler$CachedChain.doFilter(ServletHandler.java:1652) [junit4] > at org.eclipse.jetty.servlet.ServletHandler.doHandle(ServletHandler.java:585) [junit4] > at org.eclipse.jetty.server.session.SessionHandler.doHandle(SessionHandler.java:221) [junit4] > at org.eclipse.jetty.server.handler.ContextHandler.doHandle(ContextHandler.java:1127) [junit4] > at org.eclipse.jetty.servlet.ServletHandler.doScope(ServletHandler.java:515) [junit4] > at org.eclipse.jetty.server.session.SessionHandler.doScope(SessionHandler.java:185) [junit4] > at org.eclipse.jetty.server.handler.ContextHandler.doScope(ContextHandler.java:1061) [junit4] > at org.eclipse.jetty.server.handler.ScopedHandler.handle(ScopedHandler.java:141) [junit4] > at org.eclipse.jetty.server.handler.HandlerWrapper.handle(HandlerWrapper.java:97) [junit4] > at org.eclipse.jetty.server.Server.handle(Server.java:499) [junit4] > at org.eclipse.jetty.server.HttpChannel.handle(HttpChannel.java:310) [junit4] > at org.eclipse.jetty.server.HttpConnection.onFillable(HttpConnection.java:257) [junit4] > at org.eclipse.jetty.io.AbstractConnection$2.run(AbstractConnection.java:540) [junit4] > at org.eclipse.jetty.util.thread.QueuedThreadPool.runJob(QueuedThreadPool.java:635) [junit4] > at org.eclipse.jetty.util.thread.QueuedThreadPool$3.run(QueuedThreadPool.java:555) [junit4] > at java.lang.Thread.run(Thread.java:745) [junit4] > ,code=500}

[junit4] >
Powered by Jetty:// [junit4] > [junit4] > [junit4] > at org.apache.solr.client.solrj.impl.HttpSolrClient.executeMethod(HttpSolrClient.java:543) [junit4] > at org.apache.solr.client.solrj.impl.HttpSolrClient.request(HttpSolrClient.java:241) [junit4] > at org.apache.solr.client.solrj.impl.HttpSolrClient.request(HttpSolrClient.java:230) [junit4] > at org.apache.solr.client.solrj.impl.LBHttpSolrClient.doRequest(LBHttpSolrClient.java:372) [junit4] > at org.apache.solr.client.solrj.impl.LBHttpSolrClient.request(LBHttpSolrClient.java:341) [junit4] > ... 48 more [junit4] 2> 2517096 INFO (SUITE-TestReplicaProperties-seed#[D0B5585D42450E30]-worker) [n:127.0.0.1:56927_ c:testcollection s:shard2 r:core_node3 x:testcollection_shard2_replica2] o.a.s.SolrTestCaseJ4 ###deleteCore [junit4] 2> NOTE: leaving temporary files on disk at: /Users/jenkins/workspace/Lucene-Solr-5.x-MacOSX/solr/build/solr-core/test/J0/temp/solr.cloud.TestReplicaProperties_D0B5585D42450E30-001 [junit4] 2> NOTE: test params are: codec=CheapBastard, sim=RandomSimilarityProvider(queryNorm=false,coord=crazy): {}, locale=no, timezone=Africa/Maseru [junit4] 2> NOTE: Mac OS X 10.8.5 x86_64/Oracle Corporation 1.8.0_60 (64-bit)/cpus=3,threads=1,free=118145736,total=486539264 [junit4] 2> NOTE: All tests run in this JVM: [QueryEqualityTest, SharedFSAutoReplicaFailoverTest, HLLSerializationTest, TestQuerySenderNoQuery, BlockCacheTest, TestManagedSchemaDynamicFieldResource, TestSchemaNameResource, TestManagedResourceStorage, TestCSVLoader, CursorMarkTest, TestLuceneMatchVersion, SimplePostToolTest, ShardSplitTest, TestSchemaSimilarityResource, UnloadDistributedZkTest, TestHdfsUpdateLog, SimpleCollectionCreateDeleteTest, DistributedQueryComponentOptimizationTest, DeleteShardTest, PKIAuthenticationIntegrationTest, DirectSolrSpellCheckerTest, ChangedSchemaMergeTest, RequiredFieldsTest, TestAuthenticationFramework, TestLazyCores, TestSolrJ, TestIntervalFaceting, AtomicUpdatesTest, TestStressReorder, TestSweetSpotSimilarityFactory, OverseerTaskQueueTest, HdfsRecoveryZkTest, DateFieldTest, HdfsRecoverLeaseTest, DOMUtilTest, JsonLoaderTest, TestCloudSchemaless, DistributedQueryElevationComponentTest, DistribDocExpirationUpdateProcessorTest, SegmentsInfoRequestHandlerTest, BadComponentTest, TestSerializedLuceneMatchVersion, HdfsWriteToMultipleCollectionsTest, ZkCLITest, TestDocBasedVersionConstraints, TestSearchPerf, TestMergePolicyConfig, IndexSchemaTest, UpdateParamsTest, DistributedSpellCheckComponentTest, TestJettySolrRunner, TestCloudInspectUtil, HdfsSyncSliceTest, TestJmxMonitoredMap, TestRemoveLastDynamicCopyField, TestPostingsSolrHighlighter, HttpPartitionTest, ResourceLoaderTest, HdfsThreadLeakTest, TestUniqueKeyFieldResource, ParsingFieldUpdateProcessorsTest, ZkNodePropsTest, HdfsUnloadDistributedZkTest, StatelessScriptUpdateProcessorFactoryTest, AddBlockUpdateTest, ConnectionManagerTest, TestRemoteStreaming, CloudExitableDirectoryReaderTest, DistributedMLTComponentTest, TestTrackingShardHandlerFactory, CoreAdminRequestStatusTest, TestJsonRequest, SolrCloudExampleTest, TestSimpleTrackingShardHandler, TestMiniSolrCloudCluster, TestReloadDeadlock, TestCollapseQParserPlugin, TestSimpleQParserPlugin, TestCursorMarkWithoutUniqueKey, DistributedDebugComponentTest, TestManagedSchema, TestFastWriter, SOLR749Test, HdfsDirectoryFactoryTest, PrimitiveFieldTypeTest, ShardRoutingTest, TestPseudoReturnFields, TestInitParams, TestJmxIntegration, TestCryptoKeys, DocumentBuilderTest, ActionThrottleTest, TestClassNameShortening, RecoveryZkTest, OverseerCollectionConfigSetProcessorTest, ClusterStateUpdateTest, TestDocumentBuilder, TestFaceting, TestLeaderInitiatedRecoveryThread, TestSurroundQueryParser, PathHierarchyTokenizerFactoryTest, DistributedVersionInfoTest, BasicDistributedZkTest, TestSortingResponseWriter, TestGroupingSearch, TestLFUCache, FastVectorHighlighterTest, SystemInfoHandlerTest, MBeansHandlerTest, TestExtendedDismaxParser, PolyFieldTest, DistributedExpandComponentTest, TestHashQParserPlugin, TestFieldCollectionResource, TestWordDelimiterFilterFactory, TestBlobHandler, PeerSyncTest, TestConfigSetsAPI, SharedFSAutoReplicaFailoverUtilsTest, SmileWriterTest, SpatialHeatmapFacetsTest, TestAddFieldRealTimeGet, TestReplicationHandler, AsyncMigrateRouteKeyTest, TestCustomSort, TestAnalyzeInfixSuggestions, JSONWriterTest, XmlUpdateRequestHandlerTest, DocValuesMultiTest, TestRTGBase, TestConfigSets, TestNoOpRegenerator, AutoCommitTest, TestDistributedGrouping, TestRecovery, TestHashPartitioner, TermVectorComponentDistributedTest, ZkControllerTest, TestRealTimeGet, TestJoin, TestStressVersions, HardAutoCommitTest, DistributedTermsComponentTest, TestCoreContainer, SimpleFacetsTest, SolrCoreTest, QueryElevationComponentTest, TestSort, TestFunctionQuery, BasicFunctionalityTest, DirectUpdateHandlerTest, TestBadConfig, HighlighterTest, SoftAutoCommitTest, CurrencyFieldOpenExchangeTest, CurrencyFieldXmlFileTest, TestCoreDiscovery, AnalysisAfterCoreReloadTest, SignatureUpdateProcessorFactoryTest, SpellCheckCollatorTest, SuggesterFSTTest, CoreAdminHandlerTest, SolrRequestParserTest, TestFoldingMultitermQuery, DocValuesTest, SuggesterTSTTest, SuggesterTest, TestStressLucene, SpatialFilterTest, SuggesterWFSTTest, SchemaVersionSpecificBehaviorTest, DefaultValueUpdateProcessorTest, XsltUpdateRequestHandlerTest, DisMaxRequestHandlerTest, TestQueryUtils, TestWriterPerf, TestOmitPositions, TermVectorComponentTest, MoreLikeThisHandlerTest, TestSolrQueryParser, RegexBoostProcessorTest, ReturnFieldsTest, UniqFieldsUpdateProcessorFactoryTest, TestPartialUpdateDeduplication, CSVRequestHandlerTest, TestComponentsName, SearchHandlerTest, AlternateDirectoryTest, SolrIndexConfigTest, TestStressRecovery, TestSystemIdResolver, PrimUtilsTest, TestSuggestSpellingConverter, SpellingQueryConverterTest, ClusterStateTest, TestLRUCache, TestUtils, SliceStateTest, UUIDFieldTest, FileUtilsTest, CircularListTest, CursorPagingTest, DistributedIntervalFacetingTest, SolrTestCaseJ4Test, TestCrossCoreJoin, TestDistributedMissingSort, TestTolerantSearch, AssignTest, CollectionTooManyReplicasTest, DeleteInactiveReplicaTest, DeleteReplicaTest, LeaderFailoverAfterPartitionTest, OutOfBoxZkACLAndCredentialsProvidersTest, OverriddenZkACLAndCredentialsProvidersTest, OverseerRolesTest, ReplicationFactorTest, RollingRestartTest, TestCloudPivotFacet, TestReplicaProperties] [junit4] Completed [432/539] on J0 in 91.39s, 1 test, 1 error <<< FAILURES! [...truncated 343 lines...] BUILD FAILED /Users/jenkins/workspace/Lucene-Solr-5.x-MacOSX/build.xml:785: The following error occurred while executing this line: /Users/jenkins/workspace/Lucene-Solr-5.x-MacOSX/build.xml:729: The following error occurred while executing this line: /Users/jenkins/workspace/Lucene-Solr-5.x-MacOSX/build.xml:59: The following error occurred while executing this line: /Users/jenkins/workspace/Lucene-Solr-5.x-MacOSX/solr/build.xml:233: The following error occurred while executing this line: /Users/jenkins/workspace/Lucene-Solr-5.x-MacOSX/solr/common-build.xml:524: The following error occurred while executing this line: /Users/jenkins/workspace/Lucene-Solr-5.x-MacOSX/lucene/common-build.xml:1452: The following error occurred while executing this line: /Users/jenkins/workspace/Lucene-Solr-5.x-MacOSX/lucene/common-build.xml:1006: There were test failures: 539 suites (7 ignored), 2128 tests, 1 error, 75 ignored (33 assumptions) [seed: D0B5585D42450E30] Total time: 73 minutes 57 seconds Build step 'Invoke Ant' marked build as failure Archiving artifacts [WARNINGS] Skipping publisher since build result is FAILURE Recording test results Email was triggered for: Failure - Any Sending email for trigger: Failure - Any