lucene-dev mailing list archives

Site index · List index
Message view « Date » · « Thread »
Top « Date » · « Thread »
From Apache Jenkins Server <jenk...@builds.apache.org>
Subject [JENKINS] Lucene-Solr-SmokeRelease-5.x - Build # 318 - Failure
Date Fri, 11 Sep 2015 09:49:54 GMT
Build: https://builds.apache.org/job/Lucene-Solr-SmokeRelease-5.x/318/

No tests ran.

Build Log:
[...truncated 52976 lines...]
prepare-release-no-sign:
    [mkdir] Created dir: /x1/jenkins/jenkins-slave/workspace/Lucene-Solr-SmokeRelease-5.x/lucene/build/smokeTestRelease/dist
     [copy] Copying 461 files to /x1/jenkins/jenkins-slave/workspace/Lucene-Solr-SmokeRelease-5.x/lucene/build/smokeTestRelease/dist/lucene
     [copy] Copying 245 files to /x1/jenkins/jenkins-slave/workspace/Lucene-Solr-SmokeRelease-5.x/lucene/build/smokeTestRelease/dist/solr
   [smoker] Java 1.7 JAVA_HOME=/home/jenkins/jenkins-slave/tools/hudson.model.JDK/latest1.7
   [smoker] Java 1.8 JAVA_HOME=/home/jenkins/jenkins-slave/tools/hudson.model.JDK/latest1.8
   [smoker] NOTE: output encoding is UTF-8
   [smoker] 
   [smoker] Load release URL "file:/x1/jenkins/jenkins-slave/workspace/Lucene-Solr-SmokeRelease-5.x/lucene/build/smokeTestRelease/dist/"...
   [smoker] 
   [smoker] Test Lucene...
   [smoker]   test basics...
   [smoker]   get KEYS
   [smoker]     0.1 MB in 0.01 sec (10.1 MB/sec)
   [smoker]   check changes HTML...
   [smoker]   download lucene-5.4.0-src.tgz...
   [smoker]     28.5 MB in 0.04 sec (778.1 MB/sec)
   [smoker]     verify md5/sha1 digests
   [smoker]   download lucene-5.4.0.tgz...
   [smoker]     65.9 MB in 0.08 sec (776.5 MB/sec)
   [smoker]     verify md5/sha1 digests
   [smoker]   download lucene-5.4.0.zip...
   [smoker]     76.3 MB in 0.09 sec (806.0 MB/sec)
   [smoker]     verify md5/sha1 digests
   [smoker]   unpack lucene-5.4.0.tgz...
   [smoker]     verify JAR metadata/identity/no javax.* or java.* classes...
   [smoker]     test demo with 1.7...
   [smoker]       got 6116 hits for query "lucene"
   [smoker]     checkindex with 1.7...
   [smoker]     test demo with 1.8...
   [smoker]       got 6116 hits for query "lucene"
   [smoker]     checkindex with 1.8...
   [smoker]     check Lucene's javadoc JAR
   [smoker]   unpack lucene-5.4.0.zip...
   [smoker]     verify JAR metadata/identity/no javax.* or java.* classes...
   [smoker]     test demo with 1.7...
   [smoker]       got 6116 hits for query "lucene"
   [smoker]     checkindex with 1.7...
   [smoker]     test demo with 1.8...
   [smoker]       got 6116 hits for query "lucene"
   [smoker]     checkindex with 1.8...
   [smoker]     check Lucene's javadoc JAR
   [smoker]   unpack lucene-5.4.0-src.tgz...
   [smoker]     make sure no JARs/WARs in src dist...
   [smoker]     run "ant validate"
   [smoker]     run tests w/ Java 7 and testArgs='-Dtests.slow=false'...
   [smoker]     test demo with 1.7...
   [smoker]       got 212 hits for query "lucene"
   [smoker]     checkindex with 1.7...
   [smoker]     generate javadocs w/ Java 7...
   [smoker] 
   [smoker] Crawl/parse...
   [smoker] 
   [smoker] Verify...
   [smoker]     run tests w/ Java 8 and testArgs='-Dtests.slow=false'...
   [smoker]     test demo with 1.8...
   [smoker]       got 212 hits for query "lucene"
   [smoker]     checkindex with 1.8...
   [smoker]     generate javadocs w/ Java 8...
   [smoker] 
   [smoker] Crawl/parse...
   [smoker] 
   [smoker] Verify...
   [smoker]   confirm all releases have coverage in TestBackwardsCompatibility
   [smoker]     find all past Lucene releases...
   [smoker]     run TestBackwardsCompatibility..
   [smoker]     success!
   [smoker] 
   [smoker] Test Solr...
   [smoker]   test basics...
   [smoker]   get KEYS
   [smoker]     0.1 MB in 0.00 sec (96.0 MB/sec)
   [smoker]   check changes HTML...
   [smoker]   download solr-5.4.0-src.tgz...
   [smoker]     37.1 MB in 0.05 sec (692.0 MB/sec)
   [smoker]     verify md5/sha1 digests
   [smoker]   download solr-5.4.0.tgz...
   [smoker]     129.8 MB in 0.17 sec (745.7 MB/sec)
   [smoker]     verify md5/sha1 digests
   [smoker]   download solr-5.4.0.zip...
   [smoker]     137.5 MB in 0.19 sec (741.9 MB/sec)
   [smoker]     verify md5/sha1 digests
   [smoker]   unpack solr-5.4.0.tgz...
   [smoker]     verify JAR metadata/identity/no javax.* or java.* classes...
   [smoker]     unpack lucene-5.4.0.tgz...
   [smoker]       **WARNING**: skipping check of /x1/jenkins/jenkins-slave/workspace/Lucene-Solr-SmokeRelease-5.x/lucene/build/smokeTestRelease/tmp/unpack/solr-5.4.0/contrib/dataimporthandler-extras/lib/javax.mail-1.5.1.jar: it has javax.* classes
   [smoker]       **WARNING**: skipping check of /x1/jenkins/jenkins-slave/workspace/Lucene-Solr-SmokeRelease-5.x/lucene/build/smokeTestRelease/tmp/unpack/solr-5.4.0/contrib/dataimporthandler-extras/lib/activation-1.1.1.jar: it has javax.* classes
   [smoker]     copying unpacked distribution for Java 7 ...
   [smoker]     test solr example w/ Java 7...
   [smoker]       start Solr instance (log=/x1/jenkins/jenkins-slave/workspace/Lucene-Solr-SmokeRelease-5.x/lucene/build/smokeTestRelease/tmp/unpack/solr-5.4.0-java7/solr-example.log)...
   [smoker] No process found for Solr node running on port 8983
   [smoker]       Running techproducts example on port 8983 from /x1/jenkins/jenkins-slave/workspace/Lucene-Solr-SmokeRelease-5.x/lucene/build/smokeTestRelease/tmp/unpack/solr-5.4.0-java7
   [smoker] Creating Solr home directory /x1/jenkins/jenkins-slave/workspace/Lucene-Solr-SmokeRelease-5.x/lucene/build/smokeTestRelease/tmp/unpack/solr-5.4.0-java7/example/techproducts/solr
   [smoker] 
   [smoker] Starting up Solr on port 8983 using command:
   [smoker] bin/solr start -p 8983 -s "example/techproducts/solr"
   [smoker] 
   [smoker] Waiting up to 30 seconds to see Solr running on port 8983 [|]   [/]   [-]   [\]   [|]   [/]   [-]   [\]   [|]   [/]   [-]  
   [smoker] Started Solr server on port 8983 (pid=24859). Happy searching!
   [smoker] 
   [smoker]     
   [smoker] Setup new core instance directory:
   [smoker] /x1/jenkins/jenkins-slave/workspace/Lucene-Solr-SmokeRelease-5.x/lucene/build/smokeTestRelease/tmp/unpack/solr-5.4.0-java7/example/techproducts/solr/techproducts
   [smoker] 
   [smoker] Creating new core 'techproducts' using command:
   [smoker] http://localhost:8983/solr/admin/cores?action=CREATE&name=techproducts&instanceDir=techproducts
   [smoker] 
   [smoker] {
   [smoker]   "responseHeader":{
   [smoker]     "status":0,
   [smoker]     "QTime":2325},
   [smoker]   "core":"techproducts"}
   [smoker] 
   [smoker] 
   [smoker] Indexing tech product example docs from /x1/jenkins/jenkins-slave/workspace/Lucene-Solr-SmokeRelease-5.x/lucene/build/smokeTestRelease/tmp/unpack/solr-5.4.0-java7/example/exampledocs
   [smoker] SimplePostTool version 5.0.0
   [smoker] Posting files to [base] url http://localhost:8983/solr/techproducts/update using content-type application/xml...
   [smoker] POSTing file money.xml to [base]
   [smoker] POSTing file mem.xml to [base]
   [smoker] POSTing file vidcard.xml to [base]
   [smoker] POSTing file ipod_video.xml to [base]
   [smoker] POSTing file sd500.xml to [base]
   [smoker] POSTing file gb18030-example.xml to [base]
   [smoker] POSTing file mp500.xml to [base]
   [smoker] POSTing file monitor2.xml to [base]
   [smoker] POSTing file utf8-example.xml to [base]
   [smoker] POSTing file manufacturers.xml to [base]
   [smoker] POSTing file hd.xml to [base]
   [smoker] POSTing file solr.xml to [base]
   [smoker] POSTing file monitor.xml to [base]
   [smoker] POSTing file ipod_other.xml to [base]
   [smoker] 14 files indexed.
   [smoker] COMMITting Solr index changes to http://localhost:8983/solr/techproducts/update...
   [smoker] Time spent: 0:00:00.542
   [smoker] 
   [smoker] Solr techproducts example launched successfully. Direct your Web browser to http://localhost:8983/solr to visit the Solr Admin UI
   [smoker]       test utf8...
   [smoker]       run query...
   [smoker]       stop server using: bin/solr stop -p 8983
   [smoker] Sending stop command to Solr running on port 8983 ... waiting 5 seconds to allow Jetty process 24859 to stop gracefully.
   [smoker]  [|]   [/]   [-]   [\]   [|]   [/]   [-]   [\]   [|]   [/]          copying unpacked distribution for Java 8 ...
   [smoker]     test solr example w/ Java 8...
   [smoker]       start Solr instance (log=/x1/jenkins/jenkins-slave/workspace/Lucene-Solr-SmokeRelease-5.x/lucene/build/smokeTestRelease/tmp/unpack/solr-5.4.0-java8/solr-example.log)...
   [smoker] No process found for Solr node running on port 8983
   [smoker]       Running techproducts example on port 8983 from /x1/jenkins/jenkins-slave/workspace/Lucene-Solr-SmokeRelease-5.x/lucene/build/smokeTestRelease/tmp/unpack/solr-5.4.0-java8
   [smoker] Creating Solr home directory /x1/jenkins/jenkins-slave/workspace/Lucene-Solr-SmokeRelease-5.x/lucene/build/smokeTestRelease/tmp/unpack/solr-5.4.0-java8/example/techproducts/solr
   [smoker] 
   [smoker] Starting up Solr on port 8983 using command:
   [smoker] bin/solr start -p 8983 -s "example/techproducts/solr"
   [smoker] 
   [smoker] Waiting up to 30 seconds to see Solr running on port 8983 [|]   [/]   [-]   [\]   [|]   [/]   [-]   [\]   [|]   [/]   [-]  
   [smoker] Started Solr server on port 8983 (pid=25393). Happy searching!
   [smoker] 
   [smoker]     
   [smoker] Setup new core instance directory:
   [smoker] /x1/jenkins/jenkins-slave/workspace/Lucene-Solr-SmokeRelease-5.x/lucene/build/smokeTestRelease/tmp/unpack/solr-5.4.0-java8/example/techproducts/solr/techproducts
   [smoker] 
   [smoker] Creating new core 'techproducts' using command:
   [smoker] http://localhost:8983/solr/admin/cores?action=CREATE&name=techproducts&instanceDir=techproducts
   [smoker] 
   [smoker] {
   [smoker]   "responseHeader":{
   [smoker]     "status":0,
   [smoker]     "QTime":2043},
   [smoker]   "core":"techproducts"}
   [smoker] 
   [smoker] 
   [smoker] Indexing tech product example docs from /x1/jenkins/jenkins-slave/workspace/Lucene-Solr-SmokeRelease-5.x/lucene/build/smokeTestRelease/tmp/unpack/solr-5.4.0-java8/example/exampledocs
   [smoker] SimplePostTool version 5.0.0
   [smoker] Posting files to [base] url http://localhost:8983/solr/techproducts/update using content-type application/xml...
   [smoker] POSTing file money.xml to [base]
   [smoker] POSTing file mem.xml to [base]
   [smoker] POSTing file vidcard.xml to [base]
   [smoker] POSTing file ipod_video.xml to [base]
   [smoker] POSTing file sd500.xml to [base]
   [smoker] POSTing file gb18030-example.xml to [base]
   [smoker] POSTing file mp500.xml to [base]
   [smoker] POSTing file monitor2.xml to [base]
   [smoker] POSTing file utf8-example.xml to [base]
   [smoker] POSTing file manufacturers.xml to [base]
   [smoker] POSTing file hd.xml to [base]
   [smoker] POSTing file solr.xml to [base]
   [smoker] POSTing file monitor.xml to [base]
   [smoker] POSTing file ipod_other.xml to [base]
   [smoker] 14 files indexed.
   [smoker] COMMITting Solr index changes to http://localhost:8983/solr/techproducts/update...
   [smoker] Time spent: 0:00:00.462
   [smoker] 
   [smoker] Solr techproducts example launched successfully. Direct your Web browser to http://localhost:8983/solr to visit the Solr Admin UI
   [smoker]       test utf8...
   [smoker]       run query...
   [smoker]       stop server using: bin/solr stop -p 8983
   [smoker] Sending stop command to Solr running on port 8983 ... waiting 5 seconds to allow Jetty process 25393 to stop gracefully.
   [smoker]  [|]   [/]   [-]   [\]   [|]   [/]   [-]   [\]   [|]   [/]        unpack solr-5.4.0.zip...
   [smoker]     verify JAR metadata/identity/no javax.* or java.* classes...
   [smoker]     unpack lucene-5.4.0.tgz...
   [smoker]       **WARNING**: skipping check of /x1/jenkins/jenkins-slave/workspace/Lucene-Solr-SmokeRelease-5.x/lucene/build/smokeTestRelease/tmp/unpack/solr-5.4.0/contrib/dataimporthandler-extras/lib/javax.mail-1.5.1.jar: it has javax.* classes
   [smoker]       **WARNING**: skipping check of /x1/jenkins/jenkins-slave/workspace/Lucene-Solr-SmokeRelease-5.x/lucene/build/smokeTestRelease/tmp/unpack/solr-5.4.0/contrib/dataimporthandler-extras/lib/activation-1.1.1.jar: it has javax.* classes
   [smoker]     copying unpacked distribution for Java 7 ...
   [smoker]     test solr example w/ Java 7...
   [smoker]       start Solr instance (log=/x1/jenkins/jenkins-slave/workspace/Lucene-Solr-SmokeRelease-5.x/lucene/build/smokeTestRelease/tmp/unpack/solr-5.4.0-java7/solr-example.log)...
   [smoker] No process found for Solr node running on port 8983
   [smoker]       Running techproducts example on port 8983 from /x1/jenkins/jenkins-slave/workspace/Lucene-Solr-SmokeRelease-5.x/lucene/build/smokeTestRelease/tmp/unpack/solr-5.4.0-java7
   [smoker] Creating Solr home directory /x1/jenkins/jenkins-slave/workspace/Lucene-Solr-SmokeRelease-5.x/lucene/build/smokeTestRelease/tmp/unpack/solr-5.4.0-java7/example/techproducts/solr
   [smoker] 
   [smoker] Starting up Solr on port 8983 using command:
   [smoker] bin/solr start -p 8983 -s "example/techproducts/solr"
   [smoker] 
   [smoker] Waiting up to 30 seconds to see Solr running on port 8983 [|]   [/]   [-]   [\]   [|]   [/]   [-]   [\]   [|]   [/]   [-]  
   [smoker] Started Solr server on port 8983 (pid=25781). Happy searching!
   [smoker] 
   [smoker]     
   [smoker] Setup new core instance directory:
   [smoker] /x1/jenkins/jenkins-slave/workspace/Lucene-Solr-SmokeRelease-5.x/lucene/build/smokeTestRelease/tmp/unpack/solr-5.4.0-java7/example/techproducts/solr/techproducts
   [smoker] 
   [smoker] Creating new core 'techproducts' using command:
   [smoker] http://localhost:8983/solr/admin/cores?action=CREATE&name=techproducts&instanceDir=techproducts
   [smoker] 
   [smoker] {
   [smoker]   "responseHeader":{
   [smoker]     "status":0,
   [smoker]     "QTime":2052},
   [smoker]   "core":"techproducts"}
   [smoker] 
   [smoker] 
   [smoker] Indexing tech product example docs from /x1/jenkins/jenkins-slave/workspace/Lucene-Solr-SmokeRelease-5.x/lucene/build/smokeTestRelease/tmp/unpack/solr-5.4.0-java7/example/exampledocs
   [smoker] SimplePostTool version 5.0.0
   [smoker] Posting files to [base] url http://localhost:8983/solr/techproducts/update using content-type application/xml...
   [smoker] POSTing file money.xml to [base]
   [smoker] POSTing file mem.xml to [base]
   [smoker] POSTing file vidcard.xml to [base]
   [smoker] POSTing file ipod_video.xml to [base]
   [smoker] POSTing file sd500.xml to [base]
   [smoker] POSTing file gb18030-example.xml to [base]
   [smoker] POSTing file mp500.xml to [base]
   [smoker] POSTing file monitor2.xml to [base]
   [smoker] POSTing file utf8-example.xml to [base]
   [smoker] POSTing file manufacturers.xml to [base]
   [smoker] POSTing file hd.xml to [base]
   [smoker] POSTing file solr.xml to [base]
   [smoker] POSTing file monitor.xml to [base]
   [smoker] POSTing file ipod_other.xml to [base]
   [smoker] 14 files indexed.
   [smoker] COMMITting Solr index changes to http://localhost:8983/solr/techproducts/update...
   [smoker] Time spent: 0:00:00.459
   [smoker] 
   [smoker] Solr techproducts example launched successfully. Direct your Web browser to http://localhost:8983/solr to visit the Solr Admin UI
   [smoker]       test utf8...
   [smoker]       run query...
   [smoker]       stop server using: bin/solr stop -p 8983
   [smoker] Sending stop command to Solr running on port 8983 ... waiting 5 seconds to allow Jetty process 25781 to stop gracefully.
   [smoker]  [|]   [/]   [-]   [\]   [|]   [/]   [-]   [\]   [|]   [/]          copying unpacked distribution for Java 8 ...
   [smoker]     test solr example w/ Java 8...
   [smoker]       start Solr instance (log=/x1/jenkins/jenkins-slave/workspace/Lucene-Solr-SmokeRelease-5.x/lucene/build/smokeTestRelease/tmp/unpack/solr-5.4.0-java8/solr-example.log)...
   [smoker] No process found for Solr node running on port 8983
   [smoker]       Running techproducts example on port 8983 from /x1/jenkins/jenkins-slave/workspace/Lucene-Solr-SmokeRelease-5.x/lucene/build/smokeTestRelease/tmp/unpack/solr-5.4.0-java8
   [smoker] Creating Solr home directory /x1/jenkins/jenkins-slave/workspace/Lucene-Solr-SmokeRelease-5.x/lucene/build/smokeTestRelease/tmp/unpack/solr-5.4.0-java8/example/techproducts/solr
   [smoker] 
   [smoker] Starting up Solr on port 8983 using command:
   [smoker] bin/solr start -p 8983 -s "example/techproducts/solr"
   [smoker] 
   [smoker] Waiting up to 30 seconds to see Solr running on port 8983 [|]   [/]   [-]   [\]   [|]   [/]   [-]   [\]   [|]   [/]   [-]  
   [smoker] Started Solr server on port 8983 (pid=26166). Happy searching!
   [smoker] 
   [smoker]     
   [smoker] Setup new core instance directory:
   [smoker] /x1/jenkins/jenkins-slave/workspace/Lucene-Solr-SmokeRelease-5.x/lucene/build/smokeTestRelease/tmp/unpack/solr-5.4.0-java8/example/techproducts/solr/techproducts
   [smoker] 
   [smoker] Creating new core 'techproducts' using command:
   [smoker] http://localhost:8983/solr/admin/cores?action=CREATE&name=techproducts&instanceDir=techproducts
   [smoker] 
   [smoker] {
   [smoker]   "responseHeader":{
   [smoker]     "status":0,
   [smoker]     "QTime":2316},
   [smoker]   "core":"techproducts"}
   [smoker] 
   [smoker] 
   [smoker] Indexing tech product example docs from /x1/jenkins/jenkins-slave/workspace/Lucene-Solr-SmokeRelease-5.x/lucene/build/smokeTestRelease/tmp/unpack/solr-5.4.0-java8/example/exampledocs
   [smoker] SimplePostTool version 5.0.0
   [smoker] Posting files to [base] url http://localhost:8983/solr/techproducts/update using content-type application/xml...
   [smoker] POSTing file money.xml to [base]
   [smoker] POSTing file mem.xml to [base]
   [smoker] POSTing file vidcard.xml to [base]
   [smoker] POSTing file ipod_video.xml to [base]
   [smoker] POSTing file sd500.xml to [base]
   [smoker] POSTing file gb18030-example.xml to [base]
   [smoker] POSTing file mp500.xml to [base]
   [smoker] POSTing file monitor2.xml to [base]
   [smoker] POSTing file utf8-example.xml to [base]
   [smoker] POSTing file manufacturers.xml to [base]
   [smoker] POSTing file hd.xml to [base]
   [smoker] POSTing file solr.xml to [base]
   [smoker] POSTing file monitor.xml to [base]
   [smoker] POSTing file ipod_other.xml to [base]
   [smoker] 14 files indexed.
   [smoker] COMMITting Solr index changes to http://localhost:8983/solr/techproducts/update...
   [smoker] Time spent: 0:00:00.539
   [smoker] 
   [smoker] Solr techproducts example launched successfully. Direct your Web browser to http://localhost:8983/solr to visit the Solr Admin UI
   [smoker]       test utf8...
   [smoker]       run query...
   [smoker]       stop server using: bin/solr stop -p 8983
   [smoker] Sending stop command to Solr running on port 8983 ... waiting 5 seconds to allow Jetty process 26166 to stop gracefully.
   [smoker]  [|]   [/]   [-]   [\]   [|]   [/]   [-]   [\]   [|]   [/]        unpack solr-5.4.0-src.tgz...
   [smoker]     make sure no JARs/WARs in src dist...
   [smoker]     run "ant validate"
   [smoker]     run tests w/ Java 7 and testArgs='-Dtests.slow=false'...
   [smoker]     generate javadocs w/ Java 7...
   [smoker] 
   [smoker] /x1/jenkins/jenkins-slave/workspace/Lucene-Solr-SmokeRelease-5.x/lucene/build/smokeTestRelease/tmp/unpack/solr-5.4.0/solr/build/docs/solr-uima/org/apache/solr/uima/processor/package-summary.html
   [smoker]   missing: SolrUIMAConfiguration.MapField
   [smoker] 
   [smoker] /x1/jenkins/jenkins-slave/workspace/Lucene-Solr-SmokeRelease-5.x/lucene/build/smokeTestRelease/tmp/unpack/solr-5.4.0/solr/build/docs/solr-clustering/org/apache/solr/handler/clustering/package-summary.html
   [smoker]   missing: ClusteringParams
   [smoker]   missing: DocumentClusteringEngine
   [smoker] 
   [smoker] /x1/jenkins/jenkins-slave/workspace/Lucene-Solr-SmokeRelease-5.x/lucene/build/smokeTestRelease/tmp/unpack/solr-5.4.0/solr/build/docs/solr-solrj/org/apache/solr/common/package-summary.html
   [smoker]   missing: Callable
   [smoker]   missing: SolrInputField
   [smoker]   missing: StringUtils
   [smoker]   missing: SolrException
   [smoker] 
   [smoker] /x1/jenkins/jenkins-slave/workspace/Lucene-Solr-SmokeRelease-5.x/lucene/build/smokeTestRelease/tmp/unpack/solr-5.4.0/solr/build/docs/solr-solrj/org/apache/solr/common/util/package-summary.html
   [smoker]   missing: Cache
   [smoker]   missing: ContentStream
   [smoker]   missing: JavaBinCodec.ObjectResolver
   [smoker]   missing: JavaBinCodec.WritableDocFields
   [smoker]   missing: RetryUtil.BooleanRetryCmd
   [smoker]   missing: RetryUtil.RetryCmd
   [smoker]   missing: ByteUtils
   [smoker]   missing: ExecutorUtil
   [smoker]   missing: ExecutorUtil.MDCAwareThreadPoolExecutor
   [smoker]   missing: IOUtils
   [smoker]   missing: JavaBinCodec.StringBytes
   [smoker]   missing: JavaBinCodec.StringCache
   [smoker]   missing: ObjectReleaseTracker
   [smoker]   missing: Pair
   [smoker]   missing: RetryUtil
   [smoker]   missing: SolrjNamedThreadFactory
   [smoker]   missing: StrUtils
   [smoker]   missing: URLUtil
   [smoker]   missing: Utils
   [smoker]   missing: XML
   [smoker]   missing: XMLErrorLogger
   [smoker] 
   [smoker] /x1/jenkins/jenkins-slave/workspace/Lucene-Solr-SmokeRelease-5.x/lucene/build/smokeTestRelease/tmp/unpack/solr-5.4.0/solr/build/docs/solr-solrj/org/apache/solr/common/luke/package-summary.html
   [smoker]   missing: FieldFlag
   [smoker] 
   [smoker] /x1/jenkins/jenkins-slave/workspace/Lucene-Solr-SmokeRelease-5.x/lucene/build/smokeTestRelease/tmp/unpack/solr-5.4.0/solr/build/docs/solr-solrj/org/apache/solr/common/cloud/package-summary.html
   [smoker]   missing: BeforeReconnect
   [smoker]   missing: OnReconnect
   [smoker]   missing: ZkACLProvider
   [smoker]   missing: ZkClientConnectionStrategy.ConnectedListener
   [smoker]   missing: ZkClientConnectionStrategy.DisconnectedListener
   [smoker]   missing: ZkCredentialsProvider
   [smoker]   missing: Aliases
   [smoker]   missing: ClusterState.CollectionRef
   [smoker]   missing: ClusterStateUtil
   [smoker]   missing: CompositeIdRouter
   [smoker]   missing: ConnectionManager
   [smoker]   missing: DefaultZkACLProvider
   [smoker]   missing: DefaultZkCredentialsProvider
   [smoker]   missing: DocRouter.Range
   [smoker]   missing: HashBasedRouter
   [smoker]   missing: PlainIdRouter
   [smoker]   missing: Replica
   [smoker]   missing: SolrZooKeeper
   [smoker]   missing: VMParamsAllAndReadonlyDigestZkACLProvider
   [smoker]   missing: VMParamsSingleSetCredentialsDigestZkCredentialsProvider
   [smoker]   missing: ZkClientConnectionStrategy
   [smoker]   missing: ZkClientConnectionStrategy.ZkUpdate
   [smoker]   missing: ZkCmdExecutor
   [smoker]   missing: ZkCoreNodeProps
   [smoker]   missing: ZkCredentialsProvider.ZkCredentials
   [smoker]   missing: ZkStateReader
   [smoker]   missing: ZkStateReader.ConfigData
   [smoker]   missing: ZooKeeperException
   [smoker] 
   [smoker] /x1/jenkins/jenkins-slave/workspace/Lucene-Solr-SmokeRelease-5.x/lucene/build/smokeTestRelease/tmp/unpack/solr-5.4.0/solr/build/docs/solr-solrj/org/apache/solr/common/params/package-summary.html
   [smoker]   missing: CollectionParams
   [smoker]   missing: CommonAdminParams
   [smoker]   missing: EventParams
   [smoker]   missing: HighlightParams
   [smoker]   missing: MoreLikeThisParams
   [smoker]   missing: SpatialParams
   [smoker]   missing: TermsParams
   [smoker]   missing: TermVectorParams
   [smoker]   missing: CoreAdminParams
   [smoker]   missing: DefaultSolrParams
   [smoker]   missing: MapSolrParams
   [smoker]   missing: MultiMapSolrParams
   [smoker]   missing: CollectionParams.CollectionAction
   [smoker]   missing: ConfigSetParams.ConfigSetAction
   [smoker]   missing: CoreAdminParams.CoreAdminAction
   [smoker]   missing: MoreLikeThisParams.TermStyle
   [smoker]   missing: TermsParams.TermsRegexpFlag
   [smoker] 
   [smoker] /x1/jenkins/jenkins-slave/workspace/Lucene-Solr-SmokeRelease-5.x/lucene/build/smokeTestRelease/tmp/unpack/solr-5.4.0/solr/build/docs/solr-solrj/org/apache/solr/client/solrj/package-summary.html
   [smoker]   missing: ResponseParser
   [smoker]   missing: SolrRequest
   [smoker]   missing: SolrResponse
   [smoker]   missing: SolrQuery.ORDER
   [smoker]   missing: SolrRequest.METHOD
   [smoker] 
   [smoker] /x1/jenkins/jenkins-slave/workspace/Lucene-Solr-SmokeRelease-5.x/lucene/build/smokeTestRelease/tmp/unpack/solr-5.4.0/solr/build/docs/solr-solrj/org/apache/solr/client/solrj/request/package-summary.html
   [smoker]   missing: JavaBinUpdateRequestCodec.StreamingUpdateHandler
   [smoker]   missing: AbstractUpdateRequest
   [smoker]   missing: CollectionAdminRequest.AddReplica
   [smoker]   missing: CollectionAdminRequest.AddReplicaProp
   [smoker]   missing: CollectionAdminRequest.AddRole
   [smoker]   missing: CollectionAdminRequest.BalanceShardUnique
   [smoker]   missing: CollectionAdminRequest.ClusterProp
   [smoker]   missing: CollectionAdminRequest.ClusterStatus
   [smoker]   missing: CollectionAdminRequest.CollectionAdminRoleRequest
   [smoker]   missing: CollectionAdminRequest.CollectionShardAdminRequest
   [smoker]   missing: CollectionAdminRequest.CollectionSpecificAdminRequest
   [smoker]   missing: CollectionAdminRequest.CreateAlias
   [smoker]   missing: CollectionAdminRequest.CreateShard
   [smoker]   missing: CollectionAdminRequest.Delete
   [smoker]   missing: CollectionAdminRequest.DeleteAlias
   [smoker]   missing: CollectionAdminRequest.DeleteReplica
   [smoker]   missing: CollectionAdminRequest.DeleteReplicaProp
   [smoker]   missing: CollectionAdminRequest.DeleteShard
   [smoker]   missing: CollectionAdminRequest.List
   [smoker]   missing: CollectionAdminRequest.Migrate
   [smoker]   missing: CollectionAdminRequest.MigrateClusterState
   [smoker]   missing: CollectionAdminRequest.OverseerStatus
   [smoker]   missing: CollectionAdminRequest.Reload
   [smoker]   missing: CollectionAdminRequest.RemoveRole
   [smoker]   missing: CollectionAdminRequest.RequestStatus
   [smoker]   missing: CollectionAdminRequest.SplitShard
   [smoker]   missing: ConfigSetAdminRequest.Create
   [smoker]   missing: ConfigSetAdminRequest.Delete
   [smoker]   missing: CoreAdminRequest.Create
   [smoker]   missing: CoreAdminRequest.MergeIndexes
   [smoker]   missing: CoreAdminRequest.Persist
   [smoker]   missing: CoreAdminRequest.RequestRecovery
   [smoker]   missing: CoreAdminRequest.RequestSyncShard
   [smoker]   missing: CoreAdminRequest.Unload
   [smoker]   missing: CoreAdminRequest.WaitForState
   [smoker]   missing: GenericSolrRequest
   [smoker]   missing: LukeRequest
   [smoker]   missing: QueryRequest
   [smoker]   missing: UpdateRequest
   [smoker]   missing: AbstractUpdateRequest.ACTION
   [smoker] 
   [smoker] /x1/jenkins/jenkins-slave/workspace/Lucene-Solr-SmokeRelease-5.x/lucene/build/smokeTestRelease/tmp/unpack/solr-5.4.0/solr/build/docs/solr-solrj/org/apache/solr/client/solrj/request/schema/package-summary.html
   [smoker]   missing: AbstractSchemaRequest
   [smoker]   missing: AnalyzerDefinition
   [smoker]   missing: FieldTypeDefinition
   [smoker]   missing: SchemaRequest.Update
   [smoker] 
   [smoker] /x1/jenkins/jenkins-slave/workspace/Lucene-Solr-SmokeRelease-5.x/lucene/build/smokeTestRelease/tmp/unpack/solr-5.4.0/solr/build/docs/solr-solrj/org/apache/solr/client/solrj/impl/package-summary.html
   [smoker]   missing: BinaryResponseParser
   [smoker]   missing: CloudSolrClient.RouteResponse
   [smoker]   missing: HttpClientUtil.HttpClientFactory
   [smoker]   missing: HttpSolrClient.HttpUriRequestResponse
   [smoker]   missing: LBHttpSolrClient.Req
   [smoker]   missing: LBHttpSolrClient.Rsp
   [smoker]   missing: LBHttpSolrClient.ServerWrapper
   [smoker]   missing: XMLResponseParser
   [smoker]   missing: XMLResponseParser.KnownType
   [smoker]   missing: CloudSolrClient.RouteException
   [smoker] 
   [smoker] /x1/jenkins/jenkins-slave/workspace/Lucene-Solr-SmokeRelease-5.x/lucene/build/smokeTestRelease/tmp/unpack/solr-5.4.0/solr/build/docs/solr-solrj/org/apache/solr/client/solrj/util/package-summary.html
   [smoker]   missing: ClientUtils
   [smoker] 
   [smoker] /x1/jenkins/jenkins-slave/workspace/Lucene-Solr-SmokeRelease-5.x/lucene/build/smokeTestRelease/tmp/unpack/solr-5.4.0/solr/build/docs/solr-solrj/org/apache/solr/client/solrj/beans/package-summary.html
   [smoker]   missing: BindingException
   [smoker] 
   [smoker] /x1/jenkins/jenkins-slave/workspace/Lucene-Solr-SmokeRelease-5.x/lucene/build/smokeTestRelease/tmp/unpack/solr-5.4.0/solr/build/docs/solr-solrj/org/apache/solr/client/solrj/io/stream/package-summary.html
   [smoker]   missing: JSONTupleStream
   [smoker]   missing: TupleStream
   [smoker] 
   [smoker] /x1/jenkins/jenkins-slave/workspace/Lucene-Solr-SmokeRelease-5.x/lucene/build/smokeTestRelease/tmp/unpack/solr-5.4.0/solr/build/docs/solr-solrj/org/apache/solr/client/solrj/response/package-summary.html
   [smoker]   missing: CollectionAdminResponse
   [smoker]   missing: CoreAdminResponse
   [smoker]   missing: FacetField.Count
   [smoker]   missing: LukeResponse.FieldInfo
   [smoker]   missing: LukeResponse.FieldTypeInfo
   [smoker]   missing: PivotField
   [smoker]   missing: QueryResponse
   [smoker]   missing: RangeFacet.Count
   [smoker]   missing: RangeFacet.Date
   [smoker]   missing: RangeFacet.Numeric
   [smoker]   missing: SimpleSolrResponse
   [smoker]   missing: SolrPingResponse
   [smoker]   missing: SolrResponseBase
   [smoker]   missing: SpellCheckResponse.Suggestion
   [smoker]   missing: TermsResponse.Term
   [smoker] 
   [smoker] /x1/jenkins/jenkins-slave/workspace/Lucene-Solr-SmokeRelease-5.x/lucene/build/smokeTestRelease/tmp/unpack/solr-5.4.0/solr/build/docs/solr-solrj/org/apache/solr/client/solrj/response/schema/package-summary.html
   [smoker]   missing: FieldTypeRepresentation
   [smoker]   missing: SchemaRepresentation
   [smoker]   missing: SchemaResponse.CopyFieldsResponse
   [smoker]   missing: SchemaResponse.DefaultQueryOperatorResponse
   [smoker]   missing: SchemaResponse.DynamicFieldResponse
   [smoker]   missing: SchemaResponse.DynamicFieldsResponse
   [smoker]   missing: SchemaResponse.FieldResponse
   [smoker]   missing: SchemaResponse.FieldsResponse
   [smoker]   missing: SchemaResponse.FieldTypeResponse
   [smoker]   missing: SchemaResponse.FieldTypesResponse
   [smoker]   missing: SchemaResponse.GlobalSimilarityResponse
   [smoker]   missing: SchemaResponse.SchemaNameResponse
   [smoker]   missing: SchemaResponse.SchemaVersionResponse
   [smoker]   missing: SchemaResponse.UniqueKeyResponse
   [smoker]   missing: SchemaResponse.UpdateResponse
   [smoker] 
   [smoker] /x1/jenkins/jenkins-slave/workspace/Lucene-Solr-SmokeRelease-5.x/lucene/build/smokeTestRelease/tmp/unpack/solr-5.4.0/solr/build/docs/solr-core/org/apache/solr/update/package-summary.html
   [smoker]   missing: SolrCmdDistributor.AbortCheck
   [smoker]   missing: SolrCoreState.IndexWriterCloser
   [smoker]   missing: AddUpdateCommand
   [smoker]   missing: CommitUpdateCommand
   [smoker]   missing: DefaultSolrCoreState
   [smoker]   missing: DeleteUpdateCommand
   [smoker]   missing: DocumentBuilder
   [smoker]   missing: HdfsUpdateLog
   [smoker]   missing: MemOutputStream
   [smoker]   missing: PeerSync
   [smoker]   missing: RollbackUpdateCommand
   [smoker]   missing: SolrCmdDistributor
   [smoker]   missing: SolrCmdDistributor.Error
   [smoker]   missing: SolrCmdDistributor.Node
   [smoker]   missing: SolrCmdDistributor.Req
   [smoker]   missing: SolrCmdDistributor.Response
   [smoker]   missing: SolrCmdDistributor.RetryNode
   [smoker]   missing: SolrCmdDistributor.StdNode
   [smoker]   missing: SolrIndexSplitter
   [smoker]   missing: StreamingSolrClients
   [smoker]   missing: UpdateLog
   [smoker]   missing: UpdateLog.LogPtr
   [smoker]   missing: UpdateLog.RecoveryInfo
   [smoker]   missing: UpdateShardHandler
   [smoker]   missing: UpdateShardHandlerConfig
   [smoker]   missing: VersionBucket
   [smoker]   missing: VersionInfo
   [smoker]   missing: UpdateLog.State
   [smoker]   missing: UpdateLog.SyncLevel
   [smoker] 
   [smoker] /x1/jenkins/jenkins-slave/workspace/Lucene-Solr-SmokeRelease-5.x/lucene/build/smokeTestRelease/tmp/unpack/solr-5.4.0/solr/build/docs/solr-core/org/apache/solr/update/processor/package-summary.html
   [smoker]   missing: AtomicUpdateDocumentMerger
   [smoker]   missing: DistributedUpdateProcessor
   [smoker]   missing: FieldMutatingUpdateProcessorFactory.SelectorParams
   [smoker]   missing: Lookup3Signature
   [smoker]   missing: MD5Signature
   [smoker]   missing: Signature
   [smoker]   missing: SignatureUpdateProcessorFactory
   [smoker]   missing: UpdateRequestProcessorChain.ProcessorInfo
   [smoker] 
   [smoker] /x1/jenkins/jenkins-slave/workspace/Lucene-Solr-SmokeRelease-5.x/lucene/build/smokeTestRelease/tmp/unpack/solr-5.4.0/solr/build/docs/solr-core/org/apache/solr/servlet/package-summary.html
   [smoker]   missing: SolrRequestParsers
   [smoker] 
   [smoker] /x1/jenkins/jenkins-slave/workspace/Lucene-Solr-SmokeRelease-5.x/lucene/build/smokeTestRelease/tmp/unpack/solr-5.4.0/solr/build/docs/solr-core/org/apache/solr/servlet/cache/package-summary.html
   [smoker]   missing: HttpCacheHeaderUtil
   [smoker]   missing: Method
   [smoker] 
   [smoker] /x1/jenkins/jenkins-slave/workspace/Lucene-Solr-SmokeRelease-5.x/lucene/build/smokeTestRelease/tmp/unpack/solr-5.4.0/solr/build/docs/solr-core/org/apache/solr/security/package-summary.html
   [smoker]   missing: BasicAuthPlugin.AuthenticationProvider
   [smoker]   missing: HttpClientInterceptorPlugin
   [smoker]   missing: AuthenticationPlugin
   [smoker]   missing: AuthorizationContext.CollectionRequest
   [smoker]   missing: AuthorizationResponse
   [smoker]   missing: BasicAuthPlugin
   [smoker]   missing: KerberosFilter
   [smoker]   missing: KerberosPlugin
   [smoker]   missing: PKIAuthenticationPlugin
   [smoker]   missing: RuleBasedAuthorizationPlugin
   [smoker]   missing: SecurityPluginHolder
   [smoker]   missing: Sha256AuthenticationProvider
   [smoker]   missing: AuthorizationContext.RequestType
   [smoker] 
   [smoker] /x1/jenkins/jenkins-slave/workspace/Lucene-Solr-SmokeRelease-5.x/lucene/build/smokeTestRelease/tmp/unpack/solr-5.4.0/solr/build/docs/solr-core/org/apache/solr/handler/package-summary.html
   [smoker]   missing: BlobHandler
   [smoker]   missing: DumpRequestHandler
   [smoker]   missing: IndexFetcher.CompareResult
   [smoker]   missing: MoreLikeThisHandler.InterestingTerm
   [smoker]   missing: RealTimeGetHandler
   [smoker]   missing: RequestHandlerBase
   [smoker]   missing: RestoreCore
   [smoker]   missing: SchemaHandler
   [smoker]   missing: SolrConfigHandler
   [smoker]   missing: StreamHandler
   [smoker]   missing: PingRequestHandler.ACTIONS
   [smoker] 
   [smoker] /x1/jenkins/jenkins-slave/workspace/Lucene-Solr-SmokeRelease-5.x/lucene/build/smokeTestRelease/tmp/unpack/solr-5.4.0/solr/build/docs/solr-core/org/apache/solr/handler/loader/package-summary.html
   [smoker]   missing: CSVLoader
   [smoker]   missing: JsonLoader
   [smoker]   missing: XMLLoader
   [smoker] 
   [smoker] /x1/jenkins/jenkins-slave/workspace/Lucene-Solr-SmokeRelease-5.x/lucene/build/smokeTestRelease/tmp/unpack/solr-5.4.0/solr/build/docs/solr-core/org/apache/solr/handler/admin/package-summary.html
   [smoker]   missing: ClusterStatus
   [smoker]   missing: CollectionsHandler
   [smoker]   missing: CoreAdminHandler
   [smoker]   missing: InfoHandler
   [smoker]   missing: PluginInfoHandler
   [smoker]   missing: PropertiesRequestHandler
   [smoker]   missing: SecurityConfHandler
   [smoker]   missing: ThreadDumpHandler
   [smoker] 
   [smoker] /x1/jenkins/jenkins-slave/workspace/Lucene-Solr-SmokeRelease-5.x/lucene/build/smokeTestRelease/tmp/unpack/solr-5.4.0/solr/build/docs/solr-core/org/apache/solr/handler/component/package-summary.html
   [smoker]   missing: HttpShardHandler
   [smoker]   missing: HttpShardHandlerFactory
   [smoker]   missing: PivotFacetHelper
   [smoker]   missing: RealTimeGetComponent
   [smoker]   missing: ResponseBuilder.GlobalCollectionStat
   [smoker]   missing: ShardDoc
   [smoker]   missing: ShardHandler
   [smoker]   missing: ShardHandlerFactory
   [smoker]   missing: ShardRequest
   [smoker]   missing: ShardResponse
   [smoker]   missing: SpellCheckMergeData
   [smoker] 
   [smoker] /x1/jenkins/jenkins-slave/workspace/Lucene-Solr-SmokeRelease-5.x/lucene/build/smokeTestRelease/tmp/unpack/solr-5.4.0/solr/build/docs/solr-core/org/apache/solr/request/package-summary.html
   [smoker]   missing: LocalSolrQueryRequest
   [smoker]   missing: SimpleFacets.ParsedParams
   [smoker]   missing: SolrRequestInfo
   [smoker] 
   [smoker] /x1/jenkins/jenkins-slave/workspace/Lucene-Solr-SmokeRelease-5.x/lucene/build/smokeTestRelease/tmp/unpack/solr-5.4.0/solr/build/docs/solr-core/org/apache/solr/request/macro/package-summary.html
   [smoker]   missing: MacroExpander
   [smoker] 
   [smoker] /x1/jenkins/jenkins-slave/workspace/Lucene-Solr-SmokeRelease-5.x/lucene/build/smokeTestRelease/tmp/unpack/solr-5.4.0/solr/build/docs/solr-core/org/apache/solr/request/json/package-summary.html
   [smoker]   missing: JSONUtil
   [smoker]   missing: ObjectUtil
   [smoker]   missing: ObjectUtil.ConflictHandler
   [smoker]   missing: RequestUtil
   [smoker] 
   [smoker] /x1/jenkins/jenkins-slave/workspace/Lucene-Solr-SmokeRelease-5.x/lucene/build/smokeTestRelease/tmp/unpack/solr-5.4.0/solr/build/docs/solr-core/org/apache/solr/store/hdfs/package-summary.html
   [smoker]   missing: HdfsDirectory
   [smoker]   missing: HdfsFileReader
   [smoker]   missing: HdfsFileWriter
   [smoker]   missing: HdfsLocalityReporter
   [smoker]   missing: HdfsLockFactory
   [smoker] 
   [smoker] /x1/jenkins/jenkins-slave/workspace/Lucene-Solr-SmokeRelease-5.x/lucene/build/smokeTestRelease/tmp/unpack/solr-5.4.0/solr/build/docs/solr-core/org/apache/solr/store/blockcache/package-summary.html
   [smoker]   missing: Cache
   [smoker]   missing: Store
   [smoker]   missing: BlockCache
   [smoker]   missing: BlockCacheKey
   [smoker]   missing: BlockCacheLocation
   [smoker]   missing: BlockDirectory
   [smoker]   missing: BlockDirectoryCache
   [smoker]   missing: BlockLocks
   [smoker]   missing: BufferStore
   [smoker]   missing: CustomBufferedIndexInput
   [smoker]   missing: Metrics.MethodCall
   [smoker]   missing: ReusedBufferedIndexOutput
   [smoker] 
   [smoker] /x1/jenkins/jenkins-slave/workspace/Lucene-Solr-SmokeRelease-5.x/lucene/build/smokeTestRelease/tmp/unpack/solr-5.4.0/solr/build/docs/solr-core/org/apache/solr/spelling/package-summary.html
   [smoker]   missing: ResultEntry
   [smoker]   missing: SpellCheckCollation
   [smoker]   missing: SpellCheckCollator
   [smoker]   missing: SpellCheckCorrection
   [smoker]   missing: SpellingOptions
   [smoker] 
   [smoker] /x1/jenkins/jenkins-slave/workspace/Lucene-Solr-SmokeRelease-5.x/lucene/build/smokeTestRelease/tmp/unpack/solr-5.4.0/solr/build/docs/solr-core/org/apache/solr/spelling/suggest/package-summary.html
   [smoker]   missing: SuggesterParams
   [smoker]   missing: Suggester
   [smoker] 
   [smoker] /x1/jenkins/jenkins-slave/workspace/Lucene-Solr-SmokeRelease-5.x/lucene/build/smokeTestRelease/tmp/unpack/solr-5.4.0/solr/build/docs/solr-core/org/apache/solr/schema/package-summary.html
   [smoker]   missing: AbstractSpatialPrefixTreeFieldType
   [smoker]   missing: BBoxField
   [smoker]   missing: BinaryField
   [smoker]   missing: BoolField
   [smoker]   missing: ClassicIndexSchemaFactory
   [smoker]   missing: FieldProperties
   [smoker]   missing: FieldTypePluginLoader
   [smoker]   missing: IndexSchema.DynamicCopy
   [smoker]   missing: IndexSchema.DynamicField
   [smoker]   missing: IndexSchema.DynamicReplacement
   [smoker]   missing: IndexSchema.DynamicReplacement.DynamicPattern
   [smoker]   missing: JsonPreAnalyzedParser
   [smoker]   missing: SpatialPointVectorFieldType
   [smoker]   missing: SpatialRecursivePrefixTreeFieldType
   [smoker]   missing: SpatialTermQueryPrefixTreeFieldType
   [smoker]   missing: StrField
   [smoker]   missing: StrFieldSource
   [smoker]   missing: SchemaManager.OpType
   [smoker]   missing: TrieField.TrieTypes
   [smoker] 
   [smoker] /x1/jenkins/jenkins-slave/workspace/Lucene-Solr-SmokeRelease-5.x/lucene/build/smokeTestRelease/tmp/unpack/solr-5.4.0/solr/build/docs/solr-core/org/apache/solr/core/package-summary.html
   [smoker]   missing: CachingDirectoryFactory.CloseListener
   [smoker]   missing: Diagnostics.Callable
   [smoker]   missing: MapSerializable
   [smoker]   missing: SolrCore.RawWriter
   [smoker]   missing: SolrEventListener
   [smoker]   missing: AbstractSolrEventListener
   [smoker]   missing: CloudConfig
   [smoker]   missing: CloudConfig.CloudConfigBuilder
   [smoker]   missing: Config
   [smoker]   missing: ConfigSetProperties
   [smoker]   missing: CoreContainer
   [smoker]   missing: CoreContainer.CoreLoadFailure
   [smoker]   missing: Diagnostics
   [smoker]   missing: HdfsDirectoryFactory
   [smoker]   missing: ImplicitPlugins
   [smoker]   missing: JarRepository.JarContent
   [smoker]   missing: JarRepository.JarContentRef
   [smoker]   missing: MemClassLoader
   [smoker]   missing: NodeConfig
   [smoker]   missing: NodeConfig.NodeConfigBuilder
   [smoker]   missing: QuerySenderListener
   [smoker]   missing: RequestHandlers
   [smoker]   missing: RequestParams.VersionedParams
   [smoker]   missing: SolrConfig.HttpCachingConfig
   [smoker]   missing: SolrConfig.JmxConfiguration
   [smoker]   missing: SolrConfig.SolrPluginInfo
   [smoker]   missing: SolrConfig.UpdateHandlerInfo
   [smoker]   missing: SolrCore
   [smoker]   missing: SolrResourceLoader
   [smoker]   missing: SolrXmlConfig
   [smoker]   missing: ZkContainer
   [smoker]   missing: DirectoryFactory.DirContext
   [smoker]   missing: SolrConfig.HttpCachingConfig.LastModFrom
   [smoker]   missing: SolrConfig.PluginOpts
   [smoker]   missing: SolrInfoMBean.Category
   [smoker]   missing: SolrResourceNotFoundException
   [smoker] 
   [smoker] /x1/jenkins/jenkins-slave/workspace/Lucene-Solr-SmokeRelease-5.x/lucene/build/smokeTestRelease/tmp/unpack/solr-5.4.0/solr/build/docs/solr-core/org/apache/solr/query/package-summary.html
   [smoker]   missing: FilterQuery
   [smoker] 
   [smoker] /x1/jenkins/jenkins-slave/workspace/Lucene-Solr-SmokeRelease-5.x/lucene/build/smokeTestRelease/tmp/unpack/solr-5.4.0/solr/build/docs/solr-core/org/apache/solr/util/package-summary.html
   [smoker]   missing: ConcurrentLFUCache.EvictionListener
   [smoker]   missing: ConcurrentLRUCache.EvictionListener
   [smoker]   missing: FSHDFSUtils.CallerInfo
   [smoker]   missing: RTimer.TimerImpl
   [smoker]   missing: AdjustableSemaphore
   [smoker]   missing: CommandOperation
   [smoker]   missing: ConcurrentLFUCache.Stats
   [smoker]   missing: ConcurrentLRUCache.Stats
   [smoker]   missing: CryptoKeys.RSAKeyPair
   [smoker]   missing: DateFormatUtil
   [smoker]   missing: DateFormatUtil.ThreadLocalDateFormat
   [smoker]   missing: DefaultSolrThreadFactory
   [smoker]   missing: DOMUtil
   [smoker]   missing: FileUtils
   [smoker]   missing: HdfsUtil
   [smoker]   missing: NumberUtils
   [smoker]   missing: PrimUtils.IntComparator
   [smoker]   missing: PropertiesInputStream
   [smoker]   missing: PropertiesOutputStream
   [smoker]   missing: RecordingJSONParser
   [smoker]   missing: SimplePostTool.BAOS
   [smoker]   missing: SolrCLI.CreateCoreTool
   [smoker]   missing: SolrCLI.CreateTool
   [smoker]   missing: SolrCLI.DeleteTool
   [smoker]   missing: SolrCLI.ToolBase
   [smoker]   missing: SolrLogLayout
   [smoker]   missing: SolrLogLayout.CoreInfo
   [smoker]   missing: SolrLogLayout.Method
   [smoker]   missing: TimeOut
   [smoker]   missing: VersionedFile
   [smoker] 
   [smoker] /x1/jenkins/jenkins-slave/workspace/Lucene-Solr-SmokeRelease-5.x/lucene/build/smokeTestRelease/tmp/unpack/solr-5.4.0/solr/build/docs/solr-core/org/apache/solr/util/plugin/package-summary.html
   [smoker]   missing: SolrCoreAware
   [smoker]   missing: MapPluginLoader
   [smoker]   missing: NamedListPluginLoader
   [smoker] 
   [smoker] /x1/jenkins/jenkins-slave/workspace/Lucene-Solr-SmokeRelease-5.x/lucene/build/smokeTestRelease/tmp/unpack/solr-5.4.0/solr/build/docs/solr-core/org/apache/solr/highlight/package-summary.html
   [smoker]   missing: SolrEncoder
   [smoker]   missing: SolrFormatter
   [smoker]   missing: SolrFragListBuilder
   [smoker]   missing: SolrFragmenter
   [smoker]   missing: BreakIteratorBoundaryScanner
   [smoker]   missing: DefaultSolrHighlighter
   [smoker]   missing: GapFragmenter
   [smoker]   missing: HighlightingPluginBase
   [smoker]   missing: ScoreOrderFragmentsBuilder
   [smoker]   missing: SimpleBoundaryScanner
   [smoker]   missing: SimpleFragListBuilder
   [smoker]   missing: SimpleFragmentsBuilder
   [smoker]   missing: SingleFragListBuilder
   [smoker]   missing: SolrBoundaryScanner
   [smoker]   missing: SolrFragmentsBuilder
   [smoker]   missing: SolrHighlighter
   [smoker]   missing: WeightedFragListBuilder
   [smoker] 
   [smoker] /x1/jenkins/jenkins-slave/workspace/Lucene-Solr-SmokeRelease-5.x/lucene/build/smokeTestRelease/tmp/unpack/solr-5.4.0/solr/build/docs/solr-core/org/apache/solr/parser/package-summary.html
   [smoker]   missing: QueryParser
   [smoker] 
   [smoker] /x1/jenkins/jenkins-slave/workspace/Lucene-Solr-SmokeRelease-5.x/lucene/build/smokeTestRelease/tmp/unpack/solr-5.4.0/solr/build/docs/solr-core/org/apache/solr/search/package-summary.html
   [smoker]   missing: DocSetProducer
   [smoker]   missing: ScoreFilter
   [smoker]   missing: BitsFilteredPostingsEnum
   [smoker]   missing: CollapsingQParserPlugin.CollapseScore
   [smoker]   missing: DocSetCollector
   [smoker]   missing: DocSetUtil
   [smoker]   missing: ExportQParserPlugin
   [smoker]   missing: ExtendedDismaxQParser.Clause
   [smoker]   missing: ExtendedQueryBase
   [smoker]   missing: FunctionQParser
   [smoker]   missing: FunctionRangeQuery
   [smoker]   missing: JoinQParserPlugin
   [smoker]   missing: LRUCache
   [smoker]   missing: LuceneQParser
   [smoker]   missing: MaxScoreQParser
   [smoker]   missing: QParserPlugin
   [smoker]   missing: QueryContext
   [smoker]   missing: QueryUtils
   [smoker]   missing: ReRankQParserPlugin
   [smoker]   missing: SolrIndexSearcher.DocsEnumState
   [smoker]   missing: SolrIndexSearcher.ProcessedFilter
   [smoker]   missing: SpatialBoxQParserPlugin
   [smoker]   missing: SpatialFilterQParser
   [smoker]   missing: SpatialOptions
   [smoker]   missing: Grouping.Format
   [smoker]   missing: Grouping.TotalCount
   [smoker] 
   [smoker] /x1/jenkins/jenkins-slave/workspace/Lucene-Solr-SmokeRelease-5.x/lucene/build/smokeTestRelease/tmp/unpack/solr-5.4.0/solr/build/docs/solr-core/org/apache/solr/search/facet/package-summary.html
   [smoker]   missing: UnInvertedField.Callback
   [smoker]   missing: AggValueSource
   [smoker]   missing: AvgAgg
   [smoker]   missing: BlockJoin
   [smoker]   missing: CountAgg
   [smoker]   missing: FacetField
   [smoker]   missing: FacetMerger
   [smoker]   missing: FacetMerger.Context
   [smoker]   missing: FacetModule
   [smoker]   missing: FacetProcessor
   [smoker]   missing: FacetQuery
   [smoker]   missing: FacetRange
   [smoker]   missing: FacetRequest
   [smoker]   missing: FacetRequest.Domain
   [smoker]   missing: FieldUtil
   [smoker]   missing: HLLAgg
   [smoker]   missing: HLLAgg.HLLFactory
   [smoker]   missing: LegacyFacet
   [smoker]   missing: LegacyFacet.Subfacet
   [smoker]   missing: MaxAgg
   [smoker]   missing: MinAgg
   [smoker]   missing: PercentileAgg
   [smoker]   missing: PercentileAgg.Parser
   [smoker]   missing: SimpleAggValueSource
   [smoker]   missing: SlotAcc
   [smoker]   missing: SlotAcc.Resizer
   [smoker]   missing: StrAggValueSource
   [smoker]   missing: SumAgg
   [smoker]   missing: SumAgg.Merger
   [smoker]   missing: SumsqAgg
   [smoker]   missing: UniqueAgg
   [smoker]   missing: FacetField.FacetMethod
   [smoker]   missing: FacetField.SortDirection
   [smoker] 
   [smoker] /x1/jenkins/jenkins-slave/workspace/Lucene-Solr-SmokeRelease-5.x/lucene/build/smokeTestRelease/tmp/unpack/solr-5.4.0/solr/build/docs/solr-core/org/apache/solr/search/mlt/package-summary.html
   [smoker]   missing: CloudMLTQParser
   [smoker]   missing: SimpleMLTQParser
   [smoker] 
   [smoker] /x1/jenkins/jenkins-slave/workspace/Lucene-Solr-SmokeRelease-5.x/lucene/build/smokeTestRelease/tmp/unpack/solr-5.4.0/solr/build/docs/solr-core/org/apache/solr/search/function/package-summary.html
   [smoker]   missing: CollapseScoreFunction
   [smoker]   missing: FileFloatSource.ReloadCacheRequestHandler
   [smoker] 
   [smoker] /x1/jenkins/jenkins-slave/workspace/Lucene-Solr-SmokeRelease-5.x/lucene/build/smokeTestRelease/tmp/unpack/solr-5.4.0/solr/build/docs/solr-core/org/apache/solr/search/function/distance/package-summary.html
   [smoker]   missing: StringDistanceFunction
   [smoker] 
   [smoker] /x1/jenkins/jenkins-slave/workspace/Lucene-Solr-SmokeRelease-5.x/lucene/build/smokeTestRelease/tmp/unpack/solr-5.4.0/solr/build/docs/solr-core/org/apache/solr/search/join/package-summary.html
   [smoker]   missing: BlockJoinChildQParser
   [smoker] 
   [smoker] /x1/jenkins/jenkins-slave/workspace/Lucene-Solr-SmokeRelease-5.x/lucene/build/smokeTestRelease/tmp/unpack/solr-5.4.0/solr/build/docs/solr-core/org/apache/solr/search/stats/package-summary.html
   [smoker]   missing: CachedSearcherStats
   [smoker]   missing: ExactSharedStatsCache
   [smoker]   missing: ExactStatsCache.ExactStatsSource
   [smoker] 
   [smoker] /x1/jenkins/jenkins-slave/workspace/Lucene-Solr-SmokeRelease-5.x/lucene/build/smokeTestRelease/tmp/unpack/solr-5.4.0/solr/build/docs/solr-core/org/apache/solr/search/grouping/package-summary.html
   [smoker]   missing: CommandHandler.Builder
   [smoker] 
   [smoker] /x1/jenkins/jenkins-slave/workspace/Lucene-Solr-SmokeRelease-5.x/lucene/build/smokeTestRelease/tmp/unpack/solr-5.4.0/solr/build/docs/solr-core/org/apache/solr/search/grouping/distributed/requestfactory/package-summary.html
   [smoker]   missing: StoredFieldsShardRequestFactory
   [smoker] 
   [smoker] /x1/jenkins/jenkins-slave/workspace/Lucene-Solr-SmokeRelease-5.x/lucene/build/smokeTestRelease/tmp/unpack/solr-5.4.0/solr/build/docs/solr-core/org/apache/solr/search/grouping/distributed/command/package-summary.html
   [smoker]   missing: QueryCommand
   [smoker]   missing: QueryCommand.Builder
   [smoker]   missing: SearchGroupsFieldCommand.Builder
   [smoker]   missing: TopGroupsFieldCommand.Builder
   [smoker] 
   [smoker] /x1/jenkins/jenkins-slave/workspace/Lucene-Solr-SmokeRelease-5.x/lucene/build/smokeTestRelease/tmp/unpack/solr-5.4.0/solr/build/docs/solr-core/org/apache/solr/client/solrj/embedded/package-summary.html
   [smoker]   missing: JettyConfig
   [smoker]   missing: JettyConfig.Builder
   [smoker]   missing: JettySolrRunner.DebugFilter
   [smoker]   missing: SSLConfig
   [smoker] 
   [smoker] /x1/jenkins/jenkins-slave/workspace/Lucene-Solr-SmokeRelease-5.x/lucene/build/smokeTestRelease/tmp/unpack/solr-5.4.0/solr/build/docs/solr-core/org/apache/solr/cloud/package-summary.html
   [smoker]   missing: ActionThrottle.NanoTimeSource
   [smoker]   missing: RecoveryStrategy.RecoveryListener
   [smoker]   missing: ActionThrottle
   [smoker]   missing: Assign
   [smoker]   missing: CloudConfigSetService
   [smoker]   missing: CloudDescriptor
   [smoker]   missing: CloudUtil
   [smoker]   missing: DistributedMap.MapEvent
   [smoker]   missing: ElectionContext
   [smoker]   missing: Overseer.FailedOp
   [smoker]   missing: Overseer.Stat
   [smoker]   missing: OverseerSolrResponse
   [smoker]   missing: OverseerTaskQueue.QueueEvent
   [smoker]   missing: RecoveryStrategy
   [smoker]   missing: SolrZkServer
   [smoker]   missing: SyncStrategy
   [smoker]   missing: ZkCLI
   [smoker]   missing: ZkSolrResourceLoader.ZkByteArrayInputStream
   [smoker]   missing: OverseerMessageHandler.ExclusiveMarking
   [smoker]   missing: ZkController.ResourceModifiedInZkException
   [smoker] 
   [smoker] /x1/jenkins/jenkins-slave/workspace/Lucene-Solr-SmokeRelease-5.x/lucene/build/smokeTestRelease/tmp/unpack/solr-5.4.0/solr/build/docs/solr-core/org/apache/solr/cloud/rule/package-summary.html
   [smoker]   missing: RemoteCallback
   [smoker]   missing: ImplicitSnitch
   [smoker]   missing: ReplicaAssigner
   [smoker]   missing: ReplicaAssigner.Position
   [smoker]   missing: Rule
   [smoker]   missing: Rule.Condition
   [smoker]   missing: Snitch
   [smoker]   missing: SnitchContext.SnitchInfo
   [smoker]   missing: Rule.Operand
   [smoker] 
   [smoker] /x1/jenkins/jenkins-slave/workspace/Lucene-Solr-SmokeRelease-5.x/lucene/build/smokeTestRelease/tmp/unpack/solr-5.4.0/solr/build/docs/solr-core/org/apache/solr/cloud/overseer/package-summary.html
   [smoker]   missing: ZkStateWriter.ZkWriteCallback
   [smoker]   missing: ClusterStateMutator
   [smoker]   missing: CollectionMutator
   [smoker]   missing: ReplicaMutator
   [smoker]   missing: SliceMutator
   [smoker]   missing: ZkWriteCommand
   [smoker] 
   [smoker] /x1/jenkins/jenkins-slave/workspace/Lucene-Solr-SmokeRelease-5.x/lucene/build/smokeTestRelease/tmp/unpack/solr-5.4.0/solr/build/docs/solr-core/org/apache/solr/analysis/package-summary.html
   [smoker]   missing: SolrAnalyzer
   [smoker] 
   [smoker] /x1/jenkins/jenkins-slave/workspace/Lucene-Solr-SmokeRelease-5.x/lucene/build/smokeTestRelease/tmp/unpack/solr-5.4.0/solr/build/docs/solr-core/org/apache/solr/logging/package-summary.html
   [smoker]   missing: ListenerConfig
   [smoker] 
   [smoker] /x1/jenkins/jenkins-slave/workspace/Lucene-Solr-SmokeRelease-5.x/lucene/build/smokeTestRelease/tmp/unpack/solr-5.4.0/solr/build/docs/solr-core/org/apache/solr/logging/jul/package-summary.html
   [smoker]   missing: JulInfo
   [smoker]   missing: JulWatcher
   [smoker]   missing: RecordHandler
   [smoker] 
   [smoker] /x1/jenkins/jenkins-slave/workspace/Lucene-Solr-SmokeRelease-5.x/lucene/build/smokeTestRelease/tmp/unpack/solr-5.4.0/solr/build/docs/solr-core/org/apache/solr/logging/log4j/package-summary.html
   [smoker]   missing: EventAppender
   [smoker]   missing: Log4jInfo
   [smoker]   missing: Log4jWatcher
   [smoker] 
   [smoker] /x1/jenkins/jenkins-slave/workspace/Lucene-Solr-SmokeRelease-5.x/lucene/build/smokeTestRelease/tmp/unpack/solr-5.4.0/solr/build/docs/solr-core/org/apache/solr/internal/csv/writer/package-summary.html
   [smoker]   missing: CSVField
   [smoker] 
   [smoker] /x1/jenkins/jenkins-slave/workspace/Lucene-Solr-SmokeRelease-5.x/lucene/build/smokeTestRelease/tmp/unpack/solr-5.4.0/solr/build/docs/solr-core/org/apache/solr/response/package-summary.html
   [smoker]   missing: SortingResponseWriter.IntComp
   [smoker]   missing: SortingResponseWriter.SortValue
   [smoker]   missing: BinaryResponseWriter
   [smoker]   missing: BinaryResponseWriter.Resolver
   [smoker]   missing: CSVResponseWriter
   [smoker]   missing: DocsStreamer
   [smoker]   missing: JSONResponseWriter
   [smoker]   missing: PHPResponseWriter
   [smoker]   missing: PythonResponseWriter
   [smoker]   missing: RubyResponseWriter
   [smoker]   missing: SchemaXmlResponseWriter
   [smoker]   missing: SchemaXmlWriter
   [smoker]   missing: SmileResponseWriter
   [smoker]   missing: SmileResponseWriter.SmileWriter
   [smoker]   missing: SortingResponseWriter
   [smoker]   missing: WriteableValue
   [smoker]   missing: XMLResponseWriter
   [smoker]   missing: XMLWriter
   [smoker]   missing: SortingResponseWriter.IgnoreException
   [smoker] 
   [smoker] /x1/jenkins/jenkins-slave/workspace/Lucene-Solr-SmokeRelease-5.x/lucene/build/smokeTestRelease/tmp/unpack/solr-5.4.0/solr/build/docs/solr-core/org/apache/solr/response/transform/package-summary.html
   [smoker]   missing: BaseEditorialTransformer
   [smoker]   missing: ChildDocTransformerFactory
   [smoker]   missing: DocIdAugmenterFactory
   [smoker]   missing: ExcludedMarkerFactory
   [smoker]   missing: ExplainAugmenterFactory
   [smoker]   missing: RawValueTransformerFactory
   [smoker]   missing: RawValueTransformerFactory.WriteableStringValue
   [smoker]   missing: ShardAugmenterFactory
   [smoker]   missing: ValueAugmenterFactory
   [smoker]   missing: ExplainAugmenterFactory.Style
   [smoker] 
   [smoker] /x1/jenkins/jenkins-slave/workspace/Lucene-Solr-SmokeRelease-5.x/lucene/build/smokeTestRelease/tmp/unpack/solr-5.4.0/solr/build/docs/solr-velocity/org/apache/solr/response/package-summary.html
   [smoker]   missing: SolrParamResourceLoader
   [smoker]   missing: SolrVelocityLogger
   [smoker]   missing: VelocityResponseWriter
   [smoker] 
   [smoker] /x1/jenkins/jenkins-slave/workspace/Lucene-Solr-SmokeRelease-5.x/lucene/build/smokeTestRelease/tmp/unpack/solr-5.4.0/solr/build/docs/solr-dataimporthandler/org/apache/solr/handler/dataimport/package-summary.html
   [smoker]   missing: DIHWriter
   [smoker]   missing: CachePropertyUtil
   [smoker]   missing: ConfigParseUtil
   [smoker]   missing: DebugInfo
   [smoker]   missing: DIHCacheSupport
   [smoker]   missing: DIHWriterBase
   [smoker]   missing: DocBuilder.Statistics
   [smoker]   missing: Evaluator.VariableWrapper
   [smoker]   missing: RequestInfo
   [smoker]   missing: SolrQueryEscapingEvaluator
   [smoker]   missing: SortedMapBackedCache
   [smoker]   missing: DataImporter.Status
   [smoker]   missing: DIHLogLevels
   [smoker] 
   [smoker] /x1/jenkins/jenkins-slave/workspace/Lucene-Solr-SmokeRelease-5.x/lucene/build/smokeTestRelease/tmp/unpack/solr-5.4.0/solr/build/docs/solr-dataimporthandler/org/apache/solr/handler/dataimport/config/package-summary.html
   [smoker]   missing: ConfigNameConstants
   [smoker]   missing: ConfigParseUtil
   [smoker]   missing: Entity
   [smoker]   missing: EntityField
   [smoker]   missing: EntityField.Builder
   [smoker]   missing: Field
   [smoker]   missing: Field.Builder
   [smoker]   missing: PropertyWriter
   [smoker]   missing: Script
   [smoker] 
   [smoker] /x1/jenkins/jenkins-slave/workspace/Lucene-Solr-SmokeRelease-5.x/lucene/build/smokeTestRelease/tmp/unpack/solr-5.4.0/solr/build/docs/solr-dataimporthandler-extras/org/apache/solr/handler/dataimport/package-summary.html
   [smoker]   missing: MailEntityProcessor.CustomFilter
   [smoker] 
   [smoker] /x1/jenkins/jenkins-slave/workspace/Lucene-Solr-SmokeRelease-5.x/lucene/build/smokeTestRelease/tmp/unpack/solr-5.4.0/solr/build/docs/solr-map-reduce/org/apache/solr/hadoop/package-summary.html
   [smoker]   missing: SolrInputDocumentWritable
   [smoker]   missing: SolrMapper
   [smoker]   missing: SolrOutputFormat
   [smoker]   missing: UnbufferedDataInputInputStream
   [smoker]   missing: Utils
   [smoker]   missing: SolrCounters
   [smoker] 
   [smoker] /x1/jenkins/jenkins-slave/workspace/Lucene-Solr-SmokeRelease-5.x/lucene/build/smokeTestRelease/tmp/unpack/solr-5.4.0/solr/build/docs/solr-map-reduce/org/apache/solr/hadoop/dedup/package-summary.html
   [smoker]   missing: SolrInputDocumentComparator.TimeStampComparator
   [smoker] 
   [smoker] /x1/jenkins/jenkins-slave/workspace/Lucene-Solr-SmokeRelease-5.x/lucene/build/smokeTestRelease/tmp/unpack/solr-5.4.0/solr/build/docs/solr-map-reduce/org/apache/solr/hadoop/morphline/package-summary.html
   [smoker]   missing: MorphlineCounters
   [smoker] 
   [smoker] /x1/jenkins/jenkins-slave/workspace/Lucene-Solr-SmokeRelease-5.x/lucene/build/smokeTestRelease/tmp/unpack/solr-5.4.0/solr/build/docs/solr-langid/org/apache/solr/update/processor/package-summary.html
   [smoker]   missing: LangIdParams
   [smoker] 
   [smoker] /x1/jenkins/jenkins-slave/workspace/Lucene-Solr-SmokeRelease-5.x/lucene/build/smokeTestRelease/tmp/unpack/solr-5.4.0/solr/build/docs/solr-cell/org/apache/solr/handler/extraction/package-summary.html
   [smoker]   missing: ExtractingDocumentLoader.MostlyPassthroughHtmlMapper
   [smoker]   missing: SolrContentHandlerFactory
   [smoker] 
   [smoker] /x1/jenkins/jenkins-slave/workspace/Lucene-Solr-SmokeRelease-5.x/lucene/build/smokeTestRelease/tmp/unpack/solr-5.4.0/solr/build/docs/solr-analytics/org/apache/solr/handler/component/package-summary.html
   [smoker]   missing: AnalyticsComponent
   [smoker] 
   [smoker] /x1/jenkins/jenkins-slave/workspace/Lucene-Solr-SmokeRelease-5.x/lucene/build/smokeTestRelease/tmp/unpack/solr-5.4.0/solr/build/docs/solr-analytics/org/apache/solr/analytics/request/package-summary.html
   [smoker]   missing: FacetRequest
   [smoker]   missing: FieldFacetRequest.FacetSortDirection
   [smoker] 
   [smoker] /x1/jenkins/jenkins-slave/workspace/Lucene-Solr-SmokeRelease-5.x/lucene/build/smokeTestRelease/tmp/unpack/solr-5.4.0/solr/build/docs/solr-analytics/org/apache/solr/analytics/plugin/package-summary.html
   [smoker]   missing: AnalyticsStatisticsCollector
   [smoker] 
   [smoker] /x1/jenkins/jenkins-slave/workspace/Lucene-Solr-SmokeRelease-5.x/lucene/build/smokeTestRelease/tmp/unpack/solr-5.4.0/solr/build/docs/solr-analytics/org/apache/solr/analytics/util/package-summary.html
   [smoker]   missing: AnalyticsParams
   [smoker]   missing: MedianCalculator
   [smoker]   missing: PercentileCalculator
   [smoker]   missing: RangeEndpointCalculator
   [smoker]   missing: RangeEndpointCalculator.DateRangeEndpointCalculator
   [smoker]   missing: RangeEndpointCalculator.DoubleRangeEndpointCalculator
   [smoker]   missing: RangeEndpointCalculator.FacetRange
   [smoker]   missing: RangeEndpointCalculator.FloatRangeEndpointCalculator
   [smoker]   missing: RangeEndpointCalculator.IntegerRangeEndpointCalculator
   [smoker]   missing: RangeEndpointCalculator.LongRangeEndpointCalculator
   [smoker] 
   [smoker] /x1/jenkins/jenkins-slave/workspace/Lucene-Solr-SmokeRelease-5.x/lucene/build/smokeTestRelease/tmp/unpack/solr-5.4.0/solr/build/docs/solr-analytics/org/apache/solr/analytics/expression/package-summary.html
   [smoker]   missing: ExpressionFactory
   [smoker] 
   [smoker] /x1/jenkins/jenkins-slave/workspace/Lucene-Solr-SmokeRelease-5.x/lucene/build/smokeTestRelease/tmp/unpack/solr-5.4.0/solr/build/docs/solr-analytics/org/apache/solr/analytics/statistics/package-summary.html
   [smoker]   missing: StatsCollectorSupplierFactory
   [smoker] 
   [smoker] /x1/jenkins/jenkins-slave/workspace/Lucene-Solr-SmokeRelease-5.x/lucene/build/smokeTestRelease/tmp/unpack/solr-5.4.0/solr/build/docs/solr-test-framework/org/apache/solr/package-summary.html
   [smoker]   missing: BaseDistributedSearchTestCase.RandDate
   [smoker]   missing: BaseDistributedSearchTestCase.RandVal
   [smoker]   missing: JSONTestUtil
   [smoker]   missing: SolrJettyTestBase
   [smoker]   missing: SolrTestCaseHS
   [smoker]   missing: SolrTestCaseHS.Client
   [smoker]   missing: SolrTestCaseHS.Client.Tester
   [smoker]   missing: SolrTestCaseHS.ClientProvider
   [smoker]   missing: SolrTestCaseHS.SolrInstance
   [smoker]   missing: SolrTestCaseHS.SolrInstances
   [smoker]   missing: SolrTestCaseJ4.CoreDescriptorBuilder
   [smoker]   missing: SolrTestCaseJ4.Doc
   [smoker]   missing: SolrTestCaseJ4.Fld
   [smoker]   missing: SolrTestCaseJ4.FVal
   [smoker]   missing: SolrTestCaseJ4.IRange
   [smoker]   missing: SolrTestCaseJ4.IVals
   [smoker]   missing: SolrTestCaseJ4.IValsPercent
   [smoker]   missing: SolrTestCaseJ4.SVal
   [smoker]   missing: SolrTestCaseJ4.Vals
   [smoker]   missing: BaseDistributedSearchTestCase.ShardsFixed
   [smoker]   missing: BaseDistributedSearchTestCase.ShardsRepeat
   [smoker] 
   [smoker] /x1/jenkins/jenkins-slave/workspace/Lucene-Solr-SmokeRelease-5.x/lucene/build/smokeTestRelease/tmp/unpack/solr-5.4.0/solr/build/docs/solr-test-framework/org/apache/solr/update/processor/package-summary.html
   [smoker]   missing: BufferingRequestProcessor
   [smoker] 
   [smoker] /x1/jenkins/jenkins-slave/workspace/Lucene-Solr-SmokeRelease-5.x/lucene/build/smokeTestRelease/tmp/unpack/solr-5.4.0/solr/build/docs/solr-test-framework/org/apache/solr/handler/component/package-summary.html
   [smoker]   missing: TrackingShardHandlerFactory.ShardRequestAndParams
   [smoker] 
   [smoker] /x1/jenkins/jenkins-slave/workspace/Lucene-Solr-SmokeRelease-5.x/lucene/build/smokeTestRelease/tmp/unpack/solr-5.4.0/solr/build/docs/solr-test-framework/org/apache/solr/core/package-summary.html
   [smoker]   missing: AbstractBadConfigTestBase
   [smoker] 
   [smoker] /x1/jenkins/jenkins-slave/workspace/Lucene-Solr-SmokeRelease-5.x/lucene/build/smokeTestRelease/tmp/unpack/solr-5.4.0/solr/build/docs/solr-test-framework/org/apache/solr/util/package-summary.html
   [smoker]   missing: RESTfulServerProvider
   [smoker]   missing: BadHdfsThreadsFilter
   [smoker]   missing: BadMrClusterThreadsFilter
   [smoker]   missing: BadZookeeperThreadsFilter
   [smoker]   missing: BaseTestHarness
   [smoker]   missing: DOMUtilTestBase
   [smoker]   missing: ReadOnlyCoresLocator
   [smoker]   missing: RestTestBase
   [smoker]   missing: RevertDefaultThreadHandlerRule
   [smoker]   missing: SSLTestConfig
   [smoker]   missing: TestHarness.TestCoresLocator
   [smoker] 
   [smoker] /x1/jenkins/jenkins-slave/workspace/Lucene-Solr-SmokeRelease-5.x/lucene/build/smokeTestRelease/tmp/unpack/solr-5.4.0/solr/build/docs/solr-test-framework/org/apache/solr/cloud/package-summary.html
   [smoker]   missing: AbstractDistribZkTestBase
   [smoker]   missing: AbstractFullDistribZkTestBase.CloudJettyRunner
   [smoker]   missing: CloudInspectUtil
   [smoker]   missing: MockSolrZkClient
   [smoker]   missing: MockZkStateReader
   [smoker]   missing: StoppableIndexingThread
   [smoker]   missing: ZkTestServer
   [smoker]   missing: ZkTestServer.HostPort
   [smoker]   missing: ZkTestServer.LimitViolationAction
   [smoker] 
   [smoker] ***WARNING***: javadocs want to fail!
   [smoker] 
   [smoker] 
   [smoker] Crawl/parse...
   [smoker] 
   [smoker] Verify...
   [smoker]     test solr example w/ Java 7...
   [smoker]       start Solr instance (log=/x1/jenkins/jenkins-slave/workspace/Lucene-Solr-SmokeRelease-5.x/lucene/build/smokeTestRelease/tmp/unpack/solr-5.4.0/solr-example.log)...
   [smoker] No process found for Solr node running on port 8983
   [smoker]       Running techproducts example on port 8983 from /x1/jenkins/jenkins-slave/workspace/Lucene-Solr-SmokeRelease-5.x/lucene/build/smokeTestRelease/tmp/unpack/solr-5.4.0
   [smoker] Creating Solr home directory /x1/jenkins/jenkins-slave/workspace/Lucene-Solr-SmokeRelease-5.x/lucene/build/smokeTestRelease/tmp/unpack/solr-5.4.0/solr/example/techproducts/solr
   [smoker] 
   [smoker] Starting up Solr on port 8983 using command:
   [smoker] bin/solr start -p 8983 -s "example/techproducts/solr"
   [smoker] 
   [smoker] Waiting up to 30 seconds to see Solr running on port 8983 [|]   [/]   [-]   [\]   [|]   [/]   [-]   [\]   [|]   [/]   [-]  
   [smoker] Started Solr server on port 8983 (pid=16100). Happy searching!
   [smoker] 
   [smoker]     
   [smoker] Setup new core instance directory:
   [smoker] /x1/jenkins/jenkins-slave/workspace/Lucene-Solr-SmokeRelease-5.x/lucene/build/smokeTestRelease/tmp/unpack/solr-5.4.0/solr/example/techproducts/solr/techproducts
   [smoker] 
   [smoker] Creating new core 'techproducts' using command:
   [smoker] http://localhost:8983/solr/admin/cores?action=CREATE&name=techproducts&instanceDir=techproducts
   [smoker] 
   [smoker] {
   [smoker]   "responseHeader":{
   [smoker]     "status":0,
   [smoker]     "QTime":2385},
   [smoker]   "core":"techproducts"}
   [smoker] 
   [smoker] 
   [smoker] Indexing tech product example docs from /x1/jenkins/jenkins-slave/workspace/Lucene-Solr-SmokeRelease-5.x/lucene/build/smokeTestRelease/tmp/unpack/solr-5.4.0/solr/example/exampledocs
   [smoker] SimplePostTool version 5.0.0
   [smoker] Posting files to [base] url http://localhost:8983/solr/techproducts/update using content-type application/xml...
   [smoker] POSTing file money.xml to [base]
   [smoker] POSTing file mem.xml to [base]
   [smoker] POSTing file vidcard.xml to [base]
   [smoker] POSTing file ipod_video.xml to [base]
   [smoker] POSTing file sd500.xml to [base]
   [smoker] POSTing file gb18030-example.xml to [base]
   [smoker] POSTing file mp500.xml to [base]
   [smoker] POSTing file monitor2.xml to [base]
   [smoker] POSTing file utf8-example.xml to [base]
   [smoker] POSTing file manufacturers.xml to [base]
   [smoker] POSTing file hd.xml to [base]
   [smoker] POSTing file solr.xml to [base]
   [smoker] POSTing file monitor.xml to [base]
   [smoker] POSTing file ipod_other.xml to [base]
   [smoker] 14 files indexed.
   [smoker] COMMITting Solr index changes to http://localhost:8983/solr/techproducts/update...
   [smoker] Time spent: 0:00:00.566
   [smoker] 
   [smoker] Solr techproducts example launched successfully. Direct your Web browser to http://localhost:8983/solr to visit the Solr Admin UI
   [smoker]       test utf8...
   [smoker]       run query...
   [smoker]       stop server using: bin/solr stop -p 8983
   [smoker] Sending stop command to Solr running on port 8983 ... waiting 5 seconds to allow Jetty process 16100 to stop gracefully.
   [smoker]  [|]   [/]   [-]   [\]   [|]   [/]   [-]   [\]   [|]   [/]          run tests w/ Java 8 and testArgs='-Dtests.slow=false'...
   [smoker] 
   [smoker] command "export JAVA_HOME="/home/jenkins/jenkins-slave/tools/hudson.model.JDK/latest1.8" PATH="/home/jenkins/jenkins-slave/tools/hudson.model.JDK/latest1.8/bin:$PATH" JAVACMD="/home/jenkins/jenkins-slave/tools/hudson.model.JDK/latest1.8/bin/java"; ant clean test -Dtests.slow=false -Dtests.slow=false" failed:
   [smoker] Buildfile: /x1/jenkins/jenkins-slave/workspace/Lucene-Solr-SmokeRelease-5.x/lucene/build/smokeTestRelease/tmp/unpack/solr-5.4.0/solr/build.xml
   [smoker] 
   [smoker] clean:
   [smoker]    [delete] Deleting directory /x1/jenkins/jenkins-slave/workspace/Lucene-Solr-SmokeRelease-5.x/lucene/build/smokeTestRelease/tmp/unpack/solr-5.4.0/solr/build
   [smoker]    [delete] Deleting directory /x1/jenkins/jenkins-slave/workspace/Lucene-Solr-SmokeRelease-5.x/lucene/build/smokeTestRelease/tmp/unpack/solr-5.4.0/solr/dist
   [smoker]    [delete] Deleting directory /x1/jenkins/jenkins-slave/workspace/Lucene-Solr-SmokeRelease-5.x/lucene/build/smokeTestRelease/tmp/unpack/solr-5.4.0/solr/package
   [smoker]    [delete] Deleting directory /x1/jenkins/jenkins-slave/workspace/Lucene-Solr-SmokeRelease-5.x/lucene/build/smokeTestRelease/tmp/unpack/solr-5.4.0/solr/example/techproducts
   [smoker] 
   [smoker] ivy-availability-check:
   [smoker] 
   [smoker] ivy-fail:
   [smoker] 
   [smoker] ivy-configure:
   [smoker] [ivy:configure] :: Apache Ivy 2.3.0 - 20130110142753 :: http://ant.apache.org/ivy/ ::
   [smoker] [ivy:configure] :: loading settings :: file = /x1/jenkins/jenkins-slave/workspace/Lucene-Solr-SmokeRelease-5.x/lucene/build/smokeTestRelease/tmp/unpack/solr-5.4.0/lucene/ivy-settings.xml
   [smoker] 
   [smoker] resolve-groovy:
   [smoker] [ivy:cachepath] :: resolving dependencies :: org.codehaus.groovy#groovy-all-caller;working
   [smoker] [ivy:cachepath] 	confs: [default]
   [smoker] [ivy:cachepath] 	found org.codehaus.groovy#groovy-all;2.4.4 in public
   [smoker] [ivy:cachepath] :: resolution report :: resolve 269ms :: artifacts dl 3ms
   [smoker] 	---------------------------------------------------------------------
   [smoker] 	|                  |            modules            ||   artifacts   |
   [smoker] 	|       conf       | number| search|dwnlded|evicted|| number|dwnlded|
   [smoker] 	---------------------------------------------------------------------
   [smoker] 	|      default     |   1   |   0   |   0   |   0   ||   1   |   0   |
   [smoker] 	---------------------------------------------------------------------
   [smoker] 
   [smoker] -init-totals:
   [smoker]     [mkdir] Created dir: /x1/jenkins/jenkins-slave/workspace/Lucene-Solr-SmokeRelease-5.x/lucene/build/smokeTestRelease/tmp/unpack/solr-5.4.0/solr/build/solr
   [smoker] 
   [smoker] -clover.load:
   [smoker] 
   [smoker] test-solr-core:
   [smoker] 
   [smoker] test:
   [smoker] 
   [smoker] -clover.disable:
   [smoker] 
   [smoker] ivy-availability-check:
   [smoker] 
   [smoker] ivy-fail:
   [smoker] 
   [smoker] ivy-configure:
   [smoker] [ivy:configure] :: loading settings :: file = /x1/jenkins/jenkins-slave/workspace/Lucene-Solr-SmokeRelease-5.x/lucene/build/smokeTestRelease/tmp/unpack/solr-5.4.0/lucene/ivy-settings.xml
   [smoker] 
   [smoker] -clover.load:
   [smoker] 
   [smoker] -clover.classpath:
   [smoker] 
   [smoker] -clover.setup:
   [smoker] 
   [smoker] clover:
   [smoker] 
   [smoker] check-analyzers-icu-uptodate:
   [smoker] 
   [smoker] jar-analyzers-icu:
   [smoker] 
   [smoker] -compile-analysis-extras:
   [smoker] 
   [smoker] check-analyzers-icu-uptodate:
   [smoker] 
   [smoker] jar-analyzers-icu:
   [smoker] 
   [smoker] compile-solr-core:
   [smoker] 
   [smoker] compile-solrj:
   [smoker] 
   [smoker] check-lucene-core-uptodate:
   [smoker] 
   [smoker] jar-lucene-core:
   [smoker] 
   [smoker] check-backward-codecs-uptodate:
   [smoker] 
   [smoker] jar-backward-codecs:
   [smoker] 
   [smoker] check-analyzers-phonetic-uptodate:
   [smoker] 
   [smoker] jar-analyzers-phonetic:
   [smoker] 
   [smoker] check-analyzers-kuromoji-uptodate:
   [smoker] 
   [smoker] jar-analyzers-kuromoji:
   [smoker] 
   [smoker] check-codecs-uptodate:
   [smoker] 
   [smoker] jar-codecs:
   [smoker] 
   [smoker] check-expressions-uptodate:
   [smoker] 
   [smoker] jar-expressions:
   [smoker] 
   [smoker] check-suggest-uptodate:
   [smoker] 
   [smoker] jar-suggest:
   [smoker] 
   [smoker] check-highlighter-uptodate:
   [smoker] 
   [smoker] jar-highlighter:
   [smoker] 
   [smoker] check-memory-uptodate:
   [smoker] 
   [smoker] jar-memory:
   [smoker] 
   [smoker] check-misc-uptodate:
   [smoker] 
   [smoker] jar-misc:
   [smoker] 
   [smoker] check-spatial-uptodate:
   [smoker] 
   [smoker] jar-spatial:
   [smoker] 
   [smoker] check-grouping-uptodate:
   [smoker] 
   [smoker] jar-grouping:
   [smoker] 
   [smoker] check-queries-uptodate:
   [smoker] 
   [smoker] jar-queries:
   [smoker] 
   [smoker] check-queryparser-uptodate:
   [smoker] 
   [smoker] jar-queryparser:
   [smoker] 
   [smoker] check-join-uptodate:
   [smoker] 
   [smoker] jar-join:
   [smoker] 
   [smoker] check-sandbox-uptodate:
   [smoker] 
   [smoker] jar-sandbox:
   [smoker] 
   [smoker] prep-lucene-jars:
   [smoker] 
   [smoker] resolve-example:
   [smoker] 
   [smoker] ivy-availability-check:
   [smoker] 
   [smoker] ivy-fail:
   [smoker] 
   [smoker] ivy-configure:
   [smoker] [ivy:configure] :: loading settings :: file = /x1/jenkins/jenkins-slave/workspace/Lucene-Solr-SmokeRelease-5.x/lucene/build/smokeTestRelease/tmp/unpack/solr-5.4.0/lucene/ivy-settings.xml
   [smoker] 
   [smoker] resolve:
   [smoker] 
   [smoker] resolve-server:
   [smoker] 
   [smoker] ivy-availability-check:
   [smoker] 
   [smoker] ivy-fail:
   [smoker] 
   [smoker] ivy-fail:
   [smoker] 
   [smoker] ivy-configure:
   [smoker] [ivy:configure] :: loading settings :: file = /x1/jenkins/jenkins-slave/workspace/Lucene-Solr-SmokeRelease-5.x/lucene/build/smokeTestRelease/tmp/unpack/solr-5.4.0/lucene/ivy-settings.xml
   [smoker] 
   [smoker] resolve:
   [smoker] 
   [smoker] ivy-availability-check:
   [smoker] 
   [smoker] ivy-fail:
   [smoker] 
   [smoker] ivy-fail:
   [smoker] 
   [smoker] ivy-configure:
   [smoker] [ivy:configure] :: loading settings :: file = /x1/jenkins/jenkins-slave/workspace/Lucene-Solr-SmokeRelease-5.x/lucene/build/smokeTestRelease/tmp/unpack/solr-5.4.0/lucene/ivy-settings.xml
   [smoker] 
   [smoker] resolve:
   [smoker] 
   [smoker] common.init:
   [smoker] 
   [smoker] compile-lucene-core:
   [smoker] 
   [smoker] ivy-availability-check:
   [smoker] 
   [smoker] ivy-fail:
   [smoker] 
   [smoker] ivy-configure:
   [smoker] [ivy:configure] :: loading settings :: file = /x1/jenkins/jenkins-slave/workspace/Lucene-Solr-SmokeRelease-5.x/lucene/build/smokeTestRelease/tmp/unpack/solr-5.4.0/lucene/ivy-settings.xml
   [smoker] 
   [smoker] resolve:
   [smoker] 
   [smoker] init:
   [smoker] 
   [smoker] -clover.disable:
   [smoker] 
   [smoker] -clover.load:
   [smoker] 
   [smoker] -clover.classpath:
   [smoker] 
   [smoker] -clover.setup:
   [smoker] 
   [smoker] clover:
   [smoker] 
   [smoker] compile-core:
   [smoker] 
   [smoker] init:
   [smoker] 
   [smoker] -clover.disable:
   [smoker] 
   [smoker] -clover.load:
   [smoker] 
   [smoker] -clover.classpath:
   [smoker] 
   [smoker] -clover.setup:
   [smoker] 
   [smoker] clover:
   [smoker] 
   [smoker] common.compile-core:
   [smoker]     [mkdir] Created dir: /x1/jenkins/jenkins-slave/workspace/Lucene-Solr-SmokeRelease-5.x/lucene/build/smokeTestRelease/tmp/unpack/solr-5.4.0/solr/build/solr-solrj/classes/java
   [smoker]     [javac] Compiling 221 source files to /x1/jenkins/jenkins-slave/workspace/Lucene-Solr-SmokeRelease-5.x/lucene/build/smokeTestRelease/tmp/unpack/solr-5.4.0/solr/build/solr-solrj/classes/java
   [smoker]     [javac] warning: [options] bootstrap class path not set in conjunction with -source 1.7
   [smoker]     [javac] Note: Some input files use or override a deprecated API.
   [smoker]     [javac] Note: Recompile with -Xlint:deprecation for details.
   [smoker]     [javac] Note: Some input files use unchecked or unsafe operations.
   [smoker]     [javac] Note: Recompile with -Xlint:unchecked for details.
   [smoker]     [javac] 1 warning
   [smoker]     [javac] Creating empty /x1/jenkins/jenkins-slave/workspace/Lucene-Solr-SmokeRelease-5.x/lucene/build/smokeTestRelease/tmp/unpack/solr-5.4.0/solr/build/solr-solrj/classes/java/org/apache/solr/client/solrj/request/schema/package-info.class
   [smoker]     [javac] Creating empty /x1/jenkins/jenkins-slave/workspace/Lucene-Solr-SmokeRelease-5.x/lucene/build/smokeTestRelease/tmp/unpack/solr-5.4.0/solr/build/solr-solrj/classes/java/org/apache/solr/client/solrj/response/schema/package-info.class
   [smoker]     [javac] Creating empty /x1/jenkins/jenkins-slave/workspace/Lucene-Solr-SmokeRelease-5.x/lucene/build/smokeTestRelease/tmp/unpack/solr-5.4.0/solr/build/solr-solrj/classes/java/org/apache/solr/client/solrj/beans/package-info.class
   [smoker]     [javac] Creating empty /x1/jenkins/jenkins-slave/workspace/Lucene-Solr-SmokeRelease-5.x/lucene/build/smokeTestRelease/tmp/unpack/solr-5.4.0/solr/build/solr-solrj/classes/java/org/apache/solr/client/solrj/io/stream/expr/package-info.class
   [smoker]     [javac] Creating empty /x1/jenkins/jenkins-slave/workspace/Lucene-Solr-SmokeRelease-5.x/lucene/build/smokeTestRelease/tmp/unpack/solr-5.4.0/solr/build/solr-solrj/classes/java/org/apache/solr/client/solrj/response/package-info.class
   [smoker]     [javac] Creating empty /x1/jenkins/jenkins-slave/workspace/Lucene-Solr-SmokeRelease-5.x/lucene/build/smokeTestRelease/tmp/unpack/solr-5.4.0/solr/build/solr-solrj/classes/java/org/apache/solr/common/util/package-info.class
   [smoker]     [javac] Creating empty /x1/jenkins/jenkins-slave/workspace/Lucene-Solr-SmokeRelease-5.x/lucene/build/smokeTestRelease/tmp/unpack/solr-5.4.0/solr/build/solr-solrj/classes/java/org/apache/solr/client/solrj/request/package-info.class
   [smoker]     [javac] Creating empty /x1/jenkins/jenkins-slave/workspace/Lucene-Solr-SmokeRelease-5.x/lucene/build/smokeTestRelease/tmp/unpack/solr-5.4.0/solr/build/solr-solrj/classes/java/org/apache/solr/client/solrj/package-info.class
   [smoker]     [javac] Creating empty /x1/jenkins/jenkins-slave/workspace/Lucene-Solr-SmokeRelease-5.x/lucene/build/smokeTestRelease/tmp/unpack/solr-5.4.0/solr/build/solr-solrj/classes/java/org/apache/solr/common/cloud/package-info.class
   [smoker]     [javac] Creating empty /x1/jenkins/jenkins-slave/workspace/Lucene-Solr-SmokeRelease-5.x/lucene/build/smokeTestRelease/tmp/unpack/solr-5.4.0/solr/build/solr-solrj/classes/java/org/apache/solr/common/params/package-info.class
   [smoker]     [javac] Creating empty /x1/jenkins/jenkins-slave/workspace/Lucene-Solr-SmokeRelease-5.x/lucene/build/smokeTestRelease/tmp/unpack/solr-5.4.0/solr/build/solr-solrj/classes/java/org/apache/solr/client/solrj/impl/package-info.class
   [smoker]     [javac] Creating empty /x1/jenkins/jenkins-slave/workspace/Lucene-Solr-SmokeRelease-5.x/lucene/build/smokeTestRelease/tmp/unpack/solr-5.4.0/solr/build/solr-solrj/classes/java/org/apache/solr/common/luke/package-info.class
   [smoker]     [javac] Creating empty /x1/jenkins/jenkins-slave/workspace/Lucene-Solr-SmokeRelease-5.x/lucene/build/smokeTestRelease/tmp/unpack/solr-5.4.0/solr/build/solr-solrj/classes/java/org/apache/solr/client/solrj/io/package-info.class
   [smoker]     [javac] Creating empty /x1/jenkins/jenkins-slave/workspace/Lucene-Solr-SmokeRelease-5.x/lucene/build/smokeTestRelease/tmp/unpack/solr-5.4.0/solr/build/solr-solrj/classes/java/org/apache/solr/client/solrj/io/stream/package-info.class
   [smoker]     [javac] Creating empty /x1/jenkins/jenkins-slave/workspace/Lucene-Solr-SmokeRelease-5.x/lucene/build/smokeTestRelease/tmp/unpack/solr-5.4.0/solr/build/solr-solrj/classes/java/org/apache/solr/common/package-info.class
   [smoker]     [javac] Creating empty /x1/jenkins/jenkins-slave/workspace/Lucene-Solr-SmokeRelease-5.x/lucene/build/smokeTestRelease/tmp/unpack/solr-5.4.0/solr/build/solr-solrj/classes/java/org/apache/solr/client/solrj/io/comp/package-info.class
   [smoker]     [javac] Creating empty /x1/jenkins/jenkins-slave/workspace/Lucene-Solr-SmokeRelease-5.x/lucene/build/smokeTestRelease/tmp/unpack/solr-5.4.0/solr/build/solr-solrj/classes/java/org/apache/solr/client/solrj/util/package-info.class
   [smoker] 
   [smoker] compile-core:
   [smoker] 
   [smoker] check-lucene-core-uptodate:
   [smoker] 
   [smoker] jar-lucene-core:
   [smoker] 
   [smoker] check-backward-codecs-uptodate:
   [smoker] 
   [smoker] jar-backward-codecs:
   [smoker] 
   [smoker] check-analyzers-phonetic-uptodate:
   [smoker] 
   [smoker] jar-analyzers-phonetic:
   [smoker] 
   [smoker] check-analyzers-kuromoji-uptodate:
   [smoker] 
   [smoker] jar-analyzers-kuromoji:
   [smoker] 
   [smoker] check-codecs-uptodate:
   [smoker] 
   [smoker] jar-codecs:
   [smoker] 
   [smoker] check-expressions-uptodate:
   [smoker] 
   [smoker] jar-expressions:
   [smoker] 
   [smoker] check-suggest-uptodate:
   [smoker] 
   [smoker] jar-suggest:
   [smoker] 
   [smoker] check-highlighter-uptodate:
   [smoker] 
   [smoker] jar-highlighter:
   [smoker] 
   [smoker] check-memory-uptodate:
   [smoker] 
   [smoker] jar-memory:
   [smoker] 
   [smoker] check-misc-uptodate:
   [smoker] 
   [smoker] jar-misc:
   [smoker] 
   [smoker] check-spatial-uptodate:
   [smoker] 
   [smoker] jar-spatial:
   [smoker] 
   [smoker] check-grouping-uptodate:
   [smoker] 
   [smoker] jar-grouping:
   [smoker] 
   [smoker] check-queries-uptodate:
   [smoker] 
   [smoker] jar-queries:
   [smoker] 
   [smoker] check-queryparser-uptodate:
   [smoker] 
   [smoker] jar-queryparser:
   [smoker] 
   [smoker] check-join-uptodate:
   [smoker] 
   [smoker] jar-join:
   [smoker] 
   [smoker] check-sandbox-uptodate:
   [smoker] 
   [smoker] jar-sandbox:
   [smoker] 
   [smoker] prep-lucene-jars:
   [smoker] 
   [smoker] resolve-example:
   [smoker] 
   [smoker] ivy-availability-check:
   [smoker] 
   [smoker] ivy-fail:
   [smoker] 
   [smoker] ivy-configure:
   [smoker] [ivy:configure] :: loading settings :: file = /x1/jenkins/jenkins-slave/workspace/Lucene-Solr-SmokeRelease-5.x/lucene/build/smokeTestRelease/tmp/unpack/solr-5.4.0/lucene/ivy-settings.xml
   [smoker] 
   [smoker] resolve:
   [smoker] 
   [smoker] resolve-server:
   [smoker] 
   [smoker] ivy-availability-check:
   [smoker] 
   [smoker] ivy-fail:
   [smoker] 
   [smoker] ivy-fail:
   [smoker] 
   [smoker] ivy-configure:
   [smoker] [ivy:configure] :: loading settings :: file = /x1/jenkins/jenkins-slave/workspace/Lucene-Solr-SmokeRelease-5.x/lucene/build/smokeTestRelease/tmp/unpack/solr-5.4.0/lucene/ivy-settings.xml
   [smoker] 
   [smoker] resolve:
   [smoker] 
   [smoker] ivy-availability-check:
   [smoker] 
   [smoker] ivy-fail:
   [smoker] 
   [smoker] ivy-fail:
   [smoker] 
   [smoker] ivy-configure:
   [smoker] [ivy:configure] :: loading settings :: file = /x1/jenkins/jenkins-slave/workspace/Lucene-Solr-SmokeRelease-5.x/lucene/build/smokeTestRelease/tmp/unpack/solr-5.4.0/lucene/ivy-settings.xml
   [smoker] 
   [smoker] resolve:
   [smoker] 
   [smoker] common.init:
   [smoker] 
   [smoker] compile-lucene-core:
   [smoker] 
   [smoker] ivy-availability-check:
   [smoker] 
   [smoker] ivy-fail:
   [smoker] 
   [smoker] ivy-configure:
   [smoker] [ivy:configure] :: loading settings :: file = /x1/jenkins/jenkins-slave/workspace/Lucene-Solr-SmokeRelease-5.x/lucene/build/smokeTestRelease/tmp/unpack/solr-5.4.0/lucene/ivy-settings.xml
   [smoker] 
   [smoker] resolve:
   [smoker] 
   [smoker] init:
   [smoker] 
   [smoker] -clover.disable:
   [smoker] 
   [smoker] -clover.load:
   [smoker] 
   [smoker] -clover.classpath:
   [smoker] 
   [smoker] -clover.setup:
   [smoker] 
   [smoker] clover:
   [smoker] 
   [smoker] compile-core:
   [smoker] 
   [smoker] init:
   [smoker] 
   [smoker] -clover.disable:
   [smoker] 
   [smoker] -clover.load:
   [smoker] 
   [smoker] -clover.classpath:
   [smoker] 
   [smoker] -clover.setup:
   [smoker] 
   [smoker] clover:
   [smoker] 
   [smoker] common.compile-core:
   [smoker]     [mkdir] Created dir: /x1/jenkins/jenkins-slave/workspace/Lucene-Solr-SmokeRelease-5.x/lucene/build/smokeTestRelease/tmp/unpack/solr-5.4.0/solr/build/solr-core/classes/java
   [smoker]     [javac] Compiling 856 source files to /x1/jenkins/jenkins-slave/workspace/Lucene-Solr-SmokeRelease-5.x/lucene/build/smokeTestRelease/tmp/unpack/solr-5.4.0/solr/build/solr-core/classes/java
   [smoker]     [javac] warning: [options] bootstrap class path not set in conjunction with -source 1.7
   [smoker]     [javac] Note: Some input files use or override a deprecated API.
   [smoker]     [javac] Note: Recompile with -Xlint:deprecation for details.
   [smoker]     [javac] Note: Some input files use unchecked or unsafe operations.
   [smoker]     [javac] Note: Recompile with -Xlint:unchecked for details.
   [smoker]     [javac] 1 warning
   [smoker]     [javac] Creating empty /x1/jenkins/jenkins-slave/workspace/Lucene-Solr-SmokeRelease-5.x/lucene/build/smokeTestRelease/tmp/unpack/solr-5.4.0/solr/build/solr-core/classes/java/org/apache/solr/logging/log4j/package-info.class
   [smoker]     [javac] Creating empty /x1/jenkins/jenkins-slave/workspace/Lucene-Solr-SmokeRelease-5.x/lucene/build/smokeTestRelease/tmp/unpack/solr-5.4.0/solr/build/solr-core/classes/java/org/apache/solr/client/solrj/embedded/package-info.class
   [smoker]     [javac] Creating empty /x1/jenkins/jenkins-slave/workspace/Lucene-Solr-SmokeRelease-5.x/lucene/build/smokeTestRelease/tmp/unpack/solr-5.4.0/solr/build/solr-core/classes/java/org/apache/solr/internal/csv/package-info.class
   [smoker]     [javac] Creating empty /x1/jenkins/jenkins-slave/workspace/Lucene-Solr-SmokeRelease-5.x/lucene/build/smokeTestRelease/tmp/unpack/solr-5.4.0/solr/build/solr-core/classes/java/org/apache/solr/search/function/distance/package-info.class
   [smoker]     [javac] Creating empty /x1/jenkins/jenkins-slave/workspace/Lucene-Solr-SmokeRelease-5.x/lucene/build/smokeTestRelease/tmp/unpack/solr-5.4.0/solr/build/solr-core/classes/java/org/apache/solr/search/grouping/distributed/requestfactory/package-info.class
   [smoker]     [javac] Creating empty /x1/jenkins/jenkins-slave/workspace/Lucene-Solr-SmokeRelease-5.x/lucene/build/smokeTestRelease/tmp/unpack/solr-5.4.0/solr/build/solr-core/classes/java/org/apache/solr/search/grouping/collector/package-info.class
   [smoker]     [javac] Creating empty /x1/jenkins/jenkins-slave/workspace/Lucene-Solr-SmokeRelease-5.x/lucene/build/smokeTestRelease/tmp/unpack/solr-5.4.0/solr/build/solr-core/classes/java/org/apache/solr/search/grouping/distributed/command/package-info.class
   [smoker]     [javac] Creating empty /x1/jenkins/jenkins-slave/workspace/Lucene-Solr-SmokeRelease-5.x/lucene/build/smokeTestRelease/tmp/unpack/solr-5.4.0/solr/build/solr-core/classes/java/org/apache/solr/spelling/package-info.class
   [smoker]     [javac] Creating empty /x1/jenkins/jenkins-slave/workspace/Lucene-Solr-SmokeRelease-5.x/lucene/build/smokeTestRelease/tmp/unpack/solr-5.4.0/solr/build/solr-core/classes/java/org/apache/solr/cloud/package-info.class
   [smoker]     [javac] Creating empty /x1/jenkins/jenkins-slave/workspace/Lucene-Solr-SmokeRelease-5.x/lucene/build/smokeTestRelease/tmp/unpack/solr-5.4.0/solr/build/solr-core/classes/java/org/apache/solr/spelling/suggest/fst/package-info.class
   [smoker]     [javac] Creating empty /x1/jenkins/jenkins-slave/workspace/Lucene-Solr-SmokeRelease-5.x/lucene/build/smokeTestRelease/tmp/unpack/solr-5.4.0/solr/build/solr-core/classes/java/org/apache/solr/util/plugin/package-info.class
   [smoker]     [javac] Creating empty /x1/jenkins/jenkins-slave/workspace/Lucene-Solr-SmokeRelease-5.x/lucene/build/smokeTestRelease/tmp/unpack/solr-5.4.0/solr/build/solr-core/classes/java/org/apache/solr/search/function/package-info.class
   [smoker]     [javac] Creating empty /x1/jenkins/jenkins-slave/workspace/Lucene-Solr-SmokeRelease-5.x/lucene/build/smokeTestRelease/tmp/unpack/solr-5.4.0/solr/build/solr-core/classes/java/org/apache/solr/store/blockcache/package-info.class
   [smoker]     [javac] Creating empty /x1/jenkins/jenkins-slave/workspace/Lucene-Solr-SmokeRelease-5.x/lucene/build/smokeTestRelease/tmp/unpack/solr-5.4.0/solr/build/so

[...truncated too long message...]

n 0.01s, 1 test, 1 skipped
   [smoker]    [junit4] 
   [smoker]    [junit4] Suite: org.apache.solr.cloud.OverseerRolesTest
   [smoker]    [junit4] IGNOR/A 0.00s J0 | OverseerRolesTest.test
   [smoker]    [junit4]    > Assumption #1: 'slow' test group is disabled (@Slow())
   [smoker]    [junit4] Completed [520/538] on J0 in 0.00s, 1 test, 1 skipped
   [smoker]    [junit4] 
   [smoker]    [junit4] Suite: org.apache.solr.cloud.TestDistribDocBasedVersion
   [smoker]    [junit4] IGNOR/A 0.00s J1 | TestDistribDocBasedVersion.test
   [smoker]    [junit4]    > Assumption #1: 'slow' test group is disabled (@Slow())
   [smoker]    [junit4] Completed [521/538] on J1 in 0.01s, 1 test, 1 skipped
   [smoker]    [junit4] 
   [smoker]    [junit4] Suite: org.apache.solr.cloud.TestRequestStatusCollectionAPI
   [smoker]    [junit4] IGNOR/A 0.00s J2 | TestRequestStatusCollectionAPI.test
   [smoker]    [junit4]    > Assumption #1: 'slow' test group is disabled (@Slow())
   [smoker]    [junit4] Completed [522/538] on J2 in 0.00s, 1 test, 1 skipped
   [smoker]    [junit4] 
   [smoker]    [junit4] Suite: org.apache.solr.cloud.UnloadDistributedZkTest
   [smoker]    [junit4] IGNOR/A 0.00s J0 | UnloadDistributedZkTest.test
   [smoker]    [junit4]    > Assumption #1: 'slow' test group is disabled (@Slow())
   [smoker]    [junit4] Completed [523/538] on J0 in 0.00s, 1 test, 1 skipped
   [smoker]    [junit4] 
   [smoker]    [junit4] Suite: org.apache.solr.cloud.hdfs.HdfsChaosMonkeySafeLeaderTest
   [smoker]    [junit4] IGNOR/A 0.00s J1 | HdfsChaosMonkeySafeLeaderTest.test
   [smoker]    [junit4]    > Assumption #1: 'nightly' test group is disabled (@Nightly(value=))
   [smoker]    [junit4] Completed [524/538] on J1 in 0.01s, 1 test, 1 skipped
   [smoker]    [junit4] 
   [smoker]    [junit4] Suite: org.apache.solr.cloud.hdfs.HdfsSyncSliceTest
   [smoker]    [junit4] IGNOR/A 0.00s J2 | HdfsSyncSliceTest.test
   [smoker]    [junit4]    > Assumption #1: 'nightly' test group is disabled (@Nightly(value=))
   [smoker]    [junit4] Completed [525/538] on J2 in 0.00s, 1 test, 1 skipped
   [smoker]    [junit4] 
   [smoker]    [junit4] Suite: org.apache.solr.handler.TestBlobHandler
   [smoker]    [junit4] IGNOR/A 0.00s J0 | TestBlobHandler.doBlobHandlerTest
   [smoker]    [junit4]    > Assumption #1: 'slow' test group is disabled (@Slow())
   [smoker]    [junit4] Completed [526/538] on J0 in 0.01s, 1 test, 1 skipped
   [smoker]    [junit4] 
   [smoker]    [junit4] Suite: org.apache.solr.handler.TestSolrConfigHandlerCloud
   [smoker]    [junit4] IGNOR/A 0.00s J1 | TestSolrConfigHandlerCloud.test
   [smoker]    [junit4]    > Assumption #1: 'slow' test group is disabled (@Slow())
   [smoker]    [junit4] Completed [527/538] on J1 in 0.01s, 1 test, 1 skipped
   [smoker]    [junit4] 
   [smoker]    [junit4] Suite: org.apache.solr.handler.TestSolrConfigHandlerConcurrent
   [smoker]    [junit4] IGNOR/A 0.00s J2 | TestSolrConfigHandlerConcurrent.test
   [smoker]    [junit4]    > Assumption #1: 'slow' test group is disabled (@Slow())
   [smoker]    [junit4] Completed [528/538] on J2 in 0.01s, 1 test, 1 skipped
   [smoker]    [junit4] 
   [smoker]    [junit4] Suite: org.apache.solr.handler.component.DistributedMLTComponentTest
   [smoker]    [junit4] IGNOR/A 0.01s J0 | DistributedMLTComponentTest.test
   [smoker]    [junit4]    > Assumption #1: 'slow' test group is disabled (@Slow())
   [smoker]    [junit4] Completed [529/538] on J0 in 0.01s, 1 test, 1 skipped
   [smoker]    [junit4] 
   [smoker]    [junit4] Suite: org.apache.solr.handler.component.DistributedSpellCheckComponentTest
   [smoker]    [junit4] IGNOR/A 0.00s J1 | DistributedSpellCheckComponentTest.test
   [smoker]    [junit4]    > Assumption #1: 'slow' test group is disabled (@Slow())
   [smoker]    [junit4] Completed [530/538] on J1 in 0.00s, 1 test, 1 skipped
   [smoker]    [junit4] 
   [smoker]    [junit4] Suite: org.apache.solr.handler.component.DistributedSuggestComponentTest
   [smoker]    [junit4] IGNOR/A 0.00s J2 | DistributedSuggestComponentTest.test
   [smoker]    [junit4]    > Assumption #1: 'slow' test group is disabled (@Slow())
   [smoker]    [junit4] Completed [531/538] on J2 in 0.00s, 1 test, 1 skipped
   [smoker]    [junit4] 
   [smoker]    [junit4] Suite: org.apache.solr.internal.csv.writer.CSVWriterTest
   [smoker]    [junit4] Completed [532/538] on J0 in 0.01s, 2 tests
   [smoker]    [junit4] 
   [smoker]    [junit4] Suite: org.apache.solr.schema.TestCloudSchemaless
   [smoker]    [junit4] IGNOR/A 0.00s J1 | TestCloudSchemaless.test
   [smoker]    [junit4]    > Assumption #1: 'slow' test group is disabled (@Slow())
   [smoker]    [junit4] Completed [533/538] on J1 in 0.00s, 1 test, 1 skipped
   [smoker]    [junit4] 
   [smoker]    [junit4] Suite: org.apache.solr.security.PKIAuthenticationIntegrationTest
   [smoker]    [junit4] IGNOR/A 0.00s J2 | PKIAuthenticationIntegrationTest.testPkiAuth
   [smoker]    [junit4]    > Assumption #1: 'slow' test group is disabled (@Slow())
   [smoker]    [junit4] Completed [534/538] on J2 in 0.01s, 1 test, 1 skipped
   [smoker]    [junit4] 
   [smoker]    [junit4] Suite: org.apache.solr.update.HardAutoCommitTest
   [smoker]    [junit4] IGNOR/A 0.00s J0 | HardAutoCommitTest.testCommitWithin
   [smoker]    [junit4]    > Assumption #1: 'slow' test group is disabled (@Slow())
   [smoker]    [junit4] Completed [535/538] on J0 in 0.00s, 1 test, 1 skipped
   [smoker]    [junit4] 
   [smoker]    [junit4] Suite: org.apache.solr.DistributedIntervalFacetingTest
   [smoker]    [junit4] IGNOR/A 0.00s J1 | DistributedIntervalFacetingTest.test
   [smoker]    [junit4]    > Assumption #1: 'slow' test group is disabled (@Slow())
   [smoker]    [junit4] Completed [536/538] on J1 in 0.01s, 1 test, 1 skipped
   [smoker]    [junit4] 
   [smoker]    [junit4] 
   [smoker]    [junit4] Tests with failures:
   [smoker]    [junit4]   - org.apache.solr.handler.TestReplicationHandlerBackup.doTestBackup
   [smoker]    [junit4] 
   [smoker]    [junit4] 
   [smoker]    [junit4] JVM J0:     1.38 ..   547.07 =   545.69s
   [smoker]    [junit4] JVM J1:     1.41 ..   547.11 =   545.70s
   [smoker]    [junit4] JVM J2:     1.38 ..   546.90 =   545.52s
   [smoker]    [junit4] Execution time total: 9 minutes 7 seconds
   [smoker]    [junit4] Tests summary: 538 suites, 2126 tests, 1 failure, 204 ignored (192 assumptions)
   [smoker] 
   [smoker] BUILD FAILED
   [smoker] /x1/jenkins/jenkins-slave/workspace/Lucene-Solr-SmokeRelease-5.x/lucene/build/smokeTestRelease/tmp/unpack/solr-5.4.0/solr/build.xml:233: The following error occurred while executing this line:
   [smoker] /x1/jenkins/jenkins-slave/workspace/Lucene-Solr-SmokeRelease-5.x/lucene/build/smokeTestRelease/tmp/unpack/solr-5.4.0/solr/common-build.xml:524: The following error occurred while executing this line:
   [smoker] /x1/jenkins/jenkins-slave/workspace/Lucene-Solr-SmokeRelease-5.x/lucene/build/smokeTestRelease/tmp/unpack/solr-5.4.0/lucene/common-build.xml:1452: The following error occurred while executing this line:
   [smoker] /x1/jenkins/jenkins-slave/workspace/Lucene-Solr-SmokeRelease-5.x/lucene/build/smokeTestRelease/tmp/unpack/solr-5.4.0/lucene/common-build.xml:1006: There were test failures: 538 suites, 2126 tests, 1 failure, 204 ignored (192 assumptions)
   [smoker] 
   [smoker] Total time: 9 minutes 39 seconds
   [smoker] 
   [smoker] 
   [smoker] Traceback (most recent call last):
   [smoker]   File "/x1/jenkins/jenkins-slave/workspace/Lucene-Solr-SmokeRelease-5.x/dev-tools/scripts/smokeTestRelease.py", line 1449, in <module>
   [smoker]     main()
   [smoker]   File "/x1/jenkins/jenkins-slave/workspace/Lucene-Solr-SmokeRelease-5.x/dev-tools/scripts/smokeTestRelease.py", line 1394, in main
   [smoker]     smokeTest(c.java, c.url, c.revision, c.version, c.tmp_dir, c.is_signed, ' '.join(c.test_args))
   [smoker]   File "/x1/jenkins/jenkins-slave/workspace/Lucene-Solr-SmokeRelease-5.x/dev-tools/scripts/smokeTestRelease.py", line 1439, in smokeTest
   [smoker]     unpackAndVerify(java, 'solr', tmpDir, 'solr-%s-src.tgz' % version, svnRevision, version, testArgs, baseURL)
   [smoker]   File "/x1/jenkins/jenkins-slave/workspace/Lucene-Solr-SmokeRelease-5.x/dev-tools/scripts/smokeTestRelease.py", line 583, in unpackAndVerify
   [smoker]     verifyUnpacked(java, project, artifact, unpackPath, svnRevision, version, testArgs, tmpDir, baseURL)
   [smoker]   File "/x1/jenkins/jenkins-slave/workspace/Lucene-Solr-SmokeRelease-5.x/dev-tools/scripts/smokeTestRelease.py", line 710, in verifyUnpacked
   [smoker]     java.run_java8('ant clean test -Dtests.slow=false %s' % testArgs, '%s/test.log' % unpackPath)
   [smoker]   File "/x1/jenkins/jenkins-slave/workspace/Lucene-Solr-SmokeRelease-5.x/dev-tools/scripts/smokeTestRelease.py", line 1226, in run_java
   [smoker]     run('%s; %s' % (cmd_prefix, cmd), logfile)
   [smoker]   File "/x1/jenkins/jenkins-slave/workspace/Lucene-Solr-SmokeRelease-5.x/dev-tools/scripts/smokeTestRelease.py", line 508, in run
   [smoker]     raise RuntimeError('command "%s" failed; see log file %s' % (command, logPath))
   [smoker] RuntimeError: command "export JAVA_HOME="/home/jenkins/jenkins-slave/tools/hudson.model.JDK/latest1.8" PATH="/home/jenkins/jenkins-slave/tools/hudson.model.JDK/latest1.8/bin:$PATH" JAVACMD="/home/jenkins/jenkins-slave/tools/hudson.model.JDK/latest1.8/bin/java"; ant clean test -Dtests.slow=false -Dtests.slow=false" failed; see log file /x1/jenkins/jenkins-slave/workspace/Lucene-Solr-SmokeRelease-5.x/lucene/build/smokeTestRelease/tmp/unpack/solr-5.4.0/test.log

BUILD FAILED
/x1/jenkins/jenkins-slave/workspace/Lucene-Solr-SmokeRelease-5.x/build.xml:536: exec returned: 1

Total time: 107 minutes 29 seconds
Build step 'Invoke Ant' marked build as failure
Email was triggered for: Failure
Sending email for trigger: Failure
Setting LATEST1_8_HOME=/home/jenkins/jenkins-slave/tools/hudson.model.JDK/latest1.8
Setting LATEST1_8_HOME=/home/jenkins/jenkins-slave/tools/hudson.model.JDK/latest1.8



Mime
View raw message