lucene-dev mailing list archives

Site index · List index
Message view « Date » · « Thread »
Top « Date » · « Thread »
From Policeman Jenkins Server <jenk...@thetaphi.de>
Subject [JENKINS] Lucene-Solr-trunk-Solaris (64bit/jdk1.8.0) - Build # 42 - Failure!
Date Fri, 11 Sep 2015 20:20:20 GMT
Build: http://jenkins.thetaphi.de/job/Lucene-Solr-trunk-Solaris/42/
Java: 64bit/jdk1.8.0 -XX:-UseCompressedOops -XX:+UseSerialGC

1 tests failed.
FAILED:  org.apache.solr.core.TestArbitraryIndexDir.testLoadNewIndexDir

Error Message:
Exception during query

Stack Trace:
java.lang.RuntimeException: Exception during query
	at __randomizedtesting.SeedInfo.seed([30254371790ABA09:D97FF849E7932AA1]:0)
	at org.apache.solr.SolrTestCaseJ4.assertQ(SolrTestCaseJ4.java:765)
	at org.apache.solr.core.TestArbitraryIndexDir.testLoadNewIndexDir(TestArbitraryIndexDir.java:128)
	at sun.reflect.NativeMethodAccessorImpl.invoke0(Native Method)
	at sun.reflect.NativeMethodAccessorImpl.invoke(NativeMethodAccessorImpl.java:62)
	at sun.reflect.DelegatingMethodAccessorImpl.invoke(DelegatingMethodAccessorImpl.java:43)
	at java.lang.reflect.Method.invoke(Method.java:497)
	at com.carrotsearch.randomizedtesting.RandomizedRunner.invoke(RandomizedRunner.java:1627)
	at com.carrotsearch.randomizedtesting.RandomizedRunner$6.evaluate(RandomizedRunner.java:836)
	at com.carrotsearch.randomizedtesting.RandomizedRunner$7.evaluate(RandomizedRunner.java:872)
	at com.carrotsearch.randomizedtesting.RandomizedRunner$8.evaluate(RandomizedRunner.java:886)
	at com.carrotsearch.randomizedtesting.rules.SystemPropertiesRestoreRule$1.evaluate(SystemPropertiesRestoreRule.java:57)
	at org.apache.lucene.util.TestRuleSetupTeardownChained$1.evaluate(TestRuleSetupTeardownChained.java:50)
	at org.apache.lucene.util.AbstractBeforeAfterRule$1.evaluate(AbstractBeforeAfterRule.java:46)
	at org.apache.lucene.util.TestRuleThreadAndTestName$1.evaluate(TestRuleThreadAndTestName.java:49)
	at org.apache.lucene.util.TestRuleIgnoreAfterMaxFailures$1.evaluate(TestRuleIgnoreAfterMaxFailures.java:65)
	at org.apache.lucene.util.TestRuleMarkFailure$1.evaluate(TestRuleMarkFailure.java:48)
	at com.carrotsearch.randomizedtesting.rules.StatementAdapter.evaluate(StatementAdapter.java:36)
	at com.carrotsearch.randomizedtesting.ThreadLeakControl$StatementRunner.run(ThreadLeakControl.java:365)
	at com.carrotsearch.randomizedtesting.ThreadLeakControl.forkTimeoutingTask(ThreadLeakControl.java:798)
	at com.carrotsearch.randomizedtesting.ThreadLeakControl$3.evaluate(ThreadLeakControl.java:458)
	at com.carrotsearch.randomizedtesting.RandomizedRunner.runSingleTest(RandomizedRunner.java:845)
	at com.carrotsearch.randomizedtesting.RandomizedRunner$3.evaluate(RandomizedRunner.java:747)
	at com.carrotsearch.randomizedtesting.RandomizedRunner$4.evaluate(RandomizedRunner.java:781)
	at com.carrotsearch.randomizedtesting.RandomizedRunner$5.evaluate(RandomizedRunner.java:792)
	at com.carrotsearch.randomizedtesting.rules.StatementAdapter.evaluate(StatementAdapter.java:36)
	at com.carrotsearch.randomizedtesting.rules.SystemPropertiesRestoreRule$1.evaluate(SystemPropertiesRestoreRule.java:57)
	at org.apache.lucene.util.AbstractBeforeAfterRule$1.evaluate(AbstractBeforeAfterRule.java:46)
	at com.carrotsearch.randomizedtesting.rules.StatementAdapter.evaluate(StatementAdapter.java:36)
	at org.apache.lucene.util.TestRuleStoreClassName$1.evaluate(TestRuleStoreClassName.java:42)
	at com.carrotsearch.randomizedtesting.rules.NoShadowingOrOverridesOnMethodsRule$1.evaluate(NoShadowingOrOverridesOnMethodsRule.java:39)
	at com.carrotsearch.randomizedtesting.rules.NoShadowingOrOverridesOnMethodsRule$1.evaluate(NoShadowingOrOverridesOnMethodsRule.java:39)
	at com.carrotsearch.randomizedtesting.rules.StatementAdapter.evaluate(StatementAdapter.java:36)
	at com.carrotsearch.randomizedtesting.rules.StatementAdapter.evaluate(StatementAdapter.java:36)
	at com.carrotsearch.randomizedtesting.rules.StatementAdapter.evaluate(StatementAdapter.java:36)
	at org.apache.lucene.util.TestRuleAssertionsRequired$1.evaluate(TestRuleAssertionsRequired.java:54)
	at org.apache.lucene.util.TestRuleMarkFailure$1.evaluate(TestRuleMarkFailure.java:48)
	at org.apache.lucene.util.TestRuleIgnoreAfterMaxFailures$1.evaluate(TestRuleIgnoreAfterMaxFailures.java:65)
	at org.apache.lucene.util.TestRuleIgnoreTestSuites$1.evaluate(TestRuleIgnoreTestSuites.java:55)
	at com.carrotsearch.randomizedtesting.rules.StatementAdapter.evaluate(StatementAdapter.java:36)
	at com.carrotsearch.randomizedtesting.ThreadLeakControl$StatementRunner.run(ThreadLeakControl.java:365)
	at java.lang.Thread.run(Thread.java:745)
Caused by: java.lang.RuntimeException: REQUEST FAILED: xpath=*[count(//doc)=1]
	xml response was: <?xml version="1.0" encoding="UTF-8"?>
<response>
<lst name="responseHeader"><int name="status">0</int><int name="QTime">0</int></lst><result name="response" numFound="0" start="0"></result>
</response>

	request was:q=id:2&qt=standard&start=0&rows=20&version=2.2
	at org.apache.solr.SolrTestCaseJ4.assertQ(SolrTestCaseJ4.java:758)
	... 40 more




Build Log:
[...truncated 10184 lines...]
   [junit4] Suite: org.apache.solr.core.TestArbitraryIndexDir
   [junit4]   2> Creating dataDir: /export/home/jenkins/workspace/Lucene-Solr-trunk-Solaris/solr/build/solr-core/test/J1/temp/solr.core.TestArbitraryIndexDir_30254371790ABA09-001/init-core-data-001
   [junit4]   2> 1626830 INFO  (SUITE-TestArbitraryIndexDir-seed#[30254371790ABA09]-worker) [    ] o.a.s.SolrTestCaseJ4 Randomized ssl (false) and clientAuth (false)
   [junit4]   2> 1626832 INFO  (TEST-TestArbitraryIndexDir.testLoadNewIndexDir-seed#[30254371790ABA09]) [    ] o.a.s.SolrTestCaseJ4 ###Starting testLoadNewIndexDir
   [junit4]   2> 1626833 INFO  (TEST-TestArbitraryIndexDir.testLoadNewIndexDir-seed#[30254371790ABA09]) [    ] o.a.s.c.SolrResourceLoader new SolrResourceLoader for directory: '/export/home/jenkins/workspace/Lucene-Solr-trunk-Solaris/solr/core/src/test-files/solr/collection1/'
   [junit4]   2> 1626834 INFO  (TEST-TestArbitraryIndexDir.testLoadNewIndexDir-seed#[30254371790ABA09]) [    ] o.a.s.c.SolrResourceLoader Adding 'file:/export/home/jenkins/workspace/Lucene-Solr-trunk-Solaris/solr/core/src/test-files/solr/collection1/lib/classes/' to classloader
   [junit4]   2> 1626834 INFO  (TEST-TestArbitraryIndexDir.testLoadNewIndexDir-seed#[30254371790ABA09]) [    ] o.a.s.c.SolrResourceLoader Adding 'file:/export/home/jenkins/workspace/Lucene-Solr-trunk-Solaris/solr/core/src/test-files/solr/collection1/lib/README' to classloader
   [junit4]   2> 1626862 INFO  (TEST-TestArbitraryIndexDir.testLoadNewIndexDir-seed#[30254371790ABA09]) [    ] o.a.s.c.SolrConfig current version of requestparams : -1
   [junit4]   2> 1626873 INFO  (TEST-TestArbitraryIndexDir.testLoadNewIndexDir-seed#[30254371790ABA09]) [    ] o.a.s.c.SolrConfig Using Lucene MatchVersion: 6.0.0
   [junit4]   2> 1626897 INFO  (TEST-TestArbitraryIndexDir.testLoadNewIndexDir-seed#[30254371790ABA09]) [    ] o.a.s.c.Config Loaded SolrConfig: solrconfig.xml
   [junit4]   2> 1626897 INFO  (TEST-TestArbitraryIndexDir.testLoadNewIndexDir-seed#[30254371790ABA09]) [    ] o.a.s.s.IndexSchema Reading Solr Schema from /export/home/jenkins/workspace/Lucene-Solr-trunk-Solaris/solr/core/src/test-files/solr/collection1/conf/schema12.xml
   [junit4]   2> 1626901 INFO  (TEST-TestArbitraryIndexDir.testLoadNewIndexDir-seed#[30254371790ABA09]) [    ] o.a.s.s.IndexSchema [null] Schema name=test
   [junit4]   2> 1626992 INFO  (TEST-TestArbitraryIndexDir.testLoadNewIndexDir-seed#[30254371790ABA09]) [    ] o.a.s.s.IndexSchema default search field in schema is text
   [junit4]   2> 1626993 INFO  (TEST-TestArbitraryIndexDir.testLoadNewIndexDir-seed#[30254371790ABA09]) [    ] o.a.s.s.IndexSchema unique key field: id
   [junit4]   2> 1626994 WARN  (TEST-TestArbitraryIndexDir.testLoadNewIndexDir-seed#[30254371790ABA09]) [    ] o.a.s.s.IndexSchema Field text is not multivalued and destination for multiple copyFields (2)
   [junit4]   2> 1627002 INFO  (TEST-TestArbitraryIndexDir.testLoadNewIndexDir-seed#[30254371790ABA09]) [    ] o.a.s.s.FileExchangeRateProvider Reloading exchange rates from file currency.xml
   [junit4]   2> 1627004 INFO  (TEST-TestArbitraryIndexDir.testLoadNewIndexDir-seed#[30254371790ABA09]) [    ] o.a.s.s.FileExchangeRateProvider Reloading exchange rates from file currency.xml
   [junit4]   2> 1627006 INFO  (TEST-TestArbitraryIndexDir.testLoadNewIndexDir-seed#[30254371790ABA09]) [    ] o.a.s.c.SolrResourceLoader JNDI not configured for solr (NoInitialContextEx)
   [junit4]   2> 1627007 INFO  (TEST-TestArbitraryIndexDir.testLoadNewIndexDir-seed#[30254371790ABA09]) [    ] o.a.s.c.SolrResourceLoader solr home defaulted to 'solr/' (could not find system property or JNDI)
   [junit4]   2> 1627007 INFO  (TEST-TestArbitraryIndexDir.testLoadNewIndexDir-seed#[30254371790ABA09]) [    ] o.a.s.c.SolrResourceLoader new SolrResourceLoader for directory: 'solr/'
   [junit4]   2> 1627023 INFO  (TEST-TestArbitraryIndexDir.testLoadNewIndexDir-seed#[30254371790ABA09]) [    ] o.a.s.c.CoreContainer New CoreContainer 1111916096
   [junit4]   2> 1627023 INFO  (TEST-TestArbitraryIndexDir.testLoadNewIndexDir-seed#[30254371790ABA09]) [    ] o.a.s.c.CoreContainer Loading cores into CoreContainer [instanceDir=solr/]
   [junit4]   2> 1627023 INFO  (TEST-TestArbitraryIndexDir.testLoadNewIndexDir-seed#[30254371790ABA09]) [    ] o.a.s.c.CoreContainer loading shared library: /export/home/jenkins/workspace/Lucene-Solr-trunk-Solaris/solr/build/solr-core/test/J1/solr/lib
   [junit4]   2> 1627024 WARN  (TEST-TestArbitraryIndexDir.testLoadNewIndexDir-seed#[30254371790ABA09]) [    ] o.a.s.c.SolrResourceLoader Can't find (or read) directory to add to classloader: lib (resolved as: /export/home/jenkins/workspace/Lucene-Solr-trunk-Solaris/solr/build/solr-core/test/J1/solr/lib).
   [junit4]   2> 1627034 INFO  (TEST-TestArbitraryIndexDir.testLoadNewIndexDir-seed#[30254371790ABA09]) [    ] o.a.s.h.c.HttpShardHandlerFactory created with socketTimeout : 600000,connTimeout : 60000,maxConnectionsPerHost : 20,maxConnections : 10000,corePoolSize : 0,maximumPoolSize : 2147483647,maxThreadIdleTime : 5,sizeOfQueue : -1,fairnessPolicy : false,useRetries : false,
   [junit4]   2> 1627036 INFO  (TEST-TestArbitraryIndexDir.testLoadNewIndexDir-seed#[30254371790ABA09]) [    ] o.a.s.u.UpdateShardHandler Creating UpdateShardHandler HTTP client with params: socketTimeout=30000&connTimeout=30000&retry=true
   [junit4]   2> 1627037 INFO  (TEST-TestArbitraryIndexDir.testLoadNewIndexDir-seed#[30254371790ABA09]) [    ] o.a.s.l.LogWatcher SLF4J impl is org.slf4j.impl.Log4jLoggerFactory
   [junit4]   2> 1627037 INFO  (TEST-TestArbitraryIndexDir.testLoadNewIndexDir-seed#[30254371790ABA09]) [    ] o.a.s.l.LogWatcher Registering Log Listener [Log4j (org.slf4j.impl.Log4jLoggerFactory)]
   [junit4]   2> 1627038 INFO  (TEST-TestArbitraryIndexDir.testLoadNewIndexDir-seed#[30254371790ABA09]) [    ] o.a.s.c.CoreContainer Security conf doesn't exist. Skipping setup for authorization module.
   [junit4]   2> 1627038 INFO  (TEST-TestArbitraryIndexDir.testLoadNewIndexDir-seed#[30254371790ABA09]) [    ] o.a.s.c.CoreContainer No authentication plugin used.
   [junit4]   2> 1627040 INFO  (TEST-TestArbitraryIndexDir.testLoadNewIndexDir-seed#[30254371790ABA09]) [    ] o.a.s.c.SolrCore Created CoreDescriptor: {name=collection1, config=solrconfig.xml, transient=false, schema=schema12.xml, loadOnStartup=true, configSetProperties=configsetprops.json, instanceDir=collection1, collection=collection1, absoluteInstDir=solr/collection1/, dataDir=/export/home/jenkins/workspace/Lucene-Solr-trunk-Solaris/solr/build/solr-core/test/J1/temp/solr.core.TestArbitraryIndexDir_30254371790ABA09-001/tempDir-001, shard=shard1}
   [junit4]   2> 1627040 INFO  (coreLoadExecutor-5753-thread-1) [    ] o.a.s.c.SolrResourceLoader new SolrResourceLoader for directory: 'solr/collection1/'
   [junit4]   2> 1627075 INFO  (coreLoadExecutor-5753-thread-1) [    ] o.a.s.c.SolrConfig current version of requestparams : -1
   [junit4]   2> 1627099 INFO  (coreLoadExecutor-5753-thread-1) [    ] o.a.s.c.SolrConfig Using Lucene MatchVersion: 6.0.0
   [junit4]   2> 1627128 INFO  (coreLoadExecutor-5753-thread-1) [    ] o.a.s.c.Config Loaded SolrConfig: solrconfig.xml
   [junit4]   2> 1627130 INFO  (coreLoadExecutor-5753-thread-1) [    ] o.a.s.s.IndexSchema Reading Solr Schema from solr/collection1/conf/schema12.xml
   [junit4]   2> 1627136 INFO  (coreLoadExecutor-5753-thread-1) [    ] o.a.s.s.IndexSchema [collection1] Schema name=test
   [junit4]   2> 1627269 INFO  (coreLoadExecutor-5753-thread-1) [    ] o.a.s.s.IndexSchema default search field in schema is text
   [junit4]   2> 1627270 INFO  (coreLoadExecutor-5753-thread-1) [    ] o.a.s.s.IndexSchema unique key field: id
   [junit4]   2> 1627270 WARN  (coreLoadExecutor-5753-thread-1) [    ] o.a.s.s.IndexSchema Field text is not multivalued and destination for multiple copyFields (2)
   [junit4]   2> 1627284 INFO  (coreLoadExecutor-5753-thread-1) [    ] o.a.s.s.FileExchangeRateProvider Reloading exchange rates from file currency.xml
   [junit4]   2> 1627286 INFO  (coreLoadExecutor-5753-thread-1) [    ] o.a.s.s.FileExchangeRateProvider Reloading exchange rates from file currency.xml
   [junit4]   2> 1627290 INFO  (coreLoadExecutor-5753-thread-1) [    ] o.a.s.c.ConfigSetProperties Did not find ConfigSet properties, assuming default properties: Can't find resource 'configsetprops.json' in classpath or '/export/home/jenkins/workspace/Lucene-Solr-trunk-Solaris/solr/build/solr-core/test/J1/solr/collection1/conf'
   [junit4]   2> 1627290 INFO  (coreLoadExecutor-5753-thread-1) [    ] o.a.s.c.CoreContainer Creating SolrCore 'collection1' using configuration from instancedir solr/collection1/
   [junit4]   2> 1627290 INFO  (coreLoadExecutor-5753-thread-1) [    x:collection1] o.a.s.c.SolrCore org.apache.solr.core.MockFSDirectoryFactory
   [junit4]   2> 1627290 INFO  (coreLoadExecutor-5753-thread-1) [    x:collection1] o.a.s.c.SolrCore [[collection1] ] Opening new SolrCore at [solr/collection1/], dataDir=[null]
   [junit4]   2> 1627290 INFO  (coreLoadExecutor-5753-thread-1) [    x:collection1] o.a.s.c.JmxMonitoredMap JMX monitoring is enabled. Adding Solr mbeans to JMX Server: com.sun.jmx.mbeanserver.JmxMBeanServer@3eddf80f
   [junit4]   2> 1627291 INFO  (coreLoadExecutor-5753-thread-1) [    x:collection1] o.a.s.c.CachingDirectoryFactory return new directory for /export/home/jenkins/workspace/Lucene-Solr-trunk-Solaris/solr/build/solr-core/test/J1/temp/solr.core.TestArbitraryIndexDir_30254371790ABA09-001/tempDir-001
   [junit4]   2> 1627291 INFO  (coreLoadExecutor-5753-thread-1) [    x:collection1] o.a.s.c.SolrCore New index directory detected: old=null new=/export/home/jenkins/workspace/Lucene-Solr-trunk-Solaris/solr/build/solr-core/test/J1/temp/solr.core.TestArbitraryIndexDir_30254371790ABA09-001/tempDir-001/index/
   [junit4]   2> 1627291 WARN  (coreLoadExecutor-5753-thread-1) [    x:collection1] o.a.s.c.SolrCore [collection1] Solr index directory '/export/home/jenkins/workspace/Lucene-Solr-trunk-Solaris/solr/build/solr-core/test/J1/temp/solr.core.TestArbitraryIndexDir_30254371790ABA09-001/tempDir-001/index' doesn't exist. Creating new index...
   [junit4]   2> 1627292 INFO  (coreLoadExecutor-5753-thread-1) [    x:collection1] o.a.s.c.CachingDirectoryFactory return new directory for /export/home/jenkins/workspace/Lucene-Solr-trunk-Solaris/solr/build/solr-core/test/J1/temp/solr.core.TestArbitraryIndexDir_30254371790ABA09-001/tempDir-001/index
   [junit4]   2> 1627292 INFO  (coreLoadExecutor-5753-thread-1) [    x:collection1] o.a.s.u.RandomMergePolicy RandomMergePolicy wrapping class org.apache.lucene.index.LogByteSizeMergePolicy: [LogByteSizeMergePolicy: minMergeSize=1677721, mergeFactor=49, maxMergeSize=2147483648, maxMergeSizeForForcedMerge=9223372036854775807, calibrateSizeByDeletes=true, maxMergeDocs=2147483647, maxCFSSegmentSizeMB=8.796093022207999E12, noCFSRatio=0.0]
   [junit4]   2> 1627336 INFO  (coreLoadExecutor-5753-thread-1) [    x:collection1] o.a.s.c.SolrCore SolrDeletionPolicy.onCommit: commits: num=1
   [junit4]   2> 	commit{dir=MockDirectoryWrapper(MMapDirectory@/export/home/jenkins/workspace/Lucene-Solr-trunk-Solaris/solr/build/solr-core/test/J1/temp/solr.core.TestArbitraryIndexDir_30254371790ABA09-001/tempDir-001/index lockFactory=org.apache.lucene.store.SingleInstanceLockFactory@554e0bad),segFN=segments_1,generation=1}
   [junit4]   2> 1627336 INFO  (coreLoadExecutor-5753-thread-1) [    x:collection1] o.a.s.c.SolrCore newest commit generation = 1
   [junit4]   2> 1627337 INFO  (OldIndexDirectoryCleanupThreadForCore-collection1) [    x:collection1] o.a.s.c.SolrCore Looking for old index directories to cleanup for core collection1 in /export/home/jenkins/workspace/Lucene-Solr-trunk-Solaris/solr/build/solr-core/test/J1/temp/solr.core.TestArbitraryIndexDir_30254371790ABA09-001/tempDir-001/
   [junit4]   2> 1627340 INFO  (coreLoadExecutor-5753-thread-1) [    x:collection1] o.a.s.u.p.UpdateRequestProcessorChain creating updateRequestProcessorChain "dedupe"
   [junit4]   2> 1627341 INFO  (coreLoadExecutor-5753-thread-1) [    x:collection1] o.a.s.u.p.UpdateRequestProcessorChain inserting DistributedUpdateProcessorFactory into updateRequestProcessorChain "dedupe"
   [junit4]   2> 1627341 INFO  (coreLoadExecutor-5753-thread-1) [    x:collection1] o.a.s.u.p.UpdateRequestProcessorChain creating updateRequestProcessorChain "dedupe-allfields"
   [junit4]   2> 1627341 INFO  (coreLoadExecutor-5753-thread-1) [    x:collection1] o.a.s.u.p.UpdateRequestProcessorChain inserting DistributedUpdateProcessorFactory into updateRequestProcessorChain "dedupe-allfields"
   [junit4]   2> 1627341 INFO  (coreLoadExecutor-5753-thread-1) [    x:collection1] o.a.s.u.p.UpdateRequestProcessorChain creating updateRequestProcessorChain "stored_sig"
   [junit4]   2> 1627341 INFO  (coreLoadExecutor-5753-thread-1) [    x:collection1] o.a.s.u.p.UpdateRequestProcessorChain inserting DistributedUpdateProcessorFactory into updateRequestProcessorChain "stored_sig"
   [junit4]   2> 1627341 INFO  (coreLoadExecutor-5753-thread-1) [    x:collection1] o.a.s.u.p.UpdateRequestProcessorChain creating updateRequestProcessorChain "uniq-fields"
   [junit4]   2> 1627342 INFO  (coreLoadExecutor-5753-thread-1) [    x:collection1] o.a.s.u.p.UpdateRequestProcessorChain inserting DistributedUpdateProcessorFactory into updateRequestProcessorChain "uniq-fields"
   [junit4]   2> 1627342 INFO  (coreLoadExecutor-5753-thread-1) [    x:collection1] o.a.s.u.p.UpdateRequestProcessorChain creating updateRequestProcessorChain "distrib-dup-test-chain-explicit"
   [junit4]   2> 1627342 INFO  (coreLoadExecutor-5753-thread-1) [    x:collection1] o.a.s.u.p.UpdateRequestProcessorChain creating updateRequestProcessorChain "distrib-dup-test-chain-implicit"
   [junit4]   2> 1627342 INFO  (coreLoadExecutor-5753-thread-1) [    x:collection1] o.a.s.u.p.UpdateRequestProcessorChain inserting DistributedUpdateProcessorFactory into updateRequestProcessorChain "distrib-dup-test-chain-implicit"
   [junit4]   2> 1627342 INFO  (coreLoadExecutor-5753-thread-1) [    x:collection1] o.a.s.c.SolrCore no updateRequestProcessorChain defined as default, creating implicit default
   [junit4]   2> 1627344 INFO  (coreLoadExecutor-5753-thread-1) [    x:collection1] o.a.s.h.l.XMLLoader xsltCacheLifetimeSeconds=60
   [junit4]   2> 1627345 INFO  (coreLoadExecutor-5753-thread-1) [    x:collection1] o.a.s.h.l.XMLLoader xsltCacheLifetimeSeconds=60
   [junit4]   2> 1627346 INFO  (coreLoadExecutor-5753-thread-1) [    x:collection1] o.a.s.h.l.XMLLoader xsltCacheLifetimeSeconds=60
   [junit4]   2> 1627347 INFO  (coreLoadExecutor-5753-thread-1) [    x:collection1] o.a.s.h.l.XMLLoader xsltCacheLifetimeSeconds=60
   [junit4]   2> 1627350 INFO  (coreLoadExecutor-5753-thread-1) [    x:collection1] o.a.s.c.PluginBag requestHandler : 'lazy' created with startup=lazy 
   [junit4]   2> 1627352 INFO  (coreLoadExecutor-5753-thread-1) [    x:collection1] o.a.s.c.RequestHandlers Registered paths: /admin/mbeans,standard,spellCheckCompRH,lazy,/update/json/docs,/admin/luke,spellCheckWithWordbreak_Direct,tvrh,/get,/admin/properties,/update/json,mltrh,/admin/threads,/search-facet-def,/update/csv,/search-facet-invariants,/admin/segments,spellCheckCompRH1,/mlt,/admin/system,/replication,dismax,defaults,/config,/schema,/admin/plugins,/admin/logging,spellCheckWithWordbreak,mock,/admin/ping,/update,/admin/file,/terms,spellCheckCompRH_Direct,/debug/dump
   [junit4]   2> 1627352 WARN  (coreLoadExecutor-5753-thread-1) [    x:collection1] o.a.s.c.SolrCore solrconfig.xml uses deprecated <admin/gettableFiles>, Please update your config to use the ShowFileRequestHandler.
   [junit4]   2> 1627353 INFO  (coreLoadExecutor-5753-thread-1) [    x:collection1] o.a.s.c.SolrCore Using default statsCache cache: org.apache.solr.search.stats.LocalStatsCache
   [junit4]   2> 1627353 INFO  (coreLoadExecutor-5753-thread-1) [    x:collection1] o.a.s.c.SolrCore Hard AutoCommit: disabled
   [junit4]   2> 1627353 INFO  (coreLoadExecutor-5753-thread-1) [    x:collection1] o.a.s.c.SolrCore Soft AutoCommit: disabled
   [junit4]   2> 1627354 INFO  (coreLoadExecutor-5753-thread-1) [    x:collection1] o.a.s.u.RandomMergePolicy RandomMergePolicy wrapping class org.apache.lucene.index.LogByteSizeMergePolicy: [LogByteSizeMergePolicy: minMergeSize=1677721, mergeFactor=22, maxMergeSize=2147483648, maxMergeSizeForForcedMerge=9223372036854775807, calibrateSizeByDeletes=true, maxMergeDocs=2147483647, maxCFSSegmentSizeMB=8.796093022207999E12, noCFSRatio=0.43775701941815537]
   [junit4]   2> 1627355 INFO  (coreLoadExecutor-5753-thread-1) [    x:collection1] o.a.s.c.SolrCore SolrDeletionPolicy.onInit: commits: num=1
   [junit4]   2> 	commit{dir=MockDirectoryWrapper(MMapDirectory@/export/home/jenkins/workspace/Lucene-Solr-trunk-Solaris/solr/build/solr-core/test/J1/temp/solr.core.TestArbitraryIndexDir_30254371790ABA09-001/tempDir-001/index lockFactory=org.apache.lucene.store.SingleInstanceLockFactory@554e0bad),segFN=segments_1,generation=1}
   [junit4]   2> 1627355 INFO  (coreLoadExecutor-5753-thread-1) [    x:collection1] o.a.s.c.SolrCore newest commit generation = 1
   [junit4]   2> 1627355 INFO  (coreLoadExecutor-5753-thread-1) [    x:collection1] o.a.s.s.SolrIndexSearcher Opening Searcher@2a3646bd[collection1] main
   [junit4]   2> 1627355 INFO  (coreLoadExecutor-5753-thread-1) [    x:collection1] o.a.s.r.RestManager Initializing RestManager with initArgs: {storageIO=org.apache.solr.rest.ManagedResourceStorage$InMemoryStorageIO}
   [junit4]   2> 1627355 INFO  (coreLoadExecutor-5753-thread-1) [    x:collection1] o.a.s.r.ManagedResourceStorage Reading _rest_managed.json using InMemoryStorage
   [junit4]   2> 1627355 INFO  (coreLoadExecutor-5753-thread-1) [    x:collection1] o.a.s.r.RestManager Initializing 0 registered ManagedResources
   [junit4]   2> 1627356 INFO  (coreLoadExecutor-5753-thread-1) [    x:collection1] o.a.s.h.c.SpellCheckComponent Initializing spell checkers
   [junit4]   2> 1627411 INFO  (coreLoadExecutor-5753-thread-1) [    x:collection1] o.a.s.s.DirectSolrSpellChecker init: {name=direct,classname=DirectSolrSpellChecker,field=lowerfilt,minQueryLength=3}
   [junit4]   2> 1627608 INFO  (coreLoadExecutor-5753-thread-1) [    x:collection1] o.a.s.h.ReplicationHandler Commits will be reserved for  10000
   [junit4]   2> 1627609 INFO  (searcherExecutor-5754-thread-1-processing-x:collection1) [    x:collection1] o.a.s.h.c.SpellCheckComponent Loading spell index for spellchecker: default
   [junit4]   2> 1627609 INFO  (searcherExecutor-5754-thread-1-processing-x:collection1) [    x:collection1] o.a.s.h.c.SpellCheckComponent Loading spell index for spellchecker: direct
   [junit4]   2> 1627610 INFO  (searcherExecutor-5754-thread-1-processing-x:collection1) [    x:collection1] o.a.s.h.c.SpellCheckComponent Loading spell index for spellchecker: wordbreak
   [junit4]   2> 1627610 INFO  (coreLoadExecutor-5753-thread-1) [    x:collection1] o.a.s.c.CoreContainer registering core: collection1
   [junit4]   2> 1627610 INFO  (searcherExecutor-5754-thread-1-processing-x:collection1) [    x:collection1] o.a.s.h.c.SpellCheckComponent Loading spell index for spellchecker: multipleFields
   [junit4]   2> 1627610 INFO  (searcherExecutor-5754-thread-1-processing-x:collection1) [    x:collection1] o.a.s.h.c.SpellCheckComponent Loading spell index for spellchecker: jarowinkler
   [junit4]   2> 1627611 INFO  (searcherExecutor-5754-thread-1-processing-x:collection1) [    x:collection1] o.a.s.h.c.SpellCheckComponent Loading spell index for spellchecker: external
   [junit4]   2> 1627612 INFO  (searcherExecutor-5754-thread-1-processing-x:collection1) [    x:collection1] o.a.s.h.c.SpellCheckComponent Loading spell index for spellchecker: freq
   [junit4]   2> 1627612 INFO  (searcherExecutor-5754-thread-1-processing-x:collection1) [    x:collection1] o.a.s.h.c.SpellCheckComponent Loading spell index for spellchecker: fqcn
   [junit4]   2> 1627613 INFO  (TEST-TestArbitraryIndexDir.testLoadNewIndexDir-seed#[30254371790ABA09]) [    ] o.a.s.u.p.LogUpdateProcessor [collection1] webapp=null path=null params={} {add=[1]} 0 1
   [junit4]   2> 1627613 INFO  (searcherExecutor-5754-thread-1-processing-x:collection1) [    x:collection1] o.a.s.h.c.SpellCheckComponent Loading spell index for spellchecker: perDict
   [junit4]   2> 1627614 INFO  (searcherExecutor-5754-thread-1-processing-x:collection1) [    x:collection1] o.a.s.c.SolrCore [collection1] Registered new searcher Searcher@2a3646bd[collection1] main{ExitableDirectoryReader(UninvertingDirectoryReader())}
   [junit4]   2> 1627703 INFO  (TEST-TestArbitraryIndexDir.testLoadNewIndexDir-seed#[30254371790ABA09]) [    ] o.a.s.u.UpdateHandler start commit{,optimize=false,openSearcher=true,waitSearcher=true,expungeDeletes=false,softCommit=false,prepareCommit=false}
   [junit4]   2> 1627876 INFO  (TEST-TestArbitraryIndexDir.testLoadNewIndexDir-seed#[30254371790ABA09]) [    ] o.a.s.c.SolrCore SolrDeletionPolicy.onCommit: commits: num=2
   [junit4]   2> 	commit{dir=MockDirectoryWrapper(MMapDirectory@/export/home/jenkins/workspace/Lucene-Solr-trunk-Solaris/solr/build/solr-core/test/J1/temp/solr.core.TestArbitraryIndexDir_30254371790ABA09-001/tempDir-001/index lockFactory=org.apache.lucene.store.SingleInstanceLockFactory@554e0bad),segFN=segments_1,generation=1}
   [junit4]   2> 	commit{dir=MockDirectoryWrapper(MMapDirectory@/export/home/jenkins/workspace/Lucene-Solr-trunk-Solaris/solr/build/solr-core/test/J1/temp/solr.core.TestArbitraryIndexDir_30254371790ABA09-001/tempDir-001/index lockFactory=org.apache.lucene.store.SingleInstanceLockFactory@554e0bad),segFN=segments_2,generation=2}
   [junit4]   2> 1627877 INFO  (TEST-TestArbitraryIndexDir.testLoadNewIndexDir-seed#[30254371790ABA09]) [    ] o.a.s.c.SolrCore newest commit generation = 2
   [junit4]   2> 1627878 INFO  (TEST-TestArbitraryIndexDir.testLoadNewIndexDir-seed#[30254371790ABA09]) [    ] o.a.s.c.SolrCore New index directory detected: old=/export/home/jenkins/workspace/Lucene-Solr-trunk-Solaris/solr/build/solr-core/test/J1/temp/solr.core.TestArbitraryIndexDir_30254371790ABA09-001/tempDir-001/index/ new=/export/home/jenkins/workspace/Lucene-Solr-trunk-Solaris/solr/build/solr-core/test/J1/temp/solr.core.TestArbitraryIndexDir_30254371790ABA09-001/tempDir-001/index_temp
   [junit4]   2> 1627882 INFO  (TEST-TestArbitraryIndexDir.testLoadNewIndexDir-seed#[30254371790ABA09]) [    ] o.a.s.s.SolrIndexSearcher Opening Searcher@183c1507[collection1] main
   [junit4]   2> 1627882 INFO  (TEST-TestArbitraryIndexDir.testLoadNewIndexDir-seed#[30254371790ABA09]) [    ] o.a.s.u.UpdateHandler end_commit_flush
   [junit4]   2> 1627884 INFO  (searcherExecutor-5754-thread-1) [    ] o.a.s.c.SolrCore [collection1] Registered new searcher Searcher@183c1507[collection1] main{ExitableDirectoryReader(UninvertingDirectoryReader(Uninverting(_0(6.0.0):C1)))}
   [junit4]   2> 1627884 INFO  (TEST-TestArbitraryIndexDir.testLoadNewIndexDir-seed#[30254371790ABA09]) [    ] o.a.s.u.p.LogUpdateProcessor [collection1] webapp=null path=null params={} {commit=} 0 181
   [junit4]   2> 1627885 INFO  (TEST-TestArbitraryIndexDir.testLoadNewIndexDir-seed#[30254371790ABA09]) [    ] o.a.s.c.SolrResourceLoader new SolrResourceLoader for directory: 'solr/collection1/'
   [junit4]   2> 1627924 INFO  (TEST-TestArbitraryIndexDir.testLoadNewIndexDir-seed#[30254371790ABA09]) [    ] o.a.s.c.SolrConfig current version of requestparams : -1
   [junit4]   2> 1627936 INFO  (TEST-TestArbitraryIndexDir.testLoadNewIndexDir-seed#[30254371790ABA09]) [    ] o.a.s.c.SolrConfig Using Lucene MatchVersion: 6.0.0
   [junit4]   2> 1627965 INFO  (TEST-TestArbitraryIndexDir.testLoadNewIndexDir-seed#[30254371790ABA09]) [    ] o.a.s.c.Config Loaded SolrConfig: solrconfig.xml
   [junit4]   2> 1627967 INFO  (TEST-TestArbitraryIndexDir.testLoadNewIndexDir-seed#[30254371790ABA09]) [    ] o.a.s.s.IndexSchema Reading Solr Schema from solr/collection1/conf/schema12.xml
   [junit4]   2> 1627970 INFO  (TEST-TestArbitraryIndexDir.testLoadNewIndexDir-seed#[30254371790ABA09]) [    ] o.a.s.s.IndexSchema [collection1] Schema name=test
   [junit4]   2> 1628069 INFO  (TEST-TestArbitraryIndexDir.testLoadNewIndexDir-seed#[30254371790ABA09]) [    ] o.a.s.s.IndexSchema default search field in schema is text
   [junit4]   2> 1628071 INFO  (TEST-TestArbitraryIndexDir.testLoadNewIndexDir-seed#[30254371790ABA09]) [    ] o.a.s.s.IndexSchema unique key field: id
   [junit4]   2> 1628072 WARN  (TEST-TestArbitraryIndexDir.testLoadNewIndexDir-seed#[30254371790ABA09]) [    ] o.a.s.s.IndexSchema Field text is not multivalued and destination for multiple copyFields (2)
   [junit4]   2> 1628089 INFO  (TEST-TestArbitraryIndexDir.testLoadNewIndexDir-seed#[30254371790ABA09]) [    ] o.a.s.s.FileExchangeRateProvider Reloading exchange rates from file currency.xml
   [junit4]   2> 1628093 INFO  (TEST-TestArbitraryIndexDir.testLoadNewIndexDir-seed#[30254371790ABA09]) [    ] o.a.s.s.FileExchangeRateProvider Reloading exchange rates from file currency.xml
   [junit4]   2> 1628096 INFO  (TEST-TestArbitraryIndexDir.testLoadNewIndexDir-seed#[30254371790ABA09]) [    ] o.a.s.c.ConfigSetProperties Did not find ConfigSet properties, assuming default properties: Can't find resource 'configsetprops.json' in classpath or '/export/home/jenkins/workspace/Lucene-Solr-trunk-Solaris/solr/build/solr-core/test/J1/solr/collection1/conf'
   [junit4]   2> 1628096 INFO  (TEST-TestArbitraryIndexDir.testLoadNewIndexDir-seed#[30254371790ABA09]) [    ] o.a.s.c.CoreContainer Reloading SolrCore 'collection1' using configuration from instancedir solr/collection1/
   [junit4]   2> 1628097 INFO  (TEST-TestArbitraryIndexDir.testLoadNewIndexDir-seed#[30254371790ABA09]) [    x:collection1] o.a.s.c.SolrCore [[collection1] ] Opening new SolrCore at [solr/collection1/], dataDir=[/export/home/jenkins/workspace/Lucene-Solr-trunk-Solaris/solr/build/solr-core/test/J1/temp/solr.core.TestArbitraryIndexDir_30254371790ABA09-001/tempDir-001/]
   [junit4]   2> 1628097 INFO  (TEST-TestArbitraryIndexDir.testLoadNewIndexDir-seed#[30254371790ABA09]) [    x:collection1] o.a.s.c.JmxMonitoredMap JMX monitoring is enabled. Adding Solr mbeans to JMX Server: com.sun.jmx.mbeanserver.JmxMBeanServer@3eddf80f
   [junit4]   2> 1628098 INFO  (TEST-TestArbitraryIndexDir.testLoadNewIndexDir-seed#[30254371790ABA09]) [    x:collection1] o.a.s.c.SolrCore New index directory detected: old=null new=/export/home/jenkins/workspace/Lucene-Solr-trunk-Solaris/solr/build/solr-core/test/J1/temp/solr.core.TestArbitraryIndexDir_30254371790ABA09-001/tempDir-001/index_temp
   [junit4]   2> 1628099 INFO  (OldIndexDirectoryCleanupThreadForCore-collection1) [    x:collection1] o.a.s.c.SolrCore Looking for old index directories to cleanup for core collection1 in /export/home/jenkins/workspace/Lucene-Solr-trunk-Solaris/solr/build/solr-core/test/J1/temp/solr.core.TestArbitraryIndexDir_30254371790ABA09-001/tempDir-001/
   [junit4]   2> 1628100 INFO  (OldIndexDirectoryCleanupThreadForCore-collection1) [    x:collection1] o.a.s.c.DirectoryFactory Found 1 old index directories to clean-up under /export/home/jenkins/workspace/Lucene-Solr-trunk-Solaris/solr/build/solr-core/test/J1/temp/solr.core.TestArbitraryIndexDir_30254371790ABA09-001/tempDir-001/
   [junit4]   2> 1628100 WARN  (OldIndexDirectoryCleanupThreadForCore-collection1) [    x:collection1] o.a.s.c.CachingDirectoryFactory Cannot delete directory /export/home/jenkins/workspace/Lucene-Solr-trunk-Solaris/solr/build/solr-core/test/J1/temp/solr.core.TestArbitraryIndexDir_30254371790ABA09-001/tempDir-001/index as it is still being referenced in the cache!
   [junit4]   2> 1628101 WARN  (OldIndexDirectoryCleanupThreadForCore-collection1) [    x:collection1] o.a.s.c.DirectoryFactory Delete old index directory /export/home/jenkins/workspace/Lucene-Solr-trunk-Solaris/solr/build/solr-core/test/J1/temp/solr.core.TestArbitraryIndexDir_30254371790ABA09-001/tempDir-001/index failed.
   [junit4]   2> 1628107 INFO  (TEST-TestArbitraryIndexDir.testLoadNewIndexDir-seed#[30254371790ABA09]) [    x:collection1] o.a.s.u.p.UpdateRequestProcessorChain creating updateRequestProcessorChain "dedupe"
   [junit4]   2> 1628108 INFO  (TEST-TestArbitraryIndexDir.testLoadNewIndexDir-seed#[30254371790ABA09]) [    x:collection1] o.a.s.u.p.UpdateRequestProcessorChain inserting DistributedUpdateProcessorFactory into updateRequestProcessorChain "dedupe"
   [junit4]   2> 1628108 INFO  (TEST-TestArbitraryIndexDir.testLoadNewIndexDir-seed#[30254371790ABA09]) [    x:collection1] o.a.s.u.p.UpdateRequestProcessorChain creating updateRequestProcessorChain "dedupe-allfields"
   [junit4]   2> 1628108 INFO  (TEST-TestArbitraryIndexDir.testLoadNewIndexDir-seed#[30254371790ABA09]) [    x:collection1] o.a.s.u.p.UpdateRequestProcessorChain inserting DistributedUpdateProcessorFactory into updateRequestProcessorChain "dedupe-allfields"
   [junit4]   2> 1628108 INFO  (TEST-TestArbitraryIndexDir.testLoadNewIndexDir-seed#[30254371790ABA09]) [    x:collection1] o.a.s.u.p.UpdateRequestProcessorChain creating updateRequestProcessorChain "stored_sig"
   [junit4]   2> 1628108 INFO  (TEST-TestArbitraryIndexDir.testLoadNewIndexDir-seed#[30254371790ABA09]) [    x:collection1] o.a.s.u.p.UpdateRequestProcessorChain inserting DistributedUpdateProcessorFactory into updateRequestProcessorChain "stored_sig"
   [junit4]   2> 1628108 INFO  (TEST-TestArbitraryIndexDir.testLoadNewIndexDir-seed#[30254371790ABA09]) [    x:collection1] o.a.s.u.p.UpdateRequestProcessorChain creating updateRequestProcessorChain "uniq-fields"
   [junit4]   2> 1628109 INFO  (TEST-TestArbitraryIndexDir.testLoadNewIndexDir-seed#[30254371790ABA09]) [    x:collection1] o.a.s.u.p.UpdateRequestProcessorChain inserting DistributedUpdateProcessorFactory into updateRequestProcessorChain "uniq-fields"
   [junit4]   2> 1628109 INFO  (TEST-TestArbitraryIndexDir.testLoadNewIndexDir-seed#[30254371790ABA09]) [    x:collection1] o.a.s.u.p.UpdateRequestProcessorChain creating updateRequestProcessorChain "distrib-dup-test-chain-explicit"
   [junit4]   2> 1628109 INFO  (TEST-TestArbitraryIndexDir.testLoadNewIndexDir-seed#[30254371790ABA09]) [    x:collection1] o.a.s.u.p.UpdateRequestProcessorChain creating updateRequestProcessorChain "distrib-dup-test-chain-implicit"
   [junit4]   2> 1628110 INFO  (TEST-TestArbitraryIndexDir.testLoadNewIndexDir-seed#[30254371790ABA09]) [    x:collection1] o.a.s.u.p.UpdateRequestProcessorChain inserting DistributedUpdateProcessorFactory into updateRequestProcessorChain "distrib-dup-test-chain-implicit"
   [junit4]   2> 1628110 INFO  (TEST-TestArbitraryIndexDir.testLoadNewIndexDir-seed#[30254371790ABA09]) [    x:collection1] o.a.s.c.SolrCore no updateRequestProcessorChain defined as default, creating implicit default
   [junit4]   2> 1628112 INFO  (TEST-TestArbitraryIndexDir.testLoadNewIndexDir-seed#[30254371790ABA09]) [    x:collection1] o.a.s.h.l.XMLLoader xsltCacheLifetimeSeconds=60
   [junit4]   2> 1628113 INFO  (TEST-TestArbitraryIndexDir.testLoadNewIndexDir-seed#[30254371790ABA09]) [    x:collection1] o.a.s.h.l.XMLLoader xsltCacheLifetimeSeconds=60
   [junit4]   2> 1628114 INFO  (TEST-TestArbitraryIndexDir.testLoadNewIndexDir-seed#[30254371790ABA09]) [    x:collection1] o.a.s.h.l.XMLLoader xsltCacheLifetimeSeconds=60
   [junit4]   2> 1628116 INFO  (TEST-TestArbitraryIndexDir.testLoadNewIndexDir-seed#[30254371790ABA09]) [    x:collection1] o.a.s.h.l.XMLLoader xsltCacheLifetimeSeconds=60
   [junit4]   2> 1628117 INFO  (TEST-TestArbitraryIndexDir.testLoadNewIndexDir-seed#[30254371790ABA09]) [    x:collection1] o.a.s.c.CachingDirectoryFactory return new directory for /export/home/jenkins/workspace/Lucene-Solr-trunk-Solaris/solr/build/solr-core/test/J1/temp/solr.core.TestArbitraryIndexDir_30254371790ABA09-001/tempDir-001/index_temp
   [junit4]   2> 1628122 INFO  (TEST-TestArbitraryIndexDir.testLoadNewIndexDir-seed#[30254371790ABA09]) [    x:collection1] o.a.s.c.PluginBag requestHandler : 'lazy' created with startup=lazy 
   [junit4]   2> 1628124 INFO  (TEST-TestArbitraryIndexDir.testLoadNewIndexDir-seed#[30254371790ABA09]) [    x:collection1] o.a.s.c.RequestHandlers Registered paths: /admin/mbeans,standard,spellCheckCompRH,lazy,/update/json/docs,/admin/luke,spellCheckWithWordbreak_Direct,tvrh,/get,/admin/properties,/update/json,mltrh,/admin/threads,/search-facet-def,/update/csv,/search-facet-invariants,/admin/segments,spellCheckCompRH1,/mlt,/admin/system,/replication,dismax,defaults,/config,/schema,/admin/plugins,/admin/logging,spellCheckWithWordbreak,mock,/admin/ping,/update,/admin/file,/terms,spellCheckCompRH_Direct,/debug/dump
   [junit4]   2> 1628124 WARN  (TEST-TestArbitraryIndexDir.testLoadNewIndexDir-seed#[30254371790ABA09]) [    x:collection1] o.a.s.c.SolrCore solrconfig.xml uses deprecated <admin/gettableFiles>, Please update your config to use the ShowFileRequestHandler.
   [junit4]   2> 1628125 INFO  (TEST-TestArbitraryIndexDir.testLoadNewIndexDir-seed#[30254371790ABA09]) [    x:collection1] o.a.s.c.SolrCore Using default statsCache cache: org.apache.solr.search.stats.LocalStatsCache
   [junit4]   2> 1628126 INFO  (TEST-TestArbitraryIndexDir.testLoadNewIndexDir-seed#[30254371790ABA09]) [    x:collection1] o.a.s.c.SolrCore Hard AutoCommit: disabled
   [junit4]   2> 1628126 INFO  (TEST-TestArbitraryIndexDir.testLoadNewIndexDir-seed#[30254371790ABA09]) [    x:collection1] o.a.s.c.SolrCore Soft AutoCommit: disabled
   [junit4]   2> 1628127 INFO  (TEST-TestArbitraryIndexDir.testLoadNewIndexDir-seed#[30254371790ABA09]) [    x:collection1] o.a.s.s.SolrIndexSearcher Opening Searcher@70a4da37[collection1] main
   [junit4]   2> 1628127 INFO  (TEST-TestArbitraryIndexDir.testLoadNewIndexDir-seed#[30254371790ABA09]) [    x:collection1] o.a.s.r.RestManager Initializing RestManager with initArgs: {storageIO=org.apache.solr.rest.ManagedResourceStorage$InMemoryStorageIO}
   [junit4]   2> 1628127 INFO  (TEST-TestArbitraryIndexDir.testLoadNewIndexDir-seed#[30254371790ABA09]) [    x:collection1] o.a.s.r.ManagedResourceStorage Reading _rest_managed.json using InMemoryStorage
   [junit4]   2> 1628128 INFO  (TEST-TestArbitraryIndexDir.testLoadNewIndexDir-seed#[30254371790ABA09]) [    x:collection1] o.a.s.r.RestManager Initializing 0 registered ManagedResources
   [junit4]   2> 1628129 INFO  (TEST-TestArbitraryIndexDir.testLoadNewIndexDir-seed#[30254371790ABA09]) [    x:collection1] o.a.s.h.c.SpellCheckComponent Initializing spell checkers
   [junit4]   2> 1628130 INFO  (TEST-TestArbitraryIndexDir.testLoadNewIndexDir-seed#[30254371790ABA09]) [    x:collection1] o.a.s.s.DirectSolrSpellChecker init: {name=direct,classname=DirectSolrSpellChecker,field=lowerfilt,minQueryLength=3}
   [junit4]   2> 1628136 INFO  (TEST-TestArbitraryIndexDir.testLoadNewIndexDir-seed#[30254371790ABA09]) [    x:collection1] o.a.s.h.ReplicationHandler Commits will be reserved for  10000
   [junit4]   2> 1628137 INFO  (TEST-TestArbitraryIndexDir.testLoadNewIndexDir-seed#[30254371790ABA09]) [    x:collection1] o.a.s.u.DefaultSolrCoreState Closing old IndexWriter... core=collection1
   [junit4]   2> 1628138 INFO  (TEST-TestArbitraryIndexDir.testLoadNewIndexDir-seed#[30254371790ABA09]) [    x:collection1] o.a.s.u.RandomMergePolicy RandomMergePolicy wrapping class org.apache.lucene.index.LogDocMergePolicy: [LogDocMergePolicy: minMergeSize=1000, mergeFactor=19, maxMergeSize=9223372036854775807, maxMergeSizeForForcedMerge=9223372036854775807, calibrateSizeByDeletes=false, maxMergeDocs=2147483647, maxCFSSegmentSizeMB=8.796093022207999E12, noCFSRatio=0.26398875381763975]
   [junit4]   2> 1628138 INFO  (searcherExecutor-5758-thread-1-processing-x:collection1) [    x:collection1] o.a.s.h.c.SpellCheckComponent Loading spell index for spellchecker: default
   [junit4]   2> 1628139 INFO  (searcherExecutor-5758-thread-1-processing-x:collection1) [    x:collection1] o.a.s.h.c.SpellCheckComponent Loading spell index for spellchecker: direct
   [junit4]   2> 1628139 INFO  (searcherExecutor-5758-thread-1-processing-x:collection1) [    x:collection1] o.a.s.h.c.SpellCheckComponent Loading spell index for spellchecker: wordbreak
   [junit4]   2> 1628139 INFO  (searcherExecutor-5758-thread-1-processing-x:collection1) [    x:collection1] o.a.s.h.c.SpellCheckComponent Loading spell index for spellchecker: multipleFields
   [junit4]   2> 1628139 INFO  (searcherExecutor-5758-thread-1-processing-x:collection1) [    x:collection1] o.a.s.h.c.SpellCheckComponent Loading spell index for spellchecker: jarowinkler
   [junit4]   2> 1628140 INFO  (searcherExecutor-5758-thread-1-processing-x:collection1) [    x:collection1] o.a.s.h.c.SpellCheckComponent Loading spell index for spellchecker: external
   [junit4]   2> 1628140 INFO  (searcherExecutor-5758-thread-1-processing-x:collection1) [    x:collection1] o.a.s.h.c.SpellCheckComponent Loading spell index for spellchecker: freq
   [junit4]   2> 1628141 INFO  (searcherExecutor-5758-thread-1-processing-x:collection1) [    x:collection1] o.a.s.h.c.SpellCheckComponent Loading spell index for spellchecker: fqcn
   [junit4]   2> 1628142 INFO  (searcherExecutor-5758-thread-1-processing-x:collection1) [    x:collection1] o.a.s.h.c.SpellCheckComponent Loading spell index for spellchecker: perDict
   [junit4]   2> 1628143 INFO  (searcherExecutor-5758-thread-1-processing-x:collection1) [    x:collection1] o.a.s.c.SolrCore [collection1] Registered new searcher Searcher@70a4da37[collection1] main{ExitableDirectoryReader(UninvertingDirectoryReader(Uninverting(_0(6.0.0):C1)))}
   [junit4]   2> 1628148 INFO  (TEST-TestArbitraryIndexDir.testLoadNewIndexDir-seed#[30254371790ABA09]) [    x:collection1] o.a.s.c.SolrCore SolrDeletionPolicy.onInit: commits: num=1
   [junit4]   2> 	commit{dir=MockDirectoryWrapper(MMapDirectory@/export/home/jenkins/workspace/Lucene-Solr-trunk-Solaris/solr/build/solr-core/test/J1/temp/solr.core.TestArbitraryIndexDir_30254371790ABA09-001/tempDir-001/index_temp lockFactory=org.apache.lucene.store.SingleInstanceLockFactory@769f254b),segFN=segments_1,generation=1}
   [junit4]   2> 1628148 INFO  (TEST-TestArbitraryIndexDir.testLoadNewIndexDir-seed#[30254371790ABA09]) [    x:collection1] o.a.s.c.SolrCore newest commit generation = 1
   [junit4]   2> 1628149 INFO  (TEST-TestArbitraryIndexDir.testLoadNewIndexDir-seed#[30254371790ABA09]) [    x:collection1] o.a.s.u.DefaultSolrCoreState New IndexWriter is ready to be used.
   [junit4]   2> 1628150 INFO  (TEST-TestArbitraryIndexDir.testLoadNewIndexDir-seed#[30254371790ABA09]) [    x:collection1] o.a.s.s.SolrIndexSearcher Opening Searcher@1c827de5[collection1] main
   [junit4]   2> 1628150 INFO  (TEST-TestArbitraryIndexDir.testLoadNewIndexDir-seed#[30254371790ABA09]) [    x:collection1] o.a.s.c.CoreContainer replacing core: collection1
   [junit4]   2> 1628150 INFO  (TEST-TestArbitraryIndexDir.testLoadNewIndexDir-seed#[30254371790ABA09]) [    x:collection1] o.a.s.c.SolrCore [collection1]  CLOSING SolrCore org.apache.solr.core.SolrCore@27fad66
   [junit4]   2> 1628150 INFO  (TEST-TestArbitraryIndexDir.testLoadNewIndexDir-seed#[30254371790ABA09]) [    x:collection1] o.a.s.u.UpdateHandler closing DirectUpdateHandler2{commits=1,autocommits=0,soft autocommits=0,optimizes=0,rollbacks=0,expungeDeletes=0,docsPending=0,adds=0,deletesById=0,deletesByQuery=0,errors=0,cumulative_adds=1,cumulative_deletesById=0,cumulative_deletesByQuery=0,cumulative_errors=0}
   [junit4]   2> 1628151 INFO  (TEST-TestArbitraryIndexDir.testLoadNewIndexDir-seed#[30254371790ABA09]) [    x:collection1] o.a.s.c.SolrCore [collection1] Closing main searcher on request.
   [junit4]   2> 1628160 INFO  (TEST-TestArbitraryIndexDir.testLoadNewIndexDir-seed#[30254371790ABA09]) [    x:collection1] o.a.s.c.S.Request [collection1] webapp=null path=null params={q=id:2&qt=standard&start=0&rows=20&version=2.2} hits=0 status=0 QTime=0 
   [junit4]   2> 1628161 ERROR (TEST-TestArbitraryIndexDir.testLoadNewIndexDir-seed#[30254371790ABA09]) [    x:collection1] o.a.s.SolrTestCaseJ4 REQUEST FAILED: xpath=*[count(//doc)=1]
   [junit4]   2> 	xml response was: <?xml version="1.0" encoding="UTF-8"?>
   [junit4]   2> <response>
   [junit4]   2> <lst name="responseHeader"><int name="status">0</int><int name="QTime">0</int></lst><result name="response" numFound="0" start="0"></result>
   [junit4]   2> </response>
   [junit4]   2> 
   [junit4]   2> 	request was:q=id:2&qt=standard&start=0&rows=20&version=2.2
   [junit4]   2> 1628161 ERROR (TEST-TestArbitraryIndexDir.testLoadNewIndexDir-seed#[30254371790ABA09]) [    x:collection1] o.a.s.SolrTestCaseJ4 REQUEST FAILED: q=id:2&qt=standard&start=0&rows=20&version=2.2:java.lang.RuntimeException: REQUEST FAILED: xpath=*[count(//doc)=1]
   [junit4]   2> 	xml response was: <?xml version="1.0" encoding="UTF-8"?>
   [junit4]   2> <response>
   [junit4]   2> <lst name="responseHeader"><int name="status">0</int><int name="QTime">0</int></lst><result name="response" numFound="0" start="0"></result>
   [junit4]   2> </response>
   [junit4]   2> 
   [junit4]   2> 	request was:q=id:2&qt=standard&start=0&rows=20&version=2.2
   [junit4]   2> 	at org.apache.solr.SolrTestCaseJ4.assertQ(SolrTestCaseJ4.java:758)
   [junit4]   2> 	at org.apache.solr.core.TestArbitraryIndexDir.testLoadNewIndexDir(TestArbitraryIndexDir.java:128)
   [junit4]   2> 	at sun.reflect.NativeMethodAccessorImpl.invoke0(Native Method)
   [junit4]   2> 	at sun.reflect.NativeMethodAccessorImpl.invoke(NativeMethodAccessorImpl.java:62)
   [junit4]   2> 	at sun.reflect.DelegatingMethodAccessorImpl.invoke(DelegatingMethodAccessorImpl.java:43)
   [junit4]   2> 	at java.lang.reflect.Method.invoke(Method.java:497)
   [junit4]   2> 	at com.carrotsearch.randomizedtesting.RandomizedRunner.invoke(RandomizedRunner.java:1627)
   [junit4]   2> 	at com.carrotsearch.randomizedtesting.RandomizedRunner$6.evaluate(RandomizedRunner.java:836)
   [junit4]   2> 	at com.carrotsearch.randomizedtesting.RandomizedRunner$7.evaluate(RandomizedRunner.java:872)
   [junit4]   2> 	at com.carrotsearch.randomizedtesting.RandomizedRunner$8.evaluate(RandomizedRunner.java:886)
   [junit4]   2> 	at com.carrotsearch.randomizedtesting.rules.SystemPropertiesRestoreRule$1.evaluate(SystemPropertiesRestoreRule.java:57)
   [junit4]   2> 	at org.apache.lucene.util.TestRuleSetupTeardownChained$1.evaluate(TestRuleSetupTeardownChained.java:50)
   [junit4]   2> 	at org.apache.lucene.util.AbstractBeforeAfterRule$1.evaluate(AbstractBeforeAfterRule.java:46)
   [junit4]   2> 	at org.apache.lucene.util.TestRuleThreadAndTestName$1.evaluate(TestRuleThreadAndTestName.java:49)
   [junit4]   2> 	at org.apache.lucene.util.TestRuleIgnoreAfterMaxFailures$1.evaluate(TestRuleIgnoreAfterMaxFailures.java:65)
   [junit4]   2> 	at org.apache.lucene.util.TestRuleMarkFailure$1.evaluate(TestRuleMarkFailure.java:48)
   [junit4]   2> 	at com.carrotsearch.randomizedtesting.rules.StatementAdapter.evaluate(StatementAdapter.java:36)
   [junit4]   2> 	at com.carrotsearch.randomizedtesting.ThreadLeakControl$StatementRunner.run(ThreadLeakControl.java:365)
   [junit4]   2> 	at com.carrotsearch.randomizedtesting.ThreadLeakControl.forkTimeoutingTask(ThreadLeakControl.java:798)
   [junit4]   2> 	at com.carrotsearch.randomizedtesting.ThreadLeakControl$3.evaluate(ThreadLeakControl.java:458)
   [junit4]   2> 	at com.carrotsearch.randomizedtesting.RandomizedRunner.runSingleTest(RandomizedRunner.java:845)
   [junit4]   2> 	at com.carrotsearch.randomizedtesting.RandomizedRunner$3.evaluate(RandomizedRunner.java:747)
   [junit4]   2> 	at com.carrotsearch.randomizedtesting.RandomizedRunner$4.evaluate(RandomizedRunner.java:781)
   [junit4]   2> 	at com.carrotsearch.randomizedtesting.RandomizedRunner$5.evaluate(RandomizedRunner.java:792)
   [junit4]   2> 	at com.carrotsearch.randomizedtesting.rules.StatementAdapter.evaluate(StatementAdapter.java:36)
   [junit4]   2> 	at com.carrotsearch.randomizedtesting.rules.SystemPropertiesRestoreRule$1.evaluate(SystemPropertiesRestoreRule.java:57)
   [junit4]   2> 	at org.apache.lucene.util.AbstractBeforeAfterRule$1.evaluate(AbstractBeforeAfterRule.java:46)
   [junit4]   2> 	at com.carrotsearch.randomizedtesting.rules.StatementAdapter.evaluate(StatementAdapter.java:36)
   [junit4]   2> 	at org.apache.lucene.util.TestRuleStoreClassName$1.evaluate(TestRuleStoreClassName.java:42)
   [junit4]   2> 	at com.carrotsearch.randomizedtesting.rules.NoShadowingOrOverridesOnMethodsRule$1.evaluate(NoShadowingOrOverridesOnMethodsRule.java:39)
   [junit4]   2> 	at com.carrotsearch.randomizedtesting.rules.NoShadowingOrOverridesOnMethodsRule$1.evaluate(NoShadowingOrOverridesOnMethodsRule.java:39)
   [junit4]   2> 	at com.carrotsearch.randomizedtesting.rules.StatementAdapter.evaluate(StatementAdapter.java:36)
   [junit4]   2> 	at com.carrotsearch.randomizedtesting.rules.StatementAdapter.evaluate(StatementAdapter.java:36)
   [junit4]   2> 	at com.carrotsearch.randomizedtesting.rules.StatementAdapter.evaluate(StatementAdapter.java:36)
   [junit4]   2> 	at org.apache.lucene.util.TestRuleAssertionsRequired$1.evaluate(TestRuleAssertionsRequired.java:54)
   [junit4]   2> 	at org.apache.lucene.util.TestRuleMarkFailure$1.evaluate(TestRuleMarkFailure.java:48)
   [junit4]   2> 	at org.apache.lucene.util.TestRuleIgnoreAfterMaxFailures$1.evaluate(TestRuleIgnoreAfterMaxFailures.java:65)
   [junit4]   2> 	at org.apache.lucene.util.TestRuleIgnoreTestSuites$1.evaluate(TestRuleIgnoreTestSuites.java:55)
   [junit4]   2> 	at com.carrotsearch.randomizedtesting.rules.StatementAdapter.evaluate(StatementAdapter.java:36)
   [junit4]   2> 	at com.carrotsearch.randomizedtesting.ThreadLeakControl$StatementRunner.run(ThreadLeakControl.java:365)
   [junit4]   2> 	at java.lang.Thread.run(Thread.java:745)
   [junit4]   2> 
   [junit4]   2> 1628162 INFO  (TEST-TestArbitraryIndexDir.testLoadNewIndexDir-seed#[30254371790ABA09]) [    x:collection1] o.a.s.SolrTestCaseJ4 ###Ending testLoadNewIndexDir
   [junit4]   2> 1628165 INFO  (searcherExecutor-5758-thread-1-processing-x:collection1) [    x:collection1] o.a.s.c.SolrCore [collection1] Registered new searcher Searcher@1c827de5[collection1] main{ExitableDirectoryReader(UninvertingDirectoryReader(Uninverting(_0(6.0.0):c1)))}
   [junit4]   2> NOTE: reproduce with: ant test  -Dtestcase=TestArbitraryIndexDir -Dtests.method=testLoadNewIndexDir -Dtests.seed=30254371790ABA09 -Dtests.slow=true -Dtests.locale=lv -Dtests.timezone=Etc/GMT-12 -Dtests.asserts=true -Dtests.file.encoding=ISO-8859-1
   [junit4] ERROR   1.35s J1 | TestArbitraryIndexDir.testLoadNewIndexDir <<<
   [junit4]    > Throwable #1: java.lang.RuntimeException: Exception during query
   [junit4]    > 	at __randomizedtesting.SeedInfo.seed([30254371790ABA09:D97FF849E7932AA1]:0)
   [junit4]    > 	at org.apache.solr.SolrTestCaseJ4.assertQ(SolrTestCaseJ4.java:765)
   [junit4]    > 	at org.apache.solr.core.TestArbitraryIndexDir.testLoadNewIndexDir(TestArbitraryIndexDir.java:128)
   [junit4]    > 	at java.lang.Thread.run(Thread.java:745)
   [junit4]    > Caused by: java.lang.RuntimeException: REQUEST FAILED: xpath=*[count(//doc)=1]
   [junit4]    > 	xml response was: <?xml version="1.0" encoding="UTF-8"?>
   [junit4]    > <response>
   [junit4]    > <lst name="responseHeader"><int name="status">0</int><int name="QTime">0</int></lst><result name="response" numFound="0" start="0"></result>
   [junit4]    > </response>
   [junit4]    > 	request was:q=id:2&qt=standard&start=0&rows=20&version=2.2
   [junit4]    > 	at org.apache.solr.SolrTestCaseJ4.assertQ(SolrTestCaseJ4.java:758)
   [junit4]    > 	... 40 more
   [junit4]   2> 1628175 INFO  (SUITE-TestArbitraryIndexDir-seed#[30254371790ABA09]-worker) [    x:collection1] o.a.s.SolrTestCaseJ4 ###deleteCore
   [junit4]   2> 1628175 INFO  (SUITE-TestArbitraryIndexDir-seed#[30254371790ABA09]-worker) [    x:collection1] o.a.s.c.CoreContainer Shutting down CoreContainer instance=1111916096
   [junit4]   2> 1628176 INFO  (SUITE-TestArbitraryIndexDir-seed#[30254371790ABA09]-worker) [    x:collection1] o.a.s.c.SolrCore [collection1]  CLOSING SolrCore org.apache.solr.core.SolrCore@5defc8a8
   [junit4]   2> 1628176 INFO  (SUITE-TestArbitraryIndexDir-seed#[30254371790ABA09]-worker) [    x:collection1] o.a.s.u.UpdateHandler closing DirectUpdateHandler2{commits=0,autocommits=0,soft autocommits=0,optimizes=0,rollbacks=0,expungeDeletes=0,docsPending=0,adds=0,deletesById=0,deletesByQuery=0,errors=0,cumulative_adds=0,cumulative_deletesById=0,cumulative_deletesByQuery=0,cumulative_errors=0}
   [junit4]   2> 1628176 INFO  (SUITE-TestArbitraryIndexDir-seed#[30254371790ABA09]-worker) [    x:collection1] o.a.s.u.SolrCoreState Closing SolrCoreState
   [junit4]   2> 1628176 INFO  (SUITE-TestArbitraryIndexDir-seed#[30254371790ABA09]-worker) [    x:collection1] o.a.s.u.DefaultSolrCoreState SolrCoreState ref count has reached 0 - closing IndexWriter
   [junit4]   2> 1628176 INFO  (SUITE-TestArbitraryIndexDir-seed#[30254371790ABA09]-worker) [    x:collection1] o.a.s.u.DefaultSolrCoreState closing IndexWriter with IndexWriterCloser
   [junit4]   2> 1628177 INFO  (SUITE-TestArbitraryIndexDir-seed#[30254371790ABA09]-worker) [    x:collection1] o.a.s.c.SolrCore [collection1] Closing main searcher on request.
   [junit4]   2> 1628193 INFO  (SUITE-TestArbitraryIndexDir-seed#[30254371790ABA09]-worker) [    x:collection1] o.a.s.c.CachingDirectoryFactory Closing MockFSDirectoryFactory - 3 directories currently being tracked
   [junit4]   2> 1628193 INFO  (SUITE-TestArbitraryIndexDir-seed#[30254371790ABA09]-worker) [    x:collection1] o.a.s.c.CachingDirectoryFactory looking to close /export/home/jenkins/workspace/Lucene-Solr-trunk-Solaris/solr/build/solr-core/test/J1/temp/solr.core.TestArbitraryIndexDir_30254371790ABA09-001/tempDir-001/index_temp [CachedDir<<refCount=0;path=/export/home/jenkins/workspace/Lucene-Solr-trunk-Solaris/solr/build/solr-core/test/J1/temp/solr.core.TestArbitraryIndexDir_30254371790ABA09-001/tempDir-001/index_temp;done=false>>]
   [junit4]   2> 1628193 INFO  (SUITE-TestArbitraryIndexDir-seed#[30254371790ABA09]-worker) [    x:collection1] o.a.s.c.CachingDirectoryFactory Closing directory: /export/home/jenkins/workspace/Lucene-Solr-trunk-Solaris/solr/build/solr-core/test/J1/temp/solr.core.TestArbitraryIndexDir_30254371790ABA09-001/tempDir-001/index_temp
   [junit4]   2> 1628198 INFO  (SUITE-TestArbitraryIndexDir-seed#[30254371790ABA09]-worker) [    x:collection1] o.a.s.c.CachingDirectoryFactory looking to close /export/home/jenkins/workspace/Lucene-Solr-trunk-Solaris/solr/build/solr-core/test/J1/temp/solr.core.TestArbitraryIndexDir_30254371790ABA09-001/tempDir-001/index [CachedDir<<refCount=0;path=/export/home/jenkins/workspace/Lucene-Solr-trunk-Solaris/solr/build/solr-core/test/J1/temp/solr.core.TestArbitraryIndexDir_30254371790ABA09-001/tempDir-001/index;done=false>>]
   [junit4]   2> 1628198 INFO  (SUITE-TestArbitraryIndexDir-seed#[30254371790ABA09]-worker) [    x:collection1] o.a.s.c.CachingDirectoryFactory Closing directory: /export/home/jenkins/workspace/Lucene-Solr-trunk-Solaris/solr/build/solr-core/test/J1/temp/solr.core.TestArbitraryIndexDir_30254371790ABA09-001/tempDir-001/index
   [junit4]   2> 1628205 INFO  (SUITE-TestArbitraryIndexDir-seed#[30254371790ABA09]-worker) [    x:collection1] o.a.s.c.CachingDirectoryFactory looking to close /export/home/jenkins/workspace/Lucene-Solr-trunk-Solaris/solr/build/solr-core/test/J1/temp/solr.core.TestArbitraryIndexDir_30254371790ABA09-001/tempDir-001 [CachedDir<<refCount=0;path=/export/home/jenkins/workspace/Lucene-Solr-trunk-Solaris/solr/build/solr-core/test/J1/temp/solr.core.TestArbitraryIndexDir_30254371790ABA09-001/tempDir-001;done=false>>]
   [junit4]   2> 1628205 INFO  (SUITE-TestArbitraryIndexDir-seed#[30254371790ABA09]-worker) [    x:collection1] o.a.s.c.CachingDirectoryFactory Closing directory: /export/home/jenkins/workspace/Lucene-Solr-trunk-Solaris/solr/build/solr-core/test/J1/temp/solr.core.TestArbitraryIndexDir_30254371790ABA09-001/tempDir-001
   [junit4]   2> NOTE: leaving temporary files on disk at: /export/home/jenkins/workspace/Lucene-Solr-trunk-Solaris/solr/build/solr-core/test/J1/temp/solr.core.TestArbitraryIndexDir_30254371790ABA09-001
   [junit4]   2> NOTE: test params are: codec=Asserting(Lucene53): {name=FSTOrd50, id=FSTOrd50}, docValues:{}, sim=RandomSimilarityProvider(queryNorm=false,coord=yes): {}, locale=lv, timezone=Etc/GMT-12
   [junit4]   2> NOTE: SunOS 5.11 amd64/Oracle Corporation 1.8.0_60 (64-bit)/cpus=3,threads=1,free=115442120,total=518979584
   [junit4]   2> NOTE: All tests run in this JVM: [SolrCoreCheckLockOnStartupTest, TestTolerantSearch, TestSolrCloudWithKerberosAlt, TestSolrQueryParserDefaultOperatorResource, CdcrReplicationDistributedZkTest, WordBreakSolrSpellCheckerTest, SaslZkACLProviderTest, TestReRankQParserPlugin, NumericFieldsTest, TestQueryTypes, TestInfoStreamLogging, TimeZoneUtilsTest, UUIDFieldTest, TestFieldResource, ZkSolrClientTest, CSVRequestHandlerTest, SuggesterTest, SolrPluginUtilsTest, ShardRoutingCustomTest, TestObjectReleaseTracker, TestStressUserVersions, TestUniqueKeyFieldResource, TermVectorComponentTest, RequestLoggingTest, ShardSplitTest, TestWriterPerf, SolrCloudExampleTest, TestSuggestSpellingConverter, ClusterStateTest, UUIDUpdateProcessorFallbackTest, SuggesterTSTTest, HighlighterMaxOffsetTest, DistributedFacetPivotLargeTest, AnalyticsQueryTest, ZkStateWriterTest, AnalyticsMergeStrategyTest, ReplicationFactorTest, BigEndianAscendingWordSerializerTest, TestRecovery, TestManagedStopFilterFactory, TestPKIAuthenticationPlugin, ResponseHeaderTest, TestAtomicUpdateErrorCases, TestConfigReload, TestScoreJoinQPNoScore, TriLevelCompositeIdRoutingTest, LeaderInitiatedRecoveryOnCommitTest, SortByFunctionTest, OpenCloseCoreStressTest, DataDrivenBlockJoinTest, DistributedFacetPivotLongTailTest, TestMissingGroups, TestHdfsUpdateLog, SolrTestCaseJ4Test, NotRequiredUniqueKeyTest, LukeRequestHandlerTest, TestClassNameShortening, TestDynamicLoading, TestPerFieldSimilarity, TestCollationField, BasicAuthIntegrationTest, TestSchemaResource, TestCustomDocTransformer, TestConfigSetsAPI, SpellCheckCollatorTest, BlockDirectoryTest, TestEmbeddedSolrServerConstructors, DistributedQueueTest, TestRealTimeGet, HdfsRecoverLeaseTest, TestRangeQuery, SynonymTokenizerTest, SharedFSAutoReplicaFailoverTest, TestFiltering, FacetPivotSmallTest, TestSimpleTrackingShardHandler, TestReload, TestBulkSchemaAPI, TestRestoreCore, CircularListTest, TestIndexSearcher, TestExpandComponent, SolrInfoMBeanTest, DistanceFunctionTest, SpellCheckComponentTest, TestCSVResponseWriter, TestChildDocTransformer, SpatialRPTFieldTypeTest, DistributedQueryComponentCustomSortTest, TestFreeTextSuggestions, TestComplexPhraseQParserPlugin, TestFastOutputStream, TestConfigSetsAPIExclusivity, ParsingFieldUpdateProcessorsTest, TestHighlightDedupGrouping, TestStandardQParsers, TestManagedSynonymFilterFactory, RankQueryTest, FieldAnalysisRequestHandlerTest, DistributedTermsComponentTest, BadIndexSchemaTest, TestSha256AuthenticationProvider, TestManagedSchemaFieldTypeResource, URLClassifyProcessorTest, TestPHPSerializedResponseWriter, HighlighterConfigTest, TestMacros, MergeStrategyTest, TestCharFilters, BinaryUpdateRequestHandlerTest, CollectionStateFormat2Test, SignatureUpdateProcessorFactoryTest, TestSortByMinMaxFunction, IndexSchemaRuntimeFieldTest, SuggesterWFSTTest, FieldMutatingUpdateProcessorTest, BigEndianAscendingWordDeserializerTest, QueryParsingTest, DistribJoinFromCollectionTest, StatsComponentTest, TestDistribDocBasedVersion, CloudMLTQParserTest, ChangedSchemaMergeTest, TestSolrDynamicMBean, UpdateRequestProcessorFactoryTest, CollectionsAPIAsyncDistributedZkTest, FullHLLTest, HdfsWriteToMultipleCollectionsTest, CurrencyFieldOpenExchangeTest, TestTrie, TestSmileRequest, TestDistributedGrouping, DocExpirationUpdateProcessorFactoryTest, BasicDistributedZkTest, ChaosMonkeySafeLeaderTest, BasicDistributedZk2Test, CollectionsAPIDistributedZkTest, LeaderElectionIntegrationTest, ShardRoutingTest, BasicZkTest, FullSolrCloudDistribCmdsTest, ClusterStateUpdateTest, TestRandomFaceting, TestZkChroot, TestRandomDVFaceting, ZkCLITest, AutoCommitTest, TestFaceting, DistributedSpellCheckComponentTest, TermVectorComponentDistributedTest, TestJoin, TestStressVersions, HardAutoCommitTest, TestSolr4Spatial, TestGroupingSearch, SolrCmdDistributorTest, ConvertedLegacyTest, TestSort, TestFunctionQuery, BasicFunctionalityTest, TestBadConfig, ShowFileRequestHandlerTest, DistributedQueryElevationComponentTest, CurrencyFieldXmlFileTest, SolrIndexSplitterTest, TestCoreDiscovery, TestExtendedDismaxParser, SuggesterFSTTest, CoreAdminHandlerTest, TestFoldingMultitermQuery, TestCSVLoader, PolyFieldTest, NoCacheHeaderTest, TestPseudoReturnFields, TestUpdate, TestWordDelimiterFilterFactory, QueryEqualityTest, DirectUpdateHandlerOptimizeTest, DefaultValueUpdateProcessorTest, TestRemoteStreaming, DocValuesMultiTest, TestSolrDeletionPolicy1, XsltUpdateRequestHandlerTest, DebugComponentTest, CacheHeaderTest, DisMaxRequestHandlerTest, TestQueryUtils, StandardRequestHandlerTest, TestReversedWildcardFilterFactory, TestOmitPositions, FileBasedSpellCheckerTest, RequestHandlersTest, TestValueSourceCache, PathHierarchyTokenizerFactoryTest, TestIndexingPerformance, MoreLikeThisHandlerTest, TestSolrQueryParser, TestArbitraryIndexDir]
   [junit4] Completed [298/545] on J1 in 1.39s, 1 test, 1 error <<< FAILURES!

[...truncated 765 lines...]
BUILD FAILED
/export/home/jenkins/workspace/Lucene-Solr-trunk-Solaris/build.xml:775: The following error occurred while executing this line:
/export/home/jenkins/workspace/Lucene-Solr-trunk-Solaris/build.xml:719: The following error occurred while executing this line:
/export/home/jenkins/workspace/Lucene-Solr-trunk-Solaris/build.xml:59: The following error occurred while executing this line:
/export/home/jenkins/workspace/Lucene-Solr-trunk-Solaris/solr/build.xml:233: The following error occurred while executing this line:
/export/home/jenkins/workspace/Lucene-Solr-trunk-Solaris/solr/common-build.xml:514: The following error occurred while executing this line:
/export/home/jenkins/workspace/Lucene-Solr-trunk-Solaris/lucene/common-build.xml:1432: The following error occurred while executing this line:
/export/home/jenkins/workspace/Lucene-Solr-trunk-Solaris/lucene/common-build.xml:987: There were test failures: 545 suites, 2143 tests, 1 error, 47 ignored (35 assumptions)

Total time: 70 minutes 8 seconds
Build step 'Invoke Ant' marked build as failure
Archiving artifacts
[WARNINGS] Skipping publisher since build result is FAILURE
Recording test results
Email was triggered for: Failure - Any
Sending email for trigger: Failure - Any



Mime
View raw message