lucene-dev mailing list archives

Site index · List index
Message view « Date » · « Thread »
Top « Date » · « Thread »
From Policeman Jenkins Server <jenk...@thetaphi.de>
Subject [JENKINS] Lucene-Solr-trunk-Solaris (64bit/jdk1.8.0) - Build # 15 - Still Failing!
Date Tue, 01 Sep 2015 11:36:19 GMT
Build: http://jenkins.thetaphi.de/job/Lucene-Solr-trunk-Solaris/15/
Java: 64bit/jdk1.8.0 -XX:-UseCompressedOops -XX:+UseConcMarkSweepGC

1 tests failed.
FAILED:  org.apache.solr.servlet.SolrRequestParserTest.testStreamURL

Error Message:
array lengths differed, expected.length=17058 actual.length=17062

Stack Trace:
java.lang.AssertionError: array lengths differed, expected.length=17058 actual.length=17062
	at __randomizedtesting.SeedInfo.seed([9B82C61DED37DE17:C2B7F80E99151322]:0)
	at org.junit.Assert.fail(Assert.java:93)
	at org.junit.internal.ComparisonCriteria.assertArraysAreSameLength(ComparisonCriteria.java:70)
	at org.junit.internal.ComparisonCriteria.arrayEquals(ComparisonCriteria.java:34)
	at org.junit.Assert.internalArrayEquals(Assert.java:416)
	at org.junit.Assert.assertArrayEquals(Assert.java:202)
	at org.junit.Assert.assertArrayEquals(Assert.java:215)
	at org.apache.solr.servlet.SolrRequestParserTest.testStreamURL(SolrRequestParserTest.java:154)
	at sun.reflect.NativeMethodAccessorImpl.invoke0(Native Method)
	at sun.reflect.NativeMethodAccessorImpl.invoke(NativeMethodAccessorImpl.java:62)
	at sun.reflect.DelegatingMethodAccessorImpl.invoke(DelegatingMethodAccessorImpl.java:43)
	at java.lang.reflect.Method.invoke(Method.java:497)
	at com.carrotsearch.randomizedtesting.RandomizedRunner.invoke(RandomizedRunner.java:1627)
	at com.carrotsearch.randomizedtesting.RandomizedRunner$6.evaluate(RandomizedRunner.java:836)
	at com.carrotsearch.randomizedtesting.RandomizedRunner$7.evaluate(RandomizedRunner.java:872)
	at com.carrotsearch.randomizedtesting.RandomizedRunner$8.evaluate(RandomizedRunner.java:886)
	at com.carrotsearch.randomizedtesting.rules.SystemPropertiesRestoreRule$1.evaluate(SystemPropertiesRestoreRule.java:57)
	at org.apache.lucene.util.TestRuleSetupTeardownChained$1.evaluate(TestRuleSetupTeardownChained.java:50)
	at org.apache.lucene.util.AbstractBeforeAfterRule$1.evaluate(AbstractBeforeAfterRule.java:46)
	at org.apache.lucene.util.TestRuleThreadAndTestName$1.evaluate(TestRuleThreadAndTestName.java:49)
	at org.apache.lucene.util.TestRuleIgnoreAfterMaxFailures$1.evaluate(TestRuleIgnoreAfterMaxFailures.java:65)
	at org.apache.lucene.util.TestRuleMarkFailure$1.evaluate(TestRuleMarkFailure.java:48)
	at com.carrotsearch.randomizedtesting.rules.StatementAdapter.evaluate(StatementAdapter.java:36)
	at com.carrotsearch.randomizedtesting.ThreadLeakControl$StatementRunner.run(ThreadLeakControl.java:365)
	at com.carrotsearch.randomizedtesting.ThreadLeakControl.forkTimeoutingTask(ThreadLeakControl.java:798)
	at com.carrotsearch.randomizedtesting.ThreadLeakControl$3.evaluate(ThreadLeakControl.java:458)
	at com.carrotsearch.randomizedtesting.RandomizedRunner.runSingleTest(RandomizedRunner.java:845)
	at com.carrotsearch.randomizedtesting.RandomizedRunner$3.evaluate(RandomizedRunner.java:747)
	at com.carrotsearch.randomizedtesting.RandomizedRunner$4.evaluate(RandomizedRunner.java:781)
	at com.carrotsearch.randomizedtesting.RandomizedRunner$5.evaluate(RandomizedRunner.java:792)
	at com.carrotsearch.randomizedtesting.rules.StatementAdapter.evaluate(StatementAdapter.java:36)
	at com.carrotsearch.randomizedtesting.rules.SystemPropertiesRestoreRule$1.evaluate(SystemPropertiesRestoreRule.java:57)
	at org.apache.lucene.util.AbstractBeforeAfterRule$1.evaluate(AbstractBeforeAfterRule.java:46)
	at com.carrotsearch.randomizedtesting.rules.StatementAdapter.evaluate(StatementAdapter.java:36)
	at org.apache.lucene.util.TestRuleStoreClassName$1.evaluate(TestRuleStoreClassName.java:42)
	at com.carrotsearch.randomizedtesting.rules.NoShadowingOrOverridesOnMethodsRule$1.evaluate(NoShadowingOrOverridesOnMethodsRule.java:39)
	at com.carrotsearch.randomizedtesting.rules.NoShadowingOrOverridesOnMethodsRule$1.evaluate(NoShadowingOrOverridesOnMethodsRule.java:39)
	at com.carrotsearch.randomizedtesting.rules.StatementAdapter.evaluate(StatementAdapter.java:36)
	at com.carrotsearch.randomizedtesting.rules.StatementAdapter.evaluate(StatementAdapter.java:36)
	at com.carrotsearch.randomizedtesting.rules.StatementAdapter.evaluate(StatementAdapter.java:36)
	at org.apache.lucene.util.TestRuleAssertionsRequired$1.evaluate(TestRuleAssertionsRequired.java:54)
	at org.apache.lucene.util.TestRuleMarkFailure$1.evaluate(TestRuleMarkFailure.java:48)
	at org.apache.lucene.util.TestRuleIgnoreAfterMaxFailures$1.evaluate(TestRuleIgnoreAfterMaxFailures.java:65)
	at org.apache.lucene.util.TestRuleIgnoreTestSuites$1.evaluate(TestRuleIgnoreTestSuites.java:55)
	at com.carrotsearch.randomizedtesting.rules.StatementAdapter.evaluate(StatementAdapter.java:36)
	at com.carrotsearch.randomizedtesting.ThreadLeakControl$StatementRunner.run(ThreadLeakControl.java:365)
	at java.lang.Thread.run(Thread.java:745)




Build Log:
[...truncated 9812 lines...]
   [junit4] Suite: org.apache.solr.servlet.SolrRequestParserTest
   [junit4]   2> Creating dataDir: /export/home/jenkins/workspace/Lucene-Solr-trunk-Solaris/solr/build/solr-core/test/J0/temp/solr.servlet.SolrRequestParserTest_9B82C61DED37DE17-001/init-core-data-001
   [junit4]   2> 1564958 INFO  (SUITE-SolrRequestParserTest-seed#[9B82C61DED37DE17]-worker)
[    ] o.a.s.SolrTestCaseJ4 Randomized ssl (false) and clientAuth (false)
   [junit4]   2> 1564958 INFO  (SUITE-SolrRequestParserTest-seed#[9B82C61DED37DE17]-worker)
[    ] o.a.s.SolrTestCaseJ4 ####initCore
   [junit4]   2> 1564959 INFO  (SUITE-SolrRequestParserTest-seed#[9B82C61DED37DE17]-worker)
[    ] o.a.s.c.SolrResourceLoader new SolrResourceLoader for directory: '/export/home/jenkins/workspace/Lucene-Solr-trunk-Solaris/solr/core/src/test-files/solr/collection1/'
   [junit4]   2> 1564959 INFO  (SUITE-SolrRequestParserTest-seed#[9B82C61DED37DE17]-worker)
[    ] o.a.s.c.SolrResourceLoader Adding 'file:/export/home/jenkins/workspace/Lucene-Solr-trunk-Solaris/solr/core/src/test-files/solr/collection1/lib/classes/'
to classloader
   [junit4]   2> 1564959 INFO  (SUITE-SolrRequestParserTest-seed#[9B82C61DED37DE17]-worker)
[    ] o.a.s.c.SolrResourceLoader Adding 'file:/export/home/jenkins/workspace/Lucene-Solr-trunk-Solaris/solr/core/src/test-files/solr/collection1/lib/README'
to classloader
   [junit4]   2> 1564975 INFO  (SUITE-SolrRequestParserTest-seed#[9B82C61DED37DE17]-worker)
[    ] o.a.s.c.SolrConfig current version of requestparams : -1
   [junit4]   2> 1564986 INFO  (SUITE-SolrRequestParserTest-seed#[9B82C61DED37DE17]-worker)
[    ] o.a.s.c.SolrConfig Using Lucene MatchVersion: 6.0.0
   [junit4]   2> 1565011 INFO  (SUITE-SolrRequestParserTest-seed#[9B82C61DED37DE17]-worker)
[    ] o.a.s.c.Config Loaded SolrConfig: solrconfig.xml
   [junit4]   2> 1565011 INFO  (SUITE-SolrRequestParserTest-seed#[9B82C61DED37DE17]-worker)
[    ] o.a.s.s.IndexSchema Reading Solr Schema from /export/home/jenkins/workspace/Lucene-Solr-trunk-Solaris/solr/core/src/test-files/solr/collection1/conf/schema.xml
   [junit4]   2> 1565015 INFO  (SUITE-SolrRequestParserTest-seed#[9B82C61DED37DE17]-worker)
[    ] o.a.s.s.IndexSchema [null] Schema name=test
   [junit4]   2> 1565129 INFO  (SUITE-SolrRequestParserTest-seed#[9B82C61DED37DE17]-worker)
[    ] o.a.s.s.OpenExchangeRatesOrgProvider Initialized with rates=open-exchange-rates.json,
refreshInterval=1440.
   [junit4]   2> 1565132 INFO  (SUITE-SolrRequestParserTest-seed#[9B82C61DED37DE17]-worker)
[    ] o.a.s.s.IndexSchema default search field in schema is text
   [junit4]   2> 1565133 INFO  (SUITE-SolrRequestParserTest-seed#[9B82C61DED37DE17]-worker)
[    ] o.a.s.s.IndexSchema unique key field: id
   [junit4]   2> 1565136 INFO  (SUITE-SolrRequestParserTest-seed#[9B82C61DED37DE17]-worker)
[    ] o.a.s.s.FileExchangeRateProvider Reloading exchange rates from file currency.xml
   [junit4]   2> 1565137 INFO  (SUITE-SolrRequestParserTest-seed#[9B82C61DED37DE17]-worker)
[    ] o.a.s.s.FileExchangeRateProvider Reloading exchange rates from file currency.xml
   [junit4]   2> 1565138 INFO  (SUITE-SolrRequestParserTest-seed#[9B82C61DED37DE17]-worker)
[    ] o.a.s.s.OpenExchangeRatesOrgProvider Reloading exchange rates from open-exchange-rates.json
   [junit4]   2> 1565139 WARN  (SUITE-SolrRequestParserTest-seed#[9B82C61DED37DE17]-worker)
[    ] o.a.s.s.OpenExchangeRatesOrgProvider Unknown key IMPORTANT NOTE
   [junit4]   2> 1565139 WARN  (SUITE-SolrRequestParserTest-seed#[9B82C61DED37DE17]-worker)
[    ] o.a.s.s.OpenExchangeRatesOrgProvider Expected key, got STRING
   [junit4]   2> 1565139 INFO  (SUITE-SolrRequestParserTest-seed#[9B82C61DED37DE17]-worker)
[    ] o.a.s.s.OpenExchangeRatesOrgProvider Reloading exchange rates from open-exchange-rates.json
   [junit4]   2> 1565139 WARN  (SUITE-SolrRequestParserTest-seed#[9B82C61DED37DE17]-worker)
[    ] o.a.s.s.OpenExchangeRatesOrgProvider Unknown key IMPORTANT NOTE
   [junit4]   2> 1565139 WARN  (SUITE-SolrRequestParserTest-seed#[9B82C61DED37DE17]-worker)
[    ] o.a.s.s.OpenExchangeRatesOrgProvider Expected key, got STRING
   [junit4]   2> 1565140 INFO  (SUITE-SolrRequestParserTest-seed#[9B82C61DED37DE17]-worker)
[    ] o.a.s.c.SolrResourceLoader JNDI not configured for solr (NoInitialContextEx)
   [junit4]   2> 1565140 INFO  (SUITE-SolrRequestParserTest-seed#[9B82C61DED37DE17]-worker)
[    ] o.a.s.c.SolrResourceLoader using system property solr.solr.home: /export/home/jenkins/workspace/Lucene-Solr-trunk-Solaris/solr/core/src/test-files/solr
   [junit4]   2> 1565140 INFO  (SUITE-SolrRequestParserTest-seed#[9B82C61DED37DE17]-worker)
[    ] o.a.s.c.SolrResourceLoader new SolrResourceLoader for directory: '/export/home/jenkins/workspace/Lucene-Solr-trunk-Solaris/solr/core/src/test-files/solr/'
   [junit4]   2> 1565149 INFO  (SUITE-SolrRequestParserTest-seed#[9B82C61DED37DE17]-worker)
[    ] o.a.s.c.CoreContainer New CoreContainer 374160168
   [junit4]   2> 1565149 INFO  (SUITE-SolrRequestParserTest-seed#[9B82C61DED37DE17]-worker)
[    ] o.a.s.c.CoreContainer Loading cores into CoreContainer [instanceDir=/export/home/jenkins/workspace/Lucene-Solr-trunk-Solaris/solr/core/src/test-files/solr/]
   [junit4]   2> 1565149 INFO  (SUITE-SolrRequestParserTest-seed#[9B82C61DED37DE17]-worker)
[    ] o.a.s.c.CoreContainer loading shared library: /export/home/jenkins/workspace/Lucene-Solr-trunk-Solaris/solr/core/src/test-files/solr/lib
   [junit4]   2> 1565149 WARN  (SUITE-SolrRequestParserTest-seed#[9B82C61DED37DE17]-worker)
[    ] o.a.s.c.SolrResourceLoader Can't find (or read) directory to add to classloader: lib
(resolved as: /export/home/jenkins/workspace/Lucene-Solr-trunk-Solaris/solr/core/src/test-files/solr/lib).
   [junit4]   2> 1565159 INFO  (SUITE-SolrRequestParserTest-seed#[9B82C61DED37DE17]-worker)
[    ] o.a.s.h.c.HttpShardHandlerFactory created with socketTimeout : 600000,connTimeout :
60000,maxConnectionsPerHost : 20,maxConnections : 10000,corePoolSize : 0,maximumPoolSize :
2147483647,maxThreadIdleTime : 5,sizeOfQueue : -1,fairnessPolicy : false,useRetries : false,
   [junit4]   2> 1565161 INFO  (SUITE-SolrRequestParserTest-seed#[9B82C61DED37DE17]-worker)
[    ] o.a.s.u.UpdateShardHandler Creating UpdateShardHandler HTTP client with params: socketTimeout=30000&connTimeout=30000&retry=true
   [junit4]   2> 1565161 INFO  (SUITE-SolrRequestParserTest-seed#[9B82C61DED37DE17]-worker)
[    ] o.a.s.l.LogWatcher SLF4J impl is org.slf4j.impl.Log4jLoggerFactory
   [junit4]   2> 1565161 INFO  (SUITE-SolrRequestParserTest-seed#[9B82C61DED37DE17]-worker)
[    ] o.a.s.l.LogWatcher Registering Log Listener [Log4j (org.slf4j.impl.Log4jLoggerFactory)]
   [junit4]   2> 1565161 INFO  (SUITE-SolrRequestParserTest-seed#[9B82C61DED37DE17]-worker)
[    ] o.a.s.c.CoreContainer Security conf doesn't exist. Skipping setup for authorization
module.
   [junit4]   2> 1565161 INFO  (SUITE-SolrRequestParserTest-seed#[9B82C61DED37DE17]-worker)
[    ] o.a.s.c.CoreContainer No authentication plugin used.
   [junit4]   2> 1565162 INFO  (SUITE-SolrRequestParserTest-seed#[9B82C61DED37DE17]-worker)
[    ] o.a.s.c.SolrCore Created CoreDescriptor: {name=collection1, config=solrconfig.xml,
transient=false, schema=schema.xml, loadOnStartup=true, configSetProperties=configsetprops.json,
instanceDir=collection1, collection=collection1, absoluteInstDir=/export/home/jenkins/workspace/Lucene-Solr-trunk-Solaris/solr/core/src/test-files/solr/collection1/,
dataDir=/export/home/jenkins/workspace/Lucene-Solr-trunk-Solaris/solr/build/solr-core/test/J0/temp/solr.servlet.SolrRequestParserTest_9B82C61DED37DE17-001/init-core-data-001,
shard=shard1}
   [junit4]   2> 1565163 INFO  (coreLoadExecutor-3612-thread-1) [    ] o.a.s.c.SolrResourceLoader
new SolrResourceLoader for directory: '/export/home/jenkins/workspace/Lucene-Solr-trunk-Solaris/solr/core/src/test-files/solr/collection1/'
   [junit4]   2> 1565163 INFO  (coreLoadExecutor-3612-thread-1) [    ] o.a.s.c.SolrResourceLoader
Adding 'file:/export/home/jenkins/workspace/Lucene-Solr-trunk-Solaris/solr/core/src/test-files/solr/collection1/lib/classes/'
to classloader
   [junit4]   2> 1565163 INFO  (coreLoadExecutor-3612-thread-1) [    ] o.a.s.c.SolrResourceLoader
Adding 'file:/export/home/jenkins/workspace/Lucene-Solr-trunk-Solaris/solr/core/src/test-files/solr/collection1/lib/README'
to classloader
   [junit4]   2> 1565176 INFO  (coreLoadExecutor-3612-thread-1) [    ] o.a.s.c.SolrConfig
current version of requestparams : -1
   [junit4]   2> 1565185 INFO  (coreLoadExecutor-3612-thread-1) [    ] o.a.s.c.SolrConfig
Using Lucene MatchVersion: 6.0.0
   [junit4]   2> 1565205 INFO  (coreLoadExecutor-3612-thread-1) [    ] o.a.s.c.Config Loaded
SolrConfig: solrconfig.xml
   [junit4]   2> 1565206 INFO  (coreLoadExecutor-3612-thread-1) [    ] o.a.s.s.IndexSchema
Reading Solr Schema from /export/home/jenkins/workspace/Lucene-Solr-trunk-Solaris/solr/core/src/test-files/solr/collection1/conf/schema.xml
   [junit4]   2> 1565209 INFO  (coreLoadExecutor-3612-thread-1) [    ] o.a.s.s.IndexSchema
[collection1] Schema name=test
   [junit4]   2> 1565307 INFO  (coreLoadExecutor-3612-thread-1) [    ] o.a.s.s.OpenExchangeRatesOrgProvider
Initialized with rates=open-exchange-rates.json, refreshInterval=1440.
   [junit4]   2> 1565314 INFO  (coreLoadExecutor-3612-thread-1) [    ] o.a.s.s.IndexSchema
default search field in schema is text
   [junit4]   2> 1565315 INFO  (coreLoadExecutor-3612-thread-1) [    ] o.a.s.s.IndexSchema
unique key field: id
   [junit4]   2> 1565318 INFO  (coreLoadExecutor-3612-thread-1) [    ] o.a.s.s.FileExchangeRateProvider
Reloading exchange rates from file currency.xml
   [junit4]   2> 1565320 INFO  (coreLoadExecutor-3612-thread-1) [    ] o.a.s.s.FileExchangeRateProvider
Reloading exchange rates from file currency.xml
   [junit4]   2> 1565321 INFO  (coreLoadExecutor-3612-thread-1) [    ] o.a.s.s.OpenExchangeRatesOrgProvider
Reloading exchange rates from open-exchange-rates.json
   [junit4]   2> 1565321 WARN  (coreLoadExecutor-3612-thread-1) [    ] o.a.s.s.OpenExchangeRatesOrgProvider
Unknown key IMPORTANT NOTE
   [junit4]   2> 1565321 WARN  (coreLoadExecutor-3612-thread-1) [    ] o.a.s.s.OpenExchangeRatesOrgProvider
Expected key, got STRING
   [junit4]   2> 1565321 INFO  (coreLoadExecutor-3612-thread-1) [    ] o.a.s.s.OpenExchangeRatesOrgProvider
Reloading exchange rates from open-exchange-rates.json
   [junit4]   2> 1565322 WARN  (coreLoadExecutor-3612-thread-1) [    ] o.a.s.s.OpenExchangeRatesOrgProvider
Unknown key IMPORTANT NOTE
   [junit4]   2> 1565322 WARN  (coreLoadExecutor-3612-thread-1) [    ] o.a.s.s.OpenExchangeRatesOrgProvider
Expected key, got STRING
   [junit4]   2> 1565322 INFO  (coreLoadExecutor-3612-thread-1) [    ] o.a.s.c.ConfigSetProperties
Did not find ConfigSet properties, assuming default properties: Can't find resource 'configsetprops.json'
in classpath or '/export/home/jenkins/workspace/Lucene-Solr-trunk-Solaris/solr/core/src/test-files/solr/collection1/conf'
   [junit4]   2> 1565322 INFO  (coreLoadExecutor-3612-thread-1) [    ] o.a.s.c.CoreContainer
Creating SolrCore 'collection1' using configuration from instancedir /export/home/jenkins/workspace/Lucene-Solr-trunk-Solaris/solr/core/src/test-files/solr/collection1/
   [junit4]   2> 1565323 INFO  (coreLoadExecutor-3612-thread-1) [    x:collection1] o.a.s.c.SolrCore
org.apache.solr.core.MockDirectoryFactory
   [junit4]   2> 1565323 INFO  (coreLoadExecutor-3612-thread-1) [    x:collection1] o.a.s.c.SolrCore
[[collection1] ] Opening new SolrCore at [/export/home/jenkins/workspace/Lucene-Solr-trunk-Solaris/solr/core/src/test-files/solr/collection1/],
dataDir=[null]
   [junit4]   2> 1565323 INFO  (coreLoadExecutor-3612-thread-1) [    x:collection1] o.a.s.c.JmxMonitoredMap
JMX monitoring is enabled. Adding Solr mbeans to JMX Server: com.sun.jmx.mbeanserver.JmxMBeanServer@23076215
   [junit4]   2> 1565323 INFO  (coreLoadExecutor-3612-thread-1) [    x:collection1] o.a.s.c.CachingDirectoryFactory
return new directory for /export/home/jenkins/workspace/Lucene-Solr-trunk-Solaris/solr/build/solr-core/test/J0/temp/solr.servlet.SolrRequestParserTest_9B82C61DED37DE17-001/init-core-data-001
   [junit4]   2> 1565323 INFO  (coreLoadExecutor-3612-thread-1) [    x:collection1] o.a.s.c.SolrCore
New index directory detected: old=null new=/export/home/jenkins/workspace/Lucene-Solr-trunk-Solaris/solr/build/solr-core/test/J0/temp/solr.servlet.SolrRequestParserTest_9B82C61DED37DE17-001/init-core-data-001/index/
   [junit4]   2> 1565323 WARN  (coreLoadExecutor-3612-thread-1) [    x:collection1] o.a.s.c.SolrCore
[collection1] Solr index directory '/export/home/jenkins/workspace/Lucene-Solr-trunk-Solaris/solr/build/solr-core/test/J0/temp/solr.servlet.SolrRequestParserTest_9B82C61DED37DE17-001/init-core-data-001/index'
doesn't exist. Creating new index...
   [junit4]   2> 1565324 INFO  (coreLoadExecutor-3612-thread-1) [    x:collection1] o.a.s.c.CachingDirectoryFactory
return new directory for /export/home/jenkins/workspace/Lucene-Solr-trunk-Solaris/solr/build/solr-core/test/J0/temp/solr.servlet.SolrRequestParserTest_9B82C61DED37DE17-001/init-core-data-001/index
   [junit4]   2> 1565324 INFO  (coreLoadExecutor-3612-thread-1) [    x:collection1] o.a.s.u.RandomMergePolicy
RandomMergePolicy wrapping class org.apache.lucene.index.LogByteSizeMergePolicy: [LogByteSizeMergePolicy:
minMergeSize=1677721, mergeFactor=11, maxMergeSize=2147483648, maxMergeSizeForForcedMerge=9223372036854775807,
calibrateSizeByDeletes=false, maxMergeDocs=2147483647, maxCFSSegmentSizeMB=8.796093022207999E12,
noCFSRatio=0.8275231303602449]
   [junit4]   2> 1565324 INFO  (coreLoadExecutor-3612-thread-1) [    x:collection1] o.a.s.c.SolrCore
SolrDeletionPolicy.onCommit: commits: num=1
   [junit4]   2> 	commit{dir=MockDirectoryWrapper(RAMDirectory@38ae7da2 lockFactory=org.apache.lucene.store.SingleInstanceLockFactory@56f79cec),segFN=segments_1,generation=1}
   [junit4]   2> 1565324 INFO  (coreLoadExecutor-3612-thread-1) [    x:collection1] o.a.s.c.SolrCore
newest commit generation = 1
   [junit4]   2> 1565325 INFO  (OldIndexDirectoryCleanupThreadForCore-collection1) [  
 x:collection1] o.a.s.c.SolrCore Looking for old index directories to cleanup for core collection1
in /export/home/jenkins/workspace/Lucene-Solr-trunk-Solaris/solr/build/solr-core/test/J0/temp/solr.servlet.SolrRequestParserTest_9B82C61DED37DE17-001/init-core-data-001/
   [junit4]   2> 1565327 INFO  (coreLoadExecutor-3612-thread-1) [    x:collection1] o.a.s.u.p.UpdateRequestProcessorChain
creating updateRequestProcessorChain "dedupe"
   [junit4]   2> 1565327 INFO  (coreLoadExecutor-3612-thread-1) [    x:collection1] o.a.s.u.p.UpdateRequestProcessorChain
inserting DistributedUpdateProcessorFactory into updateRequestProcessorChain "dedupe"
   [junit4]   2> 1565327 INFO  (coreLoadExecutor-3612-thread-1) [    x:collection1] o.a.s.u.p.UpdateRequestProcessorChain
creating updateRequestProcessorChain "dedupe-allfields"
   [junit4]   2> 1565327 INFO  (coreLoadExecutor-3612-thread-1) [    x:collection1] o.a.s.u.p.UpdateRequestProcessorChain
inserting DistributedUpdateProcessorFactory into updateRequestProcessorChain "dedupe-allfields"
   [junit4]   2> 1565327 INFO  (coreLoadExecutor-3612-thread-1) [    x:collection1] o.a.s.u.p.UpdateRequestProcessorChain
creating updateRequestProcessorChain "stored_sig"
   [junit4]   2> 1565327 INFO  (coreLoadExecutor-3612-thread-1) [    x:collection1] o.a.s.u.p.UpdateRequestProcessorChain
inserting DistributedUpdateProcessorFactory into updateRequestProcessorChain "stored_sig"
   [junit4]   2> 1565328 INFO  (coreLoadExecutor-3612-thread-1) [    x:collection1] o.a.s.u.p.UpdateRequestProcessorChain
creating updateRequestProcessorChain "uniq-fields"
   [junit4]   2> 1565328 INFO  (coreLoadExecutor-3612-thread-1) [    x:collection1] o.a.s.u.p.UpdateRequestProcessorChain
inserting DistributedUpdateProcessorFactory into updateRequestProcessorChain "uniq-fields"
   [junit4]   2> 1565328 INFO  (coreLoadExecutor-3612-thread-1) [    x:collection1] o.a.s.u.p.UpdateRequestProcessorChain
creating updateRequestProcessorChain "distrib-dup-test-chain-explicit"
   [junit4]   2> 1565328 INFO  (coreLoadExecutor-3612-thread-1) [    x:collection1] o.a.s.u.p.UpdateRequestProcessorChain
creating updateRequestProcessorChain "distrib-dup-test-chain-implicit"
   [junit4]   2> 1565328 INFO  (coreLoadExecutor-3612-thread-1) [    x:collection1] o.a.s.u.p.UpdateRequestProcessorChain
inserting DistributedUpdateProcessorFactory into updateRequestProcessorChain "distrib-dup-test-chain-implicit"
   [junit4]   2> 1565328 INFO  (coreLoadExecutor-3612-thread-1) [    x:collection1] o.a.s.c.SolrCore
no updateRequestProcessorChain defined as default, creating implicit default
   [junit4]   2> 1565330 INFO  (coreLoadExecutor-3612-thread-1) [    x:collection1] o.a.s.h.l.XMLLoader
xsltCacheLifetimeSeconds=60
   [junit4]   2> 1565331 INFO  (coreLoadExecutor-3612-thread-1) [    x:collection1] o.a.s.h.l.XMLLoader
xsltCacheLifetimeSeconds=60
   [junit4]   2> 1565331 INFO  (coreLoadExecutor-3612-thread-1) [    x:collection1] o.a.s.h.l.XMLLoader
xsltCacheLifetimeSeconds=60
   [junit4]   2> 1565332 INFO  (coreLoadExecutor-3612-thread-1) [    x:collection1] o.a.s.h.l.XMLLoader
xsltCacheLifetimeSeconds=60
   [junit4]   2> 1565335 INFO  (coreLoadExecutor-3612-thread-1) [    x:collection1] o.a.s.c.PluginBag
requestHandler : 'lazy' created with startup=lazy 
   [junit4]   2> 1565336 INFO  (coreLoadExecutor-3612-thread-1) [    x:collection1] o.a.s.c.RequestHandlers
Registered paths: /admin/mbeans,standard,spellCheckCompRH,lazy,/update/json/docs,/admin/luke,spellCheckWithWordbreak_Direct,tvrh,/get,/admin/properties,/update/json,mltrh,/admin/threads,/search-facet-def,/update/csv,/search-facet-invariants,/admin/segments,spellCheckCompRH1,/mlt,/admin/system,/replication,dismax,defaults,/config,/schema,/admin/plugins,/admin/logging,spellCheckWithWordbreak,mock,/admin/ping,/update,/admin/file,/terms,spellCheckCompRH_Direct,/debug/dump
   [junit4]   2> 1565337 WARN  (coreLoadExecutor-3612-thread-1) [    x:collection1] o.a.s.c.SolrCore
solrconfig.xml uses deprecated <admin/gettableFiles>, Please update your config to use
the ShowFileRequestHandler.
   [junit4]   2> 1565337 INFO  (coreLoadExecutor-3612-thread-1) [    x:collection1] o.a.s.c.SolrCore
Using default statsCache cache: org.apache.solr.search.stats.LocalStatsCache
   [junit4]   2> 1565337 INFO  (coreLoadExecutor-3612-thread-1) [    x:collection1] o.a.s.u.UpdateHandler
Using UpdateLog implementation: org.apache.solr.update.UpdateLog
   [junit4]   2> 1565337 INFO  (coreLoadExecutor-3612-thread-1) [    x:collection1] o.a.s.u.UpdateLog
Initializing UpdateLog: dataDir= defaultSyncLevel=FLUSH numRecordsToKeep=100 maxNumLogsToKeep=10
numVersionBuckets=65536
   [junit4]   2> 1565338 INFO  (coreLoadExecutor-3612-thread-1) [    x:collection1] o.a.s.c.SolrCore
Hard AutoCommit: disabled
   [junit4]   2> 1565338 INFO  (coreLoadExecutor-3612-thread-1) [    x:collection1] o.a.s.c.SolrCore
Soft AutoCommit: disabled
   [junit4]   2> 1565339 INFO  (coreLoadExecutor-3612-thread-1) [    x:collection1] o.a.s.u.RandomMergePolicy
RandomMergePolicy wrapping class org.apache.lucene.index.TieredMergePolicy: [TieredMergePolicy:
maxMergeAtOnce=47, maxMergeAtOnceExplicit=35, maxMergedSegmentMB=73.7568359375, floorSegmentMB=0.8935546875,
forceMergeDeletesPctAllowed=13.288997922876803, segmentsPerTier=14.0, maxCFSSegmentSizeMB=8.796093022207999E12,
noCFSRatio=0.5200505550134844
   [junit4]   2> 1565339 INFO  (coreLoadExecutor-3612-thread-1) [    x:collection1] o.a.s.c.SolrCore
SolrDeletionPolicy.onInit: commits: num=1
   [junit4]   2> 	commit{dir=MockDirectoryWrapper(RAMDirectory@38ae7da2 lockFactory=org.apache.lucene.store.SingleInstanceLockFactory@56f79cec),segFN=segments_1,generation=1}
   [junit4]   2> 1565339 INFO  (coreLoadExecutor-3612-thread-1) [    x:collection1] o.a.s.c.SolrCore
newest commit generation = 1
   [junit4]   2> 1565339 INFO  (coreLoadExecutor-3612-thread-1) [    x:collection1] o.a.s.s.SolrIndexSearcher
Opening Searcher@d0d0957[collection1] main
   [junit4]   2> 1565339 INFO  (coreLoadExecutor-3612-thread-1) [    x:collection1] o.a.s.r.RestManager
Initializing RestManager with initArgs: {storageIO=org.apache.solr.rest.ManagedResourceStorage$InMemoryStorageIO}
   [junit4]   2> 1565339 INFO  (coreLoadExecutor-3612-thread-1) [    x:collection1] o.a.s.r.ManagedResourceStorage
Reading _rest_managed.json using InMemoryStorage
   [junit4]   2> 1565339 INFO  (coreLoadExecutor-3612-thread-1) [    x:collection1] o.a.s.r.RestManager
Initializing 0 registered ManagedResources
   [junit4]   2> 1565339 INFO  (coreLoadExecutor-3612-thread-1) [    x:collection1] o.a.s.h.c.SpellCheckComponent
Initializing spell checkers
   [junit4]   2> 1565384 INFO  (coreLoadExecutor-3612-thread-1) [    x:collection1] o.a.s.s.DirectSolrSpellChecker
init: {name=direct,classname=DirectSolrSpellChecker,field=lowerfilt,minQueryLength=3}
   [junit4]   2> 1565449 INFO  (coreLoadExecutor-3612-thread-1) [    x:collection1] o.a.s.h.ReplicationHandler
Commits will be reserved for  10000
   [junit4]   2> 1565450 INFO  (searcherExecutor-3613-thread-1-processing-x:collection1)
[    x:collection1] o.a.s.h.c.SpellCheckComponent Loading spell index for spellchecker: default
   [junit4]   2> 1565450 INFO  (coreLoadExecutor-3612-thread-1) [    x:collection1] o.a.s.u.UpdateLog
Looking up max value of version field to seed version buckets
   [junit4]   2> 1565450 INFO  (coreLoadExecutor-3612-thread-1) [    x:collection1] o.a.s.u.VersionInfo
Refreshing highest value of _version_ for 65536 version buckets from index
   [junit4]   2> 1565450 INFO  (coreLoadExecutor-3612-thread-1) [    x:collection1] o.a.s.u.VersionInfo
No terms found for _version_, cannot seed version bucket highest value from index
   [junit4]   2> 1565450 INFO  (coreLoadExecutor-3612-thread-1) [    x:collection1] o.a.s.u.UpdateLog
Could not find max version in index or recent updates, using new clock 1511108908798705664
   [junit4]   2> 1565450 INFO  (searcherExecutor-3613-thread-1-processing-x:collection1)
[    x:collection1] o.a.s.h.c.SpellCheckComponent Loading spell index for spellchecker: direct
   [junit4]   2> 1565450 INFO  (searcherExecutor-3613-thread-1-processing-x:collection1)
[    x:collection1] o.a.s.h.c.SpellCheckComponent Loading spell index for spellchecker: wordbreak
   [junit4]   2> 1565450 INFO  (searcherExecutor-3613-thread-1-processing-x:collection1)
[    x:collection1] o.a.s.h.c.SpellCheckComponent Loading spell index for spellchecker: multipleFields
   [junit4]   2> 1565451 INFO  (searcherExecutor-3613-thread-1-processing-x:collection1)
[    x:collection1] o.a.s.h.c.SpellCheckComponent Loading spell index for spellchecker: jarowinkler
   [junit4]   2> 1565452 INFO  (searcherExecutor-3613-thread-1-processing-x:collection1)
[    x:collection1] o.a.s.h.c.SpellCheckComponent Loading spell index for spellchecker: external
   [junit4]   2> 1565452 INFO  (coreLoadExecutor-3612-thread-1) [    x:collection1] o.a.s.u.UpdateLog
Took 2.0ms to seed version buckets with highest version 1511108908798705664
   [junit4]   2> 1565452 INFO  (searcherExecutor-3613-thread-1-processing-x:collection1)
[    x:collection1] o.a.s.h.c.SpellCheckComponent Loading spell index for spellchecker: freq
   [junit4]   2> 1565452 INFO  (coreLoadExecutor-3612-thread-1) [    x:collection1] o.a.s.c.CoreContainer
registering core: collection1
   [junit4]   2> 1565453 INFO  (searcherExecutor-3613-thread-1-processing-x:collection1)
[    x:collection1] o.a.s.h.c.SpellCheckComponent Loading spell index for spellchecker: fqcn
   [junit4]   2> 1565453 INFO  (searcherExecutor-3613-thread-1-processing-x:collection1)
[    x:collection1] o.a.s.h.c.SpellCheckComponent Loading spell index for spellchecker: perDict
   [junit4]   2> 1565453 INFO  (searcherExecutor-3613-thread-1-processing-x:collection1)
[    x:collection1] o.a.s.c.SolrCore [collection1] Registered new searcher Searcher@d0d0957[collection1]
main{ExitableDirectoryReader(UninvertingDirectoryReader())}
   [junit4]   2> 1565453 INFO  (SUITE-SolrRequestParserTest-seed#[9B82C61DED37DE17]-worker)
[    ] o.a.s.SolrTestCaseJ4 ####initCore end
   [junit4]   2> 1565457 INFO  (TEST-SolrRequestParserTest.testStreamBody-seed#[9B82C61DED37DE17])
[    ] o.a.s.SolrTestCaseJ4 ###Starting testStreamBody
   [junit4]   2> 1565457 INFO  (TEST-SolrRequestParserTest.testStreamBody-seed#[9B82C61DED37DE17])
[    ] o.a.s.SolrTestCaseJ4 ###Ending testStreamBody
   [junit4]   2> 1565460 INFO  (TEST-SolrRequestParserTest.testStandardParseParamsAndFillStreamsISO88591-seed#[9B82C61DED37DE17])
[    ] o.a.s.SolrTestCaseJ4 ###Starting testStandardParseParamsAndFillStreamsISO88591
   [junit4]   2> 1565475 INFO  (TEST-SolrRequestParserTest.testStandardParseParamsAndFillStreamsISO88591-seed#[9B82C61DED37DE17])
[    ] o.a.s.SolrTestCaseJ4 ###Ending testStandardParseParamsAndFillStreamsISO88591
   [junit4]   2> 1565477 INFO  (TEST-SolrRequestParserTest.testPostMissingContentType-seed#[9B82C61DED37DE17])
[    ] o.a.s.SolrTestCaseJ4 ###Starting testPostMissingContentType
   [junit4]   2> 1565478 INFO  (TEST-SolrRequestParserTest.testPostMissingContentType-seed#[9B82C61DED37DE17])
[    ] o.a.s.SolrTestCaseJ4 ###Ending testPostMissingContentType
   [junit4]   2> 1565479 INFO  (TEST-SolrRequestParserTest.testStandardFormdataUploadLimit-seed#[9B82C61DED37DE17])
[    ] o.a.s.SolrTestCaseJ4 ###Starting testStandardFormdataUploadLimit
   [junit4]   2> 1565855 INFO  (TEST-SolrRequestParserTest.testStandardFormdataUploadLimit-seed#[9B82C61DED37DE17])
[    ] o.a.s.SolrTestCaseJ4 ###Ending testStandardFormdataUploadLimit
   [junit4]   2> 1565858 INFO  (TEST-SolrRequestParserTest.testParameterIncompatibilityException2-seed#[9B82C61DED37DE17])
[    ] o.a.s.SolrTestCaseJ4 ###Starting testParameterIncompatibilityException2
   [junit4]   2> 1565860 INFO  (TEST-SolrRequestParserTest.testParameterIncompatibilityException2-seed#[9B82C61DED37DE17])
[    ] o.a.s.SolrTestCaseJ4 ###Ending testParameterIncompatibilityException2
   [junit4]   2> 1565863 INFO  (TEST-SolrRequestParserTest.testAutoDetect-seed#[9B82C61DED37DE17])
[    ] o.a.s.SolrTestCaseJ4 ###Starting testAutoDetect
   [junit4]   2> 1565871 INFO  (TEST-SolrRequestParserTest.testAutoDetect-seed#[9B82C61DED37DE17])
[    ] o.a.s.SolrTestCaseJ4 ###Ending testAutoDetect
   [junit4]   2> 1565874 INFO  (TEST-SolrRequestParserTest.testUrlParamParsing-seed#[9B82C61DED37DE17])
[    ] o.a.s.SolrTestCaseJ4 ###Starting testUrlParamParsing
   [junit4]   2> 1565876 INFO  (TEST-SolrRequestParserTest.testUrlParamParsing-seed#[9B82C61DED37DE17])
[    ] o.a.s.SolrTestCaseJ4 ###Ending testUrlParamParsing
   [junit4]   2> 1565882 INFO  (TEST-SolrRequestParserTest.testStreamURL-seed#[9B82C61DED37DE17])
[    ] o.a.s.SolrTestCaseJ4 ###Starting testStreamURL
   [junit4]   2> 1566478 INFO  (TEST-SolrRequestParserTest.testStreamURL-seed#[9B82C61DED37DE17])
[    ] o.a.s.SolrTestCaseJ4 ###Ending testStreamURL
   [junit4]   2> NOTE: reproduce with: ant test  -Dtestcase=SolrRequestParserTest -Dtests.method=testStreamURL
-Dtests.seed=9B82C61DED37DE17 -Dtests.slow=true -Dtests.locale=ar_SY -Dtests.timezone=Asia/Beirut
-Dtests.asserts=true -Dtests.file.encoding=ISO-8859-1
   [junit4] FAILURE 0.61s J0 | SolrRequestParserTest.testStreamURL <<<
   [junit4]    > Throwable #1: java.lang.AssertionError: array lengths differed, expected.length=17058
actual.length=17062
   [junit4]    > 	at __randomizedtesting.SeedInfo.seed([9B82C61DED37DE17:C2B7F80E99151322]:0)
   [junit4]    > 	at org.apache.solr.servlet.SolrRequestParserTest.testStreamURL(SolrRequestParserTest.java:154)
   [junit4]    > 	at java.lang.Thread.run(Thread.java:745)
   [junit4]   2> 1566487 INFO  (TEST-SolrRequestParserTest.testParameterIncompatibilityException1-seed#[9B82C61DED37DE17])
[    ] o.a.s.SolrTestCaseJ4 ###Starting testParameterIncompatibilityException1
   [junit4]   2> 1566490 INFO  (TEST-SolrRequestParserTest.testParameterIncompatibilityException1-seed#[9B82C61DED37DE17])
[    ] o.a.s.SolrTestCaseJ4 ###Ending testParameterIncompatibilityException1
   [junit4]   2> 1566492 INFO  (TEST-SolrRequestParserTest.testStandardParseParamsAndFillStreams-seed#[9B82C61DED37DE17])
[    ] o.a.s.SolrTestCaseJ4 ###Starting testStandardParseParamsAndFillStreams
   [junit4]   2> 1566493 INFO  (TEST-SolrRequestParserTest.testStandardParseParamsAndFillStreams-seed#[9B82C61DED37DE17])
[    ] o.a.s.SolrTestCaseJ4 ###Ending testStandardParseParamsAndFillStreams
   [junit4]   2> 1566495 INFO  (TEST-SolrRequestParserTest.testAddHttpRequestToContext-seed#[9B82C61DED37DE17])
[    ] o.a.s.SolrTestCaseJ4 ###Starting testAddHttpRequestToContext
   [junit4]   2> 1566495 INFO  (TEST-SolrRequestParserTest.testAddHttpRequestToContext-seed#[9B82C61DED37DE17])
[    ] o.a.s.SolrTestCaseJ4 ###Ending testAddHttpRequestToContext
   [junit4]   2> 1566496 INFO  (SUITE-SolrRequestParserTest-seed#[9B82C61DED37DE17]-worker)
[    ] o.a.s.SolrTestCaseJ4 ###deleteCore
   [junit4]   2> 1566496 INFO  (SUITE-SolrRequestParserTest-seed#[9B82C61DED37DE17]-worker)
[    ] o.a.s.c.CoreContainer Shutting down CoreContainer instance=374160168
   [junit4]   2> 1566496 INFO  (SUITE-SolrRequestParserTest-seed#[9B82C61DED37DE17]-worker)
[    x:collection1] o.a.s.c.SolrCore [collection1]  CLOSING SolrCore org.apache.solr.core.SolrCore@6564888b
   [junit4]   2> 1566497 INFO  (SUITE-SolrRequestParserTest-seed#[9B82C61DED37DE17]-worker)
[    x:collection1] o.a.s.u.UpdateHandler closing DirectUpdateHandler2{commits=0,autocommits=0,soft
autocommits=0,optimizes=0,rollbacks=0,expungeDeletes=0,docsPending=0,adds=0,deletesById=0,deletesByQuery=0,errors=0,cumulative_adds=0,cumulative_deletesById=0,cumulative_deletesByQuery=0,cumulative_errors=0,transaction_logs_total_size=0,transaction_logs_total_number=0}
   [junit4]   2> 1566497 INFO  (SUITE-SolrRequestParserTest-seed#[9B82C61DED37DE17]-worker)
[    x:collection1] o.a.s.u.SolrCoreState Closing SolrCoreState
   [junit4]   2> 1566497 INFO  (SUITE-SolrRequestParserTest-seed#[9B82C61DED37DE17]-worker)
[    x:collection1] o.a.s.u.DefaultSolrCoreState SolrCoreState ref count has reached 0 - closing
IndexWriter
   [junit4]   2> 1566497 INFO  (SUITE-SolrRequestParserTest-seed#[9B82C61DED37DE17]-worker)
[    x:collection1] o.a.s.u.DefaultSolrCoreState closing IndexWriter with IndexWriterCloser
   [junit4]   2> 1566498 INFO  (SUITE-SolrRequestParserTest-seed#[9B82C61DED37DE17]-worker)
[    x:collection1] o.a.s.c.SolrCore [collection1] Closing main searcher on request.
   [junit4]   2> 1566510 INFO  (SUITE-SolrRequestParserTest-seed#[9B82C61DED37DE17]-worker)
[    x:collection1] o.a.s.c.CachingDirectoryFactory Closing MockDirectoryFactory - 2 directories
currently being tracked
   [junit4]   2> 1566510 INFO  (SUITE-SolrRequestParserTest-seed#[9B82C61DED37DE17]-worker)
[    x:collection1] o.a.s.c.CachingDirectoryFactory looking to close /export/home/jenkins/workspace/Lucene-Solr-trunk-Solaris/solr/build/solr-core/test/J0/temp/solr.servlet.SolrRequestParserTest_9B82C61DED37DE17-001/init-core-data-001/index
[CachedDir<<refCount=0;path=/export/home/jenkins/workspace/Lucene-Solr-trunk-Solaris/solr/build/solr-core/test/J0/temp/solr.servlet.SolrRequestParserTest_9B82C61DED37DE17-001/init-core-data-001/index;done=false>>]
   [junit4]   2> 1566510 INFO  (SUITE-SolrRequestParserTest-seed#[9B82C61DED37DE17]-worker)
[    x:collection1] o.a.s.c.CachingDirectoryFactory Closing directory: /export/home/jenkins/workspace/Lucene-Solr-trunk-Solaris/solr/build/solr-core/test/J0/temp/solr.servlet.SolrRequestParserTest_9B82C61DED37DE17-001/init-core-data-001/index
   [junit4]   2> 1566510 INFO  (SUITE-SolrRequestParserTest-seed#[9B82C61DED37DE17]-worker)
[    x:collection1] o.a.s.c.CachingDirectoryFactory looking to close /export/home/jenkins/workspace/Lucene-Solr-trunk-Solaris/solr/build/solr-core/test/J0/temp/solr.servlet.SolrRequestParserTest_9B82C61DED37DE17-001/init-core-data-001
[CachedDir<<refCount=0;path=/export/home/jenkins/workspace/Lucene-Solr-trunk-Solaris/solr/build/solr-core/test/J0/temp/solr.servlet.SolrRequestParserTest_9B82C61DED37DE17-001/init-core-data-001;done=false>>]
   [junit4]   2> 1566510 INFO  (SUITE-SolrRequestParserTest-seed#[9B82C61DED37DE17]-worker)
[    x:collection1] o.a.s.c.CachingDirectoryFactory Closing directory: /export/home/jenkins/workspace/Lucene-Solr-trunk-Solaris/solr/build/solr-core/test/J0/temp/solr.servlet.SolrRequestParserTest_9B82C61DED37DE17-001/init-core-data-001
   [junit4]   2> NOTE: leaving temporary files on disk at: /export/home/jenkins/workspace/Lucene-Solr-trunk-Solaris/solr/build/solr-core/test/J0/temp/solr.servlet.SolrRequestParserTest_9B82C61DED37DE17-001
   [junit4]   2> NOTE: test params are: codec=Asserting(Lucene53): {}, docValues:{}, sim=DefaultSimilarity,
locale=ar_SY, timezone=Asia/Beirut
   [junit4]   2> NOTE: SunOS 5.11 amd64/Oracle Corporation 1.8.0_60 (64-bit)/cpus=3,threads=1,free=179105872,total=304586752
   [junit4]   2> NOTE: All tests run in this JVM: [CoreAdminRequestStatusTest, TestTrieFacet,
DocValuesMissingTest, JSONWriterTest, SharedFSAutoReplicaFailoverUtilsTest, VMParamsZkACLAndCredentialsProvidersTest,
MoreLikeThisHandlerTest, TestSolrJ, AlternateDirectoryTest, DistributedQueryElevationComponentTest,
ReturnFieldsTest, ExitableDirectoryReaderTest, DateFieldTest, TestCustomSort, TestRebalanceLeaders,
LeaderFailoverAfterPartitionTest, DistributedMLTComponentTest, TestTrackingShardHandlerFactory,
DistributedExpandComponentTest, UnloadDistributedZkTest, RemoteQueryErrorTest, TestBlobHandler,
TestMiniSolrCloudCluster, TestSchemaSimilarityResource, AnalysisAfterCoreReloadTest, TestManagedSchema,
CleanupOldIndexTest, PluginInfoTest, TestInitParams, DocValuesTest, UpdateParamsTest, QueryEqualityTest,
TestSearchPerf, DistributedSuggestComponentTest, TestBlendedInfixSuggestions, SyncSliceTest,
IndexBasedSpellCheckerTest, CoreMergeIndexesAdminHandlerTest, CloudExitableDirectoryReaderTest,
HdfsDirectoryFactoryTest, TestStressLucene, HdfsBasicDistributedZkTest, OverseerRolesTest,
SmileWriterTest, IgnoreCommitOptimizeUpdateProcessorFactoryTest, TestAnalyzedSuggestions,
PathHierarchyTokenizerFactoryTest, TestFastWriter, TestIntervalFaceting, HdfsRecoveryZkTest,
TestNamedUpdateProcessors, TestConfigSetProperties, SegmentsInfoRequestHandlerTest, TestExactStatsCache,
SpatialFilterTest, RecoveryZkTest, TestStressReorder, TestReplicationHandlerBackup, DOMUtilTest,
TestSearcherReuse, TestRequestStatusCollectionAPI, CdcrReplicationHandlerTest, RuleEngineTest,
HLLUtilTest, RecoveryAfterSoftCommitTest, SOLR749Test, CdcrReplicationDistributedZkTest, QueryElevationComponentTest,
RulesTest, TestAddFieldRealTimeGet, OverseerCollectionConfigSetProcessorTest, TestFastLRUCache,
ShardRoutingTest, TestCryptoKeys, DistributedDebugComponentTest, TestSimpleQParserPlugin,
TestJmxMonitoredMap, SolrIndexConfigTest, TestPartialUpdateDeduplication, TestGroupingSearch,
JsonLoaderTest, TestScoreJoinQPScore, TestPseudoReturnFields, SimpleFacetsTest, TestDocumentBuilder,
ExplicitHLLTest, ScriptEngineTest, HttpPartitionTest, TestArbitraryIndexDir, SuggestComponentTest,
TestFunctionQuery, TestDistributedStatsComponentCardinality, TestSQLHandler, DocValuesMultiTest,
DistributedQueryComponentOptimizationTest, MBeansHandlerTest, TestCSVLoader, DeleteShardTest,
TestSystemIdResolver, SolrRequestParserTest]
   [junit4] Completed [250/543] on J0 in 1.58s, 11 tests, 1 failure <<< FAILURES!

[...truncated 951 lines...]
BUILD FAILED
/export/home/jenkins/workspace/Lucene-Solr-trunk-Solaris/build.xml:775: The following error
occurred while executing this line:
/export/home/jenkins/workspace/Lucene-Solr-trunk-Solaris/build.xml:719: The following error
occurred while executing this line:
/export/home/jenkins/workspace/Lucene-Solr-trunk-Solaris/build.xml:59: The following error
occurred while executing this line:
/export/home/jenkins/workspace/Lucene-Solr-trunk-Solaris/solr/build.xml:233: The following
error occurred while executing this line:
/export/home/jenkins/workspace/Lucene-Solr-trunk-Solaris/solr/common-build.xml:514: The following
error occurred while executing this line:
/export/home/jenkins/workspace/Lucene-Solr-trunk-Solaris/lucene/common-build.xml:1432: The
following error occurred while executing this line:
/export/home/jenkins/workspace/Lucene-Solr-trunk-Solaris/lucene/common-build.xml:987: There
were test failures: 543 suites, 2145 tests, 1 failure, 47 ignored (35 assumptions)

Total time: 72 minutes 46 seconds
Build step 'Invoke Ant' marked build as failure
Archiving artifacts
[WARNINGS] Skipping publisher since build result is FAILURE
Recording test results
Email was triggered for: Failure - Any
Sending email for trigger: Failure - Any



Mime
View raw message