lucene-dev mailing list archives

Site index · List index
Message view « Date » · « Thread »
Top « Date » · « Thread »
From Policeman Jenkins Server <jenk...@thetaphi.de>
Subject [JENKINS-EA] Lucene-Solr-trunk-Linux (64bit/jdk1.9.0-ea-b78) - Build # 14171 - Still Failing!
Date Wed, 09 Sep 2015 21:14:10 GMT
Build: http://jenkins.thetaphi.de/job/Lucene-Solr-trunk-Linux/14171/
Java: 64bit/jdk1.9.0-ea-b78 -XX:-UseCompressedOops -XX:+UseParallelGC

2 tests failed.
FAILED:  org.apache.solr.cloud.CdcrReplicationHandlerTest.doTest

Error Message:
Captured an uncaught exception in thread: Thread[id=8220, name=RecoveryThread-source_collection_shard1_replica2, state=RUNNABLE, group=TGRP-CdcrReplicationHandlerTest]

Stack Trace:
com.carrotsearch.randomizedtesting.UncaughtExceptionError: Captured an uncaught exception in thread: Thread[id=8220, name=RecoveryThread-source_collection_shard1_replica2, state=RUNNABLE, group=TGRP-CdcrReplicationHandlerTest]
Caused by: org.apache.solr.common.cloud.ZooKeeperException: 
	at __randomizedtesting.SeedInfo.seed([E34398B09FA3A45D]:0)
	at org.apache.solr.cloud.RecoveryStrategy.run(RecoveryStrategy.java:234)
Caused by: org.apache.solr.common.SolrException: java.io.FileNotFoundException: /home/jenkins/workspace/Lucene-Solr-trunk-Linux/solr/build/solr-core/test/J2/temp/solr.cloud.CdcrReplicationHandlerTest_E34398B09FA3A45D-001/jetty-002/cores/source_collection_shard1_replica2/data/tlog/tlog.0000000000000000008.1511871005855842304 (No such file or directory)
	at org.apache.solr.update.CdcrTransactionLog.reopenOutputStream(CdcrTransactionLog.java:244)
	at org.apache.solr.update.CdcrTransactionLog.incref(CdcrTransactionLog.java:173)
	at org.apache.solr.update.UpdateLog.getRecentUpdates(UpdateLog.java:1079)
	at org.apache.solr.update.UpdateLog.seedBucketsWithHighestVersion(UpdateLog.java:1579)
	at org.apache.solr.update.UpdateLog.seedBucketsWithHighestVersion(UpdateLog.java:1610)
	at org.apache.solr.core.SolrCore.seedVersionBuckets(SolrCore.java:877)
	at org.apache.solr.cloud.RecoveryStrategy.doRecovery(RecoveryStrategy.java:526)
	at org.apache.solr.cloud.RecoveryStrategy.run(RecoveryStrategy.java:227)
Caused by: java.io.FileNotFoundException: /home/jenkins/workspace/Lucene-Solr-trunk-Linux/solr/build/solr-core/test/J2/temp/solr.cloud.CdcrReplicationHandlerTest_E34398B09FA3A45D-001/jetty-002/cores/source_collection_shard1_replica2/data/tlog/tlog.0000000000000000008.1511871005855842304 (No such file or directory)
	at java.io.RandomAccessFile.open0(Native Method)
	at java.io.RandomAccessFile.open(RandomAccessFile.java:327)
	at java.io.RandomAccessFile.<init>(RandomAccessFile.java:243)
	at org.apache.solr.update.CdcrTransactionLog.reopenOutputStream(CdcrTransactionLog.java:236)
	... 7 more


FAILED:  org.apache.solr.cloud.DistribJoinFromCollectionTest.test

Error Message:
 Expected: not "1.0"      got: "1.0" 

Stack Trace:
java.lang.AssertionError: 
Expected: not "1.0"
     got: "1.0"

	at __randomizedtesting.SeedInfo.seed([E34398B09FA3A45D:6B17A76A315FC9A5]:0)
	at org.junit.Assert.assertThat(Assert.java:780)
	at org.junit.Assert.assertThat(Assert.java:738)
	at org.apache.solr.cloud.DistribJoinFromCollectionTest.assertScore(DistribJoinFromCollectionTest.java:170)
	at org.apache.solr.cloud.DistribJoinFromCollectionTest.testJoins(DistribJoinFromCollectionTest.java:132)
	at org.apache.solr.cloud.DistribJoinFromCollectionTest.test(DistribJoinFromCollectionTest.java:100)
	at sun.reflect.NativeMethodAccessorImpl.invoke0(Native Method)
	at sun.reflect.NativeMethodAccessorImpl.invoke(NativeMethodAccessorImpl.java:62)
	at sun.reflect.DelegatingMethodAccessorImpl.invoke(DelegatingMethodAccessorImpl.java:43)
	at java.lang.reflect.Method.invoke(Method.java:504)
	at com.carrotsearch.randomizedtesting.RandomizedRunner.invoke(RandomizedRunner.java:1627)
	at com.carrotsearch.randomizedtesting.RandomizedRunner$6.evaluate(RandomizedRunner.java:836)
	at com.carrotsearch.randomizedtesting.RandomizedRunner$7.evaluate(RandomizedRunner.java:872)
	at com.carrotsearch.randomizedtesting.RandomizedRunner$8.evaluate(RandomizedRunner.java:886)
	at org.apache.solr.BaseDistributedSearchTestCase$ShardsRepeatRule$ShardsFixedStatement.callStatement(BaseDistributedSearchTestCase.java:963)
	at org.apache.solr.BaseDistributedSearchTestCase$ShardsRepeatRule$ShardsStatement.evaluate(BaseDistributedSearchTestCase.java:938)
	at com.carrotsearch.randomizedtesting.rules.SystemPropertiesRestoreRule$1.evaluate(SystemPropertiesRestoreRule.java:57)
	at org.apache.lucene.util.TestRuleSetupTeardownChained$1.evaluate(TestRuleSetupTeardownChained.java:50)
	at org.apache.lucene.util.AbstractBeforeAfterRule$1.evaluate(AbstractBeforeAfterRule.java:46)
	at org.apache.lucene.util.TestRuleThreadAndTestName$1.evaluate(TestRuleThreadAndTestName.java:49)
	at org.apache.lucene.util.TestRuleIgnoreAfterMaxFailures$1.evaluate(TestRuleIgnoreAfterMaxFailures.java:65)
	at org.apache.lucene.util.TestRuleMarkFailure$1.evaluate(TestRuleMarkFailure.java:48)
	at com.carrotsearch.randomizedtesting.rules.StatementAdapter.evaluate(StatementAdapter.java:36)
	at com.carrotsearch.randomizedtesting.ThreadLeakControl$StatementRunner.run(ThreadLeakControl.java:365)
	at com.carrotsearch.randomizedtesting.ThreadLeakControl.forkTimeoutingTask(ThreadLeakControl.java:798)
	at com.carrotsearch.randomizedtesting.ThreadLeakControl$3.evaluate(ThreadLeakControl.java:458)
	at com.carrotsearch.randomizedtesting.RandomizedRunner.runSingleTest(RandomizedRunner.java:845)
	at com.carrotsearch.randomizedtesting.RandomizedRunner$3.evaluate(RandomizedRunner.java:747)
	at com.carrotsearch.randomizedtesting.RandomizedRunner$4.evaluate(RandomizedRunner.java:781)
	at com.carrotsearch.randomizedtesting.RandomizedRunner$5.evaluate(RandomizedRunner.java:792)
	at com.carrotsearch.randomizedtesting.rules.StatementAdapter.evaluate(StatementAdapter.java:36)
	at com.carrotsearch.randomizedtesting.rules.SystemPropertiesRestoreRule$1.evaluate(SystemPropertiesRestoreRule.java:57)
	at org.apache.lucene.util.AbstractBeforeAfterRule$1.evaluate(AbstractBeforeAfterRule.java:46)
	at com.carrotsearch.randomizedtesting.rules.StatementAdapter.evaluate(StatementAdapter.java:36)
	at org.apache.lucene.util.TestRuleStoreClassName$1.evaluate(TestRuleStoreClassName.java:42)
	at com.carrotsearch.randomizedtesting.rules.NoShadowingOrOverridesOnMethodsRule$1.evaluate(NoShadowingOrOverridesOnMethodsRule.java:39)
	at com.carrotsearch.randomizedtesting.rules.NoShadowingOrOverridesOnMethodsRule$1.evaluate(NoShadowingOrOverridesOnMethodsRule.java:39)
	at com.carrotsearch.randomizedtesting.rules.StatementAdapter.evaluate(StatementAdapter.java:36)
	at com.carrotsearch.randomizedtesting.rules.StatementAdapter.evaluate(StatementAdapter.java:36)
	at com.carrotsearch.randomizedtesting.rules.StatementAdapter.evaluate(StatementAdapter.java:36)
	at org.apache.lucene.util.TestRuleAssertionsRequired$1.evaluate(TestRuleAssertionsRequired.java:54)
	at org.apache.lucene.util.TestRuleMarkFailure$1.evaluate(TestRuleMarkFailure.java:48)
	at org.apache.lucene.util.TestRuleIgnoreAfterMaxFailures$1.evaluate(TestRuleIgnoreAfterMaxFailures.java:65)
	at org.apache.lucene.util.TestRuleIgnoreTestSuites$1.evaluate(TestRuleIgnoreTestSuites.java:55)
	at com.carrotsearch.randomizedtesting.rules.StatementAdapter.evaluate(StatementAdapter.java:36)
	at com.carrotsearch.randomizedtesting.ThreadLeakControl$StatementRunner.run(ThreadLeakControl.java:365)
	at java.lang.Thread.run(Thread.java:746)




Build Log:
[...truncated 9710 lines...]
   [junit4] Suite: org.apache.solr.cloud.DistribJoinFromCollectionTest
   [junit4]   2> Creating dataDir: /home/jenkins/workspace/Lucene-Solr-trunk-Linux/solr/build/solr-core/test/J0/temp/solr.cloud.DistribJoinFromCollectionTest_E34398B09FA3A45D-001/init-core-data-001
   [junit4]   2> 490318 INFO  (SUITE-DistribJoinFromCollectionTest-seed#[E34398B09FA3A45D]-worker) [    ] o.a.s.SolrTestCaseJ4 Randomized ssl (false) and clientAuth (false)
   [junit4]   2> 490318 INFO  (SUITE-DistribJoinFromCollectionTest-seed#[E34398B09FA3A45D]-worker) [    ] o.a.s.BaseDistributedSearchTestCase Setting hostContext system property: /
   [junit4]   2> 490319 INFO  (TEST-DistribJoinFromCollectionTest.test-seed#[E34398B09FA3A45D]) [    ] o.a.s.c.ZkTestServer STARTING ZK TEST SERVER
   [junit4]   2> 490319 INFO  (Thread-2086) [    ] o.a.s.c.ZkTestServer client port:0.0.0.0/0.0.0.0:0
   [junit4]   2> 490319 INFO  (Thread-2086) [    ] o.a.s.c.ZkTestServer Starting server
   [junit4]   2> 490419 INFO  (TEST-DistribJoinFromCollectionTest.test-seed#[E34398B09FA3A45D]) [    ] o.a.s.c.ZkTestServer start zk server on port:42505
   [junit4]   2> 490419 INFO  (TEST-DistribJoinFromCollectionTest.test-seed#[E34398B09FA3A45D]) [    ] o.a.s.c.c.SolrZkClient Using default ZkCredentialsProvider
   [junit4]   2> 490420 INFO  (TEST-DistribJoinFromCollectionTest.test-seed#[E34398B09FA3A45D]) [    ] o.a.s.c.c.ConnectionManager Waiting for client to connect to ZooKeeper
   [junit4]   2> 490422 INFO  (zkCallback-870-thread-1) [    ] o.a.s.c.c.ConnectionManager Watcher org.apache.solr.common.cloud.ConnectionManager@11a3485d name:ZooKeeperConnection Watcher:127.0.0.1:42505 got event WatchedEvent state:SyncConnected type:None path:null path:null type:None
   [junit4]   2> 490422 INFO  (TEST-DistribJoinFromCollectionTest.test-seed#[E34398B09FA3A45D]) [    ] o.a.s.c.c.ConnectionManager Client is connected to ZooKeeper
   [junit4]   2> 490422 INFO  (TEST-DistribJoinFromCollectionTest.test-seed#[E34398B09FA3A45D]) [    ] o.a.s.c.c.SolrZkClient Using default ZkACLProvider
   [junit4]   2> 490422 INFO  (TEST-DistribJoinFromCollectionTest.test-seed#[E34398B09FA3A45D]) [    ] o.a.s.c.c.SolrZkClient makePath: /solr
   [junit4]   2> 490423 INFO  (TEST-DistribJoinFromCollectionTest.test-seed#[E34398B09FA3A45D]) [    ] o.a.s.c.c.SolrZkClient Using default ZkCredentialsProvider
   [junit4]   2> 490424 INFO  (TEST-DistribJoinFromCollectionTest.test-seed#[E34398B09FA3A45D]) [    ] o.a.s.c.c.ConnectionManager Waiting for client to connect to ZooKeeper
   [junit4]   2> 490425 INFO  (zkCallback-871-thread-1) [    ] o.a.s.c.c.ConnectionManager Watcher org.apache.solr.common.cloud.ConnectionManager@d5f8b0 name:ZooKeeperConnection Watcher:127.0.0.1:42505/solr got event WatchedEvent state:SyncConnected type:None path:null path:null type:None
   [junit4]   2> 490425 INFO  (TEST-DistribJoinFromCollectionTest.test-seed#[E34398B09FA3A45D]) [    ] o.a.s.c.c.ConnectionManager Client is connected to ZooKeeper
   [junit4]   2> 490425 INFO  (TEST-DistribJoinFromCollectionTest.test-seed#[E34398B09FA3A45D]) [    ] o.a.s.c.c.SolrZkClient Using default ZkACLProvider
   [junit4]   2> 490425 INFO  (TEST-DistribJoinFromCollectionTest.test-seed#[E34398B09FA3A45D]) [    ] o.a.s.c.c.SolrZkClient makePath: /collections/collection1
   [junit4]   2> 490426 INFO  (TEST-DistribJoinFromCollectionTest.test-seed#[E34398B09FA3A45D]) [    ] o.a.s.c.c.SolrZkClient makePath: /collections/collection1/shards
   [junit4]   2> 490426 INFO  (TEST-DistribJoinFromCollectionTest.test-seed#[E34398B09FA3A45D]) [    ] o.a.s.c.c.SolrZkClient makePath: /collections/control_collection
   [junit4]   2> 490426 INFO  (TEST-DistribJoinFromCollectionTest.test-seed#[E34398B09FA3A45D]) [    ] o.a.s.c.c.SolrZkClient makePath: /collections/control_collection/shards
   [junit4]   2> 490427 INFO  (TEST-DistribJoinFromCollectionTest.test-seed#[E34398B09FA3A45D]) [    ] o.a.s.c.AbstractZkTestCase put /home/jenkins/workspace/Lucene-Solr-trunk-Linux/solr/core/src/test-files/solr/collection1/conf/solrconfig-tlog.xml to /configs/conf1/solrconfig.xml
   [junit4]   2> 490427 INFO  (TEST-DistribJoinFromCollectionTest.test-seed#[E34398B09FA3A45D]) [    ] o.a.s.c.c.SolrZkClient makePath: /configs/conf1/solrconfig.xml
   [junit4]   2> 490428 INFO  (TEST-DistribJoinFromCollectionTest.test-seed#[E34398B09FA3A45D]) [    ] o.a.s.c.AbstractZkTestCase put /home/jenkins/workspace/Lucene-Solr-trunk-Linux/solr/core/src/test-files/solr/collection1/conf/schema.xml to /configs/conf1/schema.xml
   [junit4]   2> 490428 INFO  (TEST-DistribJoinFromCollectionTest.test-seed#[E34398B09FA3A45D]) [    ] o.a.s.c.c.SolrZkClient makePath: /configs/conf1/schema.xml
   [junit4]   2> 490429 INFO  (TEST-DistribJoinFromCollectionTest.test-seed#[E34398B09FA3A45D]) [    ] o.a.s.c.AbstractZkTestCase put /home/jenkins/workspace/Lucene-Solr-trunk-Linux/solr/core/src/test-files/solr/collection1/conf/solrconfig.snippet.randomindexconfig.xml to /configs/conf1/solrconfig.snippet.randomindexconfig.xml
   [junit4]   2> 490429 INFO  (TEST-DistribJoinFromCollectionTest.test-seed#[E34398B09FA3A45D]) [    ] o.a.s.c.c.SolrZkClient makePath: /configs/conf1/solrconfig.snippet.randomindexconfig.xml
   [junit4]   2> 490430 INFO  (TEST-DistribJoinFromCollectionTest.test-seed#[E34398B09FA3A45D]) [    ] o.a.s.c.AbstractZkTestCase put /home/jenkins/workspace/Lucene-Solr-trunk-Linux/solr/core/src/test-files/solr/collection1/conf/stopwords.txt to /configs/conf1/stopwords.txt
   [junit4]   2> 490430 INFO  (TEST-DistribJoinFromCollectionTest.test-seed#[E34398B09FA3A45D]) [    ] o.a.s.c.c.SolrZkClient makePath: /configs/conf1/stopwords.txt
   [junit4]   2> 490431 INFO  (TEST-DistribJoinFromCollectionTest.test-seed#[E34398B09FA3A45D]) [    ] o.a.s.c.AbstractZkTestCase put /home/jenkins/workspace/Lucene-Solr-trunk-Linux/solr/core/src/test-files/solr/collection1/conf/protwords.txt to /configs/conf1/protwords.txt
   [junit4]   2> 490431 INFO  (TEST-DistribJoinFromCollectionTest.test-seed#[E34398B09FA3A45D]) [    ] o.a.s.c.c.SolrZkClient makePath: /configs/conf1/protwords.txt
   [junit4]   2> 490431 INFO  (TEST-DistribJoinFromCollectionTest.test-seed#[E34398B09FA3A45D]) [    ] o.a.s.c.AbstractZkTestCase put /home/jenkins/workspace/Lucene-Solr-trunk-Linux/solr/core/src/test-files/solr/collection1/conf/currency.xml to /configs/conf1/currency.xml
   [junit4]   2> 490431 INFO  (TEST-DistribJoinFromCollectionTest.test-seed#[E34398B09FA3A45D]) [    ] o.a.s.c.c.SolrZkClient makePath: /configs/conf1/currency.xml
   [junit4]   2> 490432 INFO  (TEST-DistribJoinFromCollectionTest.test-seed#[E34398B09FA3A45D]) [    ] o.a.s.c.AbstractZkTestCase put /home/jenkins/workspace/Lucene-Solr-trunk-Linux/solr/core/src/test-files/solr/collection1/conf/enumsConfig.xml to /configs/conf1/enumsConfig.xml
   [junit4]   2> 490432 INFO  (TEST-DistribJoinFromCollectionTest.test-seed#[E34398B09FA3A45D]) [    ] o.a.s.c.c.SolrZkClient makePath: /configs/conf1/enumsConfig.xml
   [junit4]   2> 490433 INFO  (TEST-DistribJoinFromCollectionTest.test-seed#[E34398B09FA3A45D]) [    ] o.a.s.c.AbstractZkTestCase put /home/jenkins/workspace/Lucene-Solr-trunk-Linux/solr/core/src/test-files/solr/collection1/conf/open-exchange-rates.json to /configs/conf1/open-exchange-rates.json
   [junit4]   2> 490433 INFO  (TEST-DistribJoinFromCollectionTest.test-seed#[E34398B09FA3A45D]) [    ] o.a.s.c.c.SolrZkClient makePath: /configs/conf1/open-exchange-rates.json
   [junit4]   2> 490434 INFO  (TEST-DistribJoinFromCollectionTest.test-seed#[E34398B09FA3A45D]) [    ] o.a.s.c.AbstractZkTestCase put /home/jenkins/workspace/Lucene-Solr-trunk-Linux/solr/core/src/test-files/solr/collection1/conf/mapping-ISOLatin1Accent.txt to /configs/conf1/mapping-ISOLatin1Accent.txt
   [junit4]   2> 490434 INFO  (TEST-DistribJoinFromCollectionTest.test-seed#[E34398B09FA3A45D]) [    ] o.a.s.c.c.SolrZkClient makePath: /configs/conf1/mapping-ISOLatin1Accent.txt
   [junit4]   2> 490435 INFO  (TEST-DistribJoinFromCollectionTest.test-seed#[E34398B09FA3A45D]) [    ] o.a.s.c.AbstractZkTestCase put /home/jenkins/workspace/Lucene-Solr-trunk-Linux/solr/core/src/test-files/solr/collection1/conf/old_synonyms.txt to /configs/conf1/old_synonyms.txt
   [junit4]   2> 490435 INFO  (TEST-DistribJoinFromCollectionTest.test-seed#[E34398B09FA3A45D]) [    ] o.a.s.c.c.SolrZkClient makePath: /configs/conf1/old_synonyms.txt
   [junit4]   2> 490435 INFO  (TEST-DistribJoinFromCollectionTest.test-seed#[E34398B09FA3A45D]) [    ] o.a.s.c.AbstractZkTestCase put /home/jenkins/workspace/Lucene-Solr-trunk-Linux/solr/core/src/test-files/solr/collection1/conf/synonyms.txt to /configs/conf1/synonyms.txt
   [junit4]   2> 490435 INFO  (TEST-DistribJoinFromCollectionTest.test-seed#[E34398B09FA3A45D]) [    ] o.a.s.c.c.SolrZkClient makePath: /configs/conf1/synonyms.txt
   [junit4]   2> 490517 INFO  (TEST-DistribJoinFromCollectionTest.test-seed#[E34398B09FA3A45D]) [    ] o.a.s.SolrTestCaseJ4 Writing core.properties file to /home/jenkins/workspace/Lucene-Solr-trunk-Linux/solr/build/solr-core/test/J0/temp/solr.cloud.DistribJoinFromCollectionTest_E34398B09FA3A45D-001/control-001/cores/collection1
   [junit4]   2> 490519 INFO  (TEST-DistribJoinFromCollectionTest.test-seed#[E34398B09FA3A45D]) [    ] o.e.j.s.Server jetty-9.2.13.v20150730
   [junit4]   2> 490520 INFO  (TEST-DistribJoinFromCollectionTest.test-seed#[E34398B09FA3A45D]) [    ] o.e.j.s.h.ContextHandler Started o.e.j.s.ServletContextHandler@1a6ddbbe{/,null,AVAILABLE}
   [junit4]   2> 490523 INFO  (TEST-DistribJoinFromCollectionTest.test-seed#[E34398B09FA3A45D]) [    ] o.e.j.s.ServerConnector Started ServerConnector@6af9d734{HTTP/1.1}{127.0.0.1:47257}
   [junit4]   2> 490523 INFO  (TEST-DistribJoinFromCollectionTest.test-seed#[E34398B09FA3A45D]) [    ] o.e.j.s.Server Started @491957ms
   [junit4]   2> 490524 INFO  (TEST-DistribJoinFromCollectionTest.test-seed#[E34398B09FA3A45D]) [    ] o.a.s.c.s.e.JettySolrRunner Jetty properties: {solr.data.dir=/home/jenkins/workspace/Lucene-Solr-trunk-Linux/solr/build/solr-core/test/J0/temp/solr.cloud.DistribJoinFromCollectionTest_E34398B09FA3A45D-001/tempDir-001/control/data, hostContext=/, hostPort=47257, coreRootDirectory=/home/jenkins/workspace/Lucene-Solr-trunk-Linux/solr/build/solr-core/test/J0/../../../../../../../../../home/jenkins/workspace/Lucene-Solr-trunk-Linux/solr/build/solr-core/test/J0/temp/solr.cloud.DistribJoinFromCollectionTest_E34398B09FA3A45D-001/control-001/cores}
   [junit4]   2> 490524 INFO  (TEST-DistribJoinFromCollectionTest.test-seed#[E34398B09FA3A45D]) [    ] o.a.s.s.SolrDispatchFilter SolrDispatchFilter.init(): sun.misc.Launcher$AppClassLoader@f2a0b8e
   [junit4]   2> 490524 INFO  (TEST-DistribJoinFromCollectionTest.test-seed#[E34398B09FA3A45D]) [    ] o.a.s.c.SolrResourceLoader new SolrResourceLoader for directory: '/home/jenkins/workspace/Lucene-Solr-trunk-Linux/solr/build/solr-core/test/J0/../../../../../../../../../home/jenkins/workspace/Lucene-Solr-trunk-Linux/solr/build/solr-core/test/J0/temp/solr.cloud.DistribJoinFromCollectionTest_E34398B09FA3A45D-001/control-001/'
   [junit4]   2> 490537 INFO  (TEST-DistribJoinFromCollectionTest.test-seed#[E34398B09FA3A45D]) [    ] o.a.s.c.c.SolrZkClient Using default ZkCredentialsProvider
   [junit4]   2> 490538 INFO  (TEST-DistribJoinFromCollectionTest.test-seed#[E34398B09FA3A45D]) [    ] o.a.s.c.c.ConnectionManager Waiting for client to connect to ZooKeeper
   [junit4]   2> 490538 INFO  (zkCallback-872-thread-1) [    ] o.a.s.c.c.ConnectionManager Watcher org.apache.solr.common.cloud.ConnectionManager@392a4e66 name:ZooKeeperConnection Watcher:127.0.0.1:42505/solr got event WatchedEvent state:SyncConnected type:None path:null path:null type:None
   [junit4]   2> 490539 INFO  (TEST-DistribJoinFromCollectionTest.test-seed#[E34398B09FA3A45D]) [    ] o.a.s.c.c.ConnectionManager Client is connected to ZooKeeper
   [junit4]   2> 490539 INFO  (TEST-DistribJoinFromCollectionTest.test-seed#[E34398B09FA3A45D]) [    ] o.a.s.c.c.SolrZkClient Using default ZkACLProvider
   [junit4]   2> 490539 INFO  (TEST-DistribJoinFromCollectionTest.test-seed#[E34398B09FA3A45D]) [    ] o.a.s.s.SolrDispatchFilter Loading solr.xml from SolrHome (not found in ZooKeeper)
   [junit4]   2> 490540 INFO  (TEST-DistribJoinFromCollectionTest.test-seed#[E34398B09FA3A45D]) [    ] o.a.s.c.SolrXmlConfig Loading container configuration from /home/jenkins/workspace/Lucene-Solr-trunk-Linux/solr/build/solr-core/test/J0/../../../../../../../../../home/jenkins/workspace/Lucene-Solr-trunk-Linux/solr/build/solr-core/test/J0/temp/solr.cloud.DistribJoinFromCollectionTest_E34398B09FA3A45D-001/control-001/solr.xml
   [junit4]   2> 490544 INFO  (TEST-DistribJoinFromCollectionTest.test-seed#[E34398B09FA3A45D]) [    ] o.a.s.c.CoresLocator Config-defined core root directory: /home/jenkins/workspace/Lucene-Solr-trunk-Linux/solr/build/solr-core/test/J0/../../../../../../../../../home/jenkins/workspace/Lucene-Solr-trunk-Linux/solr/build/solr-core/test/J0/temp/solr.cloud.DistribJoinFromCollectionTest_E34398B09FA3A45D-001/control-001/cores
   [junit4]   2> 490544 INFO  (TEST-DistribJoinFromCollectionTest.test-seed#[E34398B09FA3A45D]) [    ] o.a.s.c.CoreContainer New CoreContainer 1843006542
   [junit4]   2> 490545 INFO  (TEST-DistribJoinFromCollectionTest.test-seed#[E34398B09FA3A45D]) [    ] o.a.s.c.CoreContainer Loading cores into CoreContainer [instanceDir=/home/jenkins/workspace/Lucene-Solr-trunk-Linux/solr/build/solr-core/test/J0/../../../../../../../../../home/jenkins/workspace/Lucene-Solr-trunk-Linux/solr/build/solr-core/test/J0/temp/solr.cloud.DistribJoinFromCollectionTest_E34398B09FA3A45D-001/control-001/]
   [junit4]   2> 490545 INFO  (TEST-DistribJoinFromCollectionTest.test-seed#[E34398B09FA3A45D]) [    ] o.a.s.c.CoreContainer loading shared library: /home/jenkins/workspace/Lucene-Solr-trunk-Linux/solr/build/solr-core/test/J0/../../../../../../../../../home/jenkins/workspace/Lucene-Solr-trunk-Linux/solr/build/solr-core/test/J0/temp/solr.cloud.DistribJoinFromCollectionTest_E34398B09FA3A45D-001/control-001/lib
   [junit4]   2> 490545 WARN  (TEST-DistribJoinFromCollectionTest.test-seed#[E34398B09FA3A45D]) [    ] o.a.s.c.SolrResourceLoader Can't find (or read) directory to add to classloader: lib (resolved as: /home/jenkins/workspace/Lucene-Solr-trunk-Linux/solr/build/solr-core/test/J0/../../../../../../../../../home/jenkins/workspace/Lucene-Solr-trunk-Linux/solr/build/solr-core/test/J0/temp/solr.cloud.DistribJoinFromCollectionTest_E34398B09FA3A45D-001/control-001/lib).
   [junit4]   2> 490551 INFO  (TEST-DistribJoinFromCollectionTest.test-seed#[E34398B09FA3A45D]) [    ] o.a.s.h.c.HttpShardHandlerFactory created with socketTimeout : 90000,urlScheme : ,connTimeout : 15000,maxConnectionsPerHost : 20,maxConnections : 10000,corePoolSize : 0,maximumPoolSize : 2147483647,maxThreadIdleTime : 5,sizeOfQueue : -1,fairnessPolicy : false,useRetries : false,
   [junit4]   2> 490552 INFO  (TEST-DistribJoinFromCollectionTest.test-seed#[E34398B09FA3A45D]) [    ] o.a.s.u.UpdateShardHandler Creating UpdateShardHandler HTTP client with params: socketTimeout=340000&connTimeout=45000&retry=true
   [junit4]   2> 490553 INFO  (TEST-DistribJoinFromCollectionTest.test-seed#[E34398B09FA3A45D]) [    ] o.a.s.l.LogWatcher SLF4J impl is org.slf4j.impl.Log4jLoggerFactory
   [junit4]   2> 490553 INFO  (TEST-DistribJoinFromCollectionTest.test-seed#[E34398B09FA3A45D]) [    ] o.a.s.l.LogWatcher Registering Log Listener [Log4j (org.slf4j.impl.Log4jLoggerFactory)]
   [junit4]   2> 490553 INFO  (TEST-DistribJoinFromCollectionTest.test-seed#[E34398B09FA3A45D]) [    ] o.a.s.c.ZkContainer Zookeeper client=127.0.0.1:42505/solr
   [junit4]   2> 490554 INFO  (TEST-DistribJoinFromCollectionTest.test-seed#[E34398B09FA3A45D]) [    ] o.a.s.c.ZkController zkHost includes chroot
   [junit4]   2> 490554 INFO  (TEST-DistribJoinFromCollectionTest.test-seed#[E34398B09FA3A45D]) [    ] o.a.s.c.c.SolrZkClient Using default ZkCredentialsProvider
   [junit4]   2> 490554 INFO  (TEST-DistribJoinFromCollectionTest.test-seed#[E34398B09FA3A45D]) [    ] o.a.s.c.c.ConnectionManager Waiting for client to connect to ZooKeeper
   [junit4]   2> 490555 INFO  (zkCallback-874-thread-1) [    ] o.a.s.c.c.ConnectionManager Watcher org.apache.solr.common.cloud.ConnectionManager@4c852119 name:ZooKeeperConnection Watcher:127.0.0.1:42505 got event WatchedEvent state:SyncConnected type:None path:null path:null type:None
   [junit4]   2> 490555 INFO  (TEST-DistribJoinFromCollectionTest.test-seed#[E34398B09FA3A45D]) [    ] o.a.s.c.c.ConnectionManager Client is connected to ZooKeeper
   [junit4]   2> 490556 INFO  (TEST-DistribJoinFromCollectionTest.test-seed#[E34398B09FA3A45D]) [    ] o.a.s.c.c.SolrZkClient Using default ZkACLProvider
   [junit4]   2> 490557 INFO  (TEST-DistribJoinFromCollectionTest.test-seed#[E34398B09FA3A45D]) [n:127.0.0.1:47257_    ] o.a.s.c.c.ConnectionManager Waiting for client to connect to ZooKeeper
   [junit4]   2> 490557 INFO  (zkCallback-875-thread-1-processing-n:127.0.0.1:47257_) [n:127.0.0.1:47257_    ] o.a.s.c.c.ConnectionManager Watcher org.apache.solr.common.cloud.ConnectionManager@6b6d1929 name:ZooKeeperConnection Watcher:127.0.0.1:42505/solr got event WatchedEvent state:SyncConnected type:None path:null path:null type:None
   [junit4]   2> 490557 INFO  (TEST-DistribJoinFromCollectionTest.test-seed#[E34398B09FA3A45D]) [n:127.0.0.1:47257_    ] o.a.s.c.c.ConnectionManager Client is connected to ZooKeeper
   [junit4]   2> 490558 INFO  (TEST-DistribJoinFromCollectionTest.test-seed#[E34398B09FA3A45D]) [n:127.0.0.1:47257_    ] o.a.s.c.c.SolrZkClient makePath: /overseer/queue
   [junit4]   2> 490559 INFO  (TEST-DistribJoinFromCollectionTest.test-seed#[E34398B09FA3A45D]) [n:127.0.0.1:47257_    ] o.a.s.c.c.SolrZkClient makePath: /overseer/collection-queue-work
   [junit4]   2> 490559 INFO  (TEST-DistribJoinFromCollectionTest.test-seed#[E34398B09FA3A45D]) [n:127.0.0.1:47257_    ] o.a.s.c.c.SolrZkClient makePath: /overseer/collection-map-running
   [junit4]   2> 490560 INFO  (TEST-DistribJoinFromCollectionTest.test-seed#[E34398B09FA3A45D]) [n:127.0.0.1:47257_    ] o.a.s.c.c.SolrZkClient makePath: /overseer/collection-map-completed
   [junit4]   2> 490561 INFO  (TEST-DistribJoinFromCollectionTest.test-seed#[E34398B09FA3A45D]) [n:127.0.0.1:47257_    ] o.a.s.c.c.SolrZkClient makePath: /overseer/collection-map-failure
   [junit4]   2> 490562 INFO  (TEST-DistribJoinFromCollectionTest.test-seed#[E34398B09FA3A45D]) [n:127.0.0.1:47257_    ] o.a.s.c.c.SolrZkClient makePath: /live_nodes
   [junit4]   2> 490562 INFO  (TEST-DistribJoinFromCollectionTest.test-seed#[E34398B09FA3A45D]) [n:127.0.0.1:47257_    ] o.a.s.c.c.SolrZkClient makePath: /aliases.json
   [junit4]   2> 490563 INFO  (TEST-DistribJoinFromCollectionTest.test-seed#[E34398B09FA3A45D]) [n:127.0.0.1:47257_    ] o.a.s.c.c.SolrZkClient makePath: /clusterstate.json
   [junit4]   2> 490563 INFO  (TEST-DistribJoinFromCollectionTest.test-seed#[E34398B09FA3A45D]) [n:127.0.0.1:47257_    ] o.a.s.c.c.SolrZkClient makePath: /security.json
   [junit4]   2> 490563 INFO  (TEST-DistribJoinFromCollectionTest.test-seed#[E34398B09FA3A45D]) [n:127.0.0.1:47257_    ] o.a.s.c.ZkController Register node as live in ZooKeeper:/live_nodes/127.0.0.1:47257_
   [junit4]   2> 490563 INFO  (TEST-DistribJoinFromCollectionTest.test-seed#[E34398B09FA3A45D]) [n:127.0.0.1:47257_    ] o.a.s.c.c.SolrZkClient makePath: /live_nodes/127.0.0.1:47257_
   [junit4]   2> 490564 INFO  (TEST-DistribJoinFromCollectionTest.test-seed#[E34398B09FA3A45D]) [n:127.0.0.1:47257_    ] o.a.s.c.c.SolrZkClient makePath: /overseer_elect
   [junit4]   2> 490564 INFO  (TEST-DistribJoinFromCollectionTest.test-seed#[E34398B09FA3A45D]) [n:127.0.0.1:47257_    ] o.a.s.c.c.SolrZkClient makePath: /overseer_elect/election
   [junit4]   2> 490565 INFO  (TEST-DistribJoinFromCollectionTest.test-seed#[E34398B09FA3A45D]) [n:127.0.0.1:47257_    ] o.a.s.c.Overseer Overseer (id=null) closing
   [junit4]   2> 490565 INFO  (TEST-DistribJoinFromCollectionTest.test-seed#[E34398B09FA3A45D]) [n:127.0.0.1:47257_    ] o.a.s.c.LeaderElector Joined leadership election with path: /overseer_elect/election/94491897138380804-127.0.0.1:47257_-n_0000000000
   [junit4]   2> 490565 INFO  (TEST-DistribJoinFromCollectionTest.test-seed#[E34398B09FA3A45D]) [n:127.0.0.1:47257_    ] o.a.s.c.OverseerElectionContext I am going to be the leader 127.0.0.1:47257_
   [junit4]   2> 490566 INFO  (TEST-DistribJoinFromCollectionTest.test-seed#[E34398B09FA3A45D]) [n:127.0.0.1:47257_    ] o.a.s.c.c.SolrZkClient makePath: /overseer_elect/leader
   [junit4]   2> 490566 INFO  (TEST-DistribJoinFromCollectionTest.test-seed#[E34398B09FA3A45D]) [n:127.0.0.1:47257_    ] o.a.s.c.Overseer Overseer (id=94491897138380804-127.0.0.1:47257_-n_0000000000) starting
   [junit4]   2> 490567 INFO  (TEST-DistribJoinFromCollectionTest.test-seed#[E34398B09FA3A45D]) [n:127.0.0.1:47257_    ] o.a.s.c.c.SolrZkClient makePath: /overseer/queue-work
   [junit4]   2> 490569 INFO  (TEST-DistribJoinFromCollectionTest.test-seed#[E34398B09FA3A45D]) [n:127.0.0.1:47257_    ] o.a.s.c.OverseerAutoReplicaFailoverThread Starting OverseerAutoReplicaFailoverThread autoReplicaFailoverWorkLoopDelay=10000 autoReplicaFailoverWaitAfterExpiration=30000 autoReplicaFailoverBadNodeExpiration=60000
   [junit4]   2> 490569 INFO  (TEST-DistribJoinFromCollectionTest.test-seed#[E34398B09FA3A45D]) [n:127.0.0.1:47257_    ] o.a.s.c.c.ZkStateReader Updating cluster state from ZooKeeper... 
   [junit4]   2> 490569 INFO  (OverseerCollectionConfigSetProcessor-94491897138380804-127.0.0.1:47257_-n_0000000000) [n:127.0.0.1:47257_    ] o.a.s.c.OverseerTaskProcessor Process current queue of overseer operations
   [junit4]   2> 490569 INFO  (OverseerStateUpdate-94491897138380804-127.0.0.1:47257_-n_0000000000) [n:127.0.0.1:47257_    ] o.a.s.c.Overseer Starting to work on the main queue
   [junit4]   2> 490576 INFO  (TEST-DistribJoinFromCollectionTest.test-seed#[E34398B09FA3A45D]) [n:127.0.0.1:47257_    ] o.a.s.c.CoreContainer Security conf doesn't exist. Skipping setup for authorization module.
   [junit4]   2> 490576 INFO  (TEST-DistribJoinFromCollectionTest.test-seed#[E34398B09FA3A45D]) [n:127.0.0.1:47257_    ] o.a.s.c.CoreContainer No authentication plugin used.
   [junit4]   2> 490576 INFO  (TEST-DistribJoinFromCollectionTest.test-seed#[E34398B09FA3A45D]) [n:127.0.0.1:47257_    ] o.a.s.c.CoresLocator Looking for core definitions underneath /home/jenkins/workspace/Lucene-Solr-trunk-Linux/solr/build/solr-core/test/J0/../../../../../../../../../home/jenkins/workspace/Lucene-Solr-trunk-Linux/solr/build/solr-core/test/J0/temp/solr.cloud.DistribJoinFromCollectionTest_E34398B09FA3A45D-001/control-001/cores
   [junit4]   2> 490578 INFO  (TEST-DistribJoinFromCollectionTest.test-seed#[E34398B09FA3A45D]) [n:127.0.0.1:47257_    ] o.a.s.c.SolrCore Created CoreDescriptor: {name=collection1, config=solrconfig.xml, transient=false, schema=schema.xml, loadOnStartup=true, configSetProperties=configsetprops.json, instanceDir=/home/jenkins/workspace/Lucene-Solr-trunk-Linux/solr/build/solr-core/test/J0/../../../../../../../../../home/jenkins/workspace/Lucene-Solr-trunk-Linux/solr/build/solr-core/test/J0/temp/solr.cloud.DistribJoinFromCollectionTest_E34398B09FA3A45D-001/control-001/cores/collection1, collection=control_collection, absoluteInstDir=/home/jenkins/workspace/Lucene-Solr-trunk-Linux/solr/build/solr-core/test/J0/../../../../../../../../../home/jenkins/workspace/Lucene-Solr-trunk-Linux/solr/build/solr-core/test/J0/temp/solr.cloud.DistribJoinFromCollectionTest_E34398B09FA3A45D-001/control-001/cores/collection1/, coreNodeName=, dataDir=data/, shard=}
   [junit4]   2> 490578 INFO  (TEST-DistribJoinFromCollectionTest.test-seed#[E34398B09FA3A45D]) [n:127.0.0.1:47257_    ] o.a.s.c.CoresLocator Found core collection1 in /home/jenkins/workspace/Lucene-Solr-trunk-Linux/solr/build/solr-core/test/J0/../../../../../../../../../home/jenkins/workspace/Lucene-Solr-trunk-Linux/solr/build/solr-core/test/J0/temp/solr.cloud.DistribJoinFromCollectionTest_E34398B09FA3A45D-001/control-001/cores/collection1/
   [junit4]   2> 490578 INFO  (TEST-DistribJoinFromCollectionTest.test-seed#[E34398B09FA3A45D]) [n:127.0.0.1:47257_    ] o.a.s.c.CoresLocator Found 1 core definitions
   [junit4]   2> 490579 INFO  (TEST-DistribJoinFromCollectionTest.test-seed#[E34398B09FA3A45D]) [n:127.0.0.1:47257_    ] o.a.s.s.SolrDispatchFilter user.dir=/home/jenkins/workspace/Lucene-Solr-trunk-Linux/solr/build/solr-core/test/J0
   [junit4]   2> 490579 INFO  (TEST-DistribJoinFromCollectionTest.test-seed#[E34398B09FA3A45D]) [n:127.0.0.1:47257_    ] o.a.s.s.SolrDispatchFilter SolrDispatchFilter.init() done
   [junit4]   2> 490579 INFO  (coreLoadExecutor-2422-thread-1-processing-n:127.0.0.1:47257_) [n:127.0.0.1:47257_ c:control_collection   x:collection1] o.a.s.c.ZkController publishing state=down
   [junit4]   2> 490579 INFO  (coreLoadExecutor-2422-thread-1-processing-n:127.0.0.1:47257_) [n:127.0.0.1:47257_ c:control_collection   x:collection1] o.a.s.c.ZkController numShards not found on descriptor - reading it from system property
   [junit4]   2> 490580 INFO  (OverseerStateUpdate-94491897138380804-127.0.0.1:47257_-n_0000000000) [n:127.0.0.1:47257_    ] o.a.s.c.Overseer processMessage: queueSize: 1, message = {
   [junit4]   2>   "core":"collection1",
   [junit4]   2>   "roles":null,
   [junit4]   2>   "base_url":"http://127.0.0.1:47257",
   [junit4]   2>   "node_name":"127.0.0.1:47257_",
   [junit4]   2>   "numShards":"1",
   [junit4]   2>   "state":"down",
   [junit4]   2>   "shard":null,
   [junit4]   2>   "collection":"control_collection",
   [junit4]   2>   "operation":"state"} current state version: 0
   [junit4]   2> 490580 INFO  (coreLoadExecutor-2422-thread-1-processing-n:127.0.0.1:47257_) [n:127.0.0.1:47257_ c:control_collection   x:collection1] o.a.s.c.ZkController look for our core node name
   [junit4]   2> 490580 INFO  (OverseerStateUpdate-94491897138380804-127.0.0.1:47257_-n_0000000000) [n:127.0.0.1:47257_    ] o.a.s.c.o.ReplicaMutator Update state numShards=1 message={
   [junit4]   2>   "core":"collection1",
   [junit4]   2>   "roles":null,
   [junit4]   2>   "base_url":"http://127.0.0.1:47257",
   [junit4]   2>   "node_name":"127.0.0.1:47257_",
   [junit4]   2>   "numShards":"1",
   [junit4]   2>   "state":"down",
   [junit4]   2>   "shard":null,
   [junit4]   2>   "collection":"control_collection",
   [junit4]   2>   "operation":"state"}
   [junit4]   2> 490580 INFO  (OverseerStateUpdate-94491897138380804-127.0.0.1:47257_-n_0000000000) [n:127.0.0.1:47257_    ] o.a.s.c.o.ClusterStateMutator building a new cName: control_collection
   [junit4]   2> 490581 INFO  (OverseerStateUpdate-94491897138380804-127.0.0.1:47257_-n_0000000000) [n:127.0.0.1:47257_    ] o.a.s.c.o.ReplicaMutator Assigning new node to shard shard=shard1
   [junit4]   2> 490582 INFO  (zkCallback-875-thread-1-processing-n:127.0.0.1:47257_) [n:127.0.0.1:47257_    ] o.a.s.c.c.ZkStateReader A cluster state change: WatchedEvent state:SyncConnected type:NodeDataChanged path:/clusterstate.json, has occurred - updating... (live nodes size: 1)
   [junit4]   2> 491580 INFO  (coreLoadExecutor-2422-thread-1-processing-n:127.0.0.1:47257_) [n:127.0.0.1:47257_ c:control_collection   x:collection1] o.a.s.c.ZkController waiting to find shard id in clusterstate for collection1
   [junit4]   2> 491580 INFO  (coreLoadExecutor-2422-thread-1-processing-n:127.0.0.1:47257_) [n:127.0.0.1:47257_ c:control_collection   x:collection1] o.a.s.c.ZkController Check for collection zkNode:control_collection
   [junit4]   2> 491581 INFO  (coreLoadExecutor-2422-thread-1-processing-n:127.0.0.1:47257_) [n:127.0.0.1:47257_ c:control_collection   x:collection1] o.a.s.c.ZkController Collection zkNode exists
   [junit4]   2> 491581 INFO  (coreLoadExecutor-2422-thread-1-processing-n:127.0.0.1:47257_) [n:127.0.0.1:47257_ c:control_collection   x:collection1] o.a.s.c.c.ZkStateReader Load collection config from:/collections/control_collection
   [junit4]   2> 491581 INFO  (coreLoadExecutor-2422-thread-1-processing-n:127.0.0.1:47257_) [n:127.0.0.1:47257_ c:control_collection   x:collection1] o.a.s.c.c.ZkStateReader path=/collections/control_collection configName=conf1 specified config exists in ZooKeeper
   [junit4]   2> 491581 INFO  (coreLoadExecutor-2422-thread-1-processing-n:127.0.0.1:47257_) [n:127.0.0.1:47257_ c:control_collection   x:collection1] o.a.s.c.SolrResourceLoader new SolrResourceLoader for directory: '/home/jenkins/workspace/Lucene-Solr-trunk-Linux/solr/build/solr-core/test/J0/../../../../../../../../../home/jenkins/workspace/Lucene-Solr-trunk-Linux/solr/build/solr-core/test/J0/temp/solr.cloud.DistribJoinFromCollectionTest_E34398B09FA3A45D-001/control-001/cores/collection1/'
   [junit4]   2> 491588 INFO  (coreLoadExecutor-2422-thread-1-processing-n:127.0.0.1:47257_) [n:127.0.0.1:47257_ c:control_collection   x:collection1] o.a.s.c.Config loaded config solrconfig.xml with version 0 
   [junit4]   2> 491591 INFO  (coreLoadExecutor-2422-thread-1-processing-n:127.0.0.1:47257_) [n:127.0.0.1:47257_ c:control_collection   x:collection1] o.a.s.c.SolrConfig current version of requestparams : -1
   [junit4]   2> 491594 INFO  (coreLoadExecutor-2422-thread-1-processing-n:127.0.0.1:47257_) [n:127.0.0.1:47257_ c:control_collection   x:collection1] o.a.s.c.SolrConfig Using Lucene MatchVersion: 6.0.0
   [junit4]   2> 491599 INFO  (coreLoadExecutor-2422-thread-1-processing-n:127.0.0.1:47257_) [n:127.0.0.1:47257_ c:control_collection   x:collection1] o.a.s.c.Config Loaded SolrConfig: solrconfig.xml
   [junit4]   2> 491603 INFO  (coreLoadExecutor-2422-thread-1-processing-n:127.0.0.1:47257_) [n:127.0.0.1:47257_ c:control_collection   x:collection1] o.a.s.s.IndexSchema Reading Solr Schema from /configs/conf1/schema.xml
   [junit4]   2> 491607 INFO  (coreLoadExecutor-2422-thread-1-processing-n:127.0.0.1:47257_) [n:127.0.0.1:47257_ c:control_collection   x:collection1] o.a.s.s.IndexSchema [collection1] Schema name=test
   [junit4]   2> 491667 INFO  (coreLoadExecutor-2422-thread-1-processing-n:127.0.0.1:47257_) [n:127.0.0.1:47257_ c:control_collection   x:collection1] o.a.s.s.OpenExchangeRatesOrgProvider Initialized with rates=open-exchange-rates.json, refreshInterval=1440.
   [junit4]   2> 491670 INFO  (coreLoadExecutor-2422-thread-1-processing-n:127.0.0.1:47257_) [n:127.0.0.1:47257_ c:control_collection   x:collection1] o.a.s.s.IndexSchema default search field in schema is text
   [junit4]   2> 491671 INFO  (coreLoadExecutor-2422-thread-1-processing-n:127.0.0.1:47257_) [n:127.0.0.1:47257_ c:control_collection   x:collection1] o.a.s.s.IndexSchema unique key field: id
   [junit4]   2> 491675 INFO  (coreLoadExecutor-2422-thread-1-processing-n:127.0.0.1:47257_) [n:127.0.0.1:47257_ c:control_collection   x:collection1] o.a.s.s.FileExchangeRateProvider Reloading exchange rates from file currency.xml
   [junit4]   2> 491676 INFO  (coreLoadExecutor-2422-thread-1-processing-n:127.0.0.1:47257_) [n:127.0.0.1:47257_ c:control_collection   x:collection1] o.a.s.s.FileExchangeRateProvider Reloading exchange rates from file currency.xml
   [junit4]   2> 491677 INFO  (coreLoadExecutor-2422-thread-1-processing-n:127.0.0.1:47257_) [n:127.0.0.1:47257_ c:control_collection   x:collection1] o.a.s.s.OpenExchangeRatesOrgProvider Reloading exchange rates from open-exchange-rates.json
   [junit4]   2> 491677 WARN  (coreLoadExecutor-2422-thread-1-processing-n:127.0.0.1:47257_) [n:127.0.0.1:47257_ c:control_collection   x:collection1] o.a.s.s.OpenExchangeRatesOrgProvider Unknown key IMPORTANT NOTE
   [junit4]   2> 491677 WARN  (coreLoadExecutor-2422-thread-1-processing-n:127.0.0.1:47257_) [n:127.0.0.1:47257_ c:control_collection   x:collection1] o.a.s.s.OpenExchangeRatesOrgProvider Expected key, got STRING
   [junit4]   2> 491677 INFO  (coreLoadExecutor-2422-thread-1-processing-n:127.0.0.1:47257_) [n:127.0.0.1:47257_ c:control_collection   x:collection1] o.a.s.s.OpenExchangeRatesOrgProvider Reloading exchange rates from open-exchange-rates.json
   [junit4]   2> 491678 WARN  (coreLoadExecutor-2422-thread-1-processing-n:127.0.0.1:47257_) [n:127.0.0.1:47257_ c:control_collection   x:collection1] o.a.s.s.OpenExchangeRatesOrgProvider Unknown key IMPORTANT NOTE
   [junit4]   2> 491678 WARN  (coreLoadExecutor-2422-thread-1-processing-n:127.0.0.1:47257_) [n:127.0.0.1:47257_ c:control_collection   x:collection1] o.a.s.s.OpenExchangeRatesOrgProvider Expected key, got STRING
   [junit4]   2> 491678 INFO  (coreLoadExecutor-2422-thread-1-processing-n:127.0.0.1:47257_) [n:127.0.0.1:47257_ c:control_collection   x:collection1] o.a.s.c.ConfigSetProperties Did not find ConfigSet properties, assuming default properties: Can't find resource 'configsetprops.json' in classpath or '/configs/conf1', cwd=/home/jenkins/workspace/Lucene-Solr-trunk-Linux/solr/build/solr-core/test/J0
   [junit4]   2> 491678 INFO  (coreLoadExecutor-2422-thread-1-processing-n:127.0.0.1:47257_) [n:127.0.0.1:47257_ c:control_collection   x:collection1] o.a.s.c.CoreContainer Creating SolrCore 'collection1' using configuration from collection control_collection
   [junit4]   2> 491678 INFO  (coreLoadExecutor-2422-thread-1-processing-n:127.0.0.1:47257_) [n:127.0.0.1:47257_ c:control_collection s:shard1 r:core_node1 x:collection1] o.a.s.c.SolrCore org.apache.solr.core.MockDirectoryFactory
   [junit4]   2> 491679 INFO  (coreLoadExecutor-2422-thread-1-processing-n:127.0.0.1:47257_) [n:127.0.0.1:47257_ c:control_collection s:shard1 r:core_node1 x:collection1] o.a.s.c.SolrCore [[collection1] ] Opening new SolrCore at [/home/jenkins/workspace/Lucene-Solr-trunk-Linux/solr/build/solr-core/test/J0/../../../../../../../../../home/jenkins/workspace/Lucene-Solr-trunk-Linux/solr/build/solr-core/test/J0/temp/solr.cloud.DistribJoinFromCollectionTest_E34398B09FA3A45D-001/control-001/cores/collection1/], dataDir=[null]
   [junit4]   2> 491679 INFO  (coreLoadExecutor-2422-thread-1-processing-n:127.0.0.1:47257_) [n:127.0.0.1:47257_ c:control_collection s:shard1 r:core_node1 x:collection1] o.a.s.c.JmxMonitoredMap JMX monitoring is enabled. Adding Solr mbeans to JMX Server: com.sun.jmx.mbeanserver.JmxMBeanServer@34bc6620
   [junit4]   2> 491679 INFO  (coreLoadExecutor-2422-thread-1-processing-n:127.0.0.1:47257_) [n:127.0.0.1:47257_ c:control_collection s:shard1 r:core_node1 x:collection1] o.a.s.c.CachingDirectoryFactory return new directory for /home/jenkins/workspace/Lucene-Solr-trunk-Linux/solr/build/solr-core/test/J0/../../../../../../../../../home/jenkins/workspace/Lucene-Solr-trunk-Linux/solr/build/solr-core/test/J0/temp/solr.cloud.DistribJoinFromCollectionTest_E34398B09FA3A45D-001/control-001/cores/collection1/data
   [junit4]   2> 491679 INFO  (coreLoadExecutor-2422-thread-1-processing-n:127.0.0.1:47257_) [n:127.0.0.1:47257_ c:control_collection s:shard1 r:core_node1 x:collection1] o.a.s.c.SolrCore New index directory detected: old=null new=/home/jenkins/workspace/Lucene-Solr-trunk-Linux/solr/build/solr-core/test/J0/../../../../../../../../../home/jenkins/workspace/Lucene-Solr-trunk-Linux/solr/build/solr-core/test/J0/temp/solr.cloud.DistribJoinFromCollectionTest_E34398B09FA3A45D-001/control-001/cores/collection1/data/index/
   [junit4]   2> 491679 WARN  (coreLoadExecutor-2422-thread-1-processing-n:127.0.0.1:47257_) [n:127.0.0.1:47257_ c:control_collection s:shard1 r:core_node1 x:collection1] o.a.s.c.SolrCore [collection1] Solr index directory '/home/jenkins/workspace/Lucene-Solr-trunk-Linux/solr/build/solr-core/test/J0/../../../../../../../../../home/jenkins/workspace/Lucene-Solr-trunk-Linux/solr/build/solr-core/test/J0/temp/solr.cloud.DistribJoinFromCollectionTest_E34398B09FA3A45D-001/control-001/cores/collection1/data/index' doesn't exist. Creating new index...
   [junit4]   2> 491679 INFO  (coreLoadExecutor-2422-thread-1-processing-n:127.0.0.1:47257_) [n:127.0.0.1:47257_ c:control_collection s:shard1 r:core_node1 x:collection1] o.a.s.c.CachingDirectoryFactory return new directory for /home/jenkins/workspace/Lucene-Solr-trunk-Linux/solr/build/solr-core/test/J0/../../../../../../../../../home/jenkins/workspace/Lucene-Solr-trunk-Linux/solr/build/solr-core/test/J0/temp/solr.cloud.DistribJoinFromCollectionTest_E34398B09FA3A45D-001/control-001/cores/collection1/data/index
   [junit4]   2> 491680 INFO  (coreLoadExecutor-2422-thread-1-processing-n:127.0.0.1:47257_) [n:127.0.0.1:47257_ c:control_collection s:shard1 r:core_node1 x:collection1] o.a.s.u.RandomMergePolicy RandomMergePolicy wrapping class org.apache.lucene.index.TieredMergePolicy: [TieredMergePolicy: maxMergeAtOnce=36, maxMergeAtOnceExplicit=20, maxMergedSegmentMB=0.923828125, floorSegmentMB=1.7841796875, forceMergeDeletesPctAllowed=26.511599302957087, segmentsPerTier=27.0, maxCFSSegmentSizeMB=8.796093022207999E12, noCFSRatio=0.6653233154559736
   [junit4]   2> 491680 INFO  (coreLoadExecutor-2422-thread-1-processing-n:127.0.0.1:47257_) [n:127.0.0.1:47257_ c:control_collection s:shard1 r:core_node1 x:collection1] o.a.s.c.SolrCore SolrDeletionPolicy.onCommit: commits: num=1
   [junit4]   2> 	commit{dir=MockDirectoryWrapper(RAMDirectory@59a264c0 lockFactory=org.apache.lucene.store.SingleInstanceLockFactory@a2c766e),segFN=segments_1,generation=1}
   [junit4]   2> 491680 INFO  (coreLoadExecutor-2422-thread-1-processing-n:127.0.0.1:47257_) [n:127.0.0.1:47257_ c:control_collection s:shard1 r:core_node1 x:collection1] o.a.s.c.SolrCore newest commit generation = 1
   [junit4]   2> 491680 INFO  (OldIndexDirectoryCleanupThreadForCore-collection1) [n:127.0.0.1:47257_ c:control_collection s:shard1 r:core_node1 x:collection1] o.a.s.c.SolrCore Looking for old index directories to cleanup for core collection1 in /home/jenkins/workspace/Lucene-Solr-trunk-Linux/solr/build/solr-core/test/J0/../../../../../../../../../home/jenkins/workspace/Lucene-Solr-trunk-Linux/solr/build/solr-core/test/J0/temp/solr.cloud.DistribJoinFromCollectionTest_E34398B09FA3A45D-001/control-001/cores/collection1/data/
   [junit4]   2> 491680 WARN  (OldIndexDirectoryCleanupThreadForCore-collection1) [n:127.0.0.1:47257_ c:control_collection s:shard1 r:core_node1 x:collection1] o.a.s.c.DirectoryFactory /home/jenkins/workspace/Lucene-Solr-trunk-Linux/solr/build/solr-core/test/J0/../../../../../../../../../home/jenkins/workspace/Lucene-Solr-trunk-Linux/solr/build/solr-core/test/J0/temp/solr.cloud.DistribJoinFromCollectionTest_E34398B09FA3A45D-001/control-001/cores/collection1/data/ does not point to a valid data directory; skipping clean-up of old index directories.
   [junit4]   2> 491682 INFO  (coreLoadExecutor-2422-thread-1-processing-n:127.0.0.1:47257_) [n:127.0.0.1:47257_ c:control_collection s:shard1 r:core_node1 x:collection1] o.a.s.u.p.UpdateRequestProcessorChain creating updateRequestProcessorChain "nodistrib"
   [junit4]   2> 491683 INFO  (coreLoadExecutor-2422-thread-1-processing-n:127.0.0.1:47257_) [n:127.0.0.1:47257_ c:control_collection s:shard1 r:core_node1 x:collection1] o.a.s.u.p.UpdateRequestProcessorChain creating updateRequestProcessorChain "dedupe"
   [junit4]   2> 491683 INFO  (coreLoadExecutor-2422-thread-1-processing-n:127.0.0.1:47257_) [n:127.0.0.1:47257_ c:control_collection s:shard1 r:core_node1 x:collection1] o.a.s.u.p.UpdateRequestProcessorChain inserting DistributedUpdateProcessorFactory into updateRequestProcessorChain "dedupe"
   [junit4]   2> 491683 INFO  (coreLoadExecutor-2422-thread-1-processing-n:127.0.0.1:47257_) [n:127.0.0.1:47257_ c:control_collection s:shard1 r:core_node1 x:collection1] o.a.s.u.p.UpdateRequestProcessorChain creating updateRequestProcessorChain "stored_sig"
   [junit4]   2> 491683 INFO  (coreLoadExecutor-2422-thread-1-processing-n:127.0.0.1:47257_) [n:127.0.0.1:47257_ c:control_collection s:shard1 r:core_node1 x:collection1] o.a.s.u.p.UpdateRequestProcessorChain inserting DistributedUpdateProcessorFactory into updateRequestProcessorChain "stored_sig"
   [junit4]   2> 491683 INFO  (coreLoadExecutor-2422-thread-1-processing-n:127.0.0.1:47257_) [n:127.0.0.1:47257_ c:control_collection s:shard1 r:core_node1 x:collection1] o.a.s.u.p.UpdateRequestProcessorChain creating updateRequestProcessorChain "distrib-dup-test-chain-explicit"
   [junit4]   2> 491683 INFO  (coreLoadExecutor-2422-thread-1-processing-n:127.0.0.1:47257_) [n:127.0.0.1:47257_ c:control_collection s:shard1 r:core_node1 x:collection1] o.a.s.u.p.UpdateRequestProcessorChain creating updateRequestProcessorChain "distrib-dup-test-chain-implicit"
   [junit4]   2> 491683 INFO  (coreLoadExecutor-2422-thread-1-processing-n:127.0.0.1:47257_) [n:127.0.0.1:47257_ c:control_collection s:shard1 r:core_node1 x:collection1] o.a.s.u.p.UpdateRequestProcessorChain inserting DistributedUpdateProcessorFactory into updateRequestProcessorChain "distrib-dup-test-chain-implicit"
   [junit4]   2> 491683 INFO  (coreLoadExecutor-2422-thread-1-processing-n:127.0.0.1:47257_) [n:127.0.0.1:47257_ c:control_collection s:shard1 r:core_node1 x:collection1] o.a.s.c.SolrCore no updateRequestProcessorChain defined as default, creating implicit default
   [junit4]   2> 491684 INFO  (coreLoadExecutor-2422-thread-1-processing-n:127.0.0.1:47257_) [n:127.0.0.1:47257_ c:control_collection s:shard1 r:core_node1 x:collection1] o.a.s.h.l.XMLLoader xsltCacheLifetimeSeconds=60
   [junit4]   2> 491685 INFO  (coreLoadExecutor-2422-thread-1-processing-n:127.0.0.1:47257_) [n:127.0.0.1:47257_ c:control_collection s:shard1 r:core_node1 x:collection1] o.a.s.h.l.XMLLoader xsltCacheLifetimeSeconds=60
   [junit4]   2> 491685 INFO  (coreLoadExecutor-2422-thread-1-processing-n:127.0.0.1:47257_) [n:127.0.0.1:47257_ c:control_collection s:shard1 r:core_node1 x:collection1] o.a.s.h.l.XMLLoader xsltCacheLifetimeSeconds=60
   [junit4]   2> 491686 INFO  (coreLoadExecutor-2422-thread-1-processing-n:127.0.0.1:47257_) [n:127.0.0.1:47257_ c:control_collection s:shard1 r:core_node1 x:collection1] o.a.s.h.l.XMLLoader xsltCacheLifetimeSeconds=60
   [junit4]   2> 491687 INFO  (coreLoadExecutor-2422-thread-1-processing-n:127.0.0.1:47257_) [n:127.0.0.1:47257_ c:control_collection s:shard1 r:core_node1 x:collection1] o.a.s.c.RequestHandlers Registered paths: /admin/mbeans,standard,/update/csv,/update/json/docs,/admin/luke,/admin/segments,/get,/admin/system,/replication,/admin/properties,/config,/schema,/admin/plugins,/admin/logging,/update/json,/admin/threads,/admin/ping,/update,/admin/file
   [junit4]   2> 491687 INFO  (coreLoadExecutor-2422-thread-1-processing-n:127.0.0.1:47257_) [n:127.0.0.1:47257_ c:control_collection s:shard1 r:core_node1 x:collection1] o.a.s.c.SolrCore Using default statsCache cache: org.apache.solr.search.stats.LocalStatsCache
   [junit4]   2> 491687 INFO  (coreLoadExecutor-2422-thread-1-processing-n:127.0.0.1:47257_) [n:127.0.0.1:47257_ c:control_collection s:shard1 r:core_node1 x:collection1] o.a.s.u.UpdateHandler Using UpdateLog implementation: org.apache.solr.update.UpdateLog
   [junit4]   2> 491687 INFO  (coreLoadExecutor-2422-thread-1-processing-n:127.0.0.1:47257_) [n:127.0.0.1:47257_ c:control_collection s:shard1 r:core_node1 x:collection1] o.a.s.u.UpdateLog Initializing UpdateLog: dataDir= defaultSyncLevel=FLUSH numRecordsToKeep=100 maxNumLogsToKeep=10 numVersionBuckets=65536
   [junit4]   2> 491688 INFO  (coreLoadExecutor-2422-thread-1-processing-n:127.0.0.1:47257_) [n:127.0.0.1:47257_ c:control_collection s:shard1 r:core_node1 x:collection1] o.a.s.c.SolrCore Hard AutoCommit: disabled
   [junit4]   2> 491688 INFO  (coreLoadExecutor-2422-thread-1-processing-n:127.0.0.1:47257_) [n:127.0.0.1:47257_ c:control_collection s:shard1 r:core_node1 x:collection1] o.a.s.c.SolrCore Soft AutoCommit: disabled
   [junit4]   2> 491688 INFO  (coreLoadExecutor-2422-thread-1-processing-n:127.0.0.1:47257_) [n:127.0.0.1:47257_ c:control_collection s:shard1 r:core_node1 x:collection1] o.a.s.u.RandomMergePolicy RandomMergePolicy wrapping class org.apache.lucene.index.AlcoholicMergePolicy: [AlcoholicMergePolicy: minMergeSize=0, mergeFactor=10, maxMergeSize=2131034377, maxMergeSizeForForcedMerge=9223372036854775807, calibrateSizeByDeletes=true, maxMergeDocs=2147483647, maxCFSSegmentSizeMB=8.796093022207999E12, noCFSRatio=0.1]
   [junit4]   2> 491689 INFO  (coreLoadExecutor-2422-thread-1-processing-n:127.0.0.1:47257_) [n:127.0.0.1:47257_ c:control_collection s:shard1 r:core_node1 x:collection1] o.a.s.c.SolrCore SolrDeletionPolicy.onInit: commits: num=1
   [junit4]   2> 	commit{dir=MockDirectoryWrapper(RAMDirectory@59a264c0 lockFactory=org.apache.lucene.store.SingleInstanceLockFactory@a2c766e),segFN=segments_1,generation=1}
   [junit4]   2> 491689 INFO  (coreLoadExecutor-2422-thread-1-processing-n:127.0.0.1:47257_) [n:127.0.0.1:47257_ c:control_collection s:shard1 r:core_node1 x:collection1] o.a.s.c.SolrCore newest commit generation = 1
   [junit4]   2> 491689 INFO  (coreLoadExecutor-2422-thread-1-processing-n:127.0.0.1:47257_) [n:127.0.0.1:47257_ c:control_collection s:shard1 r:core_node1 x:collection1] o.a.s.s.SolrIndexSearcher Opening Searcher@2e5f93ea[collection1] main
   [junit4]   2> 491689 INFO  (coreLoadExecutor-2422-thread-1-processing-n:127.0.0.1:47257_) [n:127.0.0.1:47257_ c:control_collection s:shard1 r:core_node1 x:collection1] o.a.s.c.c.ZkStateReader Load collection config from:/collections/control_collection
   [junit4]   2> 491690 INFO  (coreLoadExecutor-2422-thread-1-processing-n:127.0.0.1:47257_) [n:127.0.0.1:47257_ c:control_collection s:shard1 r:core_node1 x:collection1] o.a.s.c.c.ZkStateReader path=/collections/control_collection configName=conf1 specified config exists in ZooKeeper
   [junit4]   2> 491690 INFO  (coreLoadExecutor-2422-thread-1-processing-n:127.0.0.1:47257_) [n:127.0.0.1:47257_ c:control_collection s:shard1 r:core_node1 x:collection1] o.a.s.r.ManagedResourceStorage Setting up ZooKeeper-based storage for the RestManager with znodeBase: /configs/conf1
   [junit4]   2> 491690 INFO  (coreLoadExecutor-2422-thread-1-processing-n:127.0.0.1:47257_) [n:127.0.0.1:47257_ c:control_collection s:shard1 r:core_node1 x:collection1] o.a.s.r.ManagedResourceStorage Configured ZooKeeperStorageIO with znodeBase: /configs/conf1
   [junit4]   2> 491690 INFO  (coreLoadExecutor-2422-thread-1-processing-n:127.0.0.1:47257_) [n:127.0.0.1:47257_ c:control_collection s:shard1 r:core_node1 x:collection1] o.a.s.r.RestManager Initializing RestManager with initArgs: {}
   [junit4]   2> 491690 INFO  (coreLoadExecutor-2422-thread-1-processing-n:127.0.0.1:47257_) [n:127.0.0.1:47257_ c:control_collection s:shard1 r:core_node1 x:collection1] o.a.s.r.ManagedResourceStorage Reading _rest_managed.json using ZooKeeperStorageIO:path=/configs/conf1
   [junit4]   2> 491690 INFO  (coreLoadExecutor-2422-thread-1-processing-n:127.0.0.1:47257_) [n:127.0.0.1:47257_ c:control_collection s:shard1 r:core_node1 x:collection1] o.a.s.r.ManagedResourceStorage No data found for znode /configs/conf1/_rest_managed.json
   [junit4]   2> 491690 INFO  (coreLoadExecutor-2422-thread-1-processing-n:127.0.0.1:47257_) [n:127.0.0.1:47257_ c:control_collection s:shard1 r:core_node1 x:collection1] o.a.s.r.ManagedResourceStorage Loaded null at path _rest_managed.json using ZooKeeperStorageIO:path=/configs/conf1
   [junit4]   2> 491690 INFO  (coreLoadExecutor-2422-thread-1-processing-n:127.0.0.1:47257_) [n:127.0.0.1:47257_ c:control_collection s:shard1 r:core_node1 x:collection1] o.a.s.r.RestManager Initializing 0 registered ManagedResources
   [junit4]   2> 491691 INFO  (coreLoadExecutor-2422-thread-1-processing-n:127.0.0.1:47257_) [n:127.0.0.1:47257_ c:control_collection s:shard1 r:core_node1 x:collection1] o.a.s.h.ReplicationHandler Commits will be reserved for  10000
   [junit4]   2> 491691 INFO  (searcherExecutor-2423-thread-1-processing-n:127.0.0.1:47257_ x:collection1 s:shard1 c:control_collection r:core_node1) [n:127.0.0.1:47257_ c:control_collection s:shard1 r:core_node1 x:collection1] o.a.s.c.SolrCore [collection1] Registered new searcher Searcher@2e5f93ea[collection1] main{ExitableDirectoryReader(UninvertingDirectoryReader())}
   [junit4]   2> 491691 INFO  (coreLoadExecutor-2422-thread-1-processing-n:127.0.0.1:47257_) [n:127.0.0.1:47257_ c:control_collection s:shard1 r:core_node1 x:collection1] o.a.s.u.UpdateLog Looking up max value of version field to seed version buckets
   [junit4]   2> 491691 INFO  (coreLoadExecutor-2422-thread-1-processing-n:127.0.0.1:47257_) [n:127.0.0.1:47257_ c:control_collection s:shard1 r:core_node1 x:collection1] o.a.s.u.VersionInfo Refreshing highest value of _version_ for 65536 version buckets from index
   [junit4]   2> 491691 INFO  (coreLoadExecutor-2422-thread-1-processing-n:127.0.0.1:47257_) [n:127.0.0.1:47257_ c:control_collection s:shard1 r:core_node1 x:collection1] o.a.s.u.VersionInfo No terms found for _version_, cannot seed version bucket highest value from index
   [junit4]   2> 491691 INFO  (coreLoadExecutor-2422-thread-1-processing-n:127.0.0.1:47257_) [n:127.0.0.1:47257_ c:control_collection s:shard1 r:core_node1 x:collection1] o.a.s.u.UpdateLog Could not find max version in index or recent updates, using new clock 1511870355651690496
   [junit4]   2> 491693 INFO  (coreLoadExecutor-2422-thread-1-processing-n:127.0.0.1:47257_) [n:127.0.0.1:47257_ c:control_collection s:shard1 r:core_node1 x:collection1] o.a.s.u.UpdateLog Took 1.0ms to seed version buckets with highest version 1511870355651690496
   [junit4]   2> 491693 INFO  (coreLoadExecutor-2422-thread-1-processing-n:127.0.0.1:47257_) [n:127.0.0.1:47257_ c:control_collection s:shard1 r:core_node1 x:collection1] o.a.s.c.ZkController watch zkdir /configs/conf1
   [junit4]   2> 491693 INFO  (coreLoadExecutor-2422-thread-1-processing-n:127.0.0.1:47257_) [n:127.0.0.1:47257_ c:control_collection s:shard1 r:core_node1 x:collection1] o.a.s.c.CoreContainer registering core: collection1
   [junit4]   2> 491693 INFO  (coreZkRegister-2416-thread-1-processing-n:127.0.0.1:47257_ x:collection1 s:shard1 c:control_collection r:core_node1) [n:127.0.0.1:47257_ c:control_collection s:shard1 r:core_node1 x:collection1] o.a.s.c.ZkController Register replica - core:collection1 address:http://127.0.0.1:47257 collection:control_collection shard:shard1
   [junit4]   2> 491694 INFO  (coreZkRegister-2416-thread-1-processing-n:127.0.0.1:47257_ x:collection1 s:shard1 c:control_collection r:core_node1) [n:127.0.0.1:47257_ c:control_collection s:shard1 r:core_node1 x:collection1] o.a.s.c.c.SolrZkClient makePath: /collections/control_collection/leader_elect/shard1/election
   [junit4]   2> 491695 INFO  (coreZkRegister-2416-thread-1-processing-n:127.0.0.1:47257_ x:collection1 s:shard1 c:control_collection r:core_node1) [n:127.0.0.1:47257_ c:control_collection s:shard1 r:core_node1 x:collection1] o.a.s.c.LeaderElector Joined leadership election with path: /collections/control_collection/leader_elect/shard1/election/94491897138380804-core_node1-n_0000000000
   [junit4]   2> 491695 INFO  (coreZkRegister-2416-thread-1-processing-n:127.0.0.1:47257_ x:collection1 s:shard1 c:control_collection r:core_node1) [n:127.0.0.1:47257_ c:control_collection s:shard1 r:core_node1 x:collection1] o.a.s.c.ShardLeaderElectionContext Running the leader process for shard shard1
   [junit4]   2> 491695 INFO  (coreZkRegister-2416-thread-1-processing-n:127.0.0.1:47257_ x:collection1 s:shard1 c:control_collection r:core_node1) [n:127.0.0.1:47257_ c:control_collection s:shard1 r:core_node1 x:collection1] o.a.s.c.ShardLeaderElectionContext Enough replicas found to continue.
   [junit4]   2> 491695 INFO  (coreZkRegister-2416-thread-1-processing-n:127.0.0.1:47257_ x:collection1 s:shard1 c:control_collection r:core_node1) [n:127.0.0.1:47257_ c:control_collection s:shard1 r:core_node1 x:collection1] o.a.s.c.ShardLeaderElectionContext I may be the new leader - try and sync
   [junit4]   2> 491695 INFO  (OverseerStateUpdate-94491897138380804-127.0.0.1:47257_-n_0000000000) [n:127.0.0.1:47257_    ] o.a.s.c.Overseer processMessage: queueSize: 1, message = {
   [junit4]   2>   "operation":"leader",
   [junit4]   2>   "shard":"shard1",
   [junit4]   2>   "collection":"control_collection"} current state version: 1
   [junit4]   2> 491695 INFO  (coreZkRegister-2416-thread-1-processing-n:127.0.0.1:47257_ x:collection1 s:shard1 c:control_collection r:core_node1) [n:127.0.0.1:47257_ c:control_collection s:shard1 r:core_node1 x:collection1] o.a.s.c.SyncStrategy Sync replicas to http://127.0.0.1:47257/collection1/
   [junit4]   2> 491696 INFO  (coreZkRegister-2416-thread-1-processing-n:127.0.0.1:47257_ x:collection1 s:shard1 c:control_collection r:core_node1) [n:127.0.0.1:47257_ c:control_collection s:shard1 r:core_node1 x:collection1] o.a.s.c.SyncStrategy Sync Success - now sync replicas to me
   [junit4]   2> 491696 INFO  (coreZkRegister-2416-thread-1-processing-n:127.0.0.1:47257_ x:collection1 s:shard1 c:control_collection r:core_node1) [n:127.0.0.1:47257_ c:control_collection s:shard1 r:core_node1 x:collection1] o.a.s.c.SyncStrategy http://127.0.0.1:47257/collection1/ has no replicas
   [junit4]   2> 491696 INFO  (coreZkRegister-2416-thread-1-processing-n:127.0.0.1:47257_ x:collection1 s:shard1 c:control_collection r:core_node1) [n:127.0.0.1:47257_ c:control_collection s:shard1 r:core_node1 x:collection1] o.a.s.c.ShardLeaderElectionContext I am the new leader: http://127.0.0.1:47257/collection1/ shard1
   [junit4]   2> 491696 INFO  (coreZkRegister-2416-thread-1-processing-n:127.0.0.1:47257_ x:collection1 s:shard1 c:control_collection r:core_node1) [n:127.0.0.1:47257_ c:control_collection s:shard1 r:core_node1 x:collection1] o.a.s.c.c.SolrZkClient makePath: /collections/control_collection/leaders/shard1
   [junit4]   2> 491697 INFO  (coreZkRegister-2416-thread-1-processing-n:127.0.0.1:47257_ x:collection1 s:shard1 c:control_collection r:core_node1) [n:127.0.0.1:47257_ c:control_collection s:shard1 r:core_node1 x:collection1] o.a.s.c.ShardLeaderElectionContextBase Creating leader registration node
   [junit4]   2> 491697 INFO  (OverseerStateUpdate-94491897138380804-127.0.0.1:47257_-n_0000000000) [n:127.0.0.1:47257_    ] o.a.s.c.Overseer processMessage: queueSize: 1, message = {
   [junit4]   2>   "operation":"leader",
   [junit4]   2>   "shard":"shard1",
   [junit4]   2>   "collection":"control_collection",
   [junit4]   2>   "base_url":"http://127.0.0.1:47257",
   [junit4]   2>   "core":"collection1",
   [junit4]   2>   "state":"active"} current state version: 1
   [junit4]   2> 491798 INFO  (zkCallback-875-thread-1-processing-n:127.0.0.1:47257_) [n:127.0.0.1:47257_    ] o.a.s.c.c.ZkStateReader A cluster state change: WatchedEvent state:SyncConnected type:NodeDataChanged path:/clusterstate.json, has occurred - updating... (live nodes size: 1)
   [junit4]   2> 491848 INFO  (coreZkRegister-2416-thread-1-processing-n:127.0.0.1:47257_ x:collection1 s:shard1 c:control_collection r:core_node1) [n:127.0.0.1:47257_ c:control_collection s:shard1 r:core_node1 x:collection1] o.a.s.c.ZkController We are http://127.0.0.1:47257/collection1/ and leader is http://127.0.0.1:47257/collection1/
   [junit4]   2> 491848 INFO  (coreZkRegister-2416-thread-1-processing-n:127.0.0.1:47257_ x:collection1 s:shard1 c:control_collection r:core_node1) [n:127.0.0.1:47257_ c:control_collection s:shard1 r:core_node1 x:collection1] o.a.s.c.ZkController No LogReplay needed for core=collection1 baseURL=http://127.0.0.1:47257
   [junit4]   2> 491848 INFO  (coreZkRegister-2416-thread-1-processing-n:127.0.0.1:47257_ x:collection1 s:shard1 c:control_collection r:core_node1) [n:127.0.0.1:47257_ c:control_collection s:shard1 r:core_node1 x:collection1] o.a.s.c.ZkController I am the leader, no recovery necessary
   [junit4]   2> 491848 INFO  (coreZkRegister-2416-thread-1-processing-n:127.0.0.1:47257_ x:collection1 s:shard1 c:control_collection r:core_node1) [n:127.0.0.1:47257_ c:control_collection s:shard1 r:core_node1 x:collection1] o.a.s.c.ZkController publishing state=active
   [junit4]   2> 491848 INFO  (coreZkRegister-2416-thread-1-processing-n:127.0.0.1:47257_ x:collection1 s:shard1 c:control_collection r:core_node1) [n:127.0.0.1:47257_ c:control_collection s:shard1 r:core_node1 x:collection1] o.a.s.c.ZkController numShards not found on descriptor - reading it from system property
   [junit4]   2> 491849 INFO  (OverseerStateUpdate-94491897138380804-127.0.0.1:47257_-n_0000000000) [n:127.0.0.1:47257_    ] o.a.s.c.Overseer processMessage: queueSize: 1, message = {
   [junit4]   2>   "core":"collection1",
   [junit4]   2>   "core_node_name":"core_node1",
   [junit4]   2>   "roles":null,
   [junit4]   2>   "base_url":"http://127.0.0.1:47257",
   [junit4]   2>   "node_name":"127.0.0.1:47257_",
   [junit4]   2>   "numShards":"1",
   [junit4]   2>   "state":"active",
   [junit4]   2>   "shard":"shard1",
   [junit4]   2>   "collection":"control_collection",
   [junit4]   2>   "operation":"state"} current state version: 2
   [junit4]   2> 491849 INFO  (OverseerStateUpdate-94491897138380804-127.0.0.1:47257_-n_0000000000) [n:127.0.0.1:47257_    ] o.a.s.c.o.ReplicaMutator Update state numShards=1 message={
   [junit4]   2>   "core":"collection1",
   [junit4]   2>   "core_node_name":"core_node1",
   [junit4]   2>   "roles":null,
   [junit4]   2>   "base_url":"http://127.0.0.1:47257",
   [junit4]   2>   "node_name":"127.0.0.1:47257_",
   [junit4]   2>   "numShards":"1",
   [junit4]   2>   "state":"active",
   [junit4]   2>   "shard":"shard1",
   [junit4]   2>   "collection":"control_collection",
   [junit4]   2>   "operation":"state"}
   [junit4]   2> 491951 INFO  (zkCallback-875-thread-2-processing-n:127.0.0.1:47257_) [n:127.0.0.1:47257_    ] o.a.s.c.c.ZkStateReader A cluster state change: WatchedEvent state:SyncConnected type:NodeDataChanged path:/clusterstate.json, has occurred - updating... (live nodes size: 1)
   [junit4]   2> 492080 INFO  (TEST-DistribJoinFromCollectionTest.test-seed#[E34398B09FA3A45D]) [    ] o.a.s.c.c.SolrZkClient Using default ZkCredentialsProvider
   [junit4]   2> 492080 INFO  (TEST-DistribJoinFromCollectionTest.test-seed#[E34398B09FA3A45D]) [    ] o.a.s.c.c.ConnectionManager Waiting for client to connect to ZooKeeper
   [junit4]   2> 492081 INFO  (zkCallback-877-thread-1) [    ] o.a.s.c.c.ConnectionManager Watcher org.apache.solr.common.cloud.ConnectionManager@be7e082 name:ZooKeeperConnection Watcher:127.0.0.1:42505/solr got event WatchedEvent state:SyncConnected type:None path:null path:null type:None
   [junit4]   2> 492081 INFO  (TEST-DistribJoinFromCollectionTest.test-seed#[E34398B09FA3A45D]) [    ] o.a.s.c.c.ConnectionManager Client is connected to ZooKeeper
   [junit4]   2> 492081 INFO  (TEST-DistribJoinFromCollectionTest.test-seed#[E34398B09FA3A45D]) [    ] o.a.s.c.c.SolrZkClient Using default ZkACLProvider
   [junit4]   2> 492082 INFO  (TEST-DistribJoinFromCollectionTest.test-seed#[E34398B09FA3A45D]) [    ] o.a.s.c.c.ZkStateReader Updating cluster state from ZooKeeper... 
   [junit4]   2> 492082 INFO  (TEST-DistribJoinFromCollectionTest.test-seed#[E34398B09FA3A45D]) [    ] o.a.s.c.ChaosMonkey monkey: init - expire sessions:false cause connection loss:false
   [junit4]   2> 492126 INFO  (TEST-DistribJoinFromCollectionTest.test-seed#[E34398B09FA3A45D]) [    ] o.a.s.SolrTestCaseJ4 Writing core.properties file to /home/jenkins/workspace/Lucene-Solr-trunk-Linux/solr/build/solr-core/test/J0/temp/solr.cloud.DistribJoinFromCollectionTest_E34398B09FA3A45D-001/shard-1-001/cores/collection1
   [junit4]   2> 492127 INFO  (TEST-DistribJoinFromCollectionTest.test-seed#[E34398B09FA3A45D]) [    ] o.a.s.c.AbstractFullDistribZkTestBase create jetty 1 in directory /home/jenkins/workspace/Lucene-Solr-trunk-Linux/solr/build/solr-core/test/J0/temp/solr.cloud.DistribJoinFromCollectionTest_E34398B09FA3A45D-001/shard-1-001
   [junit4]   2> 492127 INFO  (TEST-DistribJoinFromCollectionTest.test-seed#[E34398B09FA3A45D]) [    ] o.e.j.s.Server jetty-9.2.13.v20150730
   [junit4]   2> 492128 INFO  (TEST-DistribJoinFromCollectionTest.test-seed#[E34398B09FA3A45D]) [    ] o.e.j.s.h.ContextHandler Started o.e.j.s.ServletContextHandler@6c3ffea6{/,null,AVAILABLE}
   [junit4]   2> 492128 INFO  (TEST-DistribJoinFromCollectionTest.test-seed#[E34398B09FA3A45D]) [    ] o.e.j.s.ServerConnector Started ServerConnector@4469349a{HTTP/1.1}{127.0.0.1:46992}
   [junit4]   2> 492128 INFO  (TEST-DistribJoinFromCollectionTest.test-seed#[E34398B09FA3A45D]) [    ] o.e.j.s.Server Started @493562ms
   [junit4]   2> 492128 INFO  (TEST-DistribJoinFromCollectionTest.test-seed#[E34398B09FA3A45D]) [    ] o.a.s.c.s.e.JettySolrRunner Jetty properties: {solr.data.dir=/home/jenkins/workspace/Lucene-Solr-trunk-Linux/solr/build/solr-core/test/J0/temp/solr.cloud.DistribJoinFromCollectionTest_E34398B09FA3A45D-001/tempDir-001/jetty1, solrconfig=solrconfig.xml, hostContext=/, hostPort=46992, coreRootDirectory=/home/jenkins/workspace/Lucene-Solr-trunk-Linux/solr/build/solr-core/test/J0/../../../../../../../../../home/jenkins/workspace/Lucene-Solr-trunk-Linux/solr/build/solr-core/test/J0/temp/solr.cloud.DistribJoinFromCollectionTest_E34398B09FA3A45D-001/shard-1-001/cores}
   [junit4]   2> 492128 INFO  (TEST-DistribJoinFromCollectionTest.test-seed#[E34398B09FA3A45D]) [    ] o.a.s.s.SolrDispatchFilter SolrDispatchFilter.init(): sun.misc.Launcher$AppClassLoader@f2a0b8e
   [junit4]   2> 492129 INFO  (TEST-DistribJoinFromCollectionTest.test-seed#[E34398B09FA3A45D]) [    ] o.a.s.c.SolrResourceLoader new SolrResourceLoader for directory: '/home/jenkins/workspace/Lucene-Solr-trunk-Linux/solr/build/solr-core/test/J0/../../../../../../../../../home/jenkins/workspace/Lucene-Solr-trunk-Linux/solr/build/solr-core/test/J0/temp/solr.cloud.DistribJoinFromCollectionTest_E34398B09FA3A45D-001/shard-1-001/'
   [junit4]   2> 492136 INFO  (TEST-DistribJoinFromCollectionTest.test-seed#[E34398B09FA3A45D]) [    ] o.a.s.c.c.SolrZkClient Using default ZkCredentialsProvider
   [junit4]   2> 492136 INFO  (TEST-DistribJoinFromCollectionTest.test-seed#[E34398B09FA3A45D]) [    ] o.a.s.c.c.ConnectionManager Waiting for client to connect to ZooKeeper
   [junit4]   2> 492137 INFO  (zkCallback-878-thread-1) [    ] o.a.s.c.c.ConnectionManager Watcher org.apache.solr.common.cloud.ConnectionManager@296e49e8 name:ZooKeeperConnection Watcher:127.0.0.1:42505/solr got event WatchedEvent state:SyncConnected type:None path:null path:null type:None
   [junit4]   2> 492137 INFO  (TEST-DistribJoinFromCollectionTest.test-seed#[E34398B09FA3A45D]) [    ] o.a.s.c.c.ConnectionManager Client is connected to ZooKeeper
   [junit4]   2> 492138 INFO  (TEST-DistribJoinFromCollectionTest.test-seed#[E34398B09FA3A45D]) [    ] o.a.s.c.c.SolrZkClient Using default ZkACLProvider
   [junit4]   2> 492138 INFO  (TEST-DistribJoinFromCollectionTest.test-seed#[E34398B09FA3A45D]) [    ] o.a.s.s.SolrDispatchFilter Loading solr.xml from SolrHome (not found in ZooKeeper)
   [junit4]   2> 492138 INFO  (TEST-DistribJoinFromCollectionTest.test-seed#[E34398B09FA3A45D]) [    ] o.a.s.c.SolrXmlConfig Loading container configuration from /home/jenkins/workspace/Lucene-Solr-trunk-Linux/solr/build/solr-core/test/J0/../../../../../../../../../home/jenkins/workspace/Lucene-Solr-trunk-Linux/solr/build/solr-core/test/J0/temp/solr.cloud.DistribJoinFromCollectionTest_E34398B09FA3A45D-001/shard-1-001/solr.xml
   [junit4]   2> 492141 INFO  (TEST-DistribJoinFromCollectionTest.test-seed#[E34398B09FA3A45D]) [    ] o.a.s.c.CoresLocator Config-defined core root directory: /home/jenkins/workspace/Lucene-Solr-trunk-Linux/solr/build/solr-core/test/J0/../../../../../../../../../home/jenkins/workspace/Lucene-Solr-trunk-Linux/solr/build/solr-core/test/J0/temp/solr.cloud.DistribJoinFromCollectionTest_E34398B09FA3A45D-001/shard-1-001/cores
   [junit4]   2> 492141 INFO  (TEST-DistribJoinFromCollectionTest.test-seed#[E34398B09FA3A45D]) [    ] o.a.s.c.CoreContainer New CoreContainer 1851916675
   [junit4]   2> 492141 INFO  (TEST-DistribJoinFromCollectionTest.test-seed#[E34398B09FA3A45D]) [    ] o.a.s.c.CoreContainer Loading cores into CoreContainer [instanceDir=/home/jenkins/workspace/Lucene-Solr-trunk-Linux/solr/build/solr-core/test/J0/../../../../../../../../../home/jenkins/workspace/Lucene-Solr-trunk-Linux/solr/build/solr-core/test/J0/temp/solr.cloud.DistribJoinFromCollectionTest_E34398B09FA3A45D-001/shard-1-001/]
   [junit4]   2> 492141 INFO  (TEST-DistribJoinFromCollectionTest.test-seed#[E34398B09FA3A45D]) [    ] o.a.s.c.CoreContainer loading shared library: /home/jenkins/workspace/Lucene-Solr-trunk-Linux/solr/build/solr-core/test/J0/../../../../../../../../../home/jenkins/workspace/Lucene-Solr-trunk-Linux/solr/build/solr-core/test/J0/temp/solr.cloud.DistribJoinFromCollectionTest_E34398B09FA3A45D-001/shard-1-001/lib
   [junit4]   2> 492141 WARN  (TEST-DistribJoinFromCollectionTest.test-seed#[E34398B09FA3A45D]) [    ] o.a.s.c.SolrResourceLoader Can't find (or read) directory to add to classloader: lib (resolved as: /home/jenkins/workspace/Lucene-Solr-trunk-Linux/solr/build/solr-core/test/J0/../../../../../../../../../home/jenkins/workspace/Lucene-Solr-trunk-Linux/solr/build/solr-core/test/J0/temp/solr.cloud.DistribJoinFromCollectionTest_E34398B09FA3A45D-001/shard-1-001/lib).
   [junit4]   2> 492145 INFO  (TEST-DistribJoinFromCollectionTest.test-seed#[E34398B09FA3A45D]) [    ] o.a.s.h.c.HttpShardHandlerFactory created with socketTimeout : 90000,urlScheme : ,connTimeout : 15000,maxConnectionsPerHost : 20,maxConnections : 10000,corePoolSize : 0,maximumPoolSize : 2147483647,maxThreadIdleTime : 5,sizeOfQueue : -1,fairnessPolicy : false,useRetries : false,
   [junit4]   2> 492146 INFO  (TEST-DistribJoinFromCollectionTest.test-seed#[E34398B09FA3A45D]) [    ] o.a.s.u.UpdateShardHandler Creating UpdateShardHandler HTTP client with params: socketTimeout=340000&connTimeout=45000&retry=true
   [junit4]   2> 492146 INFO  (TEST-DistribJoinFromCollectionTest.test-seed#[E34398B09FA3A45D]) [    ] o.a.s.l.LogWatcher SLF4J impl is org.slf4j.impl.Log4jLoggerFactory
   [junit4]   2> 492146 INFO  (TEST-DistribJoinFromCollectionTest.test-seed#[E34398B09FA3A45D]) [    ] o.a.s.l.LogWatcher Registering Log Listener [Log4j (org.slf4j.impl.Log4jLoggerFactory)]
   [junit4]   2> 492146 INFO  (TEST-DistribJoinFromCollectionTest.test-seed#[E34398B09FA3A45D]) [    ] o.a.s.c.ZkContainer Zookeeper client=127.0.0.1:42505/solr
   [junit4]   2> 492146 INFO  (TEST-DistribJoinFromCollectionTest.test-seed#[E34398B09FA3A45D]) [    ] o.a.s.c.ZkController zkHost includes chroot
   [junit4]   2> 492146 INFO  (TEST-DistribJoinFromCollectionTest.test-seed#[E34398B09FA3A45D]) [    ] o.a.s.c.c.SolrZkClient Using default ZkCredentialsProvider
   [junit4]   2> 492146 INFO  (TEST-DistribJoinFromCollectionTest.test-seed#[E34398B09FA3A45D]) [    ] o.a.s.c.c.ConnectionManager Waiting for client to connect to ZooKeeper
   [junit4]   2> 492147 INFO  (zkCallback-880-thread-1) [    ] o.a.s.c.c.ConnectionManager Watcher org.apache.solr.common.cloud.ConnectionManager@43eed6d2 name:ZooKeeperConnection Watcher:127.0.0.1:42505 got event WatchedEvent state:SyncConnected type:None path:null path:null type:None
   [junit4]   2> 492148 INFO  (TEST-DistribJoinFromCollectionTest.test-seed#[E34398B09FA3A45D]) [    ] o.a.s.c.c.ConnectionManager Client is connected to ZooKeeper
   [junit4]   2> 492148 INFO  (TEST-DistribJoinFromCollectionTest.test-seed#[E34398B09FA3A45D]) [    ] o.a.s.c.c.SolrZkClient Using default ZkACLProvider
   [junit4]   2> 492149 INFO  (TEST-DistribJoinFromCollectionTest.test-seed#[E34398B09FA3A45D]) [n:127.0.0.1:46992_    ] o.a.s.c.c.ConnectionManager Waiting for client to connect to ZooKeeper
   [junit4]   2> 492150 INFO  (zkCallback-881-thread-1-processing-n:127.0.0.1:46992_) [n:127.0.0.1:46992_    ] o.a.s.c.c.ConnectionManager Watcher org.apache.solr.common.cloud.ConnectionManager@51419d60 name:ZooKeeperConnection Watcher:127.0.0.1:42505/solr got event WatchedEvent state:SyncConnected type:None path:null path:null type:None
   [junit4]   2> 492150 INFO  (TEST-DistribJoinFromCollectionTest.test-seed#[E34398B09FA3A45D]) [n:127.0.0.1:46992_    ] o.a.s.c.c.ConnectionManager Client is connected to ZooKeeper
   [junit4]   2> 492151 INFO  (TEST-DistribJoinFromCollectionTest.test-seed#[E34398B09FA3A45D]) [n:127.0.0.1:46992_    ] o.a.s.c.c.ZkStateReader Updating cluster state from ZooKeeper... 
   [junit4]   2> 493154 INFO  (TEST-DistribJoinFromCollectionTest.test-seed#[E34398B09FA3A45D]) [n:127.0.0.1:46992_    ] o.a.s.c.ZkController Register node as live in ZooKeeper:/live_nodes/127.0.0.1:46992_
   [junit4]   2> 493154 INFO  (TEST-DistribJoinFromCollectionTest.test-seed#[E34398B09FA3A45D]) [n:127.0.0.1:46992_    ] o.a.s.c.c.SolrZkClient makePath: /live_nodes/127.0.0.1:46992_
   [junit4]   2> 493154 INFO  (zkCallback-877-thread-1) [    ] o.a.s.c.c.ZkStateReader A live node change: WatchedEvent state:SyncConnected type:NodeChildrenChanged path:/live_nodes, has occurred - updating... (live nodes size: 1)
   [junit4]   2> 493154 INFO  (zkCallback-875-thread-2-processing-n:127.0.0.1:47257_) [n:127.0.0.1:47257_    ] o.a.s.c.c.ZkStateReader A live node change: WatchedEvent state:SyncConnected type:NodeChildrenChanged path:/live_nodes, has occurred - updating... (live nodes size: 1)
   [junit4]   2> 493155 INFO  (zkCallback-881-thread-1-processing-n:127.0.0.1:46992_) [n:127.0.0.1:46992_    ] o.a.s.c.c.ZkStateReader A live node change: WatchedEvent state:SyncConnected type:NodeChildrenChanged path:/live_nodes, has occurred - updating... (live nodes size: 1)
   [junit4]   2> 493155 INFO  (TEST-DistribJoinFromCollectionTest.test-seed#[E34398B09FA3A45D]) [n:127.0.0.1:46992_    ] o.a.s.c.Overseer Overseer (id=null) closing
   [junit4]   2> 493156 INFO  (TEST-DistribJoinFromCollectionTest.test-seed#[E34398B09FA3A45D]) [n:127.0.0.1:46992_    ] o.a.s.c.LeaderElector Joined leadership election with path: /overseer_elect/election/94491897138380808-127.0.0.1:46992_-n_0000000001
   [junit4]   2> 493156 INFO  (TEST-DistribJoinFromCollectionTest.test-seed#[E34398B09FA3A45D]) [n:127.0.0.1:46992_    ] o.a.s.c.LeaderElector Watching path /overseer_elect/election/94491897138380804-127.0.0.1:47257_-n_0000000000 to know if I could be the leader
   [junit4]   2> 493164 INFO  (TEST-DistribJoinFromCollectionTest.test-seed#[E34398B09FA3A45D]) [n:127.0.0.1:46992_    ] o.a.s.c.CoreContainer Security conf doesn't exist. Skipping setup for authorization module.
   [junit4]   2> 493164 INFO  (TEST-DistribJoinFromCollectionTest.test-seed#[E34398B09FA3A45D]) [n:127.0.0.1:46992_    ] o.a.s.c.CoreContainer No authentication plugin used.
   [junit4]   2> 493165 INFO  (TEST-DistribJoinFromCollectionTest.test-seed#[E34398B09FA3A45D]) [n:127.0.0.1:46992_    ] o.a.s.c.CoresLocator Looking for core definitions underneath /home/jenkins/workspace/Lucene-Solr-trunk-Linux/solr/build/solr-core/test/J0/../../../../../../../../../home/jenkins/workspace/Lucene-Solr-trunk-Linux/solr/build/solr-core/test/J0/temp/solr.cloud.DistribJoinFromCollectionTest_E34398B09FA3A45D-001/shard-1-001/cores
   [junit4]   2> 493166 INFO  (TEST-DistribJoinFromCollectionTest.test-seed#[E34398B09FA3A45D]) [n:127.0.0.1:46992_    ] o.a.s.c.SolrCore Created CoreDescriptor: {name=collection1, config=solrconfig.xml, transient=false, schema=schema.xml, loadOnStartup=true, configSetProperties=configsetprops.json, instanceDir=/home/jenkins/workspace/Lucene-Solr-trunk-Linux/solr/build/solr-core/test/J0/../../../../../../../../../home/jenkins/workspace/Lucene-Solr-trunk-Linux/solr/build/solr-core/test/J0/temp/solr.cloud.DistribJoinFromCollectionTest_E34398B09FA3A45D-001/shard-1-001/cores/collection1, collection=collection1, absoluteInstDir=/home/jenkins/workspace/Lucene-Solr-trunk-Linux/solr/build/solr-core/test/J0/../../../../../../../../../home/jenkins/workspace/Lucene-Solr-trunk-Linux/solr/build/solr-core/test/J0/temp/solr.cloud.DistribJoinFromCollectionTest_E34398B09FA3A45D-001/shard-1-001/cores/collection1/, coreNodeName=, dataDir=data/, shard=}
   [junit4]   2> 493166 INFO  (TEST-DistribJoinFromCollectionTest.test-seed#[E34398B09FA3A45D]) [n:127.0.0.1:46992_    ] o.a.s.c.CoresLocator Found core collection1 in /home/jenkins/workspace/Lucene-Solr-trunk-Linux/solr/build/solr-core/test/J0/../../../../../../../../../home/jenkins/workspace/Lucene-Solr-trunk-Linux/solr/build/solr-core/test/J0/temp/solr.cloud.DistribJoinFromCollectionTest_E34398B09FA3A45D-001/shard-1-001/cores/collection1/
   [junit4]   2> 493166 INFO  (TEST-DistribJoinFromCollectionTest.test-seed#[E34398B09FA3A45D]) [n:127.0.0.1:46992_    ] o.a.s.c.CoresLocator Found 1 core definitions
   [junit4]   2> 493167 INFO  (TEST-DistribJoinFromCollectionTest.test-seed#[E34398B09FA3A45D]) [n:127.0.0.1:46992_    ] o.a.s.s.SolrDispatchFilter user.dir=/home/jenkins/workspace/Lucene-Solr-trunk-Linux/solr/build/solr-core/test/J0
   [junit4]   2> 493167 INFO  (coreLoadExecutor-2433-thread-1-processing-n:127.0.0.1:46992_) [n:127.0.0.1:46992_ c:collection1   x:collection1] o.a.s.c.ZkController publishing state=down
   [junit4]   2> 493167 INFO  (coreLoadExecutor-2433-thread-1-processing-n:127.0.0.1:46992_) [n:127.0.0.1:46992_ c:collection1   x:collection1] o.a.s.c.ZkController numShards not found on descriptor - reading it from system property
   [junit4]   2> 493167 INFO  (TEST-DistribJoinFromCollectionTest.test-seed#[E34398B09FA3A45D]) [n:127.0.0.1:46992_    ] o.a.s.s.SolrDispatchFilter SolrDispatchFilter.init() done
   [junit4]   2> 493168 INFO  (coreLoadExecutor-2433-thread-1-processing-n:127.0.0.1:46992_) [n:127.0.0.1:46992_ c:collection1   x:collection1] o.a.s.c.ZkController look for our core node name
   [junit4]   2> 493168 INFO  (OverseerStateUpdate-94491897138380804-127.0.0.1:47257_-n_0000000000) [n:127.0.0.1:47257_    ] o.a.s.c.Overseer processMessage: queueSize: 1, message = {
   [junit4]   2>   "core":"collection1",
   [junit4]   2>   "roles":null,
   [junit4]   2>   "base_url":"http://127.0.0.1:46992",
   [junit4]   2>   "node_name":"127.0.0.1:46992_",
   [junit4]   2>   "numShards":"2",
   [junit4]   2>   "state":"down",
   [junit4]   2>   "shard":null,
   [junit4]   2>   "collection":"collection1",
   [junit4]   2>   "operation":"state"} current state version: 3
   [junit4]   2> 493168 INFO  (OverseerStateUpdate-94491897138380804-127.0.0.1:47257_-n_0000000000) [n:127.0.0.1:47257_    ] o.a.s.c.o.ReplicaMutator Update state numShards=2 message={
   [junit4]   2>   "core":"collection1",
   [junit4]   2>   "roles":null,
   [junit4]   2>   "base_url":"http://127.0.0.1:46992",
   [junit4]   2>   "node_name":"127.0.0.1:46992_",
   [junit4]   2>   "numShards":"2",
   [junit4]   2>   "state":"down",
   [junit4]   2>   "shard":null,
   [junit4]   2>   "collection":"collection1",
   [junit4]   2>   "operation":"state"}
   [junit4]   2> 493168 INFO  (OverseerStateUpdate-94491897138380804-127.0.0.1:47257_-n_0000000000) [n:127.0.0.1:47257_    ] o.a.s.c.o.ClusterStateMutator building a new cName: collection1
   [junit4]   2> 493168 INFO  (OverseerStateUpdate-94491897138380804-127.0.0.1:47257_-n_0000000000) [n:127.0.0.1:47257_    ] o.a.s.c.o.ReplicaMutator Assigning new node to shard shard=shard2
   [junit4]   2> 493269 INFO  (zkCallback-877-thread-1) [    ] o.a.s.c.c.ZkStateReader A cluster state change: WatchedEvent state:SyncConnected type:NodeDataChanged path:/clusterstate.json, has occurred - updating... (live nodes size: 2)
   [junit4]   2> 493269 INFO  (zkCallback-881-thread-1-processing-n:127.0.0.1:46992_) [n:127.0.0.1:46992_    ] o.a.s.c.c.ZkStateReader A cluster state change: WatchedEvent state:SyncConnected type:NodeDataChanged path:/clusterstate.json, has occurred - updating... (live nodes size: 2)
   [junit4]   2> 493269 INFO  (zkCallback-875-thread-2-processing-n:127.0.0.1:47257_) [n:127.0.0.1:47257_    ] o.a.s.c.c.ZkStateReader A cluster state change: WatchedEvent state:SyncConnected type:NodeDataChanged path:/clusterstate.json, has occurred - updating... (live nodes size: 2)
   [junit4]   2> 494168 INFO  (coreLoadExecutor-2433-thread-1-processing-n:127.0.0.1:46992_) [n:127.0.0.1:46992_ c:collection1   x:collection1] o.a.s.c.ZkController waiting to find shard id in clusterstate for collection1
   [junit4]   2> 494168 INFO  (coreLoadExecutor-2433-thread-1-processing-n:127.0.0.1:46992_) [n:127.0.0.1:46992_ c:collection1   x:collection1] o.a.s.c.ZkController Check for collection zkNode:collection1
   [junit4]   2> 494168 INFO  (coreLoadExecutor-2433-thread-1-processing-n:127.0.0.1:46992_) [n:127.0.0.1:46992_ c:collection1   x:collection1] o.a.s.c.ZkController Collection zkNode exists
   [junit4]   2> 494168 INFO  (coreLoadExecutor-2433-thread-1-processing-n:127.0.0.1:46992_) [n:127.0.0.1:46992_ c:collection1   x:collection1] o.a.s.c.c.ZkStateReader Load collection config from:/collections/collection1
   [junit4]   2> 494169 INFO  (coreLoadExecutor-2433-thread-1-processing-n:127.0.0.1:46992_) [n:127.0.0.1:46992_ c:collection1   x:collection1] o.a.s.c.c.ZkStateReader path=/collections/collection1 configName=conf1 specified config exists in ZooKeeper
   [junit4]   2> 494169 INFO  (coreLoadExecutor-2433-thread-1-processing-n:127.0.0.1:46992_) [n:127.0.0.1:46992_ c:collection1   x:collection1] o.a.s.c.SolrResourceLoader new SolrResourceLoader for directory: '/home/jenkins/workspace/Lucene-Solr-trunk-Linux/solr/build/solr-core/test/J0/../../../../../../../../../home/jenkins/workspace/Lucene-Solr-trunk-Linux/solr/build/solr-core/test/J0/temp/solr.cloud.DistribJoinFromCollectionTest_E34398B09FA3A45D-001/shard-1-001/cores/collection1/'
   [junit4]   2> 494175 INFO  (coreLoadExecutor-2433-thread-1-processing-n:127.0.0.1:46992_) [n:127.0.0.1:46992_ c:collection1   x:collection1] o.a.s.c.Config loaded config solrconfig.xml with version 0 
   [junit4]   2> 494178 INFO  (coreLoadExecutor-2433-thread-1-processing-n:127.0.0.1:46992_) [n:127.0.0.1:46992_ c:collection1   x:collection1] o.a.s.c.SolrConfig current version of requestparams : -1
   [junit4]   2> 494181 INFO  (coreLoadExecutor-2433-thread-1-processing-n:127.0.0.1:46992_) [n:127.0.0.1:46992_ c:collection1   x:collection1] o.a.s.c.SolrConfig Using Lucene MatchVersion: 6.0.0
   [junit4]   2> 494186 INFO  (coreLoadExecutor-2433-thread-1-processing-n:127.0.0.1:46992_) [n:127.0.0.1:46992_ c:collection1   x:collection1] o.a.s.c.Config Loaded SolrConfig: solrconfig.xml
   [junit4]   2> 494186 INFO  (coreLoadExecutor-2433-thread-1-processing-n:127.0.0.1:46992_) [n:127.0.0.1:46992_ c:collection1   x:collection1] o.a.s.s.IndexSchema Reading Solr Schema from /configs/conf1/schema.xml
   [junit4]   2> 494189 INFO  (coreLoadExecutor-2433-thread-1-processing-n:127.0.0.1:46992_) [n:127.0.0.1:46992_ c:collection1   x:collection1] o.a.s.s.IndexSchema [collection1] Schema name=test
   [junit4]   2> 494244 INFO  (coreLoadExecutor-2433-thread-1-processing-n:127.0.0.1:46992_) [n:127.0.0.1:46992_ c:collection1   x:collection1] o.a.s.s.OpenExchangeRatesOrgProvider Initialized with rates=open-exchange-rates.json, refreshInterval=1440.
   [junit4]   2> 494248 INFO  (coreLoadExecutor-2433-thread-1-processing-n:127.0.0.1:46992_) [n:127.0.0.1:46992_ c:collection1   x:collection1] o.a.s.s.IndexSchema default search field in schema is text
   [junit4]   2> 494248 INFO  (coreLoadExecutor-2433-thread-1-processing-n:127.0.0.1:46992_) [n:127.0.0.1:46992_ c:collection1   x:collection1] o.a.s.s.IndexSchema unique key field: id
   [junit4]   2> 494256 INFO  (coreLoadExecutor-2433-thread-1-processing-n:127.0.0.1:46992_) [n:127.0.0.1:46992_ c:collection1   x:collection1] o.a.s.s.FileExchangeRateProvider Reloading exchange rates from file currency.xml
   [junit4]   2> 494257 INFO  (coreLoadExecutor-2433-thread-1-processing-n:127.0.0.1:46992_) [n:127.0.0.1:46992_ c:collection1   x:collection1] o.a.s.s.FileExchangeRateProvider Reloading exchange rates from file currency.xml
   [junit4]   2> 494258 INFO  (coreLoadExecutor-2433-thread-1-processing-n:127.0.0.1:46992_) [n:127.0.0.1:46992_ c:collection1   x:collection1] o.a.s.s.OpenExchangeRatesOrgProvider Reloading exchange rates from open-exchange-rates.json
   [junit4]   2> 494258 WARN  (coreLoadExecutor-2433-thread-1-processing-n:127.0.0.1:46992_) [n:127.0.0.1:46992_ c:collection1   x:collection1] o.a.s.s.OpenExchangeRatesOrgProvider Unknown key IMPORTANT NOTE
   [junit4]   2> 494259 WARN  (coreLoadExecutor-2433-thread-1-processing-n:127.0.0.1:46992_) [n:127.0.0.1:46992_ c:collection1   x:collection1] o.a.s.s.OpenExchangeRatesOrgProvider Expected key, got STRING
   [junit4]   2> 494259 INFO  (coreLoadExecutor-2433-thread-1-processing-n:127.0.0.1:46992_) [n:127.0.0.1:46992_ c:collection1   x:collection1] o.a.s.s.OpenExchangeRatesOrgProvider Reloading exchange rates from open-exchange-rates.json
   [junit4]   2> 494259 WARN  (coreLoadExecutor-2433-thread-1-processing-n:127.0.0.1:46992_) [n:127.0.0.1:46992_ c:collection1   x:collection1] o.a.s.s.OpenExchangeRatesOrgProvider Unknown key IMPORTANT NOTE
   [junit4]   2> 494259 WARN  (coreLoadExecutor-2433-thread-1-processing-n:127.0.0.1:46992_) [n:127.0.0.1:46992_ c:collection1   x:collection1] o.a.s.s.OpenExchangeRatesOrgProvider Expected key, got STRING
   [junit4]   2> 494260 INFO  (coreLoadExecutor-2433-thread-1-processing-n:127.0.0.1:46992_) [n:127.0.0.1:46992_ c:collection1   x:collection1] o.a.s.c.ConfigSetProperties Did not find ConfigSet properties, assuming default properties: Can't find resource 'configsetprops.json' in classpath or '/configs/conf1', cwd=/home/jenkins/workspace/Lucene-Solr-trunk-Linux/solr/build/solr-core/test/J0
   [junit4]   2> 494260 INFO  (coreLoadExecutor-2433-thread-1-processing-n:127.0.0.1:46992_) [n:127.0.0.1:46992_ c:collection1   x:collection1] o.a.s.c.CoreContainer Creating SolrCore 'collection1' using configuration from collection collection1
   [junit4]   2> 494260 INFO  (coreLoadExecutor-2433-thread-1-processing-n:127.0.0.1:46992_) [n:127.0.0.1:46992_ c:collection1 s:shard2 r:core_node1 x:collection1] o.a.s.c.SolrCore org.apache.solr.core.MockDirectoryFactory
   [junit4]   2> 494260 INFO  (coreLoadExecutor-2433-thread-1-processing-n:127.0.0.1:46992_) [n:127.0.0.1:46992_ c:collection1 s:shard2 r:core_node1 x:collection1] o.a.s.c.SolrCore [[collection1] ] Opening new SolrCore at [/home/jenkins/workspace/Lucene-Solr-trunk-Linux/solr/build/solr-core/test/J0/../../../../../../../../../home/jenkins/workspace/Lucene-Solr-trunk-Linux/solr/build/solr-core/test/J0/temp/solr.cloud.DistribJoinFromCollectionTest_E34398B09FA3A45D-001/shard-1-001/cores/collection1/], dataDir=[null]
   [junit4]   2> 494260 INFO  (coreLoadExecutor-2433-thread-1-processing-n:127.0.0.1:46992_) [n:127.0.0.1:46992_ c:collection1 s:shard2 r:core_node1 x:collection1] o.a.s.c.JmxMonitoredMap JMX monitoring is enabled. Adding Solr mbeans to JMX Server: com.sun.jmx.mbeanserver.JmxMBeanServer@34bc6620
   [junit4]   2> 494260 INFO 

[...truncated too long message...]

]   2> 
   [junit4]   2> Maximum concurrent children watches above limit:
   [junit4]   2> 
   [junit4]   2> 	63	/solr/collections
   [junit4]   2> 	60	/solr/live_nodes
   [junit4]   2> 
   [junit4]   2> NOTE: reproduce with: ant test  -Dtestcase=CdcrReplicationHandlerTest -Dtests.method=doTest -Dtests.seed=E34398B09FA3A45D -Dtests.multiplier=3 -Dtests.slow=true -Dtests.locale=sah_RU -Dtests.timezone=Africa/Windhoek -Dtests.asserts=true -Dtests.file.encoding=UTF-8
   [junit4] ERROR    448s J2 | CdcrReplicationHandlerTest.doTest <<<
   [junit4]    > Throwable #1: java.lang.AssertionError: There are still nodes recoverying - waited for 330 seconds
   [junit4]    > 	at org.apache.solr.cloud.AbstractDistribZkTestBase.waitForRecoveriesToFinish(AbstractDistribZkTestBase.java:172)
   [junit4]    > 	at org.apache.solr.cloud.AbstractDistribZkTestBase.waitForRecoveriesToFinish(AbstractDistribZkTestBase.java:133)
   [junit4]    > 	at org.apache.solr.cloud.AbstractDistribZkTestBase.waitForRecoveriesToFinish(AbstractDistribZkTestBase.java:128)
   [junit4]    > 	at org.apache.solr.cloud.BaseCdcrDistributedZkTest.waitForRecoveriesToFinish(BaseCdcrDistributedZkTest.java:465)
   [junit4]    > 	at org.apache.solr.cloud.BaseCdcrDistributedZkTest.restartServer(BaseCdcrDistributedZkTest.java:506)
   [junit4]    > 	at org.apache.solr.cloud.CdcrReplicationHandlerTest.doTestPartialReplicationWithTruncatedTlog(CdcrReplicationHandlerTest.java:145)
   [junit4]    > 	at org.apache.solr.cloud.CdcrReplicationHandlerTest.doTest(CdcrReplicationHandlerTest.java:52)
   [junit4]    > 	at org.apache.solr.BaseDistributedSearchTestCase$ShardsRepeatRule$ShardsFixedStatement.callStatement(BaseDistributedSearchTestCase.java:963)
   [junit4]    > 	at org.apache.solr.BaseDistributedSearchTestCase$ShardsRepeatRule$ShardsStatement.evaluate(BaseDistributedSearchTestCase.java:938)
   [junit4]    > 	at java.lang.Thread.run(Thread.java:746)Throwable #2: com.carrotsearch.randomizedtesting.UncaughtExceptionError: Captured an uncaught exception in thread: Thread[id=8220, name=RecoveryThread-source_collection_shard1_replica2, state=RUNNABLE, group=TGRP-CdcrReplicationHandlerTest]
   [junit4]    > Caused by: org.apache.solr.common.cloud.ZooKeeperException: 
   [junit4]    > 	at __randomizedtesting.SeedInfo.seed([E34398B09FA3A45D]:0)
   [junit4]    > 	at org.apache.solr.cloud.RecoveryStrategy.run(RecoveryStrategy.java:234)
   [junit4]    > Caused by: org.apache.solr.common.SolrException: java.io.FileNotFoundException: /home/jenkins/workspace/Lucene-Solr-trunk-Linux/solr/build/solr-core/test/J2/temp/solr.cloud.CdcrReplicationHandlerTest_E34398B09FA3A45D-001/jetty-002/cores/source_collection_shard1_replica2/data/tlog/tlog.0000000000000000008.1511871005855842304 (No such file or directory)
   [junit4]    > 	at org.apache.solr.update.CdcrTransactionLog.reopenOutputStream(CdcrTransactionLog.java:244)
   [junit4]    > 	at org.apache.solr.update.CdcrTransactionLog.incref(CdcrTransactionLog.java:173)
   [junit4]    > 	at org.apache.solr.update.UpdateLog.getRecentUpdates(UpdateLog.java:1079)
   [junit4]    > 	at org.apache.solr.update.UpdateLog.seedBucketsWithHighestVersion(UpdateLog.java:1579)
   [junit4]    > 	at org.apache.solr.update.UpdateLog.seedBucketsWithHighestVersion(UpdateLog.java:1610)
   [junit4]    > 	at org.apache.solr.core.SolrCore.seedVersionBuckets(SolrCore.java:877)
   [junit4]    > 	at org.apache.solr.cloud.RecoveryStrategy.doRecovery(RecoveryStrategy.java:526)
   [junit4]    > 	at org.apache.solr.cloud.RecoveryStrategy.run(RecoveryStrategy.java:227)
   [junit4]    > Caused by: java.io.FileNotFoundException: /home/jenkins/workspace/Lucene-Solr-trunk-Linux/solr/build/solr-core/test/J2/temp/solr.cloud.CdcrReplicationHandlerTest_E34398B09FA3A45D-001/jetty-002/cores/source_collection_shard1_replica2/data/tlog/tlog.0000000000000000008.1511871005855842304 (No such file or directory)
   [junit4]    > 	at java.io.RandomAccessFile.open0(Native Method)
   [junit4]    > 	at java.io.RandomAccessFile.open(RandomAccessFile.java:327)
   [junit4]    > 	at java.io.RandomAccessFile.<init>(RandomAccessFile.java:243)
   [junit4]    > 	at org.apache.solr.update.CdcrTransactionLog.reopenOutputStream(CdcrTransactionLog.java:236)
   [junit4]    > 	... 7 more
   [junit4]   2> 1505023 INFO  (SUITE-CdcrReplicationHandlerTest-seed#[E34398B09FA3A45D]-worker) [n:127.0.0.1:55717_ c:source_collection s:shard1 r:core_node1 x:source_collection_shard1_replica1] o.a.s.SolrTestCaseJ4 ###deleteCore
   [junit4]   2> NOTE: leaving temporary files on disk at: /home/jenkins/workspace/Lucene-Solr-trunk-Linux/solr/build/solr-core/test/J2/temp/solr.cloud.CdcrReplicationHandlerTest_E34398B09FA3A45D-001
   [junit4]   2> Sep 09, 2015 9:09:01 PM com.carrotsearch.randomizedtesting.ThreadLeakControl checkThreadLeaks
   [junit4]   2> WARNING: Will linger awaiting termination of 4 leaked thread(s).
   [junit4]   2> NOTE: test params are: codec=DummyCompressingStoredFields(storedFieldsFormat=CompressingStoredFieldsFormat(compressionMode=DUMMY, chunkSize=5, maxDocsPerChunk=2, blockSize=7), termVectorsFormat=CompressingTermVectorsFormat(compressionMode=DUMMY, chunkSize=5, blockSize=7)), sim=RandomSimilarityProvider(queryNorm=true,coord=yes): {}, locale=sah_RU, timezone=Africa/Windhoek
   [junit4]   2> NOTE: Linux 3.19.0-26-generic amd64/Oracle Corporation 1.9.0-ea (64-bit)/cpus=12,threads=1,free=235018288,total=521142272
   [junit4]   2> NOTE: All tests run in this JVM: [RAMDirectoryFactoryTest, SolrXmlInZkTest, NoCacheHeaderTest, TestFuzzyAnalyzedSuggestions, TestLRUStatsCache, ClusterStateTest, TestBulkSchemaAPI, PrimitiveFieldTypeTest, HdfsBasicDistributedZkTest, RegexBoostProcessorTest, FacetPivotSmallTest, TestSearchPerf, DocValuesMultiTest, ResponseHeaderTest, OverseerTest, TestIndexSearcher, SolrCoreCheckLockOnStartupTest, TestDocBasedVersionConstraints, TestCoreDiscovery, CdcrUpdateLogTest, TestStressReorder, HdfsChaosMonkeySafeLeaderTest, TestConfigReload, FieldAnalysisRequestHandlerTest, SimpleFacetsTest, ZkNodePropsTest, TestTrieFacet, CursorMarkTest, TestDistributedStatsComponentCardinality, AsyncCallRequestStatusResponseTest, FieldMutatingUpdateProcessorTest, TestCSVResponseWriter, BigEndianAscendingWordDeserializerTest, AnalyticsMergeStrategyTest, TestLRUCache, OverseerCollectionConfigSetProcessorTest, TestExactSharedStatsCache, TestMiniSolrCloudClusterBase, TestHashQParserPlugin, TestGroupingSearch, DistribCursorPagingTest, TestPHPSerializedResponseWriter, TestSha256AuthenticationProvider, DirectUpdateHandlerOptimizeTest, SuggesterTSTTest, BinaryUpdateRequestHandlerTest, TestMissingGroups, TestSystemIdResolver, AnalyticsQueryTest, MultiThreadedOCPTest, TestElisionMultitermQuery, CoreAdminHandlerTest, TestBulkSchemaConcurrent, FullSolrCloudDistribCmdsTest, TestManagedSchemaDynamicFieldResource, TestJmxIntegration, TestExpandComponent, HdfsWriteToMultipleCollectionsTest, OverseerTaskQueueTest, TestSolrIndexConfig, DirectSolrConnectionTest, LukeRequestHandlerTest, TestDownShardTolerantSearch, DistributedDebugComponentTest, BadIndexSchemaTest, UUIDFieldTest, LeaderElectionTest, SegmentsInfoRequestHandlerTest, TestFieldResource, ShowFileRequestHandlerTest, OverriddenZkACLAndCredentialsProvidersTest, DistributedFacetPivotSmallAdvancedTest, DirectUpdateHandlerTest, TestSort, TestReRankQParserPlugin, AsyncMigrateRouteKeyTest, TestRecovery, RequestHandlersTest, TestStressRecovery, ConcurrentDeleteAndCreateCollectionTest, TermVectorComponentDistributedTest, TestRTimerTree, TestDefaultSimilarityFactory, TestSweetSpotSimilarityFactory, CloudMLTQParserTest, AddBlockUpdateTest, TestMinMaxOnMultiValuedField, RecoveryZkTest, TestExtendedDismaxParser, BasicDistributedZkTest, BasicDistributedZk2Test, LeaderElectionIntegrationTest, TestRandomFaceting, TestZkChroot, TestDistributedSearch, CurrencyFieldOpenExchangeTest, CurrencyFieldXmlFileTest, SimplePostToolTest, AnalysisAfterCoreReloadTest, SignatureUpdateProcessorFactoryTest, SpellCheckCollatorTest, SolrRequestParserTest, TestFoldingMultitermQuery, SuggesterTest, SuggesterWFSTTest, TestSolrDeletionPolicy1, DebugComponentTest, TestWriterPerf, DocumentAnalysisRequestHandlerTest, XmlUpdateRequestHandlerTest, MoreLikeThisHandlerTest, FastVectorHighlighterTest, LoggingHandlerTest, MBeansHandlerTest, PingRequestHandlerTest, TestComponentsName, TestQuerySenderListener, ResponseLogComponentTest, BadComponentTest, SampleTest, TestLuceneMatchVersion, TestLMDirichletSimilarityFactory, TestFastWriter, PluginInfoTest, TestDocumentBuilder, DistributedMLTComponentTest, TestEmbeddedSolrServerConstructors, ActionThrottleTest, AssignTest, BaseCdcrDistributedZkTest, CdcrReplicationHandlerTest]
   [junit4] Completed [432/545] on J2 in 448.92s, 1 test, 1 error <<< FAILURES!

[...truncated 363 lines...]
BUILD FAILED
/home/jenkins/workspace/Lucene-Solr-trunk-Linux/build.xml:775: The following error occurred while executing this line:
/home/jenkins/workspace/Lucene-Solr-trunk-Linux/build.xml:719: The following error occurred while executing this line:
/home/jenkins/workspace/Lucene-Solr-trunk-Linux/build.xml:59: The following error occurred while executing this line:
/home/jenkins/workspace/Lucene-Solr-trunk-Linux/solr/build.xml:233: The following error occurred while executing this line:
/home/jenkins/workspace/Lucene-Solr-trunk-Linux/solr/common-build.xml:514: The following error occurred while executing this line:
/home/jenkins/workspace/Lucene-Solr-trunk-Linux/lucene/common-build.xml:1432: The following error occurred while executing this line:
/home/jenkins/workspace/Lucene-Solr-trunk-Linux/lucene/common-build.xml:987: There were test failures: 545 suites, 2143 tests, 1 error, 1 failure, 71 ignored (35 assumptions)

Total time: 46 minutes 57 seconds
Build step 'Invoke Ant' marked build as failure
Archiving artifacts
[WARNINGS] Skipping publisher since build result is FAILURE
Recording test results
Email was triggered for: Failure - Any
Sending email for trigger: Failure - Any



Mime
View raw message