lucene-dev mailing list archives

Site index · List index
Message view « Date » · « Thread »
Top « Date » · « Thread »
From Policeman Jenkins Server <jenk...@thetaphi.de>
Subject [JENKINS] Lucene-Solr-5.x-Linux (32bit/jdk1.7.0_80) - Build # 13910 - Failure!
Date Sat, 12 Sep 2015 10:41:30 GMT
Build: http://jenkins.thetaphi.de/job/Lucene-Solr-5.x-Linux/13910/
Java: 32bit/jdk1.7.0_80 -client -XX:+UseConcMarkSweepGC

1 tests failed.
FAILED:  org.apache.lucene.index.TestIndexWriterExceptions.testNoLostDeletesOrUpdates

Error Message:
this IndexWriter is closed

Stack Trace:
org.apache.lucene.store.AlreadyClosedException: this IndexWriter is closed
	at __randomizedtesting.SeedInfo.seed([1CDE4CD4545E2EA2:75A54E5FA2F0E4E2]:0)
	at org.apache.lucene.index.IndexWriter.ensureOpen(IndexWriter.java:719)
	at org.apache.lucene.index.IndexWriter.getConfig(IndexWriter.java:1046)
	at org.apache.lucene.index.RandomIndexWriter.commit(RandomIndexWriter.java:283)
	at org.apache.lucene.index.TestIndexWriterExceptions.testNoLostDeletesOrUpdates(TestIndexWriterExceptions.java:2072)
	at sun.reflect.NativeMethodAccessorImpl.invoke0(Native Method)
	at sun.reflect.NativeMethodAccessorImpl.invoke(NativeMethodAccessorImpl.java:57)
	at sun.reflect.DelegatingMethodAccessorImpl.invoke(DelegatingMethodAccessorImpl.java:43)
	at java.lang.reflect.Method.invoke(Method.java:606)
	at com.carrotsearch.randomizedtesting.RandomizedRunner.invoke(RandomizedRunner.java:1627)
	at com.carrotsearch.randomizedtesting.RandomizedRunner$6.evaluate(RandomizedRunner.java:836)
	at com.carrotsearch.randomizedtesting.RandomizedRunner$7.evaluate(RandomizedRunner.java:872)
	at com.carrotsearch.randomizedtesting.RandomizedRunner$8.evaluate(RandomizedRunner.java:886)
	at org.apache.lucene.util.TestRuleSetupTeardownChained$1.evaluate(TestRuleSetupTeardownChained.java:50)
	at org.apache.lucene.util.AbstractBeforeAfterRule$1.evaluate(AbstractBeforeAfterRule.java:46)
	at org.apache.lucene.util.TestRuleThreadAndTestName$1.evaluate(TestRuleThreadAndTestName.java:49)
	at org.apache.lucene.util.TestRuleIgnoreAfterMaxFailures$1.evaluate(TestRuleIgnoreAfterMaxFailures.java:65)
	at org.apache.lucene.util.TestRuleMarkFailure$1.evaluate(TestRuleMarkFailure.java:48)
	at com.carrotsearch.randomizedtesting.rules.StatementAdapter.evaluate(StatementAdapter.java:36)
	at com.carrotsearch.randomizedtesting.ThreadLeakControl$StatementRunner.run(ThreadLeakControl.java:365)
	at com.carrotsearch.randomizedtesting.ThreadLeakControl.forkTimeoutingTask(ThreadLeakControl.java:798)
	at com.carrotsearch.randomizedtesting.ThreadLeakControl$3.evaluate(ThreadLeakControl.java:458)
	at com.carrotsearch.randomizedtesting.RandomizedRunner.runSingleTest(RandomizedRunner.java:845)
	at com.carrotsearch.randomizedtesting.RandomizedRunner$3.evaluate(RandomizedRunner.java:747)
	at com.carrotsearch.randomizedtesting.RandomizedRunner$4.evaluate(RandomizedRunner.java:781)
	at com.carrotsearch.randomizedtesting.RandomizedRunner$5.evaluate(RandomizedRunner.java:792)
	at org.apache.lucene.util.AbstractBeforeAfterRule$1.evaluate(AbstractBeforeAfterRule.java:46)
	at com.carrotsearch.randomizedtesting.rules.StatementAdapter.evaluate(StatementAdapter.java:36)
	at org.apache.lucene.util.TestRuleStoreClassName$1.evaluate(TestRuleStoreClassName.java:42)
	at com.carrotsearch.randomizedtesting.rules.NoShadowingOrOverridesOnMethodsRule$1.evaluate(NoShadowingOrOverridesOnMethodsRule.java:39)
	at com.carrotsearch.randomizedtesting.rules.NoShadowingOrOverridesOnMethodsRule$1.evaluate(NoShadowingOrOverridesOnMethodsRule.java:39)
	at com.carrotsearch.randomizedtesting.rules.StatementAdapter.evaluate(StatementAdapter.java:36)
	at com.carrotsearch.randomizedtesting.rules.StatementAdapter.evaluate(StatementAdapter.java:36)
	at com.carrotsearch.randomizedtesting.rules.StatementAdapter.evaluate(StatementAdapter.java:36)
	at org.apache.lucene.util.TestRuleAssertionsRequired$1.evaluate(TestRuleAssertionsRequired.java:54)
	at org.apache.lucene.util.TestRuleMarkFailure$1.evaluate(TestRuleMarkFailure.java:48)
	at org.apache.lucene.util.TestRuleIgnoreAfterMaxFailures$1.evaluate(TestRuleIgnoreAfterMaxFailures.java:65)
	at org.apache.lucene.util.TestRuleIgnoreTestSuites$1.evaluate(TestRuleIgnoreTestSuites.java:55)
	at com.carrotsearch.randomizedtesting.rules.StatementAdapter.evaluate(StatementAdapter.java:36)
	at com.carrotsearch.randomizedtesting.ThreadLeakControl$StatementRunner.run(ThreadLeakControl.java:365)
	at java.lang.Thread.run(Thread.java:745)
Caused by: org.apache.lucene.store.MockDirectoryWrapper$FakeIOException
	at org.apache.lucene.index.TestIndexWriterExceptions$11.eval(TestIndexWriterExceptions.java:1923)
	at org.apache.lucene.store.MockDirectoryWrapper.maybeThrowDeterministicException(MockDirectoryWrapper.java:958)
	at org.apache.lucene.store.MockIndexOutputWrapper.writeBytes(MockIndexOutputWrapper.java:145)
	at org.apache.lucene.store.MockIndexOutputWrapper.writeByte(MockIndexOutputWrapper.java:127)
	at org.apache.lucene.store.DataOutput.writeVInt(DataOutput.java:191)
	at org.apache.lucene.codecs.lucene50.Lucene50DocValuesConsumer.addNumericField(Lucene50DocValuesConsumer.java:163)
	at org.apache.lucene.codecs.lucene50.Lucene50DocValuesConsumer.addNumericField(Lucene50DocValuesConsumer.java:80)
	at org.apache.lucene.codecs.asserting.AssertingDocValuesFormat$AssertingDocValuesConsumer.addNumericField(AssertingDocValuesFormat.java:89)
	at org.apache.lucene.codecs.perfield.PerFieldDocValuesFormat$FieldsWriter.addNumericField(PerFieldDocValuesFormat.java:111)
	at org.apache.lucene.index.ReadersAndUpdates.handleNumericDVUpdates(ReadersAndUpdates.java:328)
	at org.apache.lucene.index.ReadersAndUpdates.writeFieldUpdates(ReadersAndUpdates.java:521)
	at org.apache.lucene.index.IndexWriter.commitMergedDeletesAndUpdates(IndexWriter.java:3417)
	at org.apache.lucene.index.IndexWriter.commitMerge(IndexWriter.java:3485)
	at org.apache.lucene.index.IndexWriter.mergeMiddle(IndexWriter.java:4212)
	at org.apache.lucene.index.IndexWriter.merge(IndexWriter.java:3644)
	at org.apache.lucene.index.ConcurrentMergeScheduler.doMerge(ConcurrentMergeScheduler.java:588)
	at org.apache.lucene.index.ConcurrentMergeScheduler$MergeThread.run(ConcurrentMergeScheduler.java:626)




Build Log:
[...truncated 1108 lines...]
   [junit4] Suite: org.apache.lucene.index.TestIndexWriterExceptions
   [junit4] IGNOR/A 0.00s J1 | TestIndexWriterExceptions.testTooManyTokens
   [junit4]    > Assumption #1: 'nightly' test group is disabled (@Nightly())
   [junit4]   2> NOTE: reproduce with: ant test  -Dtestcase=TestIndexWriterExceptions -Dtests.method=testNoLostDeletesOrUpdates
-Dtests.seed=1CDE4CD4545E2EA2 -Dtests.multiplier=3 -Dtests.slow=true -Dtests.locale=zh_TW
-Dtests.timezone=America/Mexico_City -Dtests.asserts=true -Dtests.file.encoding=UTF-8
   [junit4] ERROR   3.32s J1 | TestIndexWriterExceptions.testNoLostDeletesOrUpdates <<<
   [junit4]    > Throwable #1: org.apache.lucene.store.AlreadyClosedException: this IndexWriter
is closed
   [junit4]    > 	at __randomizedtesting.SeedInfo.seed([1CDE4CD4545E2EA2:75A54E5FA2F0E4E2]:0)
   [junit4]    > 	at org.apache.lucene.index.IndexWriter.ensureOpen(IndexWriter.java:719)
   [junit4]    > 	at org.apache.lucene.index.IndexWriter.getConfig(IndexWriter.java:1046)
   [junit4]    > 	at org.apache.lucene.index.RandomIndexWriter.commit(RandomIndexWriter.java:283)
   [junit4]    > 	at org.apache.lucene.index.TestIndexWriterExceptions.testNoLostDeletesOrUpdates(TestIndexWriterExceptions.java:2072)
   [junit4]    > 	at java.lang.Thread.run(Thread.java:745)
   [junit4]    > Caused by: org.apache.lucene.store.MockDirectoryWrapper$FakeIOException
   [junit4]    > 	at org.apache.lucene.index.TestIndexWriterExceptions$11.eval(TestIndexWriterExceptions.java:1923)
   [junit4]    > 	at org.apache.lucene.store.MockDirectoryWrapper.maybeThrowDeterministicException(MockDirectoryWrapper.java:958)
   [junit4]    > 	at org.apache.lucene.store.MockIndexOutputWrapper.writeBytes(MockIndexOutputWrapper.java:145)
   [junit4]    > 	at org.apache.lucene.store.MockIndexOutputWrapper.writeByte(MockIndexOutputWrapper.java:127)
   [junit4]    > 	at org.apache.lucene.store.DataOutput.writeVInt(DataOutput.java:191)
   [junit4]    > 	at org.apache.lucene.codecs.lucene50.Lucene50DocValuesConsumer.addNumericField(Lucene50DocValuesConsumer.java:163)
   [junit4]    > 	at org.apache.lucene.codecs.lucene50.Lucene50DocValuesConsumer.addNumericField(Lucene50DocValuesConsumer.java:80)
   [junit4]    > 	at org.apache.lucene.codecs.asserting.AssertingDocValuesFormat$AssertingDocValuesConsumer.addNumericField(AssertingDocValuesFormat.java:89)
   [junit4]    > 	at org.apache.lucene.codecs.perfield.PerFieldDocValuesFormat$FieldsWriter.addNumericField(PerFieldDocValuesFormat.java:111)
   [junit4]    > 	at org.apache.lucene.index.ReadersAndUpdates.handleNumericDVUpdates(ReadersAndUpdates.java:328)
   [junit4]    > 	at org.apache.lucene.index.ReadersAndUpdates.writeFieldUpdates(ReadersAndUpdates.java:521)
   [junit4]    > 	at org.apache.lucene.index.IndexWriter.commitMergedDeletesAndUpdates(IndexWriter.java:3417)
   [junit4]    > 	at org.apache.lucene.index.IndexWriter.commitMerge(IndexWriter.java:3485)
   [junit4]    > 	at org.apache.lucene.index.IndexWriter.mergeMiddle(IndexWriter.java:4212)
   [junit4]    > 	at org.apache.lucene.index.IndexWriter.merge(IndexWriter.java:3644)
   [junit4]    > 	at org.apache.lucene.index.ConcurrentMergeScheduler.doMerge(ConcurrentMergeScheduler.java:588)
   [junit4]    > 	at org.apache.lucene.index.ConcurrentMergeScheduler$MergeThread.run(ConcurrentMergeScheduler.java:626)
   [junit4]   2> NOTE: leaving temporary files on disk at: /home/jenkins/workspace/Lucene-Solr-5.x-Linux/lucene/build/core/test/J1/temp/lucene.index.TestIndexWriterExceptions_1CDE4CD4545E2EA2-001
   [junit4]   2> NOTE: test params are: codec=Asserting(Lucene53): {content7=Lucene50(blocksize=128),
contents=Lucene50(blocksize=128), crash=BlockTreeOrds(blocksize=128), foo=Lucene50(blocksize=128),
id=BlockTreeOrds(blocksize=128), content=Lucene50(blocksize=128), content2=BlockTreeOrds(blocksize=128),
content5=PostingsFormat(name=LuceneVarGapFixedInterval), field=Lucene50(blocksize=128), content6=BlockTreeOrds(blocksize=128),
content1=PostingsFormat(name=LuceneVarGapFixedInterval), subid=BlockTreeOrds(blocksize=128),
field2=PostingsFormat(name=LuceneVarGapFixedInterval), field1=Lucene50(blocksize=128), content4=Lucene50(blocksize=128)},
docValues:{f=DocValuesFormat(name=Lucene50), bcf=DocValuesFormat(name=Memory), sortednumericdv=DocValuesFormat(name=Lucene50),
numericdv=DocValuesFormat(name=Asserting), bf=DocValuesFormat(name=Lucene50), binarydv=DocValuesFormat(name=Asserting),
sortedsetdv=DocValuesFormat(name=Asserting), cf=DocValuesFormat(name=Asserting), sorteddv=DocValuesFormat(name=Asserting)},
sim=RandomSimilarityProvider(queryNorm=false,coord=crazy): {contents=DFR I(ne)L3(800.0), id=IB
SPL-L2, content=DFR I(ne)B2, content2=DFR I(n)B1, field=DFR I(n)3(800.0), content6=LM Jelinek-Mercer(0.100000),
content1=DFR I(ne)Z(0.3), content4=DFR GB1}, locale=zh_TW, timezone=America/Mexico_City
   [junit4]   2> NOTE: Linux 3.19.0-26-generic i386/Oracle Corporation 1.7.0_80 (32-bit)/cpus=12,threads=1,free=164600216,total=306622464
   [junit4]   2> NOTE: All tests run in this JVM: [TestFuzzyQuery, TestFieldsReader, TestIndexWriterMaxDocs,
TestDemo, TestDocumentWriter, TestConstantScoreQuery, TestBooleanMinShouldMatch, TestSubScorerFreqs,
TestNRTCachingDirectory, TestDocValues, Test2BPagedBytes, TestUsageTrackingFilterCachingPolicy,
TestSimpleFSDirectory, TestSegmentTermDocs, TestFilteredQuery, TestSortedNumericSortField,
TestSizeBoundedForceMerge, TestAddIndexes, TestSpanMultiTermQueryWrapper, TestRegexpQuery,
TestLucene50SegmentInfoFormat, TestFastDecompressionMode, TestBoolean2, TestWildcardRandom,
TestFilterDirectoryReader, TestFileSwitchDirectory, TestSloppyMath, TestSpanContainQuery,
TestSloppyPhraseQuery2, TestDeterminizeLexicon, TestFlushByRamOrCountsPolicy, TestSearchAfter,
TestMatchAllDocsQuery, TestPrefixInBooleanQuery, TestAllFilesHaveChecksumFooter, Test4GBStoredFields,
TestTryDelete, TestDocumentsWriterStallControl, TestIndexWriterForceMerge, TestStressAdvance,
TestMinShouldMatch2, TestReaderClosed, TestNoMergeScheduler, TestSpanOrQuery, TestPackedInts,
TestApproximationSearchEquivalence, TestDocsAndPositions, TestSearch, TestSimilarity2, TestPriorityQueue,
TestLucene50FieldInfoFormat, TestElevationComparator, TestTermVectorsWriter, TestNeedsScores,
TestBlendedTermQuery, TestDuelingCodecs, TestField, TestByteSlices, TestIndexWriterExceptions]
   [junit4] Completed [190/414] on J1 in 12.27s, 36 tests, 1 error, 1 skipped <<<
FAILURES!

[...truncated 727 lines...]
BUILD FAILED
/home/jenkins/workspace/Lucene-Solr-5.x-Linux/build.xml:785: The following error occurred
while executing this line:
/home/jenkins/workspace/Lucene-Solr-5.x-Linux/build.xml:729: The following error occurred
while executing this line:
/home/jenkins/workspace/Lucene-Solr-5.x-Linux/build.xml:59: The following error occurred while
executing this line:
/home/jenkins/workspace/Lucene-Solr-5.x-Linux/lucene/build.xml:50: The following error occurred
while executing this line:
/home/jenkins/workspace/Lucene-Solr-5.x-Linux/lucene/common-build.xml:1452: The following
error occurred while executing this line:
/home/jenkins/workspace/Lucene-Solr-5.x-Linux/lucene/common-build.xml:1006: There were test
failures: 414 suites, 3334 tests, 1 error, 52 ignored (48 assumptions)

Total time: 7 minutes 16 seconds
Build step 'Invoke Ant' marked build as failure
Archiving artifacts
[WARNINGS] Skipping publisher since build result is FAILURE
Recording test results
Email was triggered for: Failure - Any
Sending email for trigger: Failure - Any



Mime
View raw message