lucene-dev mailing list archives

Site index · List index
Message view « Date » · « Thread »
Top « Date » · « Thread »
From Apache Jenkins Server <jenk...@builds.apache.org>
Subject [JENKINS] Lucene-Solr-NightlyTests-5.x - Build # 971 - Still Failing
Date Wed, 30 Sep 2015 00:35:03 GMT
Build: https://builds.apache.org/job/Lucene-Solr-NightlyTests-5.x/971/

2 tests failed.
REGRESSION:  org.apache.solr.cloud.CollectionsAPIDistributedZkTest.test

Error Message:
Captured an uncaught exception in thread: Thread[id=1857, name=collection5, state=RUNNABLE, group=TGRP-CollectionsAPIDistributedZkTest]

Stack Trace:
com.carrotsearch.randomizedtesting.UncaughtExceptionError: Captured an uncaught exception in thread: Thread[id=1857, name=collection5, state=RUNNABLE, group=TGRP-CollectionsAPIDistributedZkTest]
Caused by: org.apache.solr.client.solrj.impl.HttpSolrClient$RemoteSolrException: Error from server at http://127.0.0.1:50250: Could not find collection : awholynewstresscollection_collection5_3
	at __randomizedtesting.SeedInfo.seed([55BD0976D413947D]:0)
	at org.apache.solr.client.solrj.impl.HttpSolrClient.executeMethod(HttpSolrClient.java:575)
	at org.apache.solr.client.solrj.impl.HttpSolrClient.request(HttpSolrClient.java:241)
	at org.apache.solr.client.solrj.impl.HttpSolrClient.request(HttpSolrClient.java:230)
	at org.apache.solr.client.solrj.impl.LBHttpSolrClient.doRequest(LBHttpSolrClient.java:372)
	at org.apache.solr.client.solrj.impl.LBHttpSolrClient.request(LBHttpSolrClient.java:325)
	at org.apache.solr.client.solrj.impl.CloudSolrClient.sendRequest(CloudSolrClient.java:1099)
	at org.apache.solr.client.solrj.impl.CloudSolrClient.requestWithRetryOnStaleState(CloudSolrClient.java:870)
	at org.apache.solr.client.solrj.impl.CloudSolrClient.request(CloudSolrClient.java:806)
	at org.apache.solr.client.solrj.SolrClient.request(SolrClient.java:1220)
	at org.apache.solr.cloud.CollectionsAPIDistributedZkTest$1CollectionThread.run(CollectionsAPIDistributedZkTest.java:895)


FAILED:  org.apache.solr.cloud.hdfs.HdfsCollectionsAPIDistributedZkTest.test

Error Message:
Captured an uncaught exception in thread: Thread[id=5359, name=collection4, state=RUNNABLE, group=TGRP-HdfsCollectionsAPIDistributedZkTest]

Stack Trace:
com.carrotsearch.randomizedtesting.UncaughtExceptionError: Captured an uncaught exception in thread: Thread[id=5359, name=collection4, state=RUNNABLE, group=TGRP-HdfsCollectionsAPIDistributedZkTest]
Caused by: org.apache.solr.client.solrj.impl.HttpSolrClient$RemoteSolrException: Error from server at http://127.0.0.1:53360: Could not find collection : awholynewstresscollection_collection4_1
	at __randomizedtesting.SeedInfo.seed([55BD0976D413947D]:0)
	at org.apache.solr.client.solrj.impl.HttpSolrClient.executeMethod(HttpSolrClient.java:575)
	at org.apache.solr.client.solrj.impl.HttpSolrClient.request(HttpSolrClient.java:241)
	at org.apache.solr.client.solrj.impl.HttpSolrClient.request(HttpSolrClient.java:230)
	at org.apache.solr.client.solrj.impl.LBHttpSolrClient.doRequest(LBHttpSolrClient.java:372)
	at org.apache.solr.client.solrj.impl.LBHttpSolrClient.request(LBHttpSolrClient.java:325)
	at org.apache.solr.client.solrj.impl.CloudSolrClient.sendRequest(CloudSolrClient.java:1099)
	at org.apache.solr.client.solrj.impl.CloudSolrClient.requestWithRetryOnStaleState(CloudSolrClient.java:870)
	at org.apache.solr.client.solrj.impl.CloudSolrClient.request(CloudSolrClient.java:806)
	at org.apache.solr.client.solrj.SolrClient.request(SolrClient.java:1220)
	at org.apache.solr.cloud.CollectionsAPIDistributedZkTest$1CollectionThread.run(CollectionsAPIDistributedZkTest.java:895)




Build Log:
[...truncated 10143 lines...]
   [junit4] Suite: org.apache.solr.cloud.CollectionsAPIDistributedZkTest
   [junit4]   2> Creating dataDir: /x1/jenkins/jenkins-slave/workspace/Lucene-Solr-NightlyTests-5.x/solr/build/solr-core/test/J1/temp/solr.cloud.CollectionsAPIDistributedZkTest_55BD0976D413947D-001/init-core-data-001
   [junit4]   2> 121970 INFO  (SUITE-CollectionsAPIDistributedZkTest-seed#[55BD0976D413947D]-worker) [    ] o.a.s.SolrTestCaseJ4 Randomized ssl (false) and clientAuth (true)
   [junit4]   2> 121970 INFO  (SUITE-CollectionsAPIDistributedZkTest-seed#[55BD0976D413947D]-worker) [    ] o.a.s.BaseDistributedSearchTestCase Setting hostContext system property: /
   [junit4]   2> 121976 INFO  (TEST-CollectionsAPIDistributedZkTest.test-seed#[55BD0976D413947D]) [    ] o.a.s.c.ZkTestServer STARTING ZK TEST SERVER
   [junit4]   2> 121976 INFO  (Thread-1082) [    ] o.a.s.c.ZkTestServer client port:0.0.0.0/0.0.0.0:0
   [junit4]   2> 121976 INFO  (Thread-1082) [    ] o.a.s.c.ZkTestServer Starting server
   [junit4]   2> 122076 INFO  (TEST-CollectionsAPIDistributedZkTest.test-seed#[55BD0976D413947D]) [    ] o.a.s.c.ZkTestServer start zk server on port:53827
   [junit4]   2> 122076 INFO  (TEST-CollectionsAPIDistributedZkTest.test-seed#[55BD0976D413947D]) [    ] o.a.s.c.c.SolrZkClient Using default ZkCredentialsProvider
   [junit4]   2> 122078 INFO  (TEST-CollectionsAPIDistributedZkTest.test-seed#[55BD0976D413947D]) [    ] o.a.s.c.c.ConnectionManager Waiting for client to connect to ZooKeeper
   [junit4]   2> 122102 INFO  (zkCallback-81-thread-1) [    ] o.a.s.c.c.ConnectionManager Watcher org.apache.solr.common.cloud.ConnectionManager@7459376 name:ZooKeeperConnection Watcher:127.0.0.1:53827 got event WatchedEvent state:SyncConnected type:None path:null path:null type:None
   [junit4]   2> 122102 INFO  (TEST-CollectionsAPIDistributedZkTest.test-seed#[55BD0976D413947D]) [    ] o.a.s.c.c.ConnectionManager Client is connected to ZooKeeper
   [junit4]   2> 122102 INFO  (TEST-CollectionsAPIDistributedZkTest.test-seed#[55BD0976D413947D]) [    ] o.a.s.c.c.SolrZkClient Using default ZkACLProvider
   [junit4]   2> 122102 INFO  (TEST-CollectionsAPIDistributedZkTest.test-seed#[55BD0976D413947D]) [    ] o.a.s.c.c.SolrZkClient makePath: /solr
   [junit4]   2> 122116 INFO  (TEST-CollectionsAPIDistributedZkTest.test-seed#[55BD0976D413947D]) [    ] o.a.s.c.c.SolrZkClient Using default ZkCredentialsProvider
   [junit4]   2> 122119 INFO  (TEST-CollectionsAPIDistributedZkTest.test-seed#[55BD0976D413947D]) [    ] o.a.s.c.c.ConnectionManager Waiting for client to connect to ZooKeeper
   [junit4]   2> 122119 INFO  (zkCallback-82-thread-1) [    ] o.a.s.c.c.ConnectionManager Watcher org.apache.solr.common.cloud.ConnectionManager@288c7c7d name:ZooKeeperConnection Watcher:127.0.0.1:53827/solr got event WatchedEvent state:SyncConnected type:None path:null path:null type:None
   [junit4]   2> 122119 INFO  (TEST-CollectionsAPIDistributedZkTest.test-seed#[55BD0976D413947D]) [    ] o.a.s.c.c.ConnectionManager Client is connected to ZooKeeper
   [junit4]   2> 122120 INFO  (TEST-CollectionsAPIDistributedZkTest.test-seed#[55BD0976D413947D]) [    ] o.a.s.c.c.SolrZkClient Using default ZkACLProvider
   [junit4]   2> 122120 INFO  (TEST-CollectionsAPIDistributedZkTest.test-seed#[55BD0976D413947D]) [    ] o.a.s.c.c.SolrZkClient makePath: /collections/collection1
   [junit4]   2> 122123 INFO  (TEST-CollectionsAPIDistributedZkTest.test-seed#[55BD0976D413947D]) [    ] o.a.s.c.c.SolrZkClient makePath: /collections/collection1/shards
   [junit4]   2> 122125 INFO  (TEST-CollectionsAPIDistributedZkTest.test-seed#[55BD0976D413947D]) [    ] o.a.s.c.c.SolrZkClient makePath: /collections/control_collection
   [junit4]   2> 122129 INFO  (TEST-CollectionsAPIDistributedZkTest.test-seed#[55BD0976D413947D]) [    ] o.a.s.c.c.SolrZkClient makePath: /collections/control_collection/shards
   [junit4]   2> 122132 INFO  (TEST-CollectionsAPIDistributedZkTest.test-seed#[55BD0976D413947D]) [    ] o.a.s.c.AbstractZkTestCase put /x1/jenkins/jenkins-slave/workspace/Lucene-Solr-NightlyTests-5.x/solr/core/src/test-files/solr/collection1/conf/solrconfig-tlog.xml to /configs/conf1/solrconfig.xml
   [junit4]   2> 122132 INFO  (TEST-CollectionsAPIDistributedZkTest.test-seed#[55BD0976D413947D]) [    ] o.a.s.c.c.SolrZkClient makePath: /configs/conf1/solrconfig.xml
   [junit4]   2> 122138 INFO  (TEST-CollectionsAPIDistributedZkTest.test-seed#[55BD0976D413947D]) [    ] o.a.s.c.AbstractZkTestCase put /x1/jenkins/jenkins-slave/workspace/Lucene-Solr-NightlyTests-5.x/solr/core/src/test-files/solr/collection1/conf/schema.xml to /configs/conf1/schema.xml
   [junit4]   2> 122138 INFO  (TEST-CollectionsAPIDistributedZkTest.test-seed#[55BD0976D413947D]) [    ] o.a.s.c.c.SolrZkClient makePath: /configs/conf1/schema.xml
   [junit4]   2> 122145 INFO  (TEST-CollectionsAPIDistributedZkTest.test-seed#[55BD0976D413947D]) [    ] o.a.s.c.AbstractZkTestCase put /x1/jenkins/jenkins-slave/workspace/Lucene-Solr-NightlyTests-5.x/solr/core/src/test-files/solr/collection1/conf/solrconfig.snippet.randomindexconfig.xml to /configs/conf1/solrconfig.snippet.randomindexconfig.xml
   [junit4]   2> 122145 INFO  (TEST-CollectionsAPIDistributedZkTest.test-seed#[55BD0976D413947D]) [    ] o.a.s.c.c.SolrZkClient makePath: /configs/conf1/solrconfig.snippet.randomindexconfig.xml
   [junit4]   2> 122154 INFO  (TEST-CollectionsAPIDistributedZkTest.test-seed#[55BD0976D413947D]) [    ] o.a.s.c.AbstractZkTestCase put /x1/jenkins/jenkins-slave/workspace/Lucene-Solr-NightlyTests-5.x/solr/core/src/test-files/solr/collection1/conf/stopwords.txt to /configs/conf1/stopwords.txt
   [junit4]   2> 122154 INFO  (TEST-CollectionsAPIDistributedZkTest.test-seed#[55BD0976D413947D]) [    ] o.a.s.c.c.SolrZkClient makePath: /configs/conf1/stopwords.txt
   [junit4]   2> 122160 INFO  (TEST-CollectionsAPIDistributedZkTest.test-seed#[55BD0976D413947D]) [    ] o.a.s.c.AbstractZkTestCase put /x1/jenkins/jenkins-slave/workspace/Lucene-Solr-NightlyTests-5.x/solr/core/src/test-files/solr/collection1/conf/protwords.txt to /configs/conf1/protwords.txt
   [junit4]   2> 122160 INFO  (TEST-CollectionsAPIDistributedZkTest.test-seed#[55BD0976D413947D]) [    ] o.a.s.c.c.SolrZkClient makePath: /configs/conf1/protwords.txt
   [junit4]   2> 122163 INFO  (TEST-CollectionsAPIDistributedZkTest.test-seed#[55BD0976D413947D]) [    ] o.a.s.c.AbstractZkTestCase put /x1/jenkins/jenkins-slave/workspace/Lucene-Solr-NightlyTests-5.x/solr/core/src/test-files/solr/collection1/conf/currency.xml to /configs/conf1/currency.xml
   [junit4]   2> 122163 INFO  (TEST-CollectionsAPIDistributedZkTest.test-seed#[55BD0976D413947D]) [    ] o.a.s.c.c.SolrZkClient makePath: /configs/conf1/currency.xml
   [junit4]   2> 122167 INFO  (TEST-CollectionsAPIDistributedZkTest.test-seed#[55BD0976D413947D]) [    ] o.a.s.c.AbstractZkTestCase put /x1/jenkins/jenkins-slave/workspace/Lucene-Solr-NightlyTests-5.x/solr/core/src/test-files/solr/collection1/conf/enumsConfig.xml to /configs/conf1/enumsConfig.xml
   [junit4]   2> 122167 INFO  (TEST-CollectionsAPIDistributedZkTest.test-seed#[55BD0976D413947D]) [    ] o.a.s.c.c.SolrZkClient makePath: /configs/conf1/enumsConfig.xml
   [junit4]   2> 122172 INFO  (TEST-CollectionsAPIDistributedZkTest.test-seed#[55BD0976D413947D]) [    ] o.a.s.c.AbstractZkTestCase put /x1/jenkins/jenkins-slave/workspace/Lucene-Solr-NightlyTests-5.x/solr/core/src/test-files/solr/collection1/conf/open-exchange-rates.json to /configs/conf1/open-exchange-rates.json
   [junit4]   2> 122172 INFO  (TEST-CollectionsAPIDistributedZkTest.test-seed#[55BD0976D413947D]) [    ] o.a.s.c.c.SolrZkClient makePath: /configs/conf1/open-exchange-rates.json
   [junit4]   2> 122178 INFO  (TEST-CollectionsAPIDistributedZkTest.test-seed#[55BD0976D413947D]) [    ] o.a.s.c.AbstractZkTestCase put /x1/jenkins/jenkins-slave/workspace/Lucene-Solr-NightlyTests-5.x/solr/core/src/test-files/solr/collection1/conf/mapping-ISOLatin1Accent.txt to /configs/conf1/mapping-ISOLatin1Accent.txt
   [junit4]   2> 122178 INFO  (TEST-CollectionsAPIDistributedZkTest.test-seed#[55BD0976D413947D]) [    ] o.a.s.c.c.SolrZkClient makePath: /configs/conf1/mapping-ISOLatin1Accent.txt
   [junit4]   2> 122181 INFO  (TEST-CollectionsAPIDistributedZkTest.test-seed#[55BD0976D413947D]) [    ] o.a.s.c.AbstractZkTestCase put /x1/jenkins/jenkins-slave/workspace/Lucene-Solr-NightlyTests-5.x/solr/core/src/test-files/solr/collection1/conf/old_synonyms.txt to /configs/conf1/old_synonyms.txt
   [junit4]   2> 122181 INFO  (TEST-CollectionsAPIDistributedZkTest.test-seed#[55BD0976D413947D]) [    ] o.a.s.c.c.SolrZkClient makePath: /configs/conf1/old_synonyms.txt
   [junit4]   2> 122183 INFO  (TEST-CollectionsAPIDistributedZkTest.test-seed#[55BD0976D413947D]) [    ] o.a.s.c.AbstractZkTestCase put /x1/jenkins/jenkins-slave/workspace/Lucene-Solr-NightlyTests-5.x/solr/core/src/test-files/solr/collection1/conf/synonyms.txt to /configs/conf1/synonyms.txt
   [junit4]   2> 122184 INFO  (TEST-CollectionsAPIDistributedZkTest.test-seed#[55BD0976D413947D]) [    ] o.a.s.c.c.SolrZkClient makePath: /configs/conf1/synonyms.txt
   [junit4]   2> 122588 INFO  (TEST-CollectionsAPIDistributedZkTest.test-seed#[55BD0976D413947D]) [    ] o.a.s.SolrTestCaseJ4 Writing core.properties file to /x1/jenkins/jenkins-slave/workspace/Lucene-Solr-NightlyTests-5.x/solr/build/solr-core/test/J1/temp/solr.cloud.CollectionsAPIDistributedZkTest_55BD0976D413947D-001/control-001/cores/collection1
   [junit4]   2> 122589 INFO  (TEST-CollectionsAPIDistributedZkTest.test-seed#[55BD0976D413947D]) [    ] o.e.j.s.Server jetty-9.2.13.v20150730
   [junit4]   2> 122591 INFO  (TEST-CollectionsAPIDistributedZkTest.test-seed#[55BD0976D413947D]) [    ] o.e.j.s.h.ContextHandler Started o.e.j.s.ServletContextHandler@34aab9eb{/,null,AVAILABLE}
   [junit4]   2> 122593 INFO  (TEST-CollectionsAPIDistributedZkTest.test-seed#[55BD0976D413947D]) [    ] o.e.j.s.ServerConnector Started ServerConnector@6437c127{HTTP/1.1}{127.0.0.1:50250}
   [junit4]   2> 122593 INFO  (TEST-CollectionsAPIDistributedZkTest.test-seed#[55BD0976D413947D]) [    ] o.e.j.s.Server Started @125801ms
   [junit4]   2> 122593 INFO  (TEST-CollectionsAPIDistributedZkTest.test-seed#[55BD0976D413947D]) [    ] o.a.s.c.s.e.JettySolrRunner Jetty properties: {hostContext=/, hostPort=50250, solr.data.dir=/x1/jenkins/jenkins-slave/workspace/Lucene-Solr-NightlyTests-5.x/solr/build/solr-core/test/J1/temp/solr.cloud.CollectionsAPIDistributedZkTest_55BD0976D413947D-001/tempDir-001/control/data, coreRootDirectory=/x1/jenkins/jenkins-slave/workspace/Lucene-Solr-NightlyTests-5.x/solr/build/solr-core/test/J1/temp/solr.cloud.CollectionsAPIDistributedZkTest_55BD0976D413947D-001/control-001/cores}
   [junit4]   2> 122594 INFO  (TEST-CollectionsAPIDistributedZkTest.test-seed#[55BD0976D413947D]) [    ] o.a.s.s.SolrDispatchFilter SolrDispatchFilter.init(): sun.misc.Launcher$AppClassLoader@1fe91485
   [junit4]   2> 122594 INFO  (TEST-CollectionsAPIDistributedZkTest.test-seed#[55BD0976D413947D]) [    ] o.a.s.c.SolrResourceLoader new SolrResourceLoader for directory: '/x1/jenkins/jenkins-slave/workspace/Lucene-Solr-NightlyTests-5.x/solr/build/solr-core/test/J1/temp/solr.cloud.CollectionsAPIDistributedZkTest_55BD0976D413947D-001/control-001/'
   [junit4]   2> 122609 INFO  (TEST-CollectionsAPIDistributedZkTest.test-seed#[55BD0976D413947D]) [    ] o.a.s.c.c.SolrZkClient Using default ZkCredentialsProvider
   [junit4]   2> 122609 INFO  (TEST-CollectionsAPIDistributedZkTest.test-seed#[55BD0976D413947D]) [    ] o.a.s.c.c.ConnectionManager Waiting for client to connect to ZooKeeper
   [junit4]   2> 122612 INFO  (zkCallback-83-thread-1) [    ] o.a.s.c.c.ConnectionManager Watcher org.apache.solr.common.cloud.ConnectionManager@71466c69 name:ZooKeeperConnection Watcher:127.0.0.1:53827/solr got event WatchedEvent state:SyncConnected type:None path:null path:null type:None
   [junit4]   2> 122612 INFO  (TEST-CollectionsAPIDistributedZkTest.test-seed#[55BD0976D413947D]) [    ] o.a.s.c.c.ConnectionManager Client is connected to ZooKeeper
   [junit4]   2> 122612 INFO  (TEST-CollectionsAPIDistributedZkTest.test-seed#[55BD0976D413947D]) [    ] o.a.s.c.c.SolrZkClient Using default ZkACLProvider
   [junit4]   2> 122614 INFO  (TEST-CollectionsAPIDistributedZkTest.test-seed#[55BD0976D413947D]) [    ] o.a.s.s.SolrDispatchFilter Loading solr.xml from SolrHome (not found in ZooKeeper)
   [junit4]   2> 122614 INFO  (TEST-CollectionsAPIDistributedZkTest.test-seed#[55BD0976D413947D]) [    ] o.a.s.c.SolrXmlConfig Loading container configuration from /x1/jenkins/jenkins-slave/workspace/Lucene-Solr-NightlyTests-5.x/solr/build/solr-core/test/J1/temp/solr.cloud.CollectionsAPIDistributedZkTest_55BD0976D413947D-001/control-001/solr.xml
   [junit4]   2> 122629 INFO  (TEST-CollectionsAPIDistributedZkTest.test-seed#[55BD0976D413947D]) [    ] o.a.s.c.CoresLocator Config-defined core root directory: /x1/jenkins/jenkins-slave/workspace/Lucene-Solr-NightlyTests-5.x/solr/build/solr-core/test/J1/temp/solr.cloud.CollectionsAPIDistributedZkTest_55BD0976D413947D-001/control-001/cores
   [junit4]   2> 122629 INFO  (TEST-CollectionsAPIDistributedZkTest.test-seed#[55BD0976D413947D]) [    ] o.a.s.c.CoreContainer New CoreContainer 1134912663
   [junit4]   2> 122629 INFO  (TEST-CollectionsAPIDistributedZkTest.test-seed#[55BD0976D413947D]) [    ] o.a.s.c.CoreContainer Loading cores into CoreContainer [instanceDir=/x1/jenkins/jenkins-slave/workspace/Lucene-Solr-NightlyTests-5.x/solr/build/solr-core/test/J1/temp/solr.cloud.CollectionsAPIDistributedZkTest_55BD0976D413947D-001/control-001/]
   [junit4]   2> 122629 INFO  (TEST-CollectionsAPIDistributedZkTest.test-seed#[55BD0976D413947D]) [    ] o.a.s.c.CoreContainer loading shared library: /x1/jenkins/jenkins-slave/workspace/Lucene-Solr-NightlyTests-5.x/solr/build/solr-core/test/J1/temp/solr.cloud.CollectionsAPIDistributedZkTest_55BD0976D413947D-001/control-001/lib
   [junit4]   2> 122629 WARN  (TEST-CollectionsAPIDistributedZkTest.test-seed#[55BD0976D413947D]) [    ] o.a.s.c.SolrResourceLoader Can't find (or read) directory to add to classloader: lib (resolved as: /x1/jenkins/jenkins-slave/workspace/Lucene-Solr-NightlyTests-5.x/solr/build/solr-core/test/J1/temp/solr.cloud.CollectionsAPIDistributedZkTest_55BD0976D413947D-001/control-001/lib).
   [junit4]   2> 122637 INFO  (TEST-CollectionsAPIDistributedZkTest.test-seed#[55BD0976D413947D]) [    ] o.a.s.h.c.HttpShardHandlerFactory created with socketTimeout : 90000,urlScheme : ,connTimeout : 15000,maxConnectionsPerHost : 20,maxConnections : 10000,corePoolSize : 0,maximumPoolSize : 2147483647,maxThreadIdleTime : 5,sizeOfQueue : -1,fairnessPolicy : false,useRetries : false,
   [junit4]   2> 122638 INFO  (TEST-CollectionsAPIDistributedZkTest.test-seed#[55BD0976D413947D]) [    ] o.a.s.u.UpdateShardHandler Creating UpdateShardHandler HTTP client with params: socketTimeout=340000&connTimeout=45000&retry=true
   [junit4]   2> 122638 INFO  (TEST-CollectionsAPIDistributedZkTest.test-seed#[55BD0976D413947D]) [    ] o.a.s.l.LogWatcher SLF4J impl is org.slf4j.impl.Log4jLoggerFactory
   [junit4]   2> 122639 INFO  (TEST-CollectionsAPIDistributedZkTest.test-seed#[55BD0976D413947D]) [    ] o.a.s.l.LogWatcher Registering Log Listener [Log4j (org.slf4j.impl.Log4jLoggerFactory)]
   [junit4]   2> 122639 INFO  (TEST-CollectionsAPIDistributedZkTest.test-seed#[55BD0976D413947D]) [    ] o.a.s.c.ZkContainer Zookeeper client=127.0.0.1:53827/solr
   [junit4]   2> 122639 INFO  (TEST-CollectionsAPIDistributedZkTest.test-seed#[55BD0976D413947D]) [    ] o.a.s.c.ZkController zkHost includes chroot
   [junit4]   2> 122639 INFO  (TEST-CollectionsAPIDistributedZkTest.test-seed#[55BD0976D413947D]) [    ] o.a.s.c.c.SolrZkClient Using default ZkCredentialsProvider
   [junit4]   2> 122639 INFO  (TEST-CollectionsAPIDistributedZkTest.test-seed#[55BD0976D413947D]) [    ] o.a.s.c.c.ConnectionManager Waiting for client to connect to ZooKeeper
   [junit4]   2> 122643 INFO  (zkCallback-85-thread-1) [    ] o.a.s.c.c.ConnectionManager Watcher org.apache.solr.common.cloud.ConnectionManager@1db90d08 name:ZooKeeperConnection Watcher:127.0.0.1:53827 got event WatchedEvent state:SyncConnected type:None path:null path:null type:None
   [junit4]   2> 122644 INFO  (TEST-CollectionsAPIDistributedZkTest.test-seed#[55BD0976D413947D]) [    ] o.a.s.c.c.ConnectionManager Client is connected to ZooKeeper
   [junit4]   2> 122644 INFO  (TEST-CollectionsAPIDistributedZkTest.test-seed#[55BD0976D413947D]) [    ] o.a.s.c.c.SolrZkClient Using default ZkACLProvider
   [junit4]   2> 122649 INFO  (TEST-CollectionsAPIDistributedZkTest.test-seed#[55BD0976D413947D]) [n:127.0.0.1:50250_    ] o.a.s.c.c.ConnectionManager Waiting for client to connect to ZooKeeper
   [junit4]   2> 122650 INFO  (zkCallback-86-thread-1-processing-n:127.0.0.1:50250_) [n:127.0.0.1:50250_    ] o.a.s.c.c.ConnectionManager Watcher org.apache.solr.common.cloud.ConnectionManager@1d398082 name:ZooKeeperConnection Watcher:127.0.0.1:53827/solr got event WatchedEvent state:SyncConnected type:None path:null path:null type:None
   [junit4]   2> 122650 INFO  (TEST-CollectionsAPIDistributedZkTest.test-seed#[55BD0976D413947D]) [n:127.0.0.1:50250_    ] o.a.s.c.c.ConnectionManager Client is connected to ZooKeeper
   [junit4]   2> 122651 INFO  (TEST-CollectionsAPIDistributedZkTest.test-seed#[55BD0976D413947D]) [n:127.0.0.1:50250_    ] o.a.s.c.c.SolrZkClient makePath: /overseer/queue
   [junit4]   2> 122653 INFO  (TEST-CollectionsAPIDistributedZkTest.test-seed#[55BD0976D413947D]) [n:127.0.0.1:50250_    ] o.a.s.c.c.SolrZkClient makePath: /overseer/collection-queue-work
   [junit4]   2> 122656 INFO  (TEST-CollectionsAPIDistributedZkTest.test-seed#[55BD0976D413947D]) [n:127.0.0.1:50250_    ] o.a.s.c.c.SolrZkClient makePath: /overseer/collection-map-running
   [junit4]   2> 122657 INFO  (TEST-CollectionsAPIDistributedZkTest.test-seed#[55BD0976D413947D]) [n:127.0.0.1:50250_    ] o.a.s.c.c.SolrZkClient makePath: /overseer/collection-map-completed
   [junit4]   2> 122659 INFO  (TEST-CollectionsAPIDistributedZkTest.test-seed#[55BD0976D413947D]) [n:127.0.0.1:50250_    ] o.a.s.c.c.SolrZkClient makePath: /overseer/collection-map-failure
   [junit4]   2> 122661 INFO  (TEST-CollectionsAPIDistributedZkTest.test-seed#[55BD0976D413947D]) [n:127.0.0.1:50250_    ] o.a.s.c.c.SolrZkClient makePath: /live_nodes
   [junit4]   2> 122662 INFO  (TEST-CollectionsAPIDistributedZkTest.test-seed#[55BD0976D413947D]) [n:127.0.0.1:50250_    ] o.a.s.c.c.SolrZkClient makePath: /aliases.json
   [junit4]   2> 122663 INFO  (TEST-CollectionsAPIDistributedZkTest.test-seed#[55BD0976D413947D]) [n:127.0.0.1:50250_    ] o.a.s.c.c.SolrZkClient makePath: /clusterstate.json
   [junit4]   2> 122664 INFO  (TEST-CollectionsAPIDistributedZkTest.test-seed#[55BD0976D413947D]) [n:127.0.0.1:50250_    ] o.a.s.c.c.SolrZkClient makePath: /security.json
   [junit4]   2> 122665 INFO  (TEST-CollectionsAPIDistributedZkTest.test-seed#[55BD0976D413947D]) [n:127.0.0.1:50250_    ] o.a.s.c.ZkController Register node as live in ZooKeeper:/live_nodes/127.0.0.1:50250_
   [junit4]   2> 122665 INFO  (TEST-CollectionsAPIDistributedZkTest.test-seed#[55BD0976D413947D]) [n:127.0.0.1:50250_    ] o.a.s.c.c.SolrZkClient makePath: /live_nodes/127.0.0.1:50250_
   [junit4]   2> 122667 INFO  (TEST-CollectionsAPIDistributedZkTest.test-seed#[55BD0976D413947D]) [n:127.0.0.1:50250_    ] o.a.s.c.c.SolrZkClient makePath: /overseer_elect
   [junit4]   2> 122668 INFO  (TEST-CollectionsAPIDistributedZkTest.test-seed#[55BD0976D413947D]) [n:127.0.0.1:50250_    ] o.a.s.c.c.SolrZkClient makePath: /overseer_elect/election
   [junit4]   2> 122669 INFO  (TEST-CollectionsAPIDistributedZkTest.test-seed#[55BD0976D413947D]) [n:127.0.0.1:50250_    ] o.a.s.c.Overseer Overseer (id=null) closing
   [junit4]   2> 122669 INFO  (TEST-CollectionsAPIDistributedZkTest.test-seed#[55BD0976D413947D]) [n:127.0.0.1:50250_    ] o.a.s.c.LeaderElector Joined leadership election with path: /overseer_elect/election/94605713784766468-127.0.0.1:50250_-n_0000000000
   [junit4]   2> 122669 INFO  (TEST-CollectionsAPIDistributedZkTest.test-seed#[55BD0976D413947D]) [n:127.0.0.1:50250_    ] o.a.s.c.OverseerElectionContext I am going to be the leader 127.0.0.1:50250_
   [junit4]   2> 122670 INFO  (TEST-CollectionsAPIDistributedZkTest.test-seed#[55BD0976D413947D]) [n:127.0.0.1:50250_    ] o.a.s.c.c.SolrZkClient makePath: /overseer_elect/leader
   [junit4]   2> 122671 INFO  (TEST-CollectionsAPIDistributedZkTest.test-seed#[55BD0976D413947D]) [n:127.0.0.1:50250_    ] o.a.s.c.Overseer Overseer (id=94605713784766468-127.0.0.1:50250_-n_0000000000) starting
   [junit4]   2> 122672 INFO  (TEST-CollectionsAPIDistributedZkTest.test-seed#[55BD0976D413947D]) [n:127.0.0.1:50250_    ] o.a.s.c.c.SolrZkClient makePath: /overseer/queue-work
   [junit4]   2> 122677 INFO  (TEST-CollectionsAPIDistributedZkTest.test-seed#[55BD0976D413947D]) [n:127.0.0.1:50250_    ] o.a.s.c.OverseerAutoReplicaFailoverThread Starting OverseerAutoReplicaFailoverThread autoReplicaFailoverWorkLoopDelay=10000 autoReplicaFailoverWaitAfterExpiration=10000 autoReplicaFailoverBadNodeExpiration=60000
   [junit4]   2> 122680 INFO  (OverseerCollectionConfigSetProcessor-94605713784766468-127.0.0.1:50250_-n_0000000000) [n:127.0.0.1:50250_    ] o.a.s.c.OverseerTaskProcessor Process current queue of overseer operations
   [junit4]   2> 122681 INFO  (OverseerStateUpdate-94605713784766468-127.0.0.1:50250_-n_0000000000) [n:127.0.0.1:50250_    ] o.a.s.c.Overseer Starting to work on the main queue
   [junit4]   2> 122681 INFO  (TEST-CollectionsAPIDistributedZkTest.test-seed#[55BD0976D413947D]) [n:127.0.0.1:50250_    ] o.a.s.c.c.ZkStateReader Updating cluster state from ZooKeeper... 
   [junit4]   2> 122713 INFO  (TEST-CollectionsAPIDistributedZkTest.test-seed#[55BD0976D413947D]) [n:127.0.0.1:50250_    ] o.a.s.c.CoreContainer Security conf doesn't exist. Skipping setup for authorization module.
   [junit4]   2> 122713 INFO  (TEST-CollectionsAPIDistributedZkTest.test-seed#[55BD0976D413947D]) [n:127.0.0.1:50250_    ] o.a.s.c.CoreContainer No authentication plugin used.
   [junit4]   2> 122715 INFO  (TEST-CollectionsAPIDistributedZkTest.test-seed#[55BD0976D413947D]) [n:127.0.0.1:50250_    ] o.a.s.c.CoresLocator Looking for core definitions underneath /x1/jenkins/jenkins-slave/workspace/Lucene-Solr-NightlyTests-5.x/solr/build/solr-core/test/J1/temp/solr.cloud.CollectionsAPIDistributedZkTest_55BD0976D413947D-001/control-001/cores
   [junit4]   2> 122715 INFO  (TEST-CollectionsAPIDistributedZkTest.test-seed#[55BD0976D413947D]) [n:127.0.0.1:50250_    ] o.a.s.c.SolrCore Created CoreDescriptor: {loadOnStartup=true, schema=schema.xml, instanceDir=/x1/jenkins/jenkins-slave/workspace/Lucene-Solr-NightlyTests-5.x/solr/build/solr-core/test/J1/temp/solr.cloud.CollectionsAPIDistributedZkTest_55BD0976D413947D-001/control-001/cores/collection1, config=solrconfig.xml, absoluteInstDir=/x1/jenkins/jenkins-slave/workspace/Lucene-Solr-NightlyTests-5.x/solr/build/solr-core/test/J1/temp/solr.cloud.CollectionsAPIDistributedZkTest_55BD0976D413947D-001/control-001/cores/collection1/, shard=, collection=control_collection, dataDir=data/, name=collection1, configSetProperties=configsetprops.json, coreNodeName=, transient=false}
   [junit4]   2> 122716 INFO  (TEST-CollectionsAPIDistributedZkTest.test-seed#[55BD0976D413947D]) [n:127.0.0.1:50250_    ] o.a.s.c.CoresLocator Found core collection1 in /x1/jenkins/jenkins-slave/workspace/Lucene-Solr-NightlyTests-5.x/solr/build/solr-core/test/J1/temp/solr.cloud.CollectionsAPIDistributedZkTest_55BD0976D413947D-001/control-001/cores/collection1/
   [junit4]   2> 122716 INFO  (TEST-CollectionsAPIDistributedZkTest.test-seed#[55BD0976D413947D]) [n:127.0.0.1:50250_    ] o.a.s.c.CoresLocator Found 1 core definitions
   [junit4]   2> 122717 INFO  (TEST-CollectionsAPIDistributedZkTest.test-seed#[55BD0976D413947D]) [n:127.0.0.1:50250_    ] o.a.s.s.SolrDispatchFilter user.dir=/x1/jenkins/jenkins-slave/workspace/Lucene-Solr-NightlyTests-5.x/solr/build/solr-core/test/J1
   [junit4]   2> 122717 INFO  (TEST-CollectionsAPIDistributedZkTest.test-seed#[55BD0976D413947D]) [n:127.0.0.1:50250_    ] o.a.s.s.SolrDispatchFilter SolrDispatchFilter.init() done
   [junit4]   2> 122717 INFO  (coreLoadExecutor-521-thread-1-processing-n:127.0.0.1:50250_) [n:127.0.0.1:50250_ c:control_collection   x:collection1] o.a.s.c.ZkController publishing state=down
   [junit4]   2> 122717 INFO  (coreLoadExecutor-521-thread-1-processing-n:127.0.0.1:50250_) [n:127.0.0.1:50250_ c:control_collection   x:collection1] o.a.s.c.ZkController numShards not found on descriptor - reading it from system property
   [junit4]   2> 122719 INFO  (OverseerStateUpdate-94605713784766468-127.0.0.1:50250_-n_0000000000) [n:127.0.0.1:50250_    ] o.a.s.c.Overseer processMessage: queueSize: 1, message = {
   [junit4]   2>   "base_url":"http://127.0.0.1:50250",
   [junit4]   2>   "core":"collection1",
   [junit4]   2>   "roles":null,
   [junit4]   2>   "collection":"control_collection",
   [junit4]   2>   "node_name":"127.0.0.1:50250_",
   [junit4]   2>   "shard":null,
   [junit4]   2>   "numShards":"1",
   [junit4]   2>   "state":"down",
   [junit4]   2>   "operation":"state"} current state version: 0
   [junit4]   2> 122719 INFO  (coreLoadExecutor-521-thread-1-processing-n:127.0.0.1:50250_) [n:127.0.0.1:50250_ c:control_collection   x:collection1] o.a.s.c.ZkController look for our core node name
   [junit4]   2> 122719 INFO  (OverseerStateUpdate-94605713784766468-127.0.0.1:50250_-n_0000000000) [n:127.0.0.1:50250_    ] o.a.s.c.o.ReplicaMutator Update state numShards=1 message={
   [junit4]   2>   "base_url":"http://127.0.0.1:50250",
   [junit4]   2>   "core":"collection1",
   [junit4]   2>   "roles":null,
   [junit4]   2>   "collection":"control_collection",
   [junit4]   2>   "node_name":"127.0.0.1:50250_",
   [junit4]   2>   "shard":null,
   [junit4]   2>   "numShards":"1",
   [junit4]   2>   "state":"down",
   [junit4]   2>   "operation":"state"}
   [junit4]   2> 122720 INFO  (OverseerStateUpdate-94605713784766468-127.0.0.1:50250_-n_0000000000) [n:127.0.0.1:50250_    ] o.a.s.c.o.ClusterStateMutator building a new cName: control_collection
   [junit4]   2> 122720 INFO  (OverseerStateUpdate-94605713784766468-127.0.0.1:50250_-n_0000000000) [n:127.0.0.1:50250_    ] o.a.s.c.o.ReplicaMutator Assigning new node to shard shard=shard1
   [junit4]   2> 122722 INFO  (zkCallback-86-thread-1-processing-n:127.0.0.1:50250_) [n:127.0.0.1:50250_    ] o.a.s.c.c.ZkStateReader A cluster state change: WatchedEvent state:SyncConnected type:NodeDataChanged path:/clusterstate.json, has occurred - updating... (live nodes size: 1)
   [junit4]   2> 123720 INFO  (coreLoadExecutor-521-thread-1-processing-n:127.0.0.1:50250_) [n:127.0.0.1:50250_ c:control_collection   x:collection1] o.a.s.c.ZkController waiting to find shard id in clusterstate for collection1
   [junit4]   2> 123720 INFO  (coreLoadExecutor-521-thread-1-processing-n:127.0.0.1:50250_) [n:127.0.0.1:50250_ c:control_collection   x:collection1] o.a.s.c.ZkController Check for collection zkNode:control_collection
   [junit4]   2> 123720 INFO  (coreLoadExecutor-521-thread-1-processing-n:127.0.0.1:50250_) [n:127.0.0.1:50250_ c:control_collection   x:collection1] o.a.s.c.ZkController Collection zkNode exists
   [junit4]   2> 123720 INFO  (coreLoadExecutor-521-thread-1-processing-n:127.0.0.1:50250_) [n:127.0.0.1:50250_ c:control_collection   x:collection1] o.a.s.c.c.ZkStateReader Load collection config from:/collections/control_collection
   [junit4]   2> 123721 INFO  (coreLoadExecutor-521-thread-1-processing-n:127.0.0.1:50250_) [n:127.0.0.1:50250_ c:control_collection   x:collection1] o.a.s.c.c.ZkStateReader path=/collections/control_collection configName=conf1 specified config exists in ZooKeeper
   [junit4]   2> 123721 INFO  (coreLoadExecutor-521-thread-1-processing-n:127.0.0.1:50250_) [n:127.0.0.1:50250_ c:control_collection   x:collection1] o.a.s.c.SolrResourceLoader new SolrResourceLoader for directory: '/x1/jenkins/jenkins-slave/workspace/Lucene-Solr-NightlyTests-5.x/solr/build/solr-core/test/J1/temp/solr.cloud.CollectionsAPIDistributedZkTest_55BD0976D413947D-001/control-001/cores/collection1/'
   [junit4]   2> 123736 INFO  (coreLoadExecutor-521-thread-1-processing-n:127.0.0.1:50250_) [n:127.0.0.1:50250_ c:control_collection   x:collection1] o.a.s.c.Config loaded config solrconfig.xml with version 0 
   [junit4]   2> 123743 INFO  (coreLoadExecutor-521-thread-1-processing-n:127.0.0.1:50250_) [n:127.0.0.1:50250_ c:control_collection   x:collection1] o.a.s.c.SolrConfig current version of requestparams : -1
   [junit4]   2> 123759 INFO  (coreLoadExecutor-521-thread-1-processing-n:127.0.0.1:50250_) [n:127.0.0.1:50250_ c:control_collection   x:collection1] o.a.s.c.SolrConfig Using Lucene MatchVersion: 5.4.0
   [junit4]   2> 123787 INFO  (coreLoadExecutor-521-thread-1-processing-n:127.0.0.1:50250_) [n:127.0.0.1:50250_ c:control_collection   x:collection1] o.a.s.c.Config Loaded SolrConfig: solrconfig.xml
   [junit4]   2> 123788 INFO  (coreLoadExecutor-521-thread-1-processing-n:127.0.0.1:50250_) [n:127.0.0.1:50250_ c:control_collection   x:collection1] o.a.s.s.IndexSchema Reading Solr Schema from /configs/conf1/schema.xml
   [junit4]   2> 123796 INFO  (coreLoadExecutor-521-thread-1-processing-n:127.0.0.1:50250_) [n:127.0.0.1:50250_ c:control_collection   x:collection1] o.a.s.s.IndexSchema [collection1] Schema name=test
   [junit4]   2> 124071 INFO  (coreLoadExecutor-521-thread-1-processing-n:127.0.0.1:50250_) [n:127.0.0.1:50250_ c:control_collection   x:collection1] o.a.s.s.OpenExchangeRatesOrgProvider Initialized with rates=open-exchange-rates.json, refreshInterval=1440.
   [junit4]   2> 124081 INFO  (coreLoadExecutor-521-thread-1-processing-n:127.0.0.1:50250_) [n:127.0.0.1:50250_ c:control_collection   x:collection1] o.a.s.s.IndexSchema default search field in schema is text
   [junit4]   2> 124083 INFO  (coreLoadExecutor-521-thread-1-processing-n:127.0.0.1:50250_) [n:127.0.0.1:50250_ c:control_collection   x:collection1] o.a.s.s.IndexSchema unique key field: id
   [junit4]   2> 124106 INFO  (coreLoadExecutor-521-thread-1-processing-n:127.0.0.1:50250_) [n:127.0.0.1:50250_ c:control_collection   x:collection1] o.a.s.s.FileExchangeRateProvider Reloading exchange rates from file currency.xml
   [junit4]   2> 124110 INFO  (coreLoadExecutor-521-thread-1-processing-n:127.0.0.1:50250_) [n:127.0.0.1:50250_ c:control_collection   x:collection1] o.a.s.s.FileExchangeRateProvider Reloading exchange rates from file currency.xml
   [junit4]   2> 124113 INFO  (coreLoadExecutor-521-thread-1-processing-n:127.0.0.1:50250_) [n:127.0.0.1:50250_ c:control_collection   x:collection1] o.a.s.s.OpenExchangeRatesOrgProvider Reloading exchange rates from open-exchange-rates.json
   [junit4]   2> 124114 WARN  (coreLoadExecutor-521-thread-1-processing-n:127.0.0.1:50250_) [n:127.0.0.1:50250_ c:control_collection   x:collection1] o.a.s.s.OpenExchangeRatesOrgProvider Unknown key IMPORTANT NOTE
   [junit4]   2> 124114 WARN  (coreLoadExecutor-521-thread-1-processing-n:127.0.0.1:50250_) [n:127.0.0.1:50250_ c:control_collection   x:collection1] o.a.s.s.OpenExchangeRatesOrgProvider Expected key, got STRING
   [junit4]   2> 124114 INFO  (coreLoadExecutor-521-thread-1-processing-n:127.0.0.1:50250_) [n:127.0.0.1:50250_ c:control_collection   x:collection1] o.a.s.s.OpenExchangeRatesOrgProvider Reloading exchange rates from open-exchange-rates.json
   [junit4]   2> 124115 WARN  (coreLoadExecutor-521-thread-1-processing-n:127.0.0.1:50250_) [n:127.0.0.1:50250_ c:control_collection   x:collection1] o.a.s.s.OpenExchangeRatesOrgProvider Unknown key IMPORTANT NOTE
   [junit4]   2> 124115 WARN  (coreLoadExecutor-521-thread-1-processing-n:127.0.0.1:50250_) [n:127.0.0.1:50250_ c:control_collection   x:collection1] o.a.s.s.OpenExchangeRatesOrgProvider Expected key, got STRING
   [junit4]   2> 124116 INFO  (coreLoadExecutor-521-thread-1-processing-n:127.0.0.1:50250_) [n:127.0.0.1:50250_ c:control_collection   x:collection1] o.a.s.c.ConfigSetProperties Did not find ConfigSet properties, assuming default properties: Can't find resource 'configsetprops.json' in classpath or '/configs/conf1', cwd=/x1/jenkins/jenkins-slave/workspace/Lucene-Solr-NightlyTests-5.x/solr/build/solr-core/test/J1
   [junit4]   2> 124116 INFO  (coreLoadExecutor-521-thread-1-processing-n:127.0.0.1:50250_) [n:127.0.0.1:50250_ c:control_collection   x:collection1] o.a.s.c.CoreContainer Creating SolrCore 'collection1' using configuration from collection control_collection
   [junit4]   2> 124117 INFO  (coreLoadExecutor-521-thread-1-processing-n:127.0.0.1:50250_) [n:127.0.0.1:50250_ c:control_collection s:shard1 r:core_node1 x:collection1] o.a.s.c.SolrCore org.apache.solr.core.MockDirectoryFactory
   [junit4]   2> 124117 INFO  (coreLoadExecutor-521-thread-1-processing-n:127.0.0.1:50250_) [n:127.0.0.1:50250_ c:control_collection s:shard1 r:core_node1 x:collection1] o.a.s.c.SolrCore [[collection1] ] Opening new SolrCore at [/x1/jenkins/jenkins-slave/workspace/Lucene-Solr-NightlyTests-5.x/solr/build/solr-core/test/J1/temp/solr.cloud.CollectionsAPIDistributedZkTest_55BD0976D413947D-001/control-001/cores/collection1/], dataDir=[null]
   [junit4]   2> 124117 INFO  (coreLoadExecutor-521-thread-1-processing-n:127.0.0.1:50250_) [n:127.0.0.1:50250_ c:control_collection s:shard1 r:core_node1 x:collection1] o.a.s.c.JmxMonitoredMap JMX monitoring is enabled. Adding Solr mbeans to JMX Server: com.sun.jmx.mbeanserver.JmxMBeanServer@66746531
   [junit4]   2> 124117 INFO  (coreLoadExecutor-521-thread-1-processing-n:127.0.0.1:50250_) [n:127.0.0.1:50250_ c:control_collection s:shard1 r:core_node1 x:collection1] o.a.s.c.CachingDirectoryFactory return new directory for /x1/jenkins/jenkins-slave/workspace/Lucene-Solr-NightlyTests-5.x/solr/build/solr-core/test/J1/temp/solr.cloud.CollectionsAPIDistributedZkTest_55BD0976D413947D-001/control-001/cores/collection1/data
   [junit4]   2> 124118 INFO  (coreLoadExecutor-521-thread-1-processing-n:127.0.0.1:50250_) [n:127.0.0.1:50250_ c:control_collection s:shard1 r:core_node1 x:collection1] o.a.s.c.SolrCore New index directory detected: old=null new=/x1/jenkins/jenkins-slave/workspace/Lucene-Solr-NightlyTests-5.x/solr/build/solr-core/test/J1/temp/solr.cloud.CollectionsAPIDistributedZkTest_55BD0976D413947D-001/control-001/cores/collection1/data/index/
   [junit4]   2> 124118 WARN  (coreLoadExecutor-521-thread-1-processing-n:127.0.0.1:50250_) [n:127.0.0.1:50250_ c:control_collection s:shard1 r:core_node1 x:collection1] o.a.s.c.SolrCore [collection1] Solr index directory '/x1/jenkins/jenkins-slave/workspace/Lucene-Solr-NightlyTests-5.x/solr/build/solr-core/test/J1/temp/solr.cloud.CollectionsAPIDistributedZkTest_55BD0976D413947D-001/control-001/cores/collection1/data/index' doesn't exist. Creating new index...
   [junit4]   2> 124118 INFO  (coreLoadExecutor-521-thread-1-processing-n:127.0.0.1:50250_) [n:127.0.0.1:50250_ c:control_collection s:shard1 r:core_node1 x:collection1] o.a.s.c.CachingDirectoryFactory return new directory for /x1/jenkins/jenkins-slave/workspace/Lucene-Solr-NightlyTests-5.x/solr/build/solr-core/test/J1/temp/solr.cloud.CollectionsAPIDistributedZkTest_55BD0976D413947D-001/control-001/cores/collection1/data/index
   [junit4]   2> 124118 INFO  (coreLoadExecutor-521-thread-1-processing-n:127.0.0.1:50250_) [n:127.0.0.1:50250_ c:control_collection s:shard1 r:core_node1 x:collection1] o.a.s.u.RandomMergePolicy RandomMergePolicy wrapping class org.apache.lucene.index.TieredMergePolicy: [TieredMergePolicy: maxMergeAtOnce=35, maxMergeAtOnceExplicit=29, maxMergedSegmentMB=6.0966796875, floorSegmentMB=1.193359375, forceMergeDeletesPctAllowed=17.71058971923877, segmentsPerTier=35.0, maxCFSSegmentSizeMB=8.796093022207999E12, noCFSRatio=0.3884626154644303
   [junit4]   2> 124119 INFO  (coreLoadExecutor-521-thread-1-processing-n:127.0.0.1:50250_) [n:127.0.0.1:50250_ c:control_collection s:shard1 r:core_node1 x:collection1] o.a.s.c.SolrCore SolrDeletionPolicy.onCommit: commits: num=1
   [junit4]   2> 	commit{dir=MockDirectoryWrapper(RAMDirectory@2b3c1532 lockFactory=org.apache.lucene.store.SingleInstanceLockFactory@75939bca),segFN=segments_1,generation=1}
   [junit4]   2> 124119 INFO  (coreLoadExecutor-521-thread-1-processing-n:127.0.0.1:50250_) [n:127.0.0.1:50250_ c:control_collection s:shard1 r:core_node1 x:collection1] o.a.s.c.SolrCore newest commit generation = 1
   [junit4]   2> 124119 INFO  (OldIndexDirectoryCleanupThreadForCore-collection1) [n:127.0.0.1:50250_ c:control_collection s:shard1 r:core_node1 x:collection1] o.a.s.c.SolrCore Looking for old index directories to cleanup for core collection1 in /x1/jenkins/jenkins-slave/workspace/Lucene-Solr-NightlyTests-5.x/solr/build/solr-core/test/J1/temp/solr.cloud.CollectionsAPIDistributedZkTest_55BD0976D413947D-001/control-001/cores/collection1/data/
   [junit4]   2> 124120 WARN  (OldIndexDirectoryCleanupThreadForCore-collection1) [n:127.0.0.1:50250_ c:control_collection s:shard1 r:core_node1 x:collection1] o.a.s.c.DirectoryFactory /x1/jenkins/jenkins-slave/workspace/Lucene-Solr-NightlyTests-5.x/solr/build/solr-core/test/J1/temp/solr.cloud.CollectionsAPIDistributedZkTest_55BD0976D413947D-001/control-001/cores/collection1/data/ does not point to a valid data directory; skipping clean-up of old index directories.
   [junit4]   2> 124129 INFO  (coreLoadExecutor-521-thread-1-processing-n:127.0.0.1:50250_) [n:127.0.0.1:50250_ c:control_collection s:shard1 r:core_node1 x:collection1] o.a.s.u.p.UpdateRequestProcessorChain creating updateRequestProcessorChain "nodistrib"
   [junit4]   2> 124129 INFO  (coreLoadExecutor-521-thread-1-processing-n:127.0.0.1:50250_) [n:127.0.0.1:50250_ c:control_collection s:shard1 r:core_node1 x:collection1] o.a.s.u.p.UpdateRequestProcessorChain creating updateRequestProcessorChain "dedupe"
   [junit4]   2> 124129 INFO  (coreLoadExecutor-521-thread-1-processing-n:127.0.0.1:50250_) [n:127.0.0.1:50250_ c:control_collection s:shard1 r:core_node1 x:collection1] o.a.s.u.p.UpdateRequestProcessorChain inserting DistributedUpdateProcessorFactory into updateRequestProcessorChain "dedupe"
   [junit4]   2> 124129 INFO  (coreLoadExecutor-521-thread-1-processing-n:127.0.0.1:50250_) [n:127.0.0.1:50250_ c:control_collection s:shard1 r:core_node1 x:collection1] o.a.s.u.p.UpdateRequestProcessorChain creating updateRequestProcessorChain "stored_sig"
   [junit4]   2> 124130 INFO  (coreLoadExecutor-521-thread-1-processing-n:127.0.0.1:50250_) [n:127.0.0.1:50250_ c:control_collection s:shard1 r:core_node1 x:collection1] o.a.s.u.p.UpdateRequestProcessorChain inserting DistributedUpdateProcessorFactory into updateRequestProcessorChain "stored_sig"
   [junit4]   2> 124130 INFO  (coreLoadExecutor-521-thread-1-processing-n:127.0.0.1:50250_) [n:127.0.0.1:50250_ c:control_collection s:shard1 r:core_node1 x:collection1] o.a.s.u.p.UpdateRequestProcessorChain creating updateRequestProcessorChain "distrib-dup-test-chain-explicit"
   [junit4]   2> 124130 INFO  (coreLoadExecutor-521-thread-1-processing-n:127.0.0.1:50250_) [n:127.0.0.1:50250_ c:control_collection s:shard1 r:core_node1 x:collection1] o.a.s.u.p.UpdateRequestProcessorChain creating updateRequestProcessorChain "distrib-dup-test-chain-implicit"
   [junit4]   2> 124130 INFO  (coreLoadExecutor-521-thread-1-processing-n:127.0.0.1:50250_) [n:127.0.0.1:50250_ c:control_collection s:shard1 r:core_node1 x:collection1] o.a.s.u.p.UpdateRequestProcessorChain inserting DistributedUpdateProcessorFactory into updateRequestProcessorChain "distrib-dup-test-chain-implicit"
   [junit4]   2> 124130 INFO  (coreLoadExecutor-521-thread-1-processing-n:127.0.0.1:50250_) [n:127.0.0.1:50250_ c:control_collection s:shard1 r:core_node1 x:collection1] o.a.s.c.SolrCore no updateRequestProcessorChain defined as default, creating implicit default
   [junit4]   2> 124133 INFO  (coreLoadExecutor-521-thread-1-processing-n:127.0.0.1:50250_) [n:127.0.0.1:50250_ c:control_collection s:shard1 r:core_node1 x:collection1] o.a.s.h.l.XMLLoader xsltCacheLifetimeSeconds=60
   [junit4]   2> 124135 INFO  (coreLoadExecutor-521-thread-1-processing-n:127.0.0.1:50250_) [n:127.0.0.1:50250_ c:control_collection s:shard1 r:core_node1 x:collection1] o.a.s.h.l.XMLLoader xsltCacheLifetimeSeconds=60
   [junit4]   2> 124136 INFO  (coreLoadExecutor-521-thread-1-processing-n:127.0.0.1:50250_) [n:127.0.0.1:50250_ c:control_collection s:shard1 r:core_node1 x:collection1] o.a.s.h.l.XMLLoader xsltCacheLifetimeSeconds=60
   [junit4]   2> 124138 INFO  (coreLoadExecutor-521-thread-1-processing-n:127.0.0.1:50250_) [n:127.0.0.1:50250_ c:control_collection s:shard1 r:core_node1 x:collection1] o.a.s.h.l.XMLLoader xsltCacheLifetimeSeconds=60
   [junit4]   2> 124143 INFO  (coreLoadExecutor-521-thread-1-processing-n:127.0.0.1:50250_) [n:127.0.0.1:50250_ c:control_collection s:shard1 r:core_node1 x:collection1] o.a.s.c.RequestHandlers Registered paths: /admin/threads,/admin/plugins,/admin/logging,/admin/ping,/replication,/update,/admin/file,/admin/mbeans,/admin/system,/get,/update/csv,/update/json/docs,/admin/segments,/update/json,/schema,/config,standard,/admin/properties,/admin/luke
   [junit4]   2> 124145 INFO  (coreLoadExecutor-521-thread-1-processing-n:127.0.0.1:50250_) [n:127.0.0.1:50250_ c:control_collection s:shard1 r:core_node1 x:collection1] o.a.s.c.SolrCore Using default statsCache cache: org.apache.solr.search.stats.LocalStatsCache
   [junit4]   2> 124145 INFO  (coreLoadExecutor-521-thread-1-processing-n:127.0.0.1:50250_) [n:127.0.0.1:50250_ c:control_collection s:shard1 r:core_node1 x:collection1] o.a.s.u.UpdateHandler Using UpdateLog implementation: org.apache.solr.update.UpdateLog
   [junit4]   2> 124145 INFO  (coreLoadExecutor-521-thread-1-processing-n:127.0.0.1:50250_) [n:127.0.0.1:50250_ c:control_collection s:shard1 r:core_node1 x:collection1] o.a.s.u.UpdateLog Initializing UpdateLog: dataDir= defaultSyncLevel=FLUSH numRecordsToKeep=100 maxNumLogsToKeep=10 numVersionBuckets=65536
   [junit4]   2> 124146 INFO  (coreLoadExecutor-521-thread-1-processing-n:127.0.0.1:50250_) [n:127.0.0.1:50250_ c:control_collection s:shard1 r:core_node1 x:collection1] o.a.s.c.SolrCore Hard AutoCommit: disabled
   [junit4]   2> 124146 INFO  (coreLoadExecutor-521-thread-1-processing-n:127.0.0.1:50250_) [n:127.0.0.1:50250_ c:control_collection s:shard1 r:core_node1 x:collection1] o.a.s.c.SolrCore Soft AutoCommit: disabled
   [junit4]   2> 124147 INFO  (coreLoadExecutor-521-thread-1-processing-n:127.0.0.1:50250_) [n:127.0.0.1:50250_ c:control_collection s:shard1 r:core_node1 x:collection1] o.a.s.u.RandomMergePolicy RandomMergePolicy wrapping class org.apache.lucene.index.TieredMergePolicy: [TieredMergePolicy: maxMergeAtOnce=14, maxMergeAtOnceExplicit=20, maxMergedSegmentMB=0.3056640625, floorSegmentMB=1.5283203125, forceMergeDeletesPctAllowed=18.962816152482954, segmentsPerTier=35.0, maxCFSSegmentSizeMB=8.796093022207999E12, noCFSRatio=0.1739528631627314
   [junit4]   2> 124147 INFO  (coreLoadExecutor-521-thread-1-processing-n:127.0.0.1:50250_) [n:127.0.0.1:50250_ c:control_collection s:shard1 r:core_node1 x:collection1] o.a.s.c.SolrCore SolrDeletionPolicy.onInit: commits: num=1
   [junit4]   2> 	commit{dir=MockDirectoryWrapper(RAMDirectory@2b3c1532 lockFactory=org.apache.lucene.store.SingleInstanceLockFactory@75939bca),segFN=segments_1,generation=1}
   [junit4]   2> 124147 INFO  (coreLoadExecutor-521-thread-1-processing-n:127.0.0.1:50250_) [n:127.0.0.1:50250_ c:control_collection s:shard1 r:core_node1 x:collection1] o.a.s.c.SolrCore newest commit generation = 1
   [junit4]   2> 124147 INFO  (coreLoadExecutor-521-thread-1-processing-n:127.0.0.1:50250_) [n:127.0.0.1:50250_ c:control_collection s:shard1 r:core_node1 x:collection1] o.a.s.s.SolrIndexSearcher Opening Searcher@6dfe4c3b[collection1] main
   [junit4]   2> 124147 INFO  (coreLoadExecutor-521-thread-1-processing-n:127.0.0.1:50250_) [n:127.0.0.1:50250_ c:control_collection s:shard1 r:core_node1 x:collection1] o.a.s.c.c.ZkStateReader Load collection config from:/collections/control_collection
   [junit4]   2> 124149 INFO  (coreLoadExecutor-521-thread-1-processing-n:127.0.0.1:50250_) [n:127.0.0.1:50250_ c:control_collection s:shard1 r:core_node1 x:collection1] o.a.s.c.c.ZkStateReader path=/collections/control_collection configName=conf1 specified config exists in ZooKeeper
   [junit4]   2> 124149 INFO  (coreLoadExecutor-521-thread-1-processing-n:127.0.0.1:50250_) [n:127.0.0.1:50250_ c:control_collection s:shard1 r:core_node1 x:collection1] o.a.s.r.ManagedResourceStorage Setting up ZooKeeper-based storage for the RestManager with znodeBase: /configs/conf1
   [junit4]   2> 124149 INFO  (coreLoadExecutor-521-thread-1-processing-n:127.0.0.1:50250_) [n:127.0.0.1:50250_ c:control_collection s:shard1 r:core_node1 x:collection1] o.a.s.r.ManagedResourceStorage Configured ZooKeeperStorageIO with znodeBase: /configs/conf1
   [junit4]   2> 124149 INFO  (coreLoadExecutor-521-thread-1-processing-n:127.0.0.1:50250_) [n:127.0.0.1:50250_ c:control_collection s:shard1 r:core_node1 x:collection1] o.a.s.r.RestManager Initializing RestManager with initArgs: {}
   [junit4]   2> 124149 INFO  (coreLoadExecutor-521-thread-1-processing-n:127.0.0.1:50250_) [n:127.0.0.1:50250_ c:control_collection s:shard1 r:core_node1 x:collection1] o.a.s.r.ManagedResourceStorage Reading _rest_managed.json using ZooKeeperStorageIO:path=/configs/conf1
   [junit4]   2> 124150 INFO  (coreLoadExecutor-521-thread-1-processing-n:127.0.0.1:50250_) [n:127.0.0.1:50250_ c:control_collection s:shard1 r:core_node1 x:collection1] o.a.s.r.ManagedResourceStorage No data found for znode /configs/conf1/_rest_managed.json
   [junit4]   2> 124150 INFO  (coreLoadExecutor-521-thread-1-processing-n:127.0.0.1:50250_) [n:127.0.0.1:50250_ c:control_collection s:shard1 r:core_node1 x:collection1] o.a.s.r.ManagedResourceStorage Loaded null at path _rest_managed.json using ZooKeeperStorageIO:path=/configs/conf1
   [junit4]   2> 124150 INFO  (coreLoadExecutor-521-thread-1-processing-n:127.0.0.1:50250_) [n:127.0.0.1:50250_ c:control_collection s:shard1 r:core_node1 x:collection1] o.a.s.r.RestManager Initializing 0 registered ManagedResources
   [junit4]   2> 124150 INFO  (coreLoadExecutor-521-thread-1-processing-n:127.0.0.1:50250_) [n:127.0.0.1:50250_ c:control_collection s:shard1 r:core_node1 x:collection1] o.a.s.h.ReplicationHandler Commits will be reserved for  10000
   [junit4]   2> 124151 INFO  (searcherExecutor-522-thread-1-processing-x:collection1 c:control_collection r:core_node1 n:127.0.0.1:50250_ s:shard1) [n:127.0.0.1:50250_ c:control_collection s:shard1 r:core_node1 x:collection1] o.a.s.c.SolrCore [collection1] Registered new searcher Searcher@6dfe4c3b[collection1] main{ExitableDirectoryReader(UninvertingDirectoryReader())}
   [junit4]   2> 124151 INFO  (coreLoadExecutor-521-thread-1-processing-n:127.0.0.1:50250_) [n:127.0.0.1:50250_ c:control_collection s:shard1 r:core_node1 x:collection1] o.a.s.u.UpdateLog Looking up max value of version field to seed version buckets
   [junit4]   2> 124151 INFO  (coreLoadExecutor-521-thread-1-processing-n:127.0.0.1:50250_) [n:127.0.0.1:50250_ c:control_collection s:shard1 r:core_node1 x:collection1] o.a.s.u.VersionInfo Refreshing highest value of _version_ for 65536 version buckets from index
   [junit4]   2> 124151 INFO  (coreLoadExecutor-521-thread-1-processing-n:127.0.0.1:50250_) [n:127.0.0.1:50250_ c:control_collection s:shard1 r:core_node1 x:collection1] o.a.s.u.VersionInfo No terms found for _version_, cannot seed version bucket highest value from index
   [junit4]   2> 124151 INFO  (coreLoadExecutor-521-thread-1-processing-n:127.0.0.1:50250_) [n:127.0.0.1:50250_ c:control_collection s:shard1 r:core_node1 x:collection1] o.a.s.u.UpdateLog Could not find max version in index or recent updates, using new clock 1513691422834819072
   [junit4]   2> 124153 INFO  (coreLoadExecutor-521-thread-1-processing-n:127.0.0.1:50250_) [n:127.0.0.1:50250_ c:control_collection s:shard1 r:core_node1 x:collection1] o.a.s.u.UpdateLog Took 2.0ms to seed version buckets with highest version 1513691422834819072
   [junit4]   2> 124153 INFO  (coreLoadExecutor-521-thread-1-processing-n:127.0.0.1:50250_) [n:127.0.0.1:50250_ c:control_collection s:shard1 r:core_node1 x:collection1] o.a.s.c.ZkController watch zkdir /configs/conf1
   [junit4]   2> 124154 INFO  (coreLoadExecutor-521-thread-1-processing-n:127.0.0.1:50250_) [n:127.0.0.1:50250_ c:control_collection s:shard1 r:core_node1 x:collection1] o.a.s.c.CoreContainer registering core: collection1
   [junit4]   2> 124155 INFO  (coreZkRegister-515-thread-1-processing-x:collection1 c:control_collection r:core_node1 n:127.0.0.1:50250_ s:shard1) [n:127.0.0.1:50250_ c:control_collection s:shard1 r:core_node1 x:collection1] o.a.s.c.ZkController Register replica - core:collection1 address:http://127.0.0.1:50250 collection:control_collection shard:shard1
   [junit4]   2> 124156 INFO  (coreZkRegister-515-thread-1-processing-x:collection1 c:control_collection r:core_node1 n:127.0.0.1:50250_ s:shard1) [n:127.0.0.1:50250_ c:control_collection s:shard1 r:core_node1 x:collection1] o.a.s.c.c.SolrZkClient makePath: /collections/control_collection/leader_elect/shard1/election
   [junit4]   2> 124162 INFO  (coreZkRegister-515-thread-1-processing-x:collection1 c:control_collection r:core_node1 n:127.0.0.1:50250_ s:shard1) [n:127.0.0.1:50250_ c:control_collection s:shard1 r:core_node1 x:collection1] o.a.s.c.LeaderElector Joined leadership election with path: /collections/control_collection/leader_elect/shard1/election/94605713784766468-core_node1-n_0000000000
   [junit4]   2> 124162 INFO  (coreZkRegister-515-thread-1-processing-x:collection1 c:control_collection r:core_node1 n:127.0.0.1:50250_ s:shard1) [n:127.0.0.1:50250_ c:control_collection s:shard1 r:core_node1 x:collection1] o.a.s.c.ShardLeaderElectionContext Running the leader process for shard shard1
   [junit4]   2> 124164 INFO  (coreZkRegister-515-thread-1-processing-x:collection1 c:control_collection r:core_node1 n:127.0.0.1:50250_ s:shard1) [n:127.0.0.1:50250_ c:control_collection s:shard1 r:core_node1 x:collection1] o.a.s.c.ShardLeaderElectionContext Enough replicas found to continue.
   [junit4]   2> 124164 INFO  (coreZkRegister-515-thread-1-processing-x:collection1 c:control_collection r:core_node1 n:127.0.0.1:50250_ s:shard1) [n:127.0.0.1:50250_ c:control_collection s:shard1 r:core_node1 x:collection1] o.a.s.c.ShardLeaderElectionContext I may be the new leader - try and sync
   [junit4]   2> 124164 INFO  (coreZkRegister-515-thread-1-processing-x:collection1 c:control_collection r:core_node1 n:127.0.0.1:50250_ s:shard1) [n:127.0.0.1:50250_ c:control_collection s:shard1 r:core_node1 x:collection1] o.a.s.c.SyncStrategy Sync replicas to http://127.0.0.1:50250/collection1/
   [junit4]   2> 124164 INFO  (coreZkRegister-515-thread-1-processing-x:collection1 c:control_collection r:core_node1 n:127.0.0.1:50250_ s:shard1) [n:127.0.0.1:50250_ c:control_collection s:shard1 r:core_node1 x:collection1] o.a.s.c.SyncStrategy Sync Success - now sync replicas to me
   [junit4]   2> 124164 INFO  (coreZkRegister-515-thread-1-processing-x:collection1 c:control_collection r:core_node1 n:127.0.0.1:50250_ s:shard1) [n:127.0.0.1:50250_ c:control_collection s:shard1 r:core_node1 x:collection1] o.a.s.c.SyncStrategy http://127.0.0.1:50250/collection1/ has no replicas
   [junit4]   2> 124164 INFO  (coreZkRegister-515-thread-1-processing-x:collection1 c:control_collection r:core_node1 n:127.0.0.1:50250_ s:shard1) [n:127.0.0.1:50250_ c:control_collection s:shard1 r:core_node1 x:collection1] o.a.s.c.ShardLeaderElectionContext I am the new leader: http://127.0.0.1:50250/collection1/ shard1
   [junit4]   2> 124165 INFO  (OverseerStateUpdate-94605713784766468-127.0.0.1:50250_-n_0000000000) [n:127.0.0.1:50250_    ] o.a.s.c.Overseer processMessage: queueSize: 1, message = {
   [junit4]   2>   "operation":"leader",
   [junit4]   2>   "shard":"shard1",
   [junit4]   2>   "collection":"control_collection"} current state version: 1
   [junit4]   2> 124165 INFO  (coreZkRegister-515-thread-1-processing-x:collection1 c:control_collection r:core_node1 n:127.0.0.1:50250_ s:shard1) [n:127.0.0.1:50250_ c:control_collection s:shard1 r:core_node1 x:collection1] o.a.s.c.c.SolrZkClient makePath: /collections/control_collection/leaders/shard1
   [junit4]   2> 124168 INFO  (coreZkRegister-515-thread-1-processing-x:collection1 c:control_collection r:core_node1 n:127.0.0.1:50250_ s:shard1) [n:127.0.0.1:50250_ c:control_collection s:shard1 r:core_node1 x:collection1] o.a.s.c.ShardLeaderElectionContextBase Creating leader registration node
   [junit4]   2> 124171 INFO  (OverseerStateUpdate-94605713784766468-127.0.0.1:50250_-n_0000000000) [n:127.0.0.1:50250_    ] o.a.s.c.Overseer processMessage: queueSize: 1, message = {
   [junit4]   2>   "operation":"leader",
   [junit4]   2>   "shard":"shard1",
   [junit4]   2>   "collection":"control_collection",
   [junit4]   2>   "base_url":"http://127.0.0.1:50250",
   [junit4]   2>   "core":"collection1",
   [junit4]   2>   "state":"active"} current state version: 1
   [junit4]   2> 124218 INFO  (TEST-CollectionsAPIDistributedZkTest.test-seed#[55BD0976D413947D]) [    ] o.a.s.c.c.SolrZkClient Using default ZkCredentialsProvider
   [junit4]   2> 124228 INFO  (TEST-CollectionsAPIDistributedZkTest.test-seed#[55BD0976D413947D]) [    ] o.a.s.c.c.ConnectionManager Waiting for client to connect to ZooKeeper
   [junit4]   2> 124230 INFO  (zkCallback-88-thread-1) [    ] o.a.s.c.c.ConnectionManager Watcher org.apache.solr.common.cloud.ConnectionManager@5af78cc5 name:ZooKeeperConnection Watcher:127.0.0.1:53827/solr got event WatchedEvent state:SyncConnected type:None path:null path:null type:None
   [junit4]   2> 124230 INFO  (TEST-CollectionsAPIDistributedZkTest.test-seed#[55BD0976D413947D]) [    ] o.a.s.c.c.ConnectionManager Client is connected to ZooKeeper
   [junit4]   2> 124230 INFO  (TEST-CollectionsAPIDistributedZkTest.test-seed#[55BD0976D413947D]) [    ] o.a.s.c.c.SolrZkClient Using default ZkACLProvider
   [junit4]   2> 124230 INFO  (TEST-CollectionsAPIDistributedZkTest.test-seed#[55BD0976D413947D]) [    ] o.a.s.c.c.ZkStateReader Updating cluster state from ZooKeeper... 
   [junit4]   2> 124235 INFO  (TEST-CollectionsAPIDistributedZkTest.test-seed#[55BD0976D413947D]) [    ] o.a.s.c.ChaosMonkey monkey: init - expire sessions:false cause connection loss:false
   [junit4]   2> 124274 INFO  (zkCallback-88-thread-1) [    ] o.a.s.c.c.ZkStateReader A cluster state change: WatchedEvent state:SyncConnected type:NodeDataChanged path:/clusterstate.json, has occurred - updating... (live nodes size: 1)
   [junit4]   2> 124274 INFO  (zkCallback-86-thread-1-processing-n:127.0.0.1:50250_) [n:127.0.0.1:50250_    ] o.a.s.c.c.ZkStateReader A cluster state change: WatchedEvent state:SyncConnected type:NodeDataChanged path:/clusterstate.json, has occurred - updating... (live nodes size: 1)
   [junit4]   2> 124280 INFO  (coreZkRegister-515-thread-1-processing-x:collection1 c:control_collection r:core_node1 n:127.0.0.1:50250_ s:shard1) [n:127.0.0.1:50250_ c:control_collection s:shard1 r:core_node1 x:collection1] o.a.s.c.ZkController We are http://127.0.0.1:50250/collection1/ and leader is http://127.0.0.1:50250/collection1/
   [junit4]   2> 124280 INFO  (coreZkRegister-515-thread-1-processing-x:collection1 c:control_collection r:core_node1 n:127.0.0.1:50250_ s:shard1) [n:127.0.0.1:50250_ c:control_collection s:shard1 r:core_node1 x:collection1] o.a.s.c.ZkController No LogReplay needed for core=collection1 baseURL=http://127.0.0.1:50250
   [junit4]   2> 124281 INFO  (coreZkRegister-515-thread-1-processing-x:collection1 c:control_collection r:core_node1 n:127.0.0.1:50250_ s:shard1) [n:127.0.0.1:50250_ c:control_collection s:shard1 r:core_node1 x:collection1] o.a.s.c.ZkController I am the leader, no recovery necessary
   [junit4]   2> 124281 INFO  (coreZkRegister-515-thread-1-processing-x:collection1 c:control_collection r:core_node1 n:127.0.0.1:50250_ s:shard1) [n:127.0.0.1:50250_ c:control_collection s:shard1 r:core_node1 x:collection1] o.a.s.c.ZkController publishing state=active
   [junit4]   2> 124281 INFO  (coreZkRegister-515-thread-1-processing-x:collection1 c:control_collection r:core_node1 n:127.0.0.1:50250_ s:shard1) [n:127.0.0.1:50250_ c:control_collection s:shard1 r:core_node1 x:collection1] o.a.s.c.ZkController numShards not found on descriptor - reading it from system property
   [junit4]   2> 124284 INFO  (OverseerStateUpdate-94605713784766468-127.0.0.1:50250_-n_0000000000) [n:127.0.0.1:50250_    ] o.a.s.c.Overseer processMessage: queueSize: 1, message = {
   [junit4]   2>   "base_url":"http://127.0.0.1:50250",
   [junit4]   2>   "core":"collection1",
   [junit4]   2>   "roles":null,
   [junit4]   2>   "collection":"control_collection",
   [junit4]   2>   "node_name":"127.0.0.1:50250_",
   [junit4]   2>   "shard":"shard1",
   [junit4]   2>   "numShards":"2",
   [junit4]   2>   "state":"active",
   [junit4]   2>   "operation":"state",
   [junit4]   2>   "core_node_name":"core_node1"} current state version: 2
   [junit4]   2> 124284 INFO  (OverseerStateUpdate-94605713784766468-127.0.0.1:50250_-n_0000000000) [n:127.0.0.1:50250_    ] o.a.s.c.o.ReplicaMutator Update state numShards=2 message={
   [junit4]   2>   "base_url":"http://127.0.0.1:50250",
   [junit4]   2>   "core":"collection1",
   [junit4]   2>   "roles":null,
   [junit4]   2>   "collection":"control_collection",
   [junit4]   2>   "node_name":"127.0.0.1:50250_",
   [junit4]   2>   "shard":"shard1",
   [junit4]   2>   "numShards":"2",
   [junit4]   2>   "state":"active",
   [junit4]   2>   "operation":"state",
   [junit4]   2>   "core_node_name":"core_node1"}
   [junit4]   2> 124388 INFO  (zkCallback-88-thread-1) [    ] o.a.s.c.c.ZkStateReader A cluster state change: WatchedEvent state:SyncConnected type:NodeDataChanged path:/clusterstate.json, has occurred - updating... (live nodes size: 1)
   [junit4]   2> 124388 INFO  (zkCallback-86-thread-1-processing-n:127.0.0.1:50250_) [n:127.0.0.1:50250_    ] o.a.s.c.c.ZkStateReader A cluster state change: WatchedEvent state:SyncConnected type:NodeDataChanged path:/clusterstate.json, has occurred - updating... (live nodes size: 1)
   [junit4]   2> 124611 INFO  (TEST-CollectionsAPIDistributedZkTest.test-seed#[55BD0976D413947D]) [    ] o.a.s.SolrTestCaseJ4 Writing core.properties file to /x1/jenkins/jenkins-slave/workspace/Lucene-Solr-NightlyTests-5.x/solr/build/solr-core/test/J1/temp/solr.cloud.CollectionsAPIDistributedZkTest_55BD0976D413947D-001/shard-1-001/cores/collection1
   [junit4]   2> 124612 INFO  (TEST-CollectionsAPIDistributedZkTest.test-seed#[55BD0976D413947D]) [    ] o.a.s.c.AbstractFullDistribZkTestBase create jetty 1 in directory /x1/jenkins/jenkins-slave/workspace/Lucene-Solr-NightlyTests-5.x/solr/build/solr-core/test/J1/temp/solr.cloud.CollectionsAPIDistributedZkTest_55BD0976D413947D-001/shard-1-001
   [junit4]   2> 124613 INFO  (TEST-CollectionsAPIDistributedZkTest.test-seed#[55BD0976D413947D]) [    ] o.e.j.s.Server jetty-9.2.13.v20150730
   [junit4]   2> 124620 INFO  (TEST-CollectionsAPIDistributedZkTest.test-seed#[55BD0976D413947D]) [    ] o.e.j.s.h.ContextHandler Started o.e.j.s.ServletContextHandler@1509144e{/,null,AVAILABLE}
   [junit4]   2> 124620 INFO  (TEST-CollectionsAPIDistributedZkTest.test-seed#[55BD0976D413947D]) [    ] o.e.j.s.ServerConnector Started ServerConnector@71417ac{HTTP/1.1}{127.0.0.1:47850}
   [junit4]   2> 124620 INFO  (TEST-CollectionsAPIDistributedZkTest.test-seed#[55BD0976D413947D]) [    ] o.e.j.s.Server Started @127828ms
   [junit4]   2> 124621 INFO  (TEST-CollectionsAPIDistributedZkTest.test-seed#[55BD0976D413947D]) [    ] o.a.s.c.s.e.JettySolrRunner Jetty properties: {hostPort=47850, hostContext=/, coreRootDirectory=/x1/jenkins/jenkins-slave/workspace/Lucene-Solr-NightlyTests-5.x/solr/build/solr-core/test/J1/../../../../../../../../../../x1/jenkins/jenkins-slave/workspace/Lucene-Solr-NightlyTests-5.x/solr/build/solr-core/test/J1/temp/solr.cloud.CollectionsAPIDistributedZkTest_55BD0976D413947D-001/shard-1-001/cores, solr.data.dir=/x1/jenkins/jenkins-slave/workspace/Lucene-Solr-NightlyTests-5.x/solr/build/solr-core/test/J1/temp/solr.cloud.CollectionsAPIDistributedZkTest_55BD0976D413947D-001/tempDir-001/jetty1, solrconfig=solrconfig.xml}
   [junit4]   2> 124622 INFO  (TEST-CollectionsAPIDistributedZkTest.test-seed#[55BD0976D413947D]) [    ] o.a.s.s.SolrDispatchFilter SolrDispatchFilter.init(): sun.misc.Launcher$AppClassLoader@1fe91485
   [junit4]   2> 124622 INFO  (TEST-CollectionsAPIDistributedZkTest.test-seed#[55BD0976D413947D]) [    ] o.a.s.c.SolrResourceLoader new SolrResourceLoader for directory: '/x1/jenkins/jenkins-slave/workspace/Lucene-Solr-NightlyTests-5.x/solr/build/solr-core/test/J1/../../../../../../../../../../x1/jenkins/jenkins-slave/workspace/Lucene-Solr-NightlyTests-5.x/solr/build/solr-core/test/J1/temp/solr.cloud.CollectionsAPIDistributedZkTest_55BD0976D413947D-001/shard-1-001/'
   [junit4]   2> 124640 INFO  (TEST-CollectionsAPIDistributedZkTest.test-seed#[55BD0976D413947D]) [    ] o.a.s.c.c.SolrZkClient Using default ZkCredentialsProvider
   [junit4]   2> 124645 INFO  (TEST-CollectionsAPIDistributedZkTest.test-seed#[55BD0976D413947D]) [    ] o.a.s.c.c.ConnectionManager Waiting for client to connect to ZooKeeper
   [junit4]   2> 124647 INFO  (zkCallback-89-thread-1) [    ] o.a.s.c.c.ConnectionManager Watcher org.apache.solr.common.cloud.ConnectionManager@1c23d8d0 name:ZooKeeperConnection Watcher:127.0.0.1:53827/solr got event WatchedEvent state:SyncConnected type:None path:null path:null type:None
   [junit4]   2> 124647 INFO  (TEST-CollectionsAPIDistributedZkTest.test-seed#[55BD0976D413947D]) [    ] o.a.s.c.c.ConnectionManager Client is connected to ZooKeeper
   [junit4]   2> 124648 INFO  (TEST-CollectionsAPIDistributedZkTest.test-seed#[55BD0976D413947D]) [    ] o.a.s.c.c.SolrZkClient Using default ZkACLProvider
   [junit4]   2> 124654 INFO  (TEST-CollectionsAPIDistributedZkTest.test-seed#[55BD0976D413947D]) [    ] o.a.s.s.SolrDispatchFilter Loading solr.xml from SolrHome (not found in ZooKeeper)
   [junit4]   2> 124654 INFO  (TEST-CollectionsAPIDistributedZkTest.test-seed#[55BD0976D413947D]) [    ] o.a.s.c.SolrXmlConfig Loading container configuration from /x1/jenkins/jenkins-slave/workspace/Lucene-Solr-NightlyTests-5.x/solr/build/solr-core/test/J1/../../../../../../../../../../x1/jenkins/jenkins-slave/workspace/Lucene-Solr-NightlyTests-5.x/solr/build/solr-core/test/J1/temp/solr.cloud.CollectionsAPIDistributedZkTest_55BD0976D413947D-001/shard-1-001/solr.xml
   [junit4]   2> 124676 INFO  (TEST-CollectionsAPIDistributedZkTest.test-seed#[55BD0976D413947D]) [    ] o.a.s.c.CoresLocator Config-defined core root directory: /x1/jenkins/jenkins-slave/workspace/Lucene-Solr-NightlyTests-5.x/solr/build/solr-core/test/J1/../../../../../../../../../../x1/jenkins/jenkins-slave/workspace/Lucene-Solr-NightlyTests-5.x/solr/build/solr-core/test/J1/temp/solr.cloud.CollectionsAPIDistributedZkTest_55BD0976D413947D-001/shard-1-001/cores
   [junit4]   2> 124676 INFO  (TEST-CollectionsAPIDistributedZkTest.test-seed#[55BD0976D413947D]) [    ] o.a.s.c.CoreContainer New CoreContainer 1422785170
   [junit4]   2> 124676 INFO  (TEST-CollectionsAPIDistributedZkTest.test-seed#[55BD0976D413947D]) [    ] o.a.s.c.CoreContainer Loading cores into CoreContainer [instanceDir=/x1/jenkins/jenkins-slave/workspace/Lucene-Solr-NightlyTests-5.x/solr/build/solr-core/test/J1/../../../../../../../../../../x1/jenkins/jenkins-slave/workspace/Lucene-Solr-NightlyTests-5.x/solr/build/solr-core/test/J1/temp/solr.cloud.CollectionsAPIDistributedZkTest_55BD0976D413947D-001/shard-1-001/]
   [junit4]   2> 124676 INFO  (TEST-CollectionsAPIDistributedZkTest.test-seed#[55BD0976D413947D]) [    ] o.a.s.c.CoreContainer loading shared library: /x1/jenkins/jenkins-slave/workspace/Lucene-Solr-NightlyTests-5.x/solr/build/solr-core/test/J1/../../../../../../../../../../x1/jenkins/jenkins-slave/workspace/Lucene-Solr-NightlyTests-5.x/solr/build/solr-core/test/J1/temp/solr.cloud.CollectionsAPIDistributedZkTest_55BD0976D413947D-001/shard-1-001/lib
   [junit4]   2> 124676 WARN  (TEST-CollectionsAPIDistributedZkTest.test-seed#[55BD0976D413947D]) [    ] o.a.s.c.SolrResourceLoader Can't find (or read) directory to add to classloader: lib (resolved as: /x1/jenkins/jenkins-slave/workspace/Lucene-Solr-NightlyTests-5.x/solr/build/solr-core/test/J1/../../../../../../../../../../x1/jenkins/jenkins-slave/workspace/Lucene-Solr-NightlyTests-5.x/solr/build/solr-core/test/J1/temp/solr.cloud.CollectionsAPIDistributedZkTest_55BD0976D413947D-001/shard-1-001/lib).
   [junit4]   2> 124684 INFO  (TEST-CollectionsAPIDistributedZkTest.test-seed#[55BD0976D413947D]) [    ] o.a.s.h.c.HttpShardHandlerFactory created with socketTimeout : 90000,urlScheme : ,connTimeout : 15000,maxConnectionsPerHost : 20,maxConnections : 10000,corePoolSize : 0,maximumPoolSize : 2147483647,maxThreadIdleTime : 5,sizeOfQueue : -1,fairnessPolicy : false,useRetries : false,
   [junit4]   2> 124685 INFO  (TEST-CollectionsAPIDistributedZkTest.test-seed#[55BD0976D413947D]) [    ] o.a.s.u.UpdateShardHandler Creating UpdateShardHandler HTTP client with params: socketTimeout=340000&connTimeout=45000&retry=true
   [junit4]   2> 124686 INFO  (TEST-CollectionsAPIDistributedZkTest.test-seed#[55BD0976D413947D]) [    ] o.a.s.l.LogWatcher SLF4J impl is org.slf4j.impl.Log4jLoggerFactory
   [junit4]   2> 124686 INFO  (TEST-CollectionsAPIDistributedZkTest.test-seed#[55BD0976D413947D]) [    ] o.a.s.l.LogWatcher Registering Log Listener [Log4j (org.slf4j.impl.Log4jLoggerFactory)]
   [junit4]   2> 124686 INFO  (TEST-CollectionsAPIDistributedZkTest.test-seed#[55BD0976D413947D]) [    ] o.a.s.c.ZkContainer Zookeeper client=127.0.0.1:53827/solr
   [junit4]   2> 124686 INFO  (TEST-CollectionsAPIDistributedZkTest.test-seed#[55BD0976D413947D]) [    ] o.a.s.c.ZkController zkHost includes chroot
   [junit4]   2> 124686 INFO  (TEST-CollectionsAPIDistributedZkTest.test-seed#[55BD0976D413947D]) [    ] o.a.s.c.c.SolrZkClient Using default ZkCredentialsProvider
   [junit4]   2> 124687 INFO  (TEST-CollectionsAPIDistributedZkTest.test-seed#[55BD0976D413947D]) [    ] o.a.s.c.c.ConnectionManager Waiting for client to connect to ZooKeeper
   [junit4]   2> 124688 INFO  (zkCallback-91-thread-1) [    ] o.a.s.c.c.ConnectionManager Watcher org.apache.solr.common.cloud.ConnectionManager@5422cffc name:ZooKeeperConnection Watcher:127.0.0.1:53827 got event WatchedEvent state:SyncConnected type:None path:null path:null type:None
   [junit4]   2> 124688 INFO  (TEST-CollectionsAPIDistributedZkTest.test-seed#[55BD0976D413947D]) [    ] o.a.s.c.c.ConnectionManager Client is connected to ZooKeeper
   [junit4]   2> 124689 INFO  (TEST-CollectionsAPIDistributedZkTest.test-seed#[55BD0976D413947D]) [    ] o.a.s.c.c.SolrZkClient Using default ZkACLProvider
   [junit4]   2> 124694 INFO  (TEST-CollectionsAPIDistributedZkTest.test-seed#[55BD0976D413947D]) [n:127.0.0.1:47850_    ] o.a.s.c.c.ConnectionManager Waiting for client to connect to ZooKeeper
   [junit4]   2> 124695 INFO  (zkCallback-92-thread-1-processing-n:127.0.0.1:47850_) [n:127.0.0.1:47850_    ] o.a.s.c.c.ConnectionManager Watcher org.apache.solr.common.cloud.ConnectionManager@4c22ce81 name:ZooKeeperConnection Watcher:127.0.0.1:53827/solr got event WatchedEvent state:SyncConnected type:None path:null path:null type:None
   [junit4]   2> 124695 INFO  (TEST-CollectionsAPIDistributedZkTest.test-seed#[55BD0976D413947D]) [n:127.0.0.1:47850_    ] o.a.s.c.c.ConnectionManager Client is connected to ZooKeeper
   [junit4]   2> 124700 INFO  (TEST-CollectionsAPIDistributedZkTest.test-seed#[55BD0976D413947D]) [n:127.0.0.1:47850_    ] o.a.s.c.c.ZkStateReader Updating cluster state from ZooKeeper... 
   [junit4]   2> 125706 INFO  (TEST-CollectionsAPIDistributedZkTest.test-seed#[55BD0976D413947D]) [n:127.0.0.1:47850_    ] o.a.s.c.ZkController Register node as live in ZooKeeper:/live_nodes/127.0.0.1:47850_
   [junit4]   2> 125707 INFO  (TEST-CollectionsAPIDistributedZkTest.test-seed#[55BD0976D413947D]) [n:127.0.0.1:47850_    ] o.a.s.c.c.SolrZkClient makePath: /live_nodes/127.0.0.1:47850_
   [junit4]   2> 125708 INFO  (zkCallback-86-thread-1-processing-n:127.0.0.1:50250_) [n:127.0.0.1:50250_    ] o.a.s.c.c.ZkStateReader A live node change: WatchedEvent state:SyncConnected type:NodeChildrenChanged path:/live_nodes, has occurred - updating... (live nodes size: 1)
   [junit4]   2> 125708 INFO  (zkCallback-92-thread-1-processing-n:127.0.0.1:47850_) [n:127.0.0.1:47850_    ] o.a.s.c.c.ZkStateReader A live node change: WatchedEvent state:SyncConnected type:NodeChildrenChanged path:/live_nodes, has occurred - updating... (live nodes size: 1)
   [junit4]   2> 125708 INFO  (zkCallback-88-thread-1) [    ] o.a.s.c.c.ZkStateReader A live node change: WatchedEvent state:SyncConnected type:NodeChildrenChanged path:/live_nodes, has occurred - updating... (live nodes size: 1)
   [junit4]   2> 125710 INFO  (TEST-CollectionsAPIDistributedZkTest.test-seed#[55BD0976D413947D]) [n:127.0.0.1:47850_    ] o.a.s.c.Overseer Overseer (id=null) closing
   [junit4]   2> 125710 INFO  (TEST-CollectionsAPIDistributedZkTest.test-seed#[55BD0976D413947D]) [n:127.0.0.1:47850_    ] o.a.s.c.LeaderElector Joined leadership election with path: /overseer_elect/election/94605713784766472-127.0.0.1:47850_-n_0000000001
   [junit4]   2> 125711 INFO  (TEST-CollectionsAPIDistributedZkTest.test-seed#[55BD0976D413947D]) [n:127.0.0.1:47850_    ] o.a.s.c.LeaderElector Watching path /overseer_elect/election/94605713784766468-127.0.0.1:50250_-n_0000000000 to know if I could be the leader
   [junit4]   2> 125731 INFO  (TEST-CollectionsAPIDistributedZkTest.test-seed#[55BD0976D413947D]) [n:127.0.0.1:47850_    ] o.a.s.c.CoreContainer Security conf doesn't exist. Skipping setup for authorization module.
   [junit4]   2> 125731 INFO  (TEST-CollectionsAPIDistributedZkTest.test-seed#[55BD0976D413947D]) [n:127.0.0.1:47850_    ] o.a.s.c.CoreContainer No authentication plugin used.
   [junit4]   2> 125733 INFO  (TEST-CollectionsAPIDistributedZkTest.test-seed#[55BD0976D413947D]) [n:127.0.0.1:47850_    ] o.a.s.c.CoresLocator Looking for core definitions underneath /x1/jenkins/jenkins-slave/workspace/Lucene-Solr-NightlyTests-5.x/solr/build/solr-core/test/J1/../../../../../../../../../../x1/jenkins/jenkins-slave/workspace/Lucene-Solr-NightlyTests-5.x/solr/build/solr-core/test/J1/temp/solr.cloud.CollectionsAPIDistributedZkTest_55BD0976D413947D-001/shard-1-001/cores
   [junit4]   2> 125734 INFO  (TEST-CollectionsAPIDistributedZkTest.test-seed#[55BD0976D413947D]) [n:127.0.0.1:47850_    ] o.a.s.c.SolrCore Created CoreDescriptor: {transient=false, name=collection1, collection=collection1, configSetProperties=configsetprops.json, coreNodeName=, loadOnStartup=true, config=solrconfig.xml, schema=schema.xml, instanceDir=/x1/jenkins/jenkins-slave/workspace/Lucene-Solr-NightlyTests-5.x/solr/build/solr-core/test/J1/../../../../../../../../../../x1/jenkins/jenkins-slave/workspace/Lucene-Solr-NightlyTests-5.x/solr/build/solr-core/test/J1/temp/solr.cloud.CollectionsAPIDistributedZkTest_55BD0976D413947D-001/shard-1-001/cores/collection1, shard=, absoluteInstDir=/x1/jenkins/jenkins-slave/workspace/Lucene-Solr-NightlyTests-5.x/solr/build/solr-core/test/J1/../../../../../../../../../../x1/jenkins/jenkins-slave/workspace/Lucene-Solr-NightlyTests-5.x/solr/build/solr-core/test/J1/temp/solr.cloud.CollectionsAPIDistributedZkTest_55BD0976D413947D-001/shard-1-001/cores/collection1/, dataDir=data/}
   [junit4]   2> 125734 INFO  (TEST-CollectionsAPIDistributedZkTest.test-seed#[55BD0976D413947D]) [n:127.0.0.1:47850_    ] o.a.s.c.CoresLocator Found core collection1 in /x1/jenkins/jenkins-slave/workspace/Lucene-Solr-NightlyTests-5.x/solr/build/solr-core/test/J1/../../../../../../../../../../x1/jenkins/jenkins-slave/workspace/Lucene-Solr-NightlyTests-5.x/solr/build/solr-core/test/J1/temp/solr.cloud.CollectionsAPIDistributedZkTest_55BD0976D413947D-001/shard-1-001/cores/collection1/
   [junit4]   2> 125734 INFO  (TEST-CollectionsAPIDistributedZkTest.test-seed#[55BD0976D413947D]) [n:127.0.0.1:47850_    ] o.a.s.c.CoresLocator Found 1 core definitions
   [junit4]   2> 125736 INFO  (TEST-CollectionsAPIDistributedZkTest.test-seed#[55BD0976D413947D]) [n:127.0.0.1:47850_    ] o.a.s.s.SolrDispatchFilter user.dir=/x1/jenkins/jenkins-slave/workspace/Lucene-Solr-NightlyTests-5.x/solr/build/solr-core/test/J1
   [junit4]   2> 125736 INFO  (coreLoadExecutor-532-thread-1-processing-n:127.0.0.1:47850_) [n:127.0.0.1:47850_ c:collection1   x:collection1] o.a.s.c.ZkController publishing state=down
   [junit4]   2> 125736 INFO  (TEST-CollectionsAPIDistributedZkTest.test-seed#[55BD0976D413947D]) [n:127.0.0.1:47850_    ] o.a.s.s.SolrDispatchFilter SolrDispatchFilter.init() done
   [junit4]   2> 125736 INFO  (coreLoadExecutor-532-thread-1-processing-n:127.0.0.1:47850_) [n:127.0.0.1:47850_ c:collection1   x:collection1] o.a.s.c.ZkController numShards not found on descriptor - reading it from system property
   [junit4]   2> 125738 INFO  (coreLoadExecutor-532-thread-1-processing-n:127.0.0.1:47850_) [n:127.0.0.1:47850_ c:collection1   x:collection1] o.a.s.c.ZkController look for our core node name
   [junit4]   2> 125738 INFO  (OverseerStateUpdate-94605713784766468-127.0.0.1:50250_-n_0000000000) [n:127.0.0.1:50250_    ] o.a.s.c.Overseer processMessage: queueSize: 1, message = {
   [junit4]   2>   "base_url":"http://127.0.0.1:47850",
   [junit4]   2>   "core":"collection1",
   [junit4]   2>   "roles":null,
   [junit4]   2>   "collection":"collection1",
   [junit4]   2>   "node_name":"127.0.0.1:47850_",
   [junit4]   2>   "shard":null,
   [junit4]   2>   "numShards":"2",
   [junit4]   2>   "state":"down",
   [junit4]   2>   "operation":"state"} current state version: 3
   [junit4]   2> 125739 INFO  (OverseerStateUpdate-94605713784766468-127.0.0.1:50250_-n_0000000000) [n:127.0.0.1:50250_    ] o.a.s.c.o.ReplicaMutator Update state numShards=2 message={
   [junit4]   2>   "base_url":"http://127.0.0.1:47850",
   [junit4]   2>   "core":"collection1",
   [junit4]   2>   "roles":null,
   [junit4]   2>   "collection":"collection1",
   [junit4]   2>   "node_name":"127.0.0.1:47850_",
   [junit4]   2>   "shard":null,
   [junit4]   2>   "numShards":"2",
   [junit4]   2>   "state":"down",
   [junit4]   2>   "operation":"state"}
   [junit4]   2> 125739 INFO  (OverseerStateUpdate-94605713784766468-127.0.0.1:50250_-n_0000000000) [n:127.0.0.1:50250_    ] o.a.s.c.o.ClusterStateMutator building a new cName: collection1
   [junit4]   2> 125739 INFO  (OverseerStateUpdate-94605713784766468-127.0.0.1:50250_-n_0000000000) [n:127.0.0.1:50250_    ] o.a.s.c.o.ReplicaMutator Assigning new node to shard shard=shard2
   [junit4]   2> 125846 INFO  (zkCallback-88-thread-1) [    ] o.a.s.c.c.ZkStateReader A cluster state change: WatchedEvent state:SyncConnected type:NodeDataChanged path:/clusterstate.json, has occurred - updating... (live nodes size: 2)
   [junit4]   2> 125846 INFO  (zkCallback-92-thread-1-processing-n:127.0.0.1:47850_) [n:127.0.0.1:47850_    ] o.a.s.c.c.ZkStateReader A cluster state change: WatchedEvent state:SyncConnected type:NodeDataChanged path:/clusterstate.json, has occurred - updating... (live nodes size: 2)
   [junit4]   2> 125846 INFO  (zkCallback-86-thread-1-processing-n:127.0.0.1:50250_) [n:127.0.0.1:50250_    ] o.a.s.c.c.ZkStateReader A cluster state change: WatchedEvent state:SyncConnected type:NodeDataChanged path:/clusterstate.json, has occurred - updating... (live nodes size: 2)
   [junit4]   2> 126739 INFO  (coreLoadExecutor-532-thread-1-processing-n:127.0.0.1:47850_) [n:127.0.0.1:47850_ c:collection1   x:collection1] o.a.s.c.ZkController waiting to find shard id in clusterstate for collection1
   [junit4]   2> 126739 INFO  (coreLoadExecutor-532-thread-1-processing-n:127.0.0.1:47850_) [n:127.0.0.1:47850_ c:collection1   x:collection1] o.a.s.c.ZkController Check for collection zkNode:collection1
   [junit4]   2> 126740 INFO  (coreLoadExecutor-532-thread-1-processing-n:127.0.0.1:47850_) [n:127.0.0.1:47850_ c:collection1   x:collection1] o.a.s.c.ZkController Collection zkNode exists
   [junit4]   2> 126740 INFO  (coreLoadExecutor-532-thread-1-processing-n:127.0.0.1:47850_) [n:127.0.0.1:47850_ c:collection1   x:collection1] o.a.s.c.c.ZkStateReader Load collection config from:/collections/collection1
   [junit4]   2> 126740 INFO  (coreLoadExecutor-532-thread-1-processing-n:127.0.0.1:47850_) [n:127.0.0.1:47850_ c:collection1   x:collection1] o.a.s.c.c.ZkStateReader path=/collections/collection1 configName=conf1 specified config exists in ZooKeeper
   [junit4]   2> 126741 INFO  (coreLoadExecutor-532-thread-1-processing-n:127.0.0.1:47850_) [n:127.0.0.1:47850_ c:collection1   x:collection1] o.a.s.c.SolrResourceLoader new SolrResourceLoader for directory: '/x1/jenkins/jenkins-slave/workspace/Lucene-Solr-NightlyTests-5.x/solr/build/solr-core/test/J1/../../../../../../../../../../x1/jenkins/jenkins-slave/workspace/Lucene-Solr-NightlyTests-5.x/solr/build/solr-core/test/J1/temp/solr.cloud.CollectionsAPIDistributedZkTest_55BD0976D413947D-001/shard-1-001/cores/collection1/'
   [junit4]   2> 126754 INFO  (coreLoadExecutor-532-thread-1-processing-n:127.0.0.1:47850_) [n:127.0.0.1:47850_ c:collection1   x:collection1] o.a.s.c.Config loaded config solrconfig.xml with version 0 
   [junit4]   2> 126762 INFO  (coreLoadExecutor-532-thread-1-processing-n:127.0.0.1:47850_) [n:127.0.0.1:47850_ c:collection1   x:collection1] o.a.s.c.SolrConfig current version of requestparams : -1
   [junit4]   2> 126783 INFO  (coreLoadExecutor-532-thread-1-processing-n:127.0.0.1:47850_) [n:127.0.0.1:47850_ c:collection1   x:collection1] o.a.s.c.SolrConfig Using Lucene MatchVersion: 5.4.0
   [junit4]   2> 126836 INFO  (coreLoadExecutor-532-thread-1-processing-n:127.0.0.1:47850_) [n:127.0.0.1:47850_ c:collection1   x:collection1] o.a.s.c.Config Loaded SolrConfig: solrconfig.xml
   [junit4]   2> 126837 INFO  (coreLoadExecutor-532-thread-1-processing-n:127.0.0.1:47850_) [n:127.0.0.1:47850_ c:collection1   x:collection1] o.a.s.s.IndexSchema Reading Solr Schema from /configs/conf1/schema.xml
   [junit4]   2> 126847 INFO  (coreLoadExecutor-532-thread-1-processing-n:127.0.0.1:47850_) [n:127.0.0.1:47850_ c:collection1   x:collection1] o.a.s.s.IndexSchema [collection1] Schema name=test
   [junit4]   2> 127136 INFO  (coreLoadExecutor-532-thread-1-processing-n:127.0.0.1:47850_) [n:127.0.0.1:47850_ c:collection1   x:collection1] o.a.s.s.OpenExchangeRatesOrgProvider Initialized with rates=open-exchange-rates.json, refreshInterval=1440.
   [junit4]   2> 127148 INFO  (coreLoadExecutor-532-thread-1-processing-n:127.0.0.1:47850_) [n:127.0.0.1:47850_ c:collection1   x:collection1] o.a.s.s.IndexSchema default search field in schema is text
   [junit4]   2> 127150 INFO  (coreLoadExecutor-532-thread-1-processing-n:127.0.0.1:47850_) [n:127.0.0.1:47850_ c:collection1   x:collection1] o.a.s.s.IndexSchema unique key field: id
   [junit4]   2> 127168 INFO  (coreLoadExecutor-532-thread-1-processing-n:127.0.0.1:47850_) [n:127.0.0.1:47850_ c:collection1   x:collection1] o.a.s.s.FileExchangeRateProvider Reloading exchange rates from file currency.xml
   [junit4]   2> 127172 INFO  (coreLoadExecutor-532-thread-1-processing-n:127.0.0.1:47850_) [n:127.0.0.1:47850_ c:collection1   x:collection1] o.a.s.s.FileExchangeRateProvider Reloading exchange rates from file currency.xml
   [junit4]   2> 127175 INFO  (coreLoadExecutor-532-thread-1-processing-n:127.0.0.1:47850_) [n:127.0.0.1:47850_ c:collection1   x:collection1] o.a.s.s.OpenExchangeRatesOrgProvider Reloading exchange rates from open-exchange-rates.json
   [junit4]   2> 127176 WARN  (coreLoadExecutor-532-thread-1-processing-n:127.0.0.1:47850_) [n:127.0.0.1:47850_ c:collection1   x:collection1] o.a.s.s.OpenExchangeRatesOrgProvider Unknown key IMPORTANT NOTE
   [junit4]   2> 127176 WARN  (coreLoadExecutor-532-thread-1-processing-n:127.0.0.1:47850_) [n:127.0.0.1:47850_ c:collection1   x:collection1] o.a.s.s.OpenExchangeRatesOrgProvider Expected key, got STRING
   [junit4]   2> 127176 INFO  (coreLoadExecutor-532-thread-1-processing-n:127.0.0.1:47850_) [n:127.0.0.1:47850_ c:collection1   x:collection1] o.a.s.s.OpenExchangeRatesOrgProvider Reloading exchange rates from open-exchange-rates.json
   [junit4]   2> 127176 WARN  (coreLoadExecutor-532-thread-1-processing-n:127.0.0.1:47850_) [n:127.0.0.1:47850_ c:collection1   x:collection1] o.a.s.s.OpenExchangeRatesOrgProvider Unknown key IMPORTANT NOTE
   [junit4]   2> 127176 WARN  (coreLoadExecutor-532-thread-1-processing-n:127.0.0.1:47850_) [n:127.0.0.1:47850_ c:collection1   x:collection1] o.a.s.s.OpenExchangeRatesOrgProvider Expected key, got STRING
   [junit4]   2> 127177 INFO  (coreLoadExecutor-532-thread-1-processing-n:127.0.0.1:47850_) [n:127.0.0.1:47850_ c:collection1   x:collection1] o.a.s.c.ConfigSetProperties Did not find ConfigSet properties, assuming default properties: Can't find resource 'configsetprops.json' in classpath or '/configs/conf1', cwd=/x1/jenkins/jenkins-slave/workspace/Lucene-Solr-NightlyTests-5.x/solr/build/solr-core/test/J1
   [junit4]   2> 127178 INFO  (coreLoadExecutor-532-thread-1-processing-n:127.0.0.1:47850_) [n:127.0.0.1:47850_ c:collection1   x:collection1] o.a.s.c.CoreContainer Creating SolrCore 'collection1' using configuration from collection collection1
   [junit4]   2> 127178 INFO  (coreLoadExecutor-532-thread-1-processing-n:127.0.0.1:47850_) [n:127.0.0.1:47850_ c:collection1 s:shard2 r:core_node1 x:collection1] o.a.s.c.SolrCore org.apache.solr.core.MockDirectoryFactory
   [junit4]   2> 127178 INFO  (coreLoadExecutor-532-thread-1-processing-n:127.0.0.1:47850_) [n:127.0.0.1:47850_ c:collection1 s:shard2 r:core_node1 x:collection1] o.a.s.c.SolrCore [[collection1] ] Opening new SolrCore at [/x1/jenkins/jenkins-slave/workspace/Lucene-Solr-NightlyTests-5.x/solr/build/solr-core/test/J1/../../../../../../../../../../x1/jenkins/jenkins-slave/workspace/Lucene-Solr-NightlyTests-5.x/solr/build/solr-core/test/J1/temp/solr.cloud.CollectionsAPIDistributedZkTest_55BD0976D413947D-001/shard-1-001/cores/collection1/], dataDir=[null]
   [junit4]   2> 127178 INFO  (coreLoadExecutor-532-thread-1-processing-n:127.0.0.1:47850_) [n:127.0.0.1:47850_ c:collection1 s:shard2 r:core_node1 x:collection1] o.a.s.c.JmxMonitoredMap JMX monitoring is enabled. Adding Solr mbeans to JMX Server: com.sun.jmx.mbeanserver.JmxMBeanServer@66746531
   [junit4]   2> 127179 INFO  (coreLoadExecutor-532-thread-1-processing-n:127.0.0.1:47850_) [n:127.0.0.1:47850_ c:collection1 s:shard2 r:core_node1 x:collection1] o.a.s.c.CachingDirectoryFactory return new directory for /x1/jenkins/jenkins-slave/workspace/Lucene-Solr-NightlyTests-5.x/solr/build/solr-core/test/J1/../../../../../../../../../../x1/jenkins/jenkins-slave/workspace/Lucene-Solr-NightlyTests-5.x/solr/build/solr-core/test/J1/temp/solr.cloud.CollectionsAPIDistributedZkTest_55BD0976D413947D-001/shard-1-001/cores/collection1/data
   [junit4]   2> 127179 INFO  (coreLoadExecutor-532-thread-1-processing-n:127.0.0.1:47850_) [n:127.0.0.1:47850_ c:collection1 s:shard2 r:core_node1 x:collection1] o.a.s.c.SolrCore New index directory detected: old=null new=/x1/jenkins/jenkins-slave/workspace/Lucene-Solr-NightlyTests-5.x/solr/build/solr-core/test/J1/../../../../../../../../../../x1/jenkins/jenkins-slave/workspace/Lucene-Solr-NightlyTests-5.x/solr/build/solr-core/test/J1/temp/solr.cloud.CollectionsAPIDistributedZkTest_55BD0976D413947D-001/shard-1-001/cores/collection1/data/index/
   [junit4]   2> 127179 WARN  (coreLoadExecutor-532-thread-1-processing-n:127.0.0.1:47850_) [n:127.0.0.1:47850_ c:collection1 s:shard2 r:core_node1 x:collection1] o.a.s.c.SolrCore [collection1] Solr index directory '/x1/jenkins/jenkins-slave/workspace/Lucene-Solr-NightlyTests-5.x/solr/build/solr-core/test/J1/../../../../../../../../../../x1/jenkins/jenkins-slave/workspace/Lucene-Solr-NightlyTests-5.x/solr/build/solr-core/test/J1/temp/solr.cloud.CollectionsAPIDistributedZkTest_55BD0976D413947D-001/shard-1-001/cores/collection1/data/index' doesn't exist. Creating new index...
   [junit4]   2> 127179 INFO  (coreLoadExecutor-532-thread-1-processing-n:127.0.0.1:47850_) [n:127.0.0.1:47850_ c:collection1 s:shard2 r:core_node1 x:collection1] o.a.s.c.CachingDirectoryFactory return new directory for /x1/jenkins/jenkins-slave/workspace/Lucene-Solr-NightlyTests-5.x/solr/build/solr-core/test/J1/../../../../../../../../../../x1/jenkins/jenkins-slave/workspace/Lucene-Solr-NightlyTests-5.x/solr/build/solr-core/test/J1/temp/solr.cloud.CollectionsAPIDistributedZkTest_55BD0976D413947D-001/shard-1-001/cores/collection1/data/index
   [junit4]   2> 127179 INFO  (coreLoadExecutor-532-thread-1-processing-n:127.0.0.1:47850_) [n:127.0.0.1:47850_ c:collection1 s:shard2 r:core_node1 x:collection1] o.a.s.u.RandomMergePolicy RandomMergePolicy wrapping class org.apache.lucene.index.TieredMergePolicy: [TieredMergePolicy: maxMergeAtOnce=35, maxMergeAtOnceExplicit=29, maxMergedSegmentMB=6.0966796875, floorSegmentMB=1.193359375, forceMergeDeletesPctAllowed=17.71058971923877, segmentsPerTier=35.0, maxCFSSegmentSizeMB=8.796093022207999E12, noCFSRatio=0.3884626154644303
   [junit4]   2> 127180 INFO  (coreLoadExecutor-532-thread-1-processing-n:127.0.0.1:47850_) [n:127.0.0.1:47850_ c:collection1 s:shard2 r:core_node1 x:collection1] o.a.s.c.SolrCore SolrDeletionPolicy.onCommit: commits: num=1
   [junit4]   2> 	commit{dir=MockDirectoryWrapper(RAMDirectory@189572bb lockFactory=org.apache.lucene.store.SingleInstanceLockFactory@7b9f5f98),segFN=segments_1,generation=1}
   [junit4]   2> 127180 INFO  (coreLoadExecutor-532-thread-1-processing-n:127.0.0.1:47850_) [n:127.0.0.1:47850_ c:collection1 s:shard2 r:core_node1 x:collection1] o.a.s.c.SolrCore newest commit generation = 1
   [junit4]   2> 127181 INFO  (OldIndexDirectoryCleanupThreadForCore-collection1) [n:127.0.0.1:47850_ c:collection1 s:shard2 r:core_node1 x:collection1] o.a.s.c.SolrCore Looking for old index directories to cleanup for core collection1 in /x1/jenkins/jenkins-slave/workspace/Lucene-Solr-NightlyTests-5.x/solr/build/solr-core/test/J1/../../../../../../../../../../x1/jenkins/jenkins-slave/workspace/Lucene-Solr-NightlyTests-5.x/solr/build/solr-core/test/J1/temp/solr.cloud.CollectionsAPIDistributedZkTest_55BD0976D413947D-001/shard-1-001/cores/collection1/data/
  

[...truncated too long message...]

tric.java:111)
   [junit4]   2> 	at org.apache.hadoop.metrics2.lib.MethodMetric.snapshot(MethodMetric.java:144)
   [junit4]   2> 	at org.apache.hadoop.metrics2.lib.MetricsRegistry.snapshot(MetricsRegistry.java:387)
   [junit4]   2> 	at org.apache.hadoop.metrics2.lib.MetricsSourceBuilder$1.getMetrics(MetricsSourceBuilder.java:79)
   [junit4]   2> 	at org.apache.hadoop.metrics2.impl.MetricsSourceAdapter.getMetrics(MetricsSourceAdapter.java:195)
   [junit4]   2> 	at org.apache.hadoop.metrics2.impl.MetricsSourceAdapter.updateJmxCache(MetricsSourceAdapter.java:172)
   [junit4]   2> 	at org.apache.hadoop.metrics2.impl.MetricsSourceAdapter.getMBeanInfo(MetricsSourceAdapter.java:151)
   [junit4]   2> 	at com.sun.jmx.interceptor.DefaultMBeanServerInterceptor.getClassName(DefaultMBeanServerInterceptor.java:1804)
   [junit4]   2> 	at com.sun.jmx.interceptor.DefaultMBeanServerInterceptor.safeGetClassName(DefaultMBeanServerInterceptor.java:1595)
   [junit4]   2> 	at com.sun.jmx.interceptor.DefaultMBeanServerInterceptor.checkMBeanPermission(DefaultMBeanServerInterceptor.java:1813)
   [junit4]   2> 	at com.sun.jmx.interceptor.DefaultMBeanServerInterceptor.exclusiveUnregisterMBean(DefaultMBeanServerInterceptor.java:430)
   [junit4]   2> 	at com.sun.jmx.interceptor.DefaultMBeanServerInterceptor.unregisterMBean(DefaultMBeanServerInterceptor.java:415)
   [junit4]   2> 	at com.sun.jmx.mbeanserver.JmxMBeanServer.unregisterMBean(JmxMBeanServer.java:546)
   [junit4]   2> 	at org.apache.hadoop.metrics2.util.MBeans.unregister(MBeans.java:81)
   [junit4]   2> 	at org.apache.hadoop.metrics2.impl.MetricsSourceAdapter.stopMBeans(MetricsSourceAdapter.java:227)
   [junit4]   2> 	at org.apache.hadoop.metrics2.impl.MetricsSourceAdapter.stop(MetricsSourceAdapter.java:212)
   [junit4]   2> 	at org.apache.hadoop.metrics2.impl.MetricsSystemImpl.stopSources(MetricsSystemImpl.java:461)
   [junit4]   2> 	at org.apache.hadoop.metrics2.impl.MetricsSystemImpl.stop(MetricsSystemImpl.java:212)
   [junit4]   2> 	at org.apache.hadoop.metrics2.impl.MetricsSystemImpl.shutdown(MetricsSystemImpl.java:592)
   [junit4]   2> 	at org.apache.hadoop.metrics2.lib.DefaultMetricsSystem.shutdownInstance(DefaultMetricsSystem.java:72)
   [junit4]   2> 	at org.apache.hadoop.metrics2.lib.DefaultMetricsSystem.shutdown(DefaultMetricsSystem.java:68)
   [junit4]   2> 	at org.apache.hadoop.hdfs.server.namenode.metrics.NameNodeMetrics.shutdown(NameNodeMetrics.java:145)
   [junit4]   2> 	at org.apache.hadoop.hdfs.server.namenode.NameNode.stop(NameNode.java:822)
   [junit4]   2> 	at org.apache.hadoop.hdfs.MiniDFSCluster.shutdown(MiniDFSCluster.java:1720)
   [junit4]   2> 	at org.apache.hadoop.hdfs.MiniDFSCluster.shutdown(MiniDFSCluster.java:1699)
   [junit4]   2> 	at org.apache.solr.cloud.hdfs.HdfsTestUtil.teardownClass(HdfsTestUtil.java:197)
   [junit4]   2> 	at org.apache.solr.cloud.hdfs.HdfsCollectionsAPIDistributedZkTest.teardownClass(HdfsCollectionsAPIDistributedZkTest.java:53)
   [junit4]   2> 	at sun.reflect.NativeMethodAccessorImpl.invoke0(Native Method)
   [junit4]   2> 	at sun.reflect.NativeMethodAccessorImpl.invoke(NativeMethodAccessorImpl.java:57)
   [junit4]   2> 	at sun.reflect.DelegatingMethodAccessorImpl.invoke(DelegatingMethodAccessorImpl.java:43)
   [junit4]   2> 	at java.lang.reflect.Method.invoke(Method.java:606)
   [junit4]   2> 	at com.carrotsearch.randomizedtesting.RandomizedRunner.invoke(RandomizedRunner.java:1665)
   [junit4]   2> 	at com.carrotsearch.randomizedtesting.RandomizedRunner$7.evaluate(RandomizedRunner.java:827)
   [junit4]   2> 	at com.carrotsearch.randomizedtesting.rules.StatementAdapter.evaluate(StatementAdapter.java:36)
   [junit4]   2> 	at com.carrotsearch.randomizedtesting.rules.SystemPropertiesRestoreRule$1.evaluate(SystemPropertiesRestoreRule.java:57)
   [junit4]   2> 	at org.apache.lucene.util.AbstractBeforeAfterRule$1.evaluate(AbstractBeforeAfterRule.java:46)
   [junit4]   2> 	at com.carrotsearch.randomizedtesting.rules.StatementAdapter.evaluate(StatementAdapter.java:36)
   [junit4]   2> 	at org.apache.lucene.util.TestRuleStoreClassName$1.evaluate(TestRuleStoreClassName.java:42)
   [junit4]   2> 	at com.carrotsearch.randomizedtesting.rules.NoShadowingOrOverridesOnMethodsRule$1.evaluate(NoShadowingOrOverridesOnMethodsRule.java:39)
   [junit4]   2> 	at com.carrotsearch.randomizedtesting.rules.NoShadowingOrOverridesOnMethodsRule$1.evaluate(NoShadowingOrOverridesOnMethodsRule.java:39)
   [junit4]   2> 	at com.carrotsearch.randomizedtesting.rules.StatementAdapter.evaluate(StatementAdapter.java:36)
   [junit4]   2> 	at com.carrotsearch.randomizedtesting.rules.StatementAdapter.evaluate(StatementAdapter.java:36)
   [junit4]   2> 	at com.carrotsearch.randomizedtesting.rules.StatementAdapter.evaluate(StatementAdapter.java:36)
   [junit4]   2> 	at org.apache.lucene.util.TestRuleAssertionsRequired$1.evaluate(TestRuleAssertionsRequired.java:54)
   [junit4]   2> 	at org.apache.lucene.util.TestRuleMarkFailure$1.evaluate(TestRuleMarkFailure.java:48)
   [junit4]   2> 	at org.apache.lucene.util.TestRuleIgnoreAfterMaxFailures$1.evaluate(TestRuleIgnoreAfterMaxFailures.java:65)
   [junit4]   2> 	at org.apache.lucene.util.TestRuleIgnoreTestSuites$1.evaluate(TestRuleIgnoreTestSuites.java:55)
   [junit4]   2> 	at com.carrotsearch.randomizedtesting.rules.StatementAdapter.evaluate(StatementAdapter.java:36)
   [junit4]   2> 	at com.carrotsearch.randomizedtesting.ThreadLeakControl$StatementRunner.run(ThreadLeakControl.java:367)
   [junit4]   2> 	at java.lang.Thread.run(Thread.java:745)
   [junit4]   2> Caused by: java.lang.NullPointerException
   [junit4]   2> 	at org.apache.hadoop.hdfs.server.blockmanagement.BlocksMap.size(BlocksMap.java:198)
   [junit4]   2> 	at org.apache.hadoop.hdfs.server.blockmanagement.BlockManager.getTotalBlocks(BlockManager.java:3291)
   [junit4]   2> 	at org.apache.hadoop.hdfs.server.namenode.FSNamesystem.getBlocksTotal(FSNamesystem.java:6223)
   [junit4]   2> 	... 53 more
   [junit4]   2> 1374794 INFO  (SUITE-HdfsCollectionsAPIDistributedZkTest-seed#[55BD0976D413947D]-worker) [n:127.0.0.1:58957_ c:addReplicaColl s:shard1 r:core_node7 x:propertyDotName] o.a.s.SolrTestCaseJ4 ###deleteCore
   [junit4]   2> Sep 29, 2015 7:38:04 PM com.carrotsearch.randomizedtesting.ThreadLeakControl checkThreadLeaks
   [junit4]   2> WARNING: Will linger awaiting termination of 2 leaked thread(s).
   [junit4]   2> NOTE: test params are: codec=Asserting(Lucene53): {_version_=PostingsFormat(name=LuceneFixedGap), range_facet_i_dv=TestBloomFilteredLucenePostings(BloomFilteringPostingsFormat(Lucene50(blocksize=128))), text=PostingsFormat(name=Direct), range_facet_l_dv=FSTOrd50, other_tl1=PostingsFormat(name=LuceneFixedGap), a_i1=TestBloomFilteredLucenePostings(BloomFilteringPostingsFormat(Lucene50(blocksize=128))), id=FSTOrd50, timestamp=TestBloomFilteredLucenePostings(BloomFilteringPostingsFormat(Lucene50(blocksize=128))), range_facet_l=TestBloomFilteredLucenePostings(BloomFilteringPostingsFormat(Lucene50(blocksize=128))), a_t=TestBloomFilteredLucenePostings(BloomFilteringPostingsFormat(Lucene50(blocksize=128))), intDefault=PostingsFormat(name=LuceneFixedGap), multiDefault=TestBloomFilteredLucenePostings(BloomFilteringPostingsFormat(Lucene50(blocksize=128)))}, docValues:{range_facet_i_dv=DocValuesFormat(name=Direct), range_facet_l_dv=DocValuesFormat(name=Lucene50), timestamp=DocValuesFormat(name=Direct)}, sim=RandomSimilarityProvider(queryNorm=true,coord=no): {}, locale=no_NO_NY, timezone=Pacific/Efate
   [junit4]   2> NOTE: Linux 3.13.0-52-generic amd64/Oracle Corporation 1.7.0_72 (64-bit)/cpus=4,threads=5,free=106976768,total=523763712
   [junit4]   2> NOTE: All tests run in this JVM: [DOMUtilTest, TestEmbeddedSolrServerConstructors, TestCoreContainer, FastVectorHighlighterTest, DateRangeFieldTest, SliceStateTest, TestConfigSets, TestUniqueKeyFieldResource, IgnoreCommitOptimizeUpdateProcessorFactoryTest, URLClassifyProcessorTest, MultiTermTest, PreAnalyzedFieldTest, TestFieldCollectionResource, TestCustomDocTransformer, CollectionStateFormat2Test, TestDistributedGrouping, TestCustomSort, NumericFieldsTest, TestConfigSetImmutable, CollectionsAPIDistributedZkTest, TestCursorMarkWithoutUniqueKey, TestManagedResourceStorage, TestHashQParserPlugin, TestCloudManagedSchema, AnalyticsMergeStrategyTest, TestInitParams, DistributedQueueTest, TestHashPartitioner, TestPivotHelperCode, HdfsCollectionsAPIDistributedZkTest]
   [junit4] Completed [153/539] on J1 in 694.71s, 1 test, 1 error <<< FAILURES!

[...truncated 1254 lines...]
BUILD FAILED
/x1/jenkins/jenkins-slave/workspace/Lucene-Solr-NightlyTests-5.x/build.xml:792: The following error occurred while executing this line:
/x1/jenkins/jenkins-slave/workspace/Lucene-Solr-NightlyTests-5.x/build.xml:729: The following error occurred while executing this line:
/x1/jenkins/jenkins-slave/workspace/Lucene-Solr-NightlyTests-5.x/build.xml:59: The following error occurred while executing this line:
/x1/jenkins/jenkins-slave/workspace/Lucene-Solr-NightlyTests-5.x/solr/build.xml:233: The following error occurred while executing this line:
/x1/jenkins/jenkins-slave/workspace/Lucene-Solr-NightlyTests-5.x/solr/common-build.xml:524: The following error occurred while executing this line:
/x1/jenkins/jenkins-slave/workspace/Lucene-Solr-NightlyTests-5.x/lucene/common-build.xml:1452: The following error occurred while executing this line:
/x1/jenkins/jenkins-slave/workspace/Lucene-Solr-NightlyTests-5.x/lucene/common-build.xml:1006: There were test failures: 539 suites (7 ignored), 2128 tests, 2 errors, 29 ignored (17 assumptions) [seed: 55BD0976D413947D]

Total time: 194 minutes 39 seconds
Build step 'Invoke Ant' marked build as failure
Archiving artifacts
Sending artifact delta relative to Lucene-Solr-NightlyTests-5.x #911
Archived 4 artifacts
Archive block size is 32768
Received 0 blocks and 1463462927 bytes
Compression is 0.0%
Took 4 min 0 sec
Recording test results
Email was triggered for: Failure
Sending email for trigger: Failure



Mime
View raw message