lucene-dev mailing list archives

Site index · List index
Message view « Date » · « Thread »
Top « Date » · « Thread »
From Policeman Jenkins Server <jenk...@thetaphi.de>
Subject [JENKINS] Lucene-Solr-trunk-Linux (64bit/jdk1.8.0_60) - Build # 14177 - Failure!
Date Thu, 10 Sep 2015 13:14:23 GMT
Build: http://jenkins.thetaphi.de/job/Lucene-Solr-trunk-Linux/14177/
Java: 64bit/jdk1.8.0_60 -XX:-UseCompressedOops -XX:+UseG1GC

1 tests failed.
FAILED:  org.apache.solr.cloud.CdcrReplicationHandlerTest.doTest

Error Message:
Captured an uncaught exception in thread: Thread[id=779, name=RecoveryThread-source_collection_shard1_replica1, state=RUNNABLE, group=TGRP-CdcrReplicationHandlerTest]

Stack Trace:
com.carrotsearch.randomizedtesting.UncaughtExceptionError: Captured an uncaught exception in thread: Thread[id=779, name=RecoveryThread-source_collection_shard1_replica1, state=RUNNABLE, group=TGRP-CdcrReplicationHandlerTest]
Caused by: org.apache.solr.common.cloud.ZooKeeperException: 
	at __randomizedtesting.SeedInfo.seed([6062827B2BA3024C]:0)
	at org.apache.solr.cloud.RecoveryStrategy.run(RecoveryStrategy.java:234)
Caused by: org.apache.solr.common.SolrException: java.io.FileNotFoundException: /home/jenkins/workspace/Lucene-Solr-trunk-Linux/solr/build/solr-core/test/J0/temp/solr.cloud.CdcrReplicationHandlerTest_6062827B2BA3024C-001/jetty-002/cores/source_collection_shard1_replica1/data/tlog/tlog.0000000000000000008.1511930382114619392 (No such file or directory)
	at org.apache.solr.update.CdcrTransactionLog.reopenOutputStream(CdcrTransactionLog.java:244)
	at org.apache.solr.update.CdcrTransactionLog.incref(CdcrTransactionLog.java:173)
	at org.apache.solr.update.UpdateLog.getRecentUpdates(UpdateLog.java:1079)
	at org.apache.solr.update.UpdateLog.seedBucketsWithHighestVersion(UpdateLog.java:1579)
	at org.apache.solr.update.UpdateLog.seedBucketsWithHighestVersion(UpdateLog.java:1610)
	at org.apache.solr.core.SolrCore.seedVersionBuckets(SolrCore.java:877)
	at org.apache.solr.cloud.RecoveryStrategy.doRecovery(RecoveryStrategy.java:526)
	at org.apache.solr.cloud.RecoveryStrategy.run(RecoveryStrategy.java:227)
Caused by: java.io.FileNotFoundException: /home/jenkins/workspace/Lucene-Solr-trunk-Linux/solr/build/solr-core/test/J0/temp/solr.cloud.CdcrReplicationHandlerTest_6062827B2BA3024C-001/jetty-002/cores/source_collection_shard1_replica1/data/tlog/tlog.0000000000000000008.1511930382114619392 (No such file or directory)
	at java.io.RandomAccessFile.open0(Native Method)
	at java.io.RandomAccessFile.open(RandomAccessFile.java:316)
	at java.io.RandomAccessFile.<init>(RandomAccessFile.java:243)
	at org.apache.solr.update.CdcrTransactionLog.reopenOutputStream(CdcrTransactionLog.java:236)
	... 7 more




Build Log:
[...truncated 9670 lines...]
   [junit4] Suite: org.apache.solr.cloud.CdcrReplicationHandlerTest
   [junit4]   2> Creating dataDir: /home/jenkins/workspace/Lucene-Solr-trunk-Linux/solr/build/solr-core/test/J0/temp/solr.cloud.CdcrReplicationHandlerTest_6062827B2BA3024C-001/init-core-data-001
   [junit4]   2> 29546 INFO  (SUITE-CdcrReplicationHandlerTest-seed#[6062827B2BA3024C]-worker) [    ] o.a.s.SolrTestCaseJ4 Randomized ssl (true) and clientAuth (false)
   [junit4]   2> 29546 INFO  (SUITE-CdcrReplicationHandlerTest-seed#[6062827B2BA3024C]-worker) [    ] o.a.s.BaseDistributedSearchTestCase Setting hostContext system property: /_/nd
   [junit4]   2> 29550 INFO  (TEST-CdcrReplicationHandlerTest.doTest-seed#[6062827B2BA3024C]) [    ] o.a.s.c.ZkTestServer STARTING ZK TEST SERVER
   [junit4]   2> 29550 INFO  (Thread-92) [    ] o.a.s.c.ZkTestServer client port:0.0.0.0/0.0.0.0:0
   [junit4]   2> 29550 INFO  (Thread-92) [    ] o.a.s.c.ZkTestServer Starting server
   [junit4]   2> 29650 INFO  (TEST-CdcrReplicationHandlerTest.doTest-seed#[6062827B2BA3024C]) [    ] o.a.s.c.ZkTestServer start zk server on port:33024
   [junit4]   2> 29651 INFO  (TEST-CdcrReplicationHandlerTest.doTest-seed#[6062827B2BA3024C]) [    ] o.a.s.c.c.SolrZkClient Using default ZkCredentialsProvider
   [junit4]   2> 29652 INFO  (TEST-CdcrReplicationHandlerTest.doTest-seed#[6062827B2BA3024C]) [    ] o.a.s.c.c.ConnectionManager Waiting for client to connect to ZooKeeper
   [junit4]   2> 29654 INFO  (zkCallback-46-thread-1) [    ] o.a.s.c.c.ConnectionManager Watcher org.apache.solr.common.cloud.ConnectionManager@39f10c15 name:ZooKeeperConnection Watcher:127.0.0.1:33024 got event WatchedEvent state:SyncConnected type:None path:null path:null type:None
   [junit4]   2> 29654 INFO  (TEST-CdcrReplicationHandlerTest.doTest-seed#[6062827B2BA3024C]) [    ] o.a.s.c.c.ConnectionManager Client is connected to ZooKeeper
   [junit4]   2> 29655 INFO  (TEST-CdcrReplicationHandlerTest.doTest-seed#[6062827B2BA3024C]) [    ] o.a.s.c.c.SolrZkClient Using default ZkACLProvider
   [junit4]   2> 29655 INFO  (TEST-CdcrReplicationHandlerTest.doTest-seed#[6062827B2BA3024C]) [    ] o.a.s.c.c.SolrZkClient makePath: /solr
   [junit4]   2> 29664 INFO  (TEST-CdcrReplicationHandlerTest.doTest-seed#[6062827B2BA3024C]) [    ] o.a.s.c.c.SolrZkClient Using default ZkCredentialsProvider
   [junit4]   2> 29664 INFO  (TEST-CdcrReplicationHandlerTest.doTest-seed#[6062827B2BA3024C]) [    ] o.a.s.c.c.ConnectionManager Waiting for client to connect to ZooKeeper
   [junit4]   2> 29666 INFO  (zkCallback-47-thread-1) [    ] o.a.s.c.c.ConnectionManager Watcher org.apache.solr.common.cloud.ConnectionManager@38334c55 name:ZooKeeperConnection Watcher:127.0.0.1:33024/solr got event WatchedEvent state:SyncConnected type:None path:null path:null type:None
   [junit4]   2> 29666 INFO  (TEST-CdcrReplicationHandlerTest.doTest-seed#[6062827B2BA3024C]) [    ] o.a.s.c.c.ConnectionManager Client is connected to ZooKeeper
   [junit4]   2> 29667 INFO  (TEST-CdcrReplicationHandlerTest.doTest-seed#[6062827B2BA3024C]) [    ] o.a.s.c.c.SolrZkClient Using default ZkACLProvider
   [junit4]   2> 29667 INFO  (TEST-CdcrReplicationHandlerTest.doTest-seed#[6062827B2BA3024C]) [    ] o.a.s.c.c.SolrZkClient makePath: /collections/collection1
   [junit4]   2> 29672 INFO  (TEST-CdcrReplicationHandlerTest.doTest-seed#[6062827B2BA3024C]) [    ] o.a.s.c.c.SolrZkClient makePath: /collections/collection1/shards
   [junit4]   2> 29673 INFO  (TEST-CdcrReplicationHandlerTest.doTest-seed#[6062827B2BA3024C]) [    ] o.a.s.c.c.SolrZkClient makePath: /collections/control_collection
   [junit4]   2> 29677 INFO  (TEST-CdcrReplicationHandlerTest.doTest-seed#[6062827B2BA3024C]) [    ] o.a.s.c.c.SolrZkClient makePath: /collections/control_collection/shards
   [junit4]   2> 29679 INFO  (TEST-CdcrReplicationHandlerTest.doTest-seed#[6062827B2BA3024C]) [    ] o.a.s.c.AbstractZkTestCase put /home/jenkins/workspace/Lucene-Solr-trunk-Linux/solr/core/src/test-files/solr/collection1/conf/solrconfig-cdcr.xml to /configs/conf1/solrconfig.xml
   [junit4]   2> 29679 INFO  (TEST-CdcrReplicationHandlerTest.doTest-seed#[6062827B2BA3024C]) [    ] o.a.s.c.c.SolrZkClient makePath: /configs/conf1/solrconfig.xml
   [junit4]   2> 29683 INFO  (TEST-CdcrReplicationHandlerTest.doTest-seed#[6062827B2BA3024C]) [    ] o.a.s.c.AbstractZkTestCase put /home/jenkins/workspace/Lucene-Solr-trunk-Linux/solr/core/src/test-files/solr/collection1/conf/schema15.xml to /configs/conf1/schema.xml
   [junit4]   2> 29683 INFO  (TEST-CdcrReplicationHandlerTest.doTest-seed#[6062827B2BA3024C]) [    ] o.a.s.c.c.SolrZkClient makePath: /configs/conf1/schema.xml
   [junit4]   2> 29685 INFO  (TEST-CdcrReplicationHandlerTest.doTest-seed#[6062827B2BA3024C]) [    ] o.a.s.c.AbstractZkTestCase put /home/jenkins/workspace/Lucene-Solr-trunk-Linux/solr/core/src/test-files/solr/collection1/conf/solrconfig.snippet.randomindexconfig.xml to /configs/conf1/solrconfig.snippet.randomindexconfig.xml
   [junit4]   2> 29686 INFO  (TEST-CdcrReplicationHandlerTest.doTest-seed#[6062827B2BA3024C]) [    ] o.a.s.c.c.SolrZkClient makePath: /configs/conf1/solrconfig.snippet.randomindexconfig.xml
   [junit4]   2> 29687 INFO  (TEST-CdcrReplicationHandlerTest.doTest-seed#[6062827B2BA3024C]) [    ] o.a.s.c.AbstractZkTestCase put /home/jenkins/workspace/Lucene-Solr-trunk-Linux/solr/core/src/test-files/solr/collection1/conf/stopwords.txt to /configs/conf1/stopwords.txt
   [junit4]   2> 29687 INFO  (TEST-CdcrReplicationHandlerTest.doTest-seed#[6062827B2BA3024C]) [    ] o.a.s.c.c.SolrZkClient makePath: /configs/conf1/stopwords.txt
   [junit4]   2> 29688 INFO  (TEST-CdcrReplicationHandlerTest.doTest-seed#[6062827B2BA3024C]) [    ] o.a.s.c.AbstractZkTestCase put /home/jenkins/workspace/Lucene-Solr-trunk-Linux/solr/core/src/test-files/solr/collection1/conf/protwords.txt to /configs/conf1/protwords.txt
   [junit4]   2> 29688 INFO  (TEST-CdcrReplicationHandlerTest.doTest-seed#[6062827B2BA3024C]) [    ] o.a.s.c.c.SolrZkClient makePath: /configs/conf1/protwords.txt
   [junit4]   2> 29690 INFO  (TEST-CdcrReplicationHandlerTest.doTest-seed#[6062827B2BA3024C]) [    ] o.a.s.c.AbstractZkTestCase put /home/jenkins/workspace/Lucene-Solr-trunk-Linux/solr/core/src/test-files/solr/collection1/conf/currency.xml to /configs/conf1/currency.xml
   [junit4]   2> 29691 INFO  (TEST-CdcrReplicationHandlerTest.doTest-seed#[6062827B2BA3024C]) [    ] o.a.s.c.c.SolrZkClient makePath: /configs/conf1/currency.xml
   [junit4]   2> 29692 INFO  (TEST-CdcrReplicationHandlerTest.doTest-seed#[6062827B2BA3024C]) [    ] o.a.s.c.AbstractZkTestCase put /home/jenkins/workspace/Lucene-Solr-trunk-Linux/solr/core/src/test-files/solr/collection1/conf/enumsConfig.xml to /configs/conf1/enumsConfig.xml
   [junit4]   2> 29692 INFO  (TEST-CdcrReplicationHandlerTest.doTest-seed#[6062827B2BA3024C]) [    ] o.a.s.c.c.SolrZkClient makePath: /configs/conf1/enumsConfig.xml
   [junit4]   2> 29694 INFO  (TEST-CdcrReplicationHandlerTest.doTest-seed#[6062827B2BA3024C]) [    ] o.a.s.c.AbstractZkTestCase put /home/jenkins/workspace/Lucene-Solr-trunk-Linux/solr/core/src/test-files/solr/collection1/conf/open-exchange-rates.json to /configs/conf1/open-exchange-rates.json
   [junit4]   2> 29695 INFO  (TEST-CdcrReplicationHandlerTest.doTest-seed#[6062827B2BA3024C]) [    ] o.a.s.c.c.SolrZkClient makePath: /configs/conf1/open-exchange-rates.json
   [junit4]   2> 29708 INFO  (TEST-CdcrReplicationHandlerTest.doTest-seed#[6062827B2BA3024C]) [    ] o.a.s.c.AbstractZkTestCase put /home/jenkins/workspace/Lucene-Solr-trunk-Linux/solr/core/src/test-files/solr/collection1/conf/mapping-ISOLatin1Accent.txt to /configs/conf1/mapping-ISOLatin1Accent.txt
   [junit4]   2> 29709 INFO  (TEST-CdcrReplicationHandlerTest.doTest-seed#[6062827B2BA3024C]) [    ] o.a.s.c.c.SolrZkClient makePath: /configs/conf1/mapping-ISOLatin1Accent.txt
   [junit4]   2> 29710 INFO  (TEST-CdcrReplicationHandlerTest.doTest-seed#[6062827B2BA3024C]) [    ] o.a.s.c.AbstractZkTestCase put /home/jenkins/workspace/Lucene-Solr-trunk-Linux/solr/core/src/test-files/solr/collection1/conf/old_synonyms.txt to /configs/conf1/old_synonyms.txt
   [junit4]   2> 29711 INFO  (TEST-CdcrReplicationHandlerTest.doTest-seed#[6062827B2BA3024C]) [    ] o.a.s.c.c.SolrZkClient makePath: /configs/conf1/old_synonyms.txt
   [junit4]   2> 29713 INFO  (TEST-CdcrReplicationHandlerTest.doTest-seed#[6062827B2BA3024C]) [    ] o.a.s.c.AbstractZkTestCase put /home/jenkins/workspace/Lucene-Solr-trunk-Linux/solr/core/src/test-files/solr/collection1/conf/synonyms.txt to /configs/conf1/synonyms.txt
   [junit4]   2> 29714 INFO  (TEST-CdcrReplicationHandlerTest.doTest-seed#[6062827B2BA3024C]) [    ] o.a.s.c.c.SolrZkClient makePath: /configs/conf1/synonyms.txt
   [junit4]   2> 29717 INFO  (TEST-CdcrReplicationHandlerTest.doTest-seed#[6062827B2BA3024C]) [    ] o.a.s.c.c.SolrZkClient Using default ZkCredentialsProvider
   [junit4]   2> 29718 INFO  (TEST-CdcrReplicationHandlerTest.doTest-seed#[6062827B2BA3024C]) [    ] o.a.s.c.c.ConnectionManager Waiting for client to connect to ZooKeeper
   [junit4]   2> 29719 INFO  (zkCallback-48-thread-1) [    ] o.a.s.c.c.ConnectionManager Watcher org.apache.solr.common.cloud.ConnectionManager@6b951ae6 name:ZooKeeperConnection Watcher:127.0.0.1:33024/solr got event WatchedEvent state:SyncConnected type:None path:null path:null type:None
   [junit4]   2> 29719 INFO  (TEST-CdcrReplicationHandlerTest.doTest-seed#[6062827B2BA3024C]) [    ] o.a.s.c.c.ConnectionManager Client is connected to ZooKeeper
   [junit4]   2> 29720 INFO  (TEST-CdcrReplicationHandlerTest.doTest-seed#[6062827B2BA3024C]) [    ] o.a.s.c.c.SolrZkClient Using default ZkACLProvider
   [junit4]   2> 29722 INFO  (TEST-CdcrReplicationHandlerTest.doTest-seed#[6062827B2BA3024C]) [    ] o.a.s.SolrTestCaseJ4 ###Starting doTest
   [junit4]   2> 29795 INFO  (TEST-CdcrReplicationHandlerTest.doTest-seed#[6062827B2BA3024C]) [    ] o.a.s.SolrTestCaseJ4 Writing core.properties file to /home/jenkins/workspace/Lucene-Solr-trunk-Linux/solr/build/solr-core/test/J0/temp/solr.cloud.CdcrReplicationHandlerTest_6062827B2BA3024C-001/jetty-001/cores/collection1
   [junit4]   2> 29807 INFO  (TEST-CdcrReplicationHandlerTest.doTest-seed#[6062827B2BA3024C]) [    ] o.e.j.s.Server jetty-9.2.13.v20150730
   [junit4]   2> 29808 INFO  (TEST-CdcrReplicationHandlerTest.doTest-seed#[6062827B2BA3024C]) [    ] o.e.j.s.h.ContextHandler Started o.e.j.s.ServletContextHandler@54e6235c{/_/nd,null,AVAILABLE}
   [junit4]   2> 29837 INFO  (TEST-CdcrReplicationHandlerTest.doTest-seed#[6062827B2BA3024C]) [    ] o.e.j.s.ServerConnector Started ServerConnector@5db6df7f{SSL-http/1.1}{127.0.0.1:42289}
   [junit4]   2> 29838 INFO  (TEST-CdcrReplicationHandlerTest.doTest-seed#[6062827B2BA3024C]) [    ] o.e.j.s.Server Started @31696ms
   [junit4]   2> 29838 INFO  (TEST-CdcrReplicationHandlerTest.doTest-seed#[6062827B2BA3024C]) [    ] o.a.s.c.s.e.JettySolrRunner Jetty properties: {shards=shard1, hostContext=/_/nd, hostPort=42289, coreRootDirectory=/home/jenkins/workspace/Lucene-Solr-trunk-Linux/solr/build/solr-core/test/J0/temp/solr.cloud.CdcrReplicationHandlerTest_6062827B2BA3024C-001/jetty-001/cores}
   [junit4]   2> 29838 INFO  (TEST-CdcrReplicationHandlerTest.doTest-seed#[6062827B2BA3024C]) [    ] o.a.s.s.SolrDispatchFilter SolrDispatchFilter.init(): sun.misc.Launcher$AppClassLoader@4e0e2f2a
   [junit4]   2> 29838 INFO  (TEST-CdcrReplicationHandlerTest.doTest-seed#[6062827B2BA3024C]) [    ] o.a.s.c.SolrResourceLoader new SolrResourceLoader for directory: '/home/jenkins/workspace/Lucene-Solr-trunk-Linux/solr/build/solr-core/test/J0/temp/solr.cloud.CdcrReplicationHandlerTest_6062827B2BA3024C-001/jetty-001/'
   [junit4]   2> 29848 INFO  (TEST-CdcrReplicationHandlerTest.doTest-seed#[6062827B2BA3024C]) [    ] o.a.s.c.c.SolrZkClient Using default ZkCredentialsProvider
   [junit4]   2> 29848 INFO  (TEST-CdcrReplicationHandlerTest.doTest-seed#[6062827B2BA3024C]) [    ] o.a.s.c.c.ConnectionManager Waiting for client to connect to ZooKeeper
   [junit4]   2> 29850 INFO  (zkCallback-49-thread-1) [    ] o.a.s.c.c.ConnectionManager Watcher org.apache.solr.common.cloud.ConnectionManager@3a0ef316 name:ZooKeeperConnection Watcher:127.0.0.1:33024/solr got event WatchedEvent state:SyncConnected type:None path:null path:null type:None
   [junit4]   2> 29851 INFO  (TEST-CdcrReplicationHandlerTest.doTest-seed#[6062827B2BA3024C]) [    ] o.a.s.c.c.ConnectionManager Client is connected to ZooKeeper
   [junit4]   2> 29851 INFO  (TEST-CdcrReplicationHandlerTest.doTest-seed#[6062827B2BA3024C]) [    ] o.a.s.c.c.SolrZkClient Using default ZkACLProvider
   [junit4]   2> 29857 INFO  (TEST-CdcrReplicationHandlerTest.doTest-seed#[6062827B2BA3024C]) [    ] o.a.s.s.SolrDispatchFilter Loading solr.xml from SolrHome (not found in ZooKeeper)
   [junit4]   2> 29857 INFO  (TEST-CdcrReplicationHandlerTest.doTest-seed#[6062827B2BA3024C]) [    ] o.a.s.c.SolrXmlConfig Loading container configuration from /home/jenkins/workspace/Lucene-Solr-trunk-Linux/solr/build/solr-core/test/J0/temp/solr.cloud.CdcrReplicationHandlerTest_6062827B2BA3024C-001/jetty-001/solr.xml
   [junit4]   2> 29867 INFO  (TEST-CdcrReplicationHandlerTest.doTest-seed#[6062827B2BA3024C]) [    ] o.a.s.c.CoresLocator Config-defined core root directory: /home/jenkins/workspace/Lucene-Solr-trunk-Linux/solr/build/solr-core/test/J0/temp/solr.cloud.CdcrReplicationHandlerTest_6062827B2BA3024C-001/jetty-001/cores
   [junit4]   2> 29867 INFO  (TEST-CdcrReplicationHandlerTest.doTest-seed#[6062827B2BA3024C]) [    ] o.a.s.c.CoreContainer New CoreContainer 1960471638
   [junit4]   2> 29867 INFO  (TEST-CdcrReplicationHandlerTest.doTest-seed#[6062827B2BA3024C]) [    ] o.a.s.c.CoreContainer Loading cores into CoreContainer [instanceDir=/home/jenkins/workspace/Lucene-Solr-trunk-Linux/solr/build/solr-core/test/J0/temp/solr.cloud.CdcrReplicationHandlerTest_6062827B2BA3024C-001/jetty-001/]
   [junit4]   2> 29868 INFO  (TEST-CdcrReplicationHandlerTest.doTest-seed#[6062827B2BA3024C]) [    ] o.a.s.c.CoreContainer loading shared library: /home/jenkins/workspace/Lucene-Solr-trunk-Linux/solr/build/solr-core/test/J0/temp/solr.cloud.CdcrReplicationHandlerTest_6062827B2BA3024C-001/jetty-001/lib
   [junit4]   2> 29868 WARN  (TEST-CdcrReplicationHandlerTest.doTest-seed#[6062827B2BA3024C]) [    ] o.a.s.c.SolrResourceLoader Can't find (or read) directory to add to classloader: lib (resolved as: /home/jenkins/workspace/Lucene-Solr-trunk-Linux/solr/build/solr-core/test/J0/temp/solr.cloud.CdcrReplicationHandlerTest_6062827B2BA3024C-001/jetty-001/lib).
   [junit4]   2> 29877 INFO  (TEST-CdcrReplicationHandlerTest.doTest-seed#[6062827B2BA3024C]) [    ] o.a.s.h.c.HttpShardHandlerFactory created with socketTimeout : 90000,urlScheme : ,connTimeout : 15000,maxConnectionsPerHost : 20,maxConnections : 10000,corePoolSize : 0,maximumPoolSize : 2147483647,maxThreadIdleTime : 5,sizeOfQueue : -1,fairnessPolicy : false,useRetries : false,
   [junit4]   2> 29880 INFO  (TEST-CdcrReplicationHandlerTest.doTest-seed#[6062827B2BA3024C]) [    ] o.a.s.u.UpdateShardHandler Creating UpdateShardHandler HTTP client with params: socketTimeout=340000&connTimeout=45000&retry=true
   [junit4]   2> 29882 INFO  (TEST-CdcrReplicationHandlerTest.doTest-seed#[6062827B2BA3024C]) [    ] o.a.s.l.LogWatcher SLF4J impl is org.slf4j.impl.Log4jLoggerFactory
   [junit4]   2> 29882 INFO  (TEST-CdcrReplicationHandlerTest.doTest-seed#[6062827B2BA3024C]) [    ] o.a.s.l.LogWatcher Registering Log Listener [Log4j (org.slf4j.impl.Log4jLoggerFactory)]
   [junit4]   2> 29882 INFO  (TEST-CdcrReplicationHandlerTest.doTest-seed#[6062827B2BA3024C]) [    ] o.a.s.c.ZkContainer Zookeeper client=127.0.0.1:33024/solr
   [junit4]   2> 29882 INFO  (TEST-CdcrReplicationHandlerTest.doTest-seed#[6062827B2BA3024C]) [    ] o.a.s.c.ZkController zkHost includes chroot
   [junit4]   2> 29882 INFO  (TEST-CdcrReplicationHandlerTest.doTest-seed#[6062827B2BA3024C]) [    ] o.a.s.c.c.SolrZkClient Using default ZkCredentialsProvider
   [junit4]   2> 29883 INFO  (TEST-CdcrReplicationHandlerTest.doTest-seed#[6062827B2BA3024C]) [    ] o.a.s.c.c.ConnectionManager Waiting for client to connect to ZooKeeper
   [junit4]   2> 29886 INFO  (zkCallback-51-thread-1) [    ] o.a.s.c.c.ConnectionManager Watcher org.apache.solr.common.cloud.ConnectionManager@1773ab22 name:ZooKeeperConnection Watcher:127.0.0.1:33024 got event WatchedEvent state:SyncConnected type:None path:null path:null type:None
   [junit4]   2> 29886 INFO  (TEST-CdcrReplicationHandlerTest.doTest-seed#[6062827B2BA3024C]) [    ] o.a.s.c.c.ConnectionManager Client is connected to ZooKeeper
   [junit4]   2> 29887 INFO  (TEST-CdcrReplicationHandlerTest.doTest-seed#[6062827B2BA3024C]) [    ] o.a.s.c.c.SolrZkClient Using default ZkACLProvider
   [junit4]   2> 29911 INFO  (TEST-CdcrReplicationHandlerTest.doTest-seed#[6062827B2BA3024C]) [n:127.0.0.1:42289__%2Fnd    ] o.a.s.c.c.ConnectionManager Waiting for client to connect to ZooKeeper
   [junit4]   2> 29913 INFO  (zkCallback-52-thread-1-processing-n:127.0.0.1:42289__%2Fnd) [n:127.0.0.1:42289__%2Fnd    ] o.a.s.c.c.ConnectionManager Watcher org.apache.solr.common.cloud.ConnectionManager@1e813690 name:ZooKeeperConnection Watcher:127.0.0.1:33024/solr got event WatchedEvent state:SyncConnected type:None path:null path:null type:None
   [junit4]   2> 29913 INFO  (TEST-CdcrReplicationHandlerTest.doTest-seed#[6062827B2BA3024C]) [n:127.0.0.1:42289__%2Fnd    ] o.a.s.c.c.ConnectionManager Client is connected to ZooKeeper
   [junit4]   2> 29922 INFO  (TEST-CdcrReplicationHandlerTest.doTest-seed#[6062827B2BA3024C]) [n:127.0.0.1:42289__%2Fnd    ] o.a.s.c.c.SolrZkClient makePath: /overseer/queue
   [junit4]   2> 29924 INFO  (TEST-CdcrReplicationHandlerTest.doTest-seed#[6062827B2BA3024C]) [n:127.0.0.1:42289__%2Fnd    ] o.a.s.c.c.SolrZkClient makePath: /overseer/collection-queue-work
   [junit4]   2> 29925 INFO  (TEST-CdcrReplicationHandlerTest.doTest-seed#[6062827B2BA3024C]) [n:127.0.0.1:42289__%2Fnd    ] o.a.s.c.c.SolrZkClient makePath: /overseer/collection-map-running
   [junit4]   2> 29927 INFO  (TEST-CdcrReplicationHandlerTest.doTest-seed#[6062827B2BA3024C]) [n:127.0.0.1:42289__%2Fnd    ] o.a.s.c.c.SolrZkClient makePath: /overseer/collection-map-completed
   [junit4]   2> 29928 INFO  (TEST-CdcrReplicationHandlerTest.doTest-seed#[6062827B2BA3024C]) [n:127.0.0.1:42289__%2Fnd    ] o.a.s.c.c.SolrZkClient makePath: /overseer/collection-map-failure
   [junit4]   2> 29930 INFO  (TEST-CdcrReplicationHandlerTest.doTest-seed#[6062827B2BA3024C]) [n:127.0.0.1:42289__%2Fnd    ] o.a.s.c.c.SolrZkClient makePath: /live_nodes
   [junit4]   2> 29937 INFO  (TEST-CdcrReplicationHandlerTest.doTest-seed#[6062827B2BA3024C]) [n:127.0.0.1:42289__%2Fnd    ] o.a.s.c.c.SolrZkClient makePath: /aliases.json
   [junit4]   2> 29939 INFO  (TEST-CdcrReplicationHandlerTest.doTest-seed#[6062827B2BA3024C]) [n:127.0.0.1:42289__%2Fnd    ] o.a.s.c.c.SolrZkClient makePath: /clusterstate.json
   [junit4]   2> 29940 INFO  (TEST-CdcrReplicationHandlerTest.doTest-seed#[6062827B2BA3024C]) [n:127.0.0.1:42289__%2Fnd    ] o.a.s.c.c.SolrZkClient makePath: /security.json
   [junit4]   2> 29941 INFO  (TEST-CdcrReplicationHandlerTest.doTest-seed#[6062827B2BA3024C]) [n:127.0.0.1:42289__%2Fnd    ] o.a.s.c.ZkController Register node as live in ZooKeeper:/live_nodes/127.0.0.1:42289__%2Fnd
   [junit4]   2> 29941 INFO  (TEST-CdcrReplicationHandlerTest.doTest-seed#[6062827B2BA3024C]) [n:127.0.0.1:42289__%2Fnd    ] o.a.s.c.c.SolrZkClient makePath: /live_nodes/127.0.0.1:42289__%2Fnd
   [junit4]   2> 29943 INFO  (TEST-CdcrReplicationHandlerTest.doTest-seed#[6062827B2BA3024C]) [n:127.0.0.1:42289__%2Fnd    ] o.a.s.c.c.SolrZkClient makePath: /overseer_elect
   [junit4]   2> 29944 INFO  (TEST-CdcrReplicationHandlerTest.doTest-seed#[6062827B2BA3024C]) [n:127.0.0.1:42289__%2Fnd    ] o.a.s.c.c.SolrZkClient makePath: /overseer_elect/election
   [junit4]   2> 29957 INFO  (TEST-CdcrReplicationHandlerTest.doTest-seed#[6062827B2BA3024C]) [n:127.0.0.1:42289__%2Fnd    ] o.a.s.c.Overseer Overseer (id=null) closing
   [junit4]   2> 29958 INFO  (TEST-CdcrReplicationHandlerTest.doTest-seed#[6062827B2BA3024C]) [n:127.0.0.1:42289__%2Fnd    ] o.a.s.c.LeaderElector Joined leadership election with path: /overseer_elect/election/94495643119452165-127.0.0.1:42289__%2Fnd-n_0000000000
   [junit4]   2> 29959 INFO  (TEST-CdcrReplicationHandlerTest.doTest-seed#[6062827B2BA3024C]) [n:127.0.0.1:42289__%2Fnd    ] o.a.s.c.OverseerElectionContext I am going to be the leader 127.0.0.1:42289__%2Fnd
   [junit4]   2> 29959 INFO  (TEST-CdcrReplicationHandlerTest.doTest-seed#[6062827B2BA3024C]) [n:127.0.0.1:42289__%2Fnd    ] o.a.s.c.c.SolrZkClient makePath: /overseer_elect/leader
   [junit4]   2> 29960 INFO  (TEST-CdcrReplicationHandlerTest.doTest-seed#[6062827B2BA3024C]) [n:127.0.0.1:42289__%2Fnd    ] o.a.s.c.Overseer Overseer (id=94495643119452165-127.0.0.1:42289__%2Fnd-n_0000000000) starting
   [junit4]   2> 29962 INFO  (TEST-CdcrReplicationHandlerTest.doTest-seed#[6062827B2BA3024C]) [n:127.0.0.1:42289__%2Fnd    ] o.a.s.c.c.SolrZkClient makePath: /overseer/queue-work
   [junit4]   2> 29967 INFO  (TEST-CdcrReplicationHandlerTest.doTest-seed#[6062827B2BA3024C]) [n:127.0.0.1:42289__%2Fnd    ] o.a.s.c.OverseerAutoReplicaFailoverThread Starting OverseerAutoReplicaFailoverThread autoReplicaFailoverWorkLoopDelay=10000 autoReplicaFailoverWaitAfterExpiration=30000 autoReplicaFailoverBadNodeExpiration=60000
   [junit4]   2> 29967 INFO  (TEST-CdcrReplicationHandlerTest.doTest-seed#[6062827B2BA3024C]) [n:127.0.0.1:42289__%2Fnd    ] o.a.s.c.c.ZkStateReader Updating cluster state from ZooKeeper... 
   [junit4]   2> 29967 INFO  (OverseerCollectionConfigSetProcessor-94495643119452165-127.0.0.1:42289__%2Fnd-n_0000000000) [n:127.0.0.1:42289__%2Fnd    ] o.a.s.c.OverseerTaskProcessor Process current queue of overseer operations
   [junit4]   2> 29968 INFO  (OverseerStateUpdate-94495643119452165-127.0.0.1:42289__%2Fnd-n_0000000000) [n:127.0.0.1:42289__%2Fnd    ] o.a.s.c.Overseer Starting to work on the main queue
   [junit4]   2> 30001 INFO  (TEST-CdcrReplicationHandlerTest.doTest-seed#[6062827B2BA3024C]) [n:127.0.0.1:42289__%2Fnd    ] o.a.s.c.CoreContainer Security conf doesn't exist. Skipping setup for authorization module.
   [junit4]   2> 30001 INFO  (TEST-CdcrReplicationHandlerTest.doTest-seed#[6062827B2BA3024C]) [n:127.0.0.1:42289__%2Fnd    ] o.a.s.c.CoreContainer No authentication plugin used.
   [junit4]   2> 30002 INFO  (TEST-CdcrReplicationHandlerTest.doTest-seed#[6062827B2BA3024C]) [n:127.0.0.1:42289__%2Fnd    ] o.a.s.c.CoresLocator Looking for core definitions underneath /home/jenkins/workspace/Lucene-Solr-trunk-Linux/solr/build/solr-core/test/J0/temp/solr.cloud.CdcrReplicationHandlerTest_6062827B2BA3024C-001/jetty-001/cores
   [junit4]   2> 30010 INFO  (TEST-CdcrReplicationHandlerTest.doTest-seed#[6062827B2BA3024C]) [n:127.0.0.1:42289__%2Fnd    ] o.a.s.c.SolrCore Created CoreDescriptor: {name=collection1, config=solrconfig.xml, transient=false, schema=schema.xml, loadOnStartup=true, configSetProperties=configsetprops.json, instanceDir=/home/jenkins/workspace/Lucene-Solr-trunk-Linux/solr/build/solr-core/test/J0/temp/solr.cloud.CdcrReplicationHandlerTest_6062827B2BA3024C-001/jetty-001/cores/collection1, collection=tmp_collection, absoluteInstDir=/home/jenkins/workspace/Lucene-Solr-trunk-Linux/solr/build/solr-core/test/J0/temp/solr.cloud.CdcrReplicationHandlerTest_6062827B2BA3024C-001/jetty-001/cores/collection1/, coreNodeName=, dataDir=data/, shard=}
   [junit4]   2> 30010 INFO  (TEST-CdcrReplicationHandlerTest.doTest-seed#[6062827B2BA3024C]) [n:127.0.0.1:42289__%2Fnd    ] o.a.s.c.CoresLocator Found core collection1 in /home/jenkins/workspace/Lucene-Solr-trunk-Linux/solr/build/solr-core/test/J0/temp/solr.cloud.CdcrReplicationHandlerTest_6062827B2BA3024C-001/jetty-001/cores/collection1/
   [junit4]   2> 30010 INFO  (TEST-CdcrReplicationHandlerTest.doTest-seed#[6062827B2BA3024C]) [n:127.0.0.1:42289__%2Fnd    ] o.a.s.c.CoresLocator Found 1 core definitions
   [junit4]   2> 30014 INFO  (coreLoadExecutor-85-thread-1-processing-n:127.0.0.1:42289__%2Fnd) [n:127.0.0.1:42289__%2Fnd c:tmp_collection   x:collection1] o.a.s.c.ZkController publishing state=down
   [junit4]   2> 30014 INFO  (coreLoadExecutor-85-thread-1-processing-n:127.0.0.1:42289__%2Fnd) [n:127.0.0.1:42289__%2Fnd c:tmp_collection   x:collection1] o.a.s.c.ZkController numShards not found on descriptor - reading it from system property
   [junit4]   2> 30015 INFO  (TEST-CdcrReplicationHandlerTest.doTest-seed#[6062827B2BA3024C]) [n:127.0.0.1:42289__%2Fnd    ] o.a.s.s.SolrDispatchFilter user.dir=/home/jenkins/workspace/Lucene-Solr-trunk-Linux/solr/build/solr-core/test/J0
   [junit4]   2> 30015 INFO  (TEST-CdcrReplicationHandlerTest.doTest-seed#[6062827B2BA3024C]) [n:127.0.0.1:42289__%2Fnd    ] o.a.s.s.SolrDispatchFilter SolrDispatchFilter.init() done
   [junit4]   2> 30018 INFO  (coreLoadExecutor-85-thread-1-processing-n:127.0.0.1:42289__%2Fnd) [n:127.0.0.1:42289__%2Fnd c:tmp_collection   x:collection1] o.a.s.c.ZkController look for our core node name
   [junit4]   2> 30018 INFO  (OverseerStateUpdate-94495643119452165-127.0.0.1:42289__%2Fnd-n_0000000000) [n:127.0.0.1:42289__%2Fnd    ] o.a.s.c.Overseer processMessage: queueSize: 1, message = {
   [junit4]   2>   "core":"collection1",
   [junit4]   2>   "roles":null,
   [junit4]   2>   "base_url":"https://127.0.0.1:42289/_/nd",
   [junit4]   2>   "node_name":"127.0.0.1:42289__%2Fnd",
   [junit4]   2>   "numShards":"1",
   [junit4]   2>   "state":"down",
   [junit4]   2>   "shard":null,
   [junit4]   2>   "collection":"tmp_collection",
   [junit4]   2>   "operation":"state"} current state version: 0
   [junit4]   2> 30029 INFO  (OverseerStateUpdate-94495643119452165-127.0.0.1:42289__%2Fnd-n_0000000000) [n:127.0.0.1:42289__%2Fnd    ] o.a.s.c.o.ReplicaMutator Update state numShards=1 message={
   [junit4]   2>   "core":"collection1",
   [junit4]   2>   "roles":null,
   [junit4]   2>   "base_url":"https://127.0.0.1:42289/_/nd",
   [junit4]   2>   "node_name":"127.0.0.1:42289__%2Fnd",
   [junit4]   2>   "numShards":"1",
   [junit4]   2>   "state":"down",
   [junit4]   2>   "shard":null,
   [junit4]   2>   "collection":"tmp_collection",
   [junit4]   2>   "operation":"state"}
   [junit4]   2> 30030 INFO  (OverseerStateUpdate-94495643119452165-127.0.0.1:42289__%2Fnd-n_0000000000) [n:127.0.0.1:42289__%2Fnd    ] o.a.s.c.o.ClusterStateMutator building a new cName: tmp_collection
   [junit4]   2> 30036 INFO  (OverseerStateUpdate-94495643119452165-127.0.0.1:42289__%2Fnd-n_0000000000) [n:127.0.0.1:42289__%2Fnd    ] o.a.s.c.o.ReplicaMutator Assigning new node to shard shard=shard1
   [junit4]   2> 30046 INFO  (zkCallback-52-thread-1-processing-n:127.0.0.1:42289__%2Fnd) [n:127.0.0.1:42289__%2Fnd    ] o.a.s.c.c.ZkStateReader A cluster state change: WatchedEvent state:SyncConnected type:NodeDataChanged path:/clusterstate.json, has occurred - updating... (live nodes size: 1)
   [junit4]   2> 31019 INFO  (coreLoadExecutor-85-thread-1-processing-n:127.0.0.1:42289__%2Fnd) [n:127.0.0.1:42289__%2Fnd c:tmp_collection   x:collection1] o.a.s.c.ZkController waiting to find shard id in clusterstate for collection1
   [junit4]   2> 31019 INFO  (coreLoadExecutor-85-thread-1-processing-n:127.0.0.1:42289__%2Fnd) [n:127.0.0.1:42289__%2Fnd c:tmp_collection   x:collection1] o.a.s.c.ZkController Check for collection zkNode:tmp_collection
   [junit4]   2> 31020 INFO  (coreLoadExecutor-85-thread-1-processing-n:127.0.0.1:42289__%2Fnd) [n:127.0.0.1:42289__%2Fnd c:tmp_collection   x:collection1] o.a.s.c.ZkController Creating collection in ZooKeeper:tmp_collection
   [junit4]   2> 31020 INFO  (coreLoadExecutor-85-thread-1-processing-n:127.0.0.1:42289__%2Fnd) [n:127.0.0.1:42289__%2Fnd c:tmp_collection   x:collection1] o.a.s.c.ZkController Looking for collection configName
   [junit4]   2> 31020 INFO  (coreLoadExecutor-85-thread-1-processing-n:127.0.0.1:42289__%2Fnd) [n:127.0.0.1:42289__%2Fnd c:tmp_collection   x:collection1] o.a.s.c.ZkController Only one config set found in zk - using it:conf1
   [junit4]   2> 31021 INFO  (coreLoadExecutor-85-thread-1-processing-n:127.0.0.1:42289__%2Fnd) [n:127.0.0.1:42289__%2Fnd c:tmp_collection   x:collection1] o.a.s.c.c.SolrZkClient makePath: /collections/tmp_collection
   [junit4]   2> 31022 INFO  (zkCallback-52-thread-2-processing-n:127.0.0.1:42289__%2Fnd) [n:127.0.0.1:42289__%2Fnd    ] o.a.s.c.c.ZkStateReader A collections change: WatchedEvent state:SyncConnected type:NodeChildrenChanged path:/collections, has occurred - updating...
   [junit4]   2> 31022 INFO  (coreLoadExecutor-85-thread-1-processing-n:127.0.0.1:42289__%2Fnd) [n:127.0.0.1:42289__%2Fnd c:tmp_collection   x:collection1] o.a.s.c.c.ZkStateReader Load collection config from:/collections/tmp_collection
   [junit4]   2> 31023 INFO  (coreLoadExecutor-85-thread-1-processing-n:127.0.0.1:42289__%2Fnd) [n:127.0.0.1:42289__%2Fnd c:tmp_collection   x:collection1] o.a.s.c.c.ZkStateReader path=/collections/tmp_collection configName=conf1 specified config exists in ZooKeeper
   [junit4]   2> 31023 INFO  (coreLoadExecutor-85-thread-1-processing-n:127.0.0.1:42289__%2Fnd) [n:127.0.0.1:42289__%2Fnd c:tmp_collection   x:collection1] o.a.s.c.SolrResourceLoader new SolrResourceLoader for directory: '/home/jenkins/workspace/Lucene-Solr-trunk-Linux/solr/build/solr-core/test/J0/temp/solr.cloud.CdcrReplicationHandlerTest_6062827B2BA3024C-001/jetty-001/cores/collection1/'
   [junit4]   2> 31046 INFO  (coreLoadExecutor-85-thread-1-processing-n:127.0.0.1:42289__%2Fnd) [n:127.0.0.1:42289__%2Fnd c:tmp_collection   x:collection1] o.a.s.c.Config loaded config solrconfig.xml with version 0 
   [junit4]   2> 31062 INFO  (coreLoadExecutor-85-thread-1-processing-n:127.0.0.1:42289__%2Fnd) [n:127.0.0.1:42289__%2Fnd c:tmp_collection   x:collection1] o.a.s.c.SolrConfig current version of requestparams : -1
   [junit4]   2> 31067 INFO  (coreLoadExecutor-85-thread-1-processing-n:127.0.0.1:42289__%2Fnd) [n:127.0.0.1:42289__%2Fnd c:tmp_collection   x:collection1] o.a.s.c.SolrConfig Using Lucene MatchVersion: 6.0.0
   [junit4]   2> 31077 INFO  (coreLoadExecutor-85-thread-1-processing-n:127.0.0.1:42289__%2Fnd) [n:127.0.0.1:42289__%2Fnd c:tmp_collection   x:collection1] o.a.s.c.Config Loaded SolrConfig: solrconfig.xml
   [junit4]   2> 31079 INFO  (coreLoadExecutor-85-thread-1-processing-n:127.0.0.1:42289__%2Fnd) [n:127.0.0.1:42289__%2Fnd c:tmp_collection   x:collection1] o.a.s.s.IndexSchema Reading Solr Schema from /configs/conf1/schema.xml
   [junit4]   2> 31092 INFO  (coreLoadExecutor-85-thread-1-processing-n:127.0.0.1:42289__%2Fnd) [n:127.0.0.1:42289__%2Fnd c:tmp_collection   x:collection1] o.a.s.s.IndexSchema [collection1] Schema name=test
   [junit4]   2> 31258 INFO  (coreLoadExecutor-85-thread-1-processing-n:127.0.0.1:42289__%2Fnd) [n:127.0.0.1:42289__%2Fnd c:tmp_collection   x:collection1] o.a.s.s.IndexSchema default search field in schema is text
   [junit4]   2> 31260 INFO  (coreLoadExecutor-85-thread-1-processing-n:127.0.0.1:42289__%2Fnd) [n:127.0.0.1:42289__%2Fnd c:tmp_collection   x:collection1] o.a.s.s.IndexSchema unique key field: id
   [junit4]   2> 31262 INFO  (coreLoadExecutor-85-thread-1-processing-n:127.0.0.1:42289__%2Fnd) [n:127.0.0.1:42289__%2Fnd c:tmp_collection   x:collection1] o.a.s.s.FileExchangeRateProvider Reloading exchange rates from file currency.xml
   [junit4]   2> 31265 INFO  (coreLoadExecutor-85-thread-1-processing-n:127.0.0.1:42289__%2Fnd) [n:127.0.0.1:42289__%2Fnd c:tmp_collection   x:collection1] o.a.s.s.FileExchangeRateProvider Reloading exchange rates from file currency.xml
   [junit4]   2> 31305 INFO  (coreLoadExecutor-85-thread-1-processing-n:127.0.0.1:42289__%2Fnd) [n:127.0.0.1:42289__%2Fnd c:tmp_collection   x:collection1] o.a.s.c.ConfigSetProperties Did not find ConfigSet properties, assuming default properties: Can't find resource 'configsetprops.json' in classpath or '/configs/conf1', cwd=/home/jenkins/workspace/Lucene-Solr-trunk-Linux/solr/build/solr-core/test/J0
   [junit4]   2> 31305 INFO  (coreLoadExecutor-85-thread-1-processing-n:127.0.0.1:42289__%2Fnd) [n:127.0.0.1:42289__%2Fnd c:tmp_collection   x:collection1] o.a.s.c.CoreContainer Creating SolrCore 'collection1' using configuration from collection tmp_collection
   [junit4]   2> 31306 INFO  (coreLoadExecutor-85-thread-1-processing-n:127.0.0.1:42289__%2Fnd) [n:127.0.0.1:42289__%2Fnd c:tmp_collection s:shard1 r:core_node1 x:collection1] o.a.s.c.SolrCore solr.StandardDirectoryFactory
   [junit4]   2> 31318 INFO  (coreLoadExecutor-85-thread-1-processing-n:127.0.0.1:42289__%2Fnd) [n:127.0.0.1:42289__%2Fnd c:tmp_collection s:shard1 r:core_node1 x:collection1] o.a.s.c.SolrCore [[collection1] ] Opening new SolrCore at [/home/jenkins/workspace/Lucene-Solr-trunk-Linux/solr/build/solr-core/test/J0/temp/solr.cloud.CdcrReplicationHandlerTest_6062827B2BA3024C-001/jetty-001/cores/collection1/], dataDir=[null]
   [junit4]   2> 31319 INFO  (coreLoadExecutor-85-thread-1-processing-n:127.0.0.1:42289__%2Fnd) [n:127.0.0.1:42289__%2Fnd c:tmp_collection s:shard1 r:core_node1 x:collection1] o.a.s.c.JmxMonitoredMap JMX monitoring is enabled. Adding Solr mbeans to JMX Server: com.sun.jmx.mbeanserver.JmxMBeanServer@723a8a2d
   [junit4]   2> 31320 INFO  (coreLoadExecutor-85-thread-1-processing-n:127.0.0.1:42289__%2Fnd) [n:127.0.0.1:42289__%2Fnd c:tmp_collection s:shard1 r:core_node1 x:collection1] o.a.s.c.CachingDirectoryFactory return new directory for /home/jenkins/workspace/Lucene-Solr-trunk-Linux/solr/build/solr-core/test/J0/temp/solr.cloud.CdcrReplicationHandlerTest_6062827B2BA3024C-001/jetty-001/cores/collection1/data
   [junit4]   2> 31321 INFO  (coreLoadExecutor-85-thread-1-processing-n:127.0.0.1:42289__%2Fnd) [n:127.0.0.1:42289__%2Fnd c:tmp_collection s:shard1 r:core_node1 x:collection1] o.a.s.c.SolrCore New index directory detected: old=null new=/home/jenkins/workspace/Lucene-Solr-trunk-Linux/solr/build/solr-core/test/J0/temp/solr.cloud.CdcrReplicationHandlerTest_6062827B2BA3024C-001/jetty-001/cores/collection1/data/index/
   [junit4]   2> 31321 WARN  (coreLoadExecutor-85-thread-1-processing-n:127.0.0.1:42289__%2Fnd) [n:127.0.0.1:42289__%2Fnd c:tmp_collection s:shard1 r:core_node1 x:collection1] o.a.s.c.SolrCore [collection1] Solr index directory '/home/jenkins/workspace/Lucene-Solr-trunk-Linux/solr/build/solr-core/test/J0/temp/solr.cloud.CdcrReplicationHandlerTest_6062827B2BA3024C-001/jetty-001/cores/collection1/data/index' doesn't exist. Creating new index...
   [junit4]   2> 31322 INFO  (coreLoadExecutor-85-thread-1-processing-n:127.0.0.1:42289__%2Fnd) [n:127.0.0.1:42289__%2Fnd c:tmp_collection s:shard1 r:core_node1 x:collection1] o.a.s.c.CachingDirectoryFactory return new directory for /home/jenkins/workspace/Lucene-Solr-trunk-Linux/solr/build/solr-core/test/J0/temp/solr.cloud.CdcrReplicationHandlerTest_6062827B2BA3024C-001/jetty-001/cores/collection1/data/index
   [junit4]   2> 31322 INFO  (coreLoadExecutor-85-thread-1-processing-n:127.0.0.1:42289__%2Fnd) [n:127.0.0.1:42289__%2Fnd c:tmp_collection s:shard1 r:core_node1 x:collection1] o.a.s.u.RandomMergePolicy RandomMergePolicy wrapping class org.apache.lucene.index.TieredMergePolicy: [TieredMergePolicy: maxMergeAtOnce=22, maxMergeAtOnceExplicit=38, maxMergedSegmentMB=79.099609375, floorSegmentMB=0.3662109375, forceMergeDeletesPctAllowed=1.8697295793508206, segmentsPerTier=48.0, maxCFSSegmentSizeMB=8.796093022207999E12, noCFSRatio=0.4734002106331866
   [junit4]   2> 31428 INFO  (coreLoadExecutor-85-thread-1-processing-n:127.0.0.1:42289__%2Fnd) [n:127.0.0.1:42289__%2Fnd c:tmp_collection s:shard1 r:core_node1 x:collection1] o.a.s.c.SolrCore SolrDeletionPolicy.onCommit: commits: num=1
   [junit4]   2> 	commit{dir=/home/jenkins/workspace/Lucene-Solr-trunk-Linux/solr/build/solr-core/test/J0/temp/solr.cloud.CdcrReplicationHandlerTest_6062827B2BA3024C-001/jetty-001/cores/collection1/data/index,segFN=segments_1,generation=1}
   [junit4]   2> 31429 INFO  (coreLoadExecutor-85-thread-1-processing-n:127.0.0.1:42289__%2Fnd) [n:127.0.0.1:42289__%2Fnd c:tmp_collection s:shard1 r:core_node1 x:collection1] o.a.s.c.SolrCore newest commit generation = 1
   [junit4]   2> 31431 INFO  (OldIndexDirectoryCleanupThreadForCore-collection1) [n:127.0.0.1:42289__%2Fnd c:tmp_collection s:shard1 r:core_node1 x:collection1] o.a.s.c.SolrCore Looking for old index directories to cleanup for core collection1 in /home/jenkins/workspace/Lucene-Solr-trunk-Linux/solr/build/solr-core/test/J0/temp/solr.cloud.CdcrReplicationHandlerTest_6062827B2BA3024C-001/jetty-001/cores/collection1/data/
   [junit4]   2> 31437 INFO  (coreLoadExecutor-85-thread-1-processing-n:127.0.0.1:42289__%2Fnd) [n:127.0.0.1:42289__%2Fnd c:tmp_collection s:shard1 r:core_node1 x:collection1] o.a.s.u.p.UpdateRequestProcessorChain creating updateRequestProcessorChain "cdcr-processor-chain"
   [junit4]   2> 31450 INFO  (coreLoadExecutor-85-thread-1-processing-n:127.0.0.1:42289__%2Fnd) [n:127.0.0.1:42289__%2Fnd c:tmp_collection s:shard1 r:core_node1 x:collection1] o.a.s.c.SolrCore no updateRequestProcessorChain defined as default, creating implicit default
   [junit4]   2> 31454 INFO  (coreLoadExecutor-85-thread-1-processing-n:127.0.0.1:42289__%2Fnd) [n:127.0.0.1:42289__%2Fnd c:tmp_collection s:shard1 r:core_node1 x:collection1] o.a.s.h.l.XMLLoader xsltCacheLifetimeSeconds=60
   [junit4]   2> 31455 INFO  (coreLoadExecutor-85-thread-1-processing-n:127.0.0.1:42289__%2Fnd) [n:127.0.0.1:42289__%2Fnd c:tmp_collection s:shard1 r:core_node1 x:collection1] o.a.s.h.l.XMLLoader xsltCacheLifetimeSeconds=60
   [junit4]   2> 31456 INFO  (coreLoadExecutor-85-thread-1-processing-n:127.0.0.1:42289__%2Fnd) [n:127.0.0.1:42289__%2Fnd c:tmp_collection s:shard1 r:core_node1 x:collection1] o.a.s.h.l.XMLLoader xsltCacheLifetimeSeconds=60
   [junit4]   2> 31457 INFO  (coreLoadExecutor-85-thread-1-processing-n:127.0.0.1:42289__%2Fnd) [n:127.0.0.1:42289__%2Fnd c:tmp_collection s:shard1 r:core_node1 x:collection1] o.a.s.h.l.XMLLoader xsltCacheLifetimeSeconds=60
   [junit4]   2> 31469 INFO  (coreLoadExecutor-85-thread-1-processing-n:127.0.0.1:42289__%2Fnd) [n:127.0.0.1:42289__%2Fnd c:tmp_collection s:shard1 r:core_node1 x:collection1] o.a.s.c.RequestHandlers Registered paths: /admin/mbeans,standard,/update/csv,/update/json/docs,/admin/luke,/admin/segments,/get,/admin/system,/replication,/admin/properties,/config,/schema,/admin/plugins,/admin/logging,/update/json,/admin/threads,/admin/ping,/cdcr,/update,/admin/file
   [junit4]   2> 31470 INFO  (coreLoadExecutor-85-thread-1-processing-n:127.0.0.1:42289__%2Fnd) [n:127.0.0.1:42289__%2Fnd c:tmp_collection s:shard1 r:core_node1 x:collection1] o.a.s.c.SolrCore Using default statsCache cache: org.apache.solr.search.stats.LocalStatsCache
   [junit4]   2> 31478 INFO  (coreLoadExecutor-85-thread-1-processing-n:127.0.0.1:42289__%2Fnd) [n:127.0.0.1:42289__%2Fnd c:tmp_collection s:shard1 r:core_node1 x:collection1] o.a.s.u.UpdateHandler Using UpdateLog implementation: org.apache.solr.update.CdcrUpdateLog
   [junit4]   2> 31479 INFO  (coreLoadExecutor-85-thread-1-processing-n:127.0.0.1:42289__%2Fnd) [n:127.0.0.1:42289__%2Fnd c:tmp_collection s:shard1 r:core_node1 x:collection1] o.a.s.u.UpdateLog Initializing UpdateLog: dataDir= defaultSyncLevel=FLUSH numRecordsToKeep=100 maxNumLogsToKeep=10 numVersionBuckets=65536
   [junit4]   2> 31493 INFO  (coreLoadExecutor-85-thread-1-processing-n:127.0.0.1:42289__%2Fnd) [n:127.0.0.1:42289__%2Fnd c:tmp_collection s:shard1 r:core_node1 x:collection1] o.a.s.c.SolrCore Hard AutoCommit: disabled
   [junit4]   2> 31494 INFO  (coreLoadExecutor-85-thread-1-processing-n:127.0.0.1:42289__%2Fnd) [n:127.0.0.1:42289__%2Fnd c:tmp_collection s:shard1 r:core_node1 x:collection1] o.a.s.c.SolrCore Soft AutoCommit: disabled
   [junit4]   2> 31495 INFO  (coreLoadExecutor-85-thread-1-processing-n:127.0.0.1:42289__%2Fnd) [n:127.0.0.1:42289__%2Fnd c:tmp_collection s:shard1 r:core_node1 x:collection1] o.a.s.u.RandomMergePolicy RandomMergePolicy wrapping class org.apache.lucene.index.LogDocMergePolicy: [LogDocMergePolicy: minMergeSize=1000, mergeFactor=28, maxMergeSize=9223372036854775807, maxMergeSizeForForcedMerge=9223372036854775807, calibrateSizeByDeletes=true, maxMergeDocs=2147483647, maxCFSSegmentSizeMB=8.796093022207999E12, noCFSRatio=1.0]
   [junit4]   2> 31496 INFO  (coreLoadExecutor-85-thread-1-processing-n:127.0.0.1:42289__%2Fnd) [n:127.0.0.1:42289__%2Fnd c:tmp_collection s:shard1 r:core_node1 x:collection1] o.a.s.c.SolrCore SolrDeletionPolicy.onInit: commits: num=1
   [junit4]   2> 	commit{dir=/home/jenkins/workspace/Lucene-Solr-trunk-Linux/solr/build/solr-core/test/J0/temp/solr.cloud.CdcrReplicationHandlerTest_6062827B2BA3024C-001/jetty-001/cores/collection1/data/index,segFN=segments_1,generation=1}
   [junit4]   2> 31496 INFO  (coreLoadExecutor-85-thread-1-processing-n:127.0.0.1:42289__%2Fnd) [n:127.0.0.1:42289__%2Fnd c:tmp_collection s:shard1 r:core_node1 x:collection1] o.a.s.c.SolrCore newest commit generation = 1
   [junit4]   2> 31496 INFO  (coreLoadExecutor-85-thread-1-processing-n:127.0.0.1:42289__%2Fnd) [n:127.0.0.1:42289__%2Fnd c:tmp_collection s:shard1 r:core_node1 x:collection1] o.a.s.s.SolrIndexSearcher Opening Searcher@4e375a01[collection1] main
   [junit4]   2> 31497 INFO  (coreLoadExecutor-85-thread-1-processing-n:127.0.0.1:42289__%2Fnd) [n:127.0.0.1:42289__%2Fnd c:tmp_collection s:shard1 r:core_node1 x:collection1] o.a.s.c.c.ZkStateReader Load collection config from:/collections/tmp_collection
   [junit4]   2> 31498 INFO  (coreLoadExecutor-85-thread-1-processing-n:127.0.0.1:42289__%2Fnd) [n:127.0.0.1:42289__%2Fnd c:tmp_collection s:shard1 r:core_node1 x:collection1] o.a.s.c.c.ZkStateReader path=/collections/tmp_collection configName=conf1 specified config exists in ZooKeeper
   [junit4]   2> 31498 INFO  (coreLoadExecutor-85-thread-1-processing-n:127.0.0.1:42289__%2Fnd) [n:127.0.0.1:42289__%2Fnd c:tmp_collection s:shard1 r:core_node1 x:collection1] o.a.s.r.ManagedResourceStorage Setting up ZooKeeper-based storage for the RestManager with znodeBase: /configs/conf1
   [junit4]   2> 31501 INFO  (coreLoadExecutor-85-thread-1-processing-n:127.0.0.1:42289__%2Fnd) [n:127.0.0.1:42289__%2Fnd c:tmp_collection s:shard1 r:core_node1 x:collection1] o.a.s.r.ManagedResourceStorage Configured ZooKeeperStorageIO with znodeBase: /configs/conf1
   [junit4]   2> 31502 INFO  (coreLoadExecutor-85-thread-1-processing-n:127.0.0.1:42289__%2Fnd) [n:127.0.0.1:42289__%2Fnd c:tmp_collection s:shard1 r:core_node1 x:collection1] o.a.s.r.RestManager Initializing RestManager with initArgs: {}
   [junit4]   2> 31502 INFO  (coreLoadExecutor-85-thread-1-processing-n:127.0.0.1:42289__%2Fnd) [n:127.0.0.1:42289__%2Fnd c:tmp_collection s:shard1 r:core_node1 x:collection1] o.a.s.r.ManagedResourceStorage Reading _rest_managed.json using ZooKeeperStorageIO:path=/configs/conf1
   [junit4]   2> 31503 INFO  (coreLoadExecutor-85-thread-1-processing-n:127.0.0.1:42289__%2Fnd) [n:127.0.0.1:42289__%2Fnd c:tmp_collection s:shard1 r:core_node1 x:collection1] o.a.s.r.ManagedResourceStorage No data found for znode /configs/conf1/_rest_managed.json
   [junit4]   2> 31506 INFO  (coreLoadExecutor-85-thread-1-processing-n:127.0.0.1:42289__%2Fnd) [n:127.0.0.1:42289__%2Fnd c:tmp_collection s:shard1 r:core_node1 x:collection1] o.a.s.r.ManagedResourceStorage Loaded null at path _rest_managed.json using ZooKeeperStorageIO:path=/configs/conf1
   [junit4]   2> 31506 INFO  (coreLoadExecutor-85-thread-1-processing-n:127.0.0.1:42289__%2Fnd) [n:127.0.0.1:42289__%2Fnd c:tmp_collection s:shard1 r:core_node1 x:collection1] o.a.s.r.RestManager Initializing 0 registered ManagedResources
   [junit4]   2> 31506 INFO  (coreLoadExecutor-85-thread-1-processing-n:127.0.0.1:42289__%2Fnd) [n:127.0.0.1:42289__%2Fnd c:tmp_collection s:shard1 r:core_node1 x:collection1] o.a.s.h.ReplicationHandler Commits will be reserved for  10000
   [junit4]   2> 31511 INFO  (coreLoadExecutor-85-thread-1-processing-n:127.0.0.1:42289__%2Fnd) [n:127.0.0.1:42289__%2Fnd c:tmp_collection s:shard1 r:core_node1 x:collection1] o.a.s.c.c.SolrZkClient makePath: /collections/tmp_collection/cdcr/state
   [junit4]   2> 31514 INFO  (coreLoadExecutor-85-thread-1-processing-n:127.0.0.1:42289__%2Fnd) [n:127.0.0.1:42289__%2Fnd c:tmp_collection s:shard1 r:core_node1 x:collection1] o.a.s.h.CdcrBufferStateManager Created znode /collections/tmp_collection/cdcr/state/buffer
   [junit4]   2> 31518 INFO  (coreLoadExecutor-85-thread-1-processing-n:127.0.0.1:42289__%2Fnd) [n:127.0.0.1:42289__%2Fnd c:tmp_collection s:shard1 r:core_node1 x:collection1] o.a.s.h.CdcrProcessStateManager Created znode /collections/tmp_collection/cdcr/state/process
   [junit4]   2> 31556 INFO  (searcherExecutor-86-thread-1-processing-n:127.0.0.1:42289__%2Fnd x:collection1 s:shard1 c:tmp_collection r:core_node1) [n:127.0.0.1:42289__%2Fnd c:tmp_collection s:shard1 r:core_node1 x:collection1] o.a.s.c.SolrCore [collection1] Registered new searcher Searcher@4e375a01[collection1] main{ExitableDirectoryReader(UninvertingDirectoryReader())}
   [junit4]   2> 31556 INFO  (coreLoadExecutor-85-thread-1-processing-n:127.0.0.1:42289__%2Fnd) [n:127.0.0.1:42289__%2Fnd c:tmp_collection s:shard1 r:core_node1 x:collection1] o.a.s.u.UpdateLog Looking up max value of version field to seed version buckets
   [junit4]   2> 31556 INFO  (coreLoadExecutor-85-thread-1-processing-n:127.0.0.1:42289__%2Fnd) [n:127.0.0.1:42289__%2Fnd c:tmp_collection s:shard1 r:core_node1 x:collection1] o.a.s.u.VersionInfo Refreshing highest value of _version_ for 65536 version buckets from index
   [junit4]   2> 31556 INFO  (coreLoadExecutor-85-thread-1-processing-n:127.0.0.1:42289__%2Fnd) [n:127.0.0.1:42289__%2Fnd c:tmp_collection s:shard1 r:core_node1 x:collection1] o.a.s.u.VersionInfo No terms found for _version_, cannot seed version bucket highest value from index
   [junit4]   2> 31556 INFO  (coreLoadExecutor-85-thread-1-processing-n:127.0.0.1:42289__%2Fnd) [n:127.0.0.1:42289__%2Fnd c:tmp_collection s:shard1 r:core_node1 x:collection1] o.a.s.u.UpdateLog Could not find max version in index or recent updates, using new clock 1511930292013629440
   [junit4]   2> 31558 INFO  (coreLoadExecutor-85-thread-1-processing-n:127.0.0.1:42289__%2Fnd) [n:127.0.0.1:42289__%2Fnd c:tmp_collection s:shard1 r:core_node1 x:collection1] o.a.s.u.UpdateLog Took 1.0ms to seed version buckets with highest version 1511930292013629440
   [junit4]   2> 31559 INFO  (coreLoadExecutor-85-thread-1-processing-n:127.0.0.1:42289__%2Fnd) [n:127.0.0.1:42289__%2Fnd c:tmp_collection s:shard1 r:core_node1 x:collection1] o.a.s.c.ZkController watch zkdir /configs/conf1
   [junit4]   2> 31560 INFO  (coreLoadExecutor-85-thread-1-processing-n:127.0.0.1:42289__%2Fnd) [n:127.0.0.1:42289__%2Fnd c:tmp_collection s:shard1 r:core_node1 x:collection1] o.a.s.c.CoreContainer registering core: collection1
   [junit4]   2> 31561 INFO  (coreZkRegister-79-thread-1-processing-n:127.0.0.1:42289__%2Fnd x:collection1 s:shard1 c:tmp_collection r:core_node1) [n:127.0.0.1:42289__%2Fnd c:tmp_collection s:shard1 r:core_node1 x:collection1] o.a.s.c.ZkController Register replica - core:collection1 address:https://127.0.0.1:42289/_/nd collection:tmp_collection shard:shard1
   [junit4]   2> 31567 INFO  (coreZkRegister-79-thread-1-processing-n:127.0.0.1:42289__%2Fnd x:collection1 s:shard1 c:tmp_collection r:core_node1) [n:127.0.0.1:42289__%2Fnd c:tmp_collection s:shard1 r:core_node1 x:collection1] o.a.s.c.c.SolrZkClient makePath: /collections/tmp_collection/leader_elect/shard1/election
   [junit4]   2> 31570 INFO  (coreZkRegister-79-thread-1-processing-n:127.0.0.1:42289__%2Fnd x:collection1 s:shard1 c:tmp_collection r:core_node1) [n:127.0.0.1:42289__%2Fnd c:tmp_collection s:shard1 r:core_node1 x:collection1] o.a.s.c.LeaderElector Joined leadership election with path: /collections/tmp_collection/leader_elect/shard1/election/94495643119452165-core_node1-n_0000000000
   [junit4]   2> 31571 INFO  (coreZkRegister-79-thread-1-processing-n:127.0.0.1:42289__%2Fnd x:collection1 s:shard1 c:tmp_collection r:core_node1) [n:127.0.0.1:42289__%2Fnd c:tmp_collection s:shard1 r:core_node1 x:collection1] o.a.s.c.ShardLeaderElectionContext Running the leader process for shard shard1
   [junit4]   2> 31572 INFO  (coreZkRegister-79-thread-1-processing-n:127.0.0.1:42289__%2Fnd x:collection1 s:shard1 c:tmp_collection r:core_node1) [n:127.0.0.1:42289__%2Fnd c:tmp_collection s:shard1 r:core_node1 x:collection1] o.a.s.c.ShardLeaderElectionContext Enough replicas found to continue.
   [junit4]   2> 31572 INFO  (coreZkRegister-79-thread-1-processing-n:127.0.0.1:42289__%2Fnd x:collection1 s:shard1 c:tmp_collection r:core_node1) [n:127.0.0.1:42289__%2Fnd c:tmp_collection s:shard1 r:core_node1 x:collection1] o.a.s.c.ShardLeaderElectionContext I may be the new leader - try and sync
   [junit4]   2> 31572 INFO  (OverseerStateUpdate-94495643119452165-127.0.0.1:42289__%2Fnd-n_0000000000) [n:127.0.0.1:42289__%2Fnd    ] o.a.s.c.Overseer processMessage: queueSize: 1, message = {
   [junit4]   2>   "operation":"leader",
   [junit4]   2>   "shard":"shard1",
   [junit4]   2>   "collection":"tmp_collection"} current state version: 1
   [junit4]   2> 31573 INFO  (coreZkRegister-79-thread-1-processing-n:127.0.0.1:42289__%2Fnd x:collection1 s:shard1 c:tmp_collection r:core_node1) [n:127.0.0.1:42289__%2Fnd c:tmp_collection s:shard1 r:core_node1 x:collection1] o.a.s.c.SyncStrategy Sync replicas to https://127.0.0.1:42289/_/nd/collection1/
   [junit4]   2> 31573 INFO  (coreZkRegister-79-thread-1-processing-n:127.0.0.1:42289__%2Fnd x:collection1 s:shard1 c:tmp_collection r:core_node1) [n:127.0.0.1:42289__%2Fnd c:tmp_collection s:shard1 r:core_node1 x:collection1] o.a.s.c.SyncStrategy Sync Success - now sync replicas to me
   [junit4]   2> 31574 INFO  (coreZkRegister-79-thread-1-processing-n:127.0.0.1:42289__%2Fnd x:collection1 s:shard1 c:tmp_collection r:core_node1) [n:127.0.0.1:42289__%2Fnd c:tmp_collection s:shard1 r:core_node1 x:collection1] o.a.s.c.SyncStrategy https://127.0.0.1:42289/_/nd/collection1/ has no replicas
   [junit4]   2> 31574 INFO  (coreZkRegister-79-thread-1-processing-n:127.0.0.1:42289__%2Fnd x:collection1 s:shard1 c:tmp_collection r:core_node1) [n:127.0.0.1:42289__%2Fnd c:tmp_collection s:shard1 r:core_node1 x:collection1] o.a.s.c.ShardLeaderElectionContext I am the new leader: https://127.0.0.1:42289/_/nd/collection1/ shard1
   [junit4]   2> 31591 INFO  (coreZkRegister-79-thread-1-processing-n:127.0.0.1:42289__%2Fnd x:collection1 s:shard1 c:tmp_collection r:core_node1) [n:127.0.0.1:42289__%2Fnd c:tmp_collection s:shard1 r:core_node1 x:collection1] o.a.s.c.c.SolrZkClient makePath: /collections/tmp_collection/leaders/shard1
   [junit4]   2> 31592 INFO  (zkCallback-52-thread-2-processing-n:127.0.0.1:42289__%2Fnd) [n:127.0.0.1:42289__%2Fnd    ] o.a.s.c.c.ZkStateReader A cluster state change: WatchedEvent state:SyncConnected type:NodeDataChanged path:/clusterstate.json, has occurred - updating... (live nodes size: 1)
   [junit4]   2> 31596 INFO  (coreZkRegister-79-thread-1-processing-n:127.0.0.1:42289__%2Fnd x:collection1 s:shard1 c:tmp_collection r:core_node1) [n:127.0.0.1:42289__%2Fnd c:tmp_collection s:shard1 r:core_node1 x:collection1] o.a.s.c.ShardLeaderElectionContextBase Creating leader registration node
   [junit4]   2> 31607 INFO  (zkCallback-52-thread-2-processing-n:127.0.0.1:42289__%2Fnd) [n:127.0.0.1:42289__%2Fnd    ] o.a.s.h.CdcrProcessStateManager Received new leader state @ tmp_collection:shard1
   [junit4]   2> 31610 INFO  (OverseerStateUpdate-94495643119452165-127.0.0.1:42289__%2Fnd-n_0000000000) [n:127.0.0.1:42289__%2Fnd    ] o.a.s.c.Overseer processMessage: queueSize: 1, message = {
   [junit4]   2>   "operation":"leader",
   [junit4]   2>   "shard":"shard1",
   [junit4]   2>   "collection":"tmp_collection",
   [junit4]   2>   "base_url":"https://127.0.0.1:42289/_/nd",
   [junit4]   2>   "core":"collection1",
   [junit4]   2>   "state":"active"} current state version: 2
   [junit4]   2> 31712 INFO  (zkCallback-52-thread-2-processing-n:127.0.0.1:42289__%2Fnd) [n:127.0.0.1:42289__%2Fnd    ] o.a.s.c.c.ZkStateReader A cluster state change: WatchedEvent state:SyncConnected type:NodeDataChanged path:/clusterstate.json, has occurred - updating... (live nodes size: 1)
   [junit4]   2> 31760 INFO  (coreZkRegister-79-thread-1-processing-n:127.0.0.1:42289__%2Fnd x:collection1 s:shard1 c:tmp_collection r:core_node1) [n:127.0.0.1:42289__%2Fnd c:tmp_collection s:shard1 r:core_node1 x:collection1] o.a.s.c.ZkController We are https://127.0.0.1:42289/_/nd/collection1/ and leader is https://127.0.0.1:42289/_/nd/collection1/
   [junit4]   2> 31760 INFO  (coreZkRegister-79-thread-1-processing-n:127.0.0.1:42289__%2Fnd x:collection1 s:shard1 c:tmp_collection r:core_node1) [n:127.0.0.1:42289__%2Fnd c:tmp_collection s:shard1 r:core_node1 x:collection1] o.a.s.c.ZkController No LogReplay needed for core=collection1 baseURL=https://127.0.0.1:42289/_/nd
   [junit4]   2> 31760 INFO  (coreZkRegister-79-thread-1-processing-n:127.0.0.1:42289__%2Fnd x:collection1 s:shard1 c:tmp_collection r:core_node1) [n:127.0.0.1:42289__%2Fnd c:tmp_collection s:shard1 r:core_node1 x:collection1] o.a.s.c.ZkController I am the leader, no recovery necessary
   [junit4]   2> 31760 INFO  (coreZkRegister-79-thread-1-processing-n:127.0.0.1:42289__%2Fnd x:collection1 s:shard1 c:tmp_collection r:core_node1) [n:127.0.0.1:42289__%2Fnd c:tmp_collection s:shard1 r:core_node1 x:collection1] o.a.s.c.ZkController publishing state=active
   [junit4]   2> 31760 INFO  (coreZkRegister-79-thread-1-processing-n:127.0.0.1:42289__%2Fnd x:collection1 s:shard1 c:tmp_collection r:core_node1) [n:127.0.0.1:42289__%2Fnd c:tmp_collection s:shard1 r:core_node1 x:collection1] o.a.s.c.ZkController numShards not found on descriptor - reading it from system property
   [junit4]   2> 31763 INFO  (OverseerStateUpdate-94495643119452165-127.0.0.1:42289__%2Fnd-n_0000000000) [n:127.0.0.1:42289__%2Fnd    ] o.a.s.c.Overseer processMessage: queueSize: 1, message = {
   [junit4]   2>   "core":"collection1",
   [junit4]   2>   "core_node_name":"core_node1",
   [junit4]   2>   "roles":null,
   [junit4]   2>   "base_url":"https://127.0.0.1:42289/_/nd",
   [junit4]   2>   "node_name":"127.0.0.1:42289__%2Fnd",
   [junit4]   2>   "numShards":"1",
   [junit4]   2>   "state":"active",
   [junit4]   2>   "shard":"shard1",
   [junit4]   2>   "collection":"tmp_collection",
   [junit4]   2>   "operation":"state"} current state version: 3
   [junit4]   2> 31764 INFO  (OverseerStateUpdate-94495643119452165-127.0.0.1:42289__%2Fnd-n_0000000000) [n:127.0.0.1:42289__%2Fnd    ] o.a.s.c.o.ReplicaMutator Update state numShards=1 message={
   [junit4]   2>   "core":"collection1",
   [junit4]   2>   "core_node_name":"core_node1",
   [junit4]   2>   "roles":null,
   [junit4]   2>   "base_url":"https://127.0.0.1:42289/_/nd",
   [junit4]   2>   "node_name":"127.0.0.1:42289__%2Fnd",
   [junit4]   2>   "numShards":"1",
   [junit4]   2>   "state":"active",
   [junit4]   2>   "shard":"shard1",
   [junit4]   2>   "collection":"tmp_collection",
   [junit4]   2>   "operation":"state"}
   [junit4]   2> 31866 INFO  (zkCallback-52-thread-2-processing-n:127.0.0.1:42289__%2Fnd) [n:127.0.0.1:42289__%2Fnd    ] o.a.s.c.c.ZkStateReader A cluster state change: WatchedEvent state:SyncConnected type:NodeDataChanged path:/clusterstate.json, has occurred - updating... (live nodes size: 1)
   [junit4]   2> 32126 INFO  (TEST-CdcrReplicationHandlerTest.doTest-seed#[6062827B2BA3024C]) [    ] o.a.s.SolrTestCaseJ4 Writing core.properties file to /home/jenkins/workspace/Lucene-Solr-trunk-Linux/solr/build/solr-core/test/J0/temp/solr.cloud.CdcrReplicationHandlerTest_6062827B2BA3024C-001/jetty-002/cores/collection1
   [junit4]   2> 32136 INFO  (TEST-CdcrReplicationHandlerTest.doTest-seed#[6062827B2BA3024C]) [    ] o.e.j.s.Server jetty-9.2.13.v20150730
   [junit4]   2> 32137 INFO  (TEST-CdcrReplicationHandlerTest.doTest-seed#[6062827B2BA3024C]) [    ] o.e.j.s.h.ContextHandler Started o.e.j.s.ServletContextHandler@41c5cac8{/_/nd,null,AVAILABLE}
   [junit4]   2> 32144 INFO  (TEST-CdcrReplicationHandlerTest.doTest-seed#[6062827B2BA3024C]) [    ] o.e.j.s.ServerConnector Started ServerConnector@7462d893{SSL-http/1.1}{127.0.0.1:39691}
   [junit4]   2> 32144 INFO  (TEST-CdcrReplicationHandlerTest.doTest-seed#[6062827B2BA3024C]) [    ] o.e.j.s.Server Started @34002ms
   [junit4]   2> 32144 INFO  (TEST-CdcrReplicationHandlerTest.doTest-seed#[6062827B2BA3024C]) [    ] o.a.s.c.s.e.JettySolrRunner Jetty properties: {shards=shard2, hostContext=/_/nd, hostPort=39691, coreRootDirectory=/home/jenkins/workspace/Lucene-Solr-trunk-Linux/solr/build/solr-core/test/J0/temp/solr.cloud.CdcrReplicationHandlerTest_6062827B2BA3024C-001/jetty-002/cores}
   [junit4]   2> 32145 INFO  (TEST-CdcrReplicationHandlerTest.doTest-seed#[6062827B2BA3024C]) [    ] o.a.s.s.SolrDispatchFilter SolrDispatchFilter.init(): sun.misc.Launcher$AppClassLoader@4e0e2f2a
   [junit4]   2> 32145 INFO  (TEST-CdcrReplicationHandlerTest.doTest-seed#[6062827B2BA3024C]) [    ] o.a.s.c.SolrResourceLoader new SolrResourceLoader for directory: '/home/jenkins/workspace/Lucene-Solr-trunk-Linux/solr/build/solr-core/test/J0/temp/solr.cloud.CdcrReplicationHandlerTest_6062827B2BA3024C-001/jetty-002/'
   [junit4]   2> 32154 INFO  (TEST-CdcrReplicationHandlerTest.doTest-seed#[6062827B2BA3024C]) [    ] o.a.s.c.c.SolrZkClient Using default ZkCredentialsProvider
   [junit4]   2> 32155 INFO  (TEST-CdcrReplicationHandlerTest.doTest-seed#[6062827B2BA3024C]) [    ] o.a.s.c.c.ConnectionManager Waiting for client to connect to ZooKeeper
   [junit4]   2> 32157 INFO  (zkCallback-53-thread-1) [    ] o.a.s.c.c.ConnectionManager Watcher org.apache.solr.common.cloud.ConnectionManager@2848dc63 name:ZooKeeperConnection Watcher:127.0.0.1:33024/solr got event WatchedEvent state:SyncConnected type:None path:null path:null type:None
   [junit4]   2> 32157 INFO  (TEST-CdcrReplicationHandlerTest.doTest-seed#[6062827B2BA3024C]) [    ] o.a.s.c.c.ConnectionManager Client is connected to ZooKeeper
   [junit4]   2> 32157 INFO  (TEST-CdcrReplicationHandlerTest.doTest-seed#[6062827B2BA3024C]) [    ] o.a.s.c.c.SolrZkClient Using default ZkACLProvider
   [junit4]   2> 32159 INFO  (TEST-CdcrReplicationHandlerTest.doTest-seed#[6062827B2BA3024C]) [    ] o.a.s.s.SolrDispatchFilter Loading solr.xml from SolrHome (not found in ZooKeeper)
   [junit4]   2> 32159 INFO  (TEST-CdcrReplicationHandlerTest.doTest-seed#[6062827B2BA3024C]) [    ] o.a.s.c.SolrXmlConfig Loading container configuration from /home/jenkins/workspace/Lucene-Solr-trunk-Linux/solr/build/solr-core/test/J0/temp/solr.cloud.CdcrReplicationHandlerTest_6062827B2BA3024C-001/jetty-002/solr.xml
   [junit4]   2> 32164 INFO  (TEST-CdcrReplicationHandlerTest.doTest-seed#[6062827B2BA3024C]) [    ] o.a.s.c.CoresLocator Config-defined core root directory: /home/jenkins/workspace/Lucene-Solr-trunk-Linux/solr/build/solr-core/test/J0/temp/solr.cloud.CdcrReplicationHandlerTest_6062827B2BA3024C-001/jetty-002/cores
   [junit4]   2> 32164 INFO  (TEST-CdcrReplicationHandlerTest.doTest-seed#[6062827B2BA3024C]) [    ] o.a.s.c.CoreContainer New CoreContainer 558330536
   [junit4]   2> 32165 INFO  (TEST-CdcrReplicationHandlerTest.doTest-seed#[6062827B2BA3024C]) [    ] o.a.s.c.CoreContainer Loading cores into CoreContainer [instanceDir=/home/jenkins/workspace/Lucene-Solr-trunk-Linux/solr/build/solr-core/test/J0/temp/solr.cloud.CdcrReplicationHandlerTest_6062827B2BA3024C-001/jetty-002/]
   [junit4]   2> 32165 INFO  (TEST-CdcrReplicationHandlerTest.doTest-seed#[6062827B2BA3024C]) [    ] o.a.s.c.CoreContainer loading shared library: /home/jenkins/workspace/Lucene-Solr-trunk-Linux/solr/build/solr-core/test/J0/temp/solr.cloud.CdcrReplicationHandlerTest_6062827B2BA3024C-001/jetty-002/lib
   [junit4]   2> 32165 WARN  (TEST-CdcrReplicationHandlerTest.doTest-seed#[6062827B2BA3024C]) [    ] o.a.s.c.SolrResourceLoader Can't find (or read) directory to add to classloader: lib (resolved as: /home/jenkins/workspace/Lucene-Solr-trunk-Linux/solr/build/solr-core/test/J0/temp/solr.cloud.CdcrReplicationHandlerTest_6062827B2BA3024C-001/jetty-002/lib).
   [junit4]   2> 32170 INFO  (TEST-CdcrReplicationHandlerTest.doTest-seed#[6062827B2BA3024C]) [    ] o.a.s.h.c.HttpShardHandlerFactory created with socketTimeout : 90000,urlScheme : ,connTimeout : 15000,maxConnectionsPerHost : 20,maxConnections : 10000,corePoolSize : 0,maximumPoolSize : 2147483647,maxThreadIdleTime : 5,sizeOfQueue : -1,fairnessPolicy : false,useRetries : false,
   [junit4]   2> 32172 INFO  (TEST-CdcrReplicationHandlerTest.doTest-seed#[6062827B2BA3024C]) [    ] o.a.s.u.UpdateShardHandler Creating UpdateShardHandler HTTP client with params: socketTimeout=340000&connTimeout=45000&retry=true
   [junit4]   2> 32174 INFO  (TEST-CdcrReplicationHandlerTest.doTest-seed#[6062827B2BA3024C]) [    ] o.a.s.l.LogWatcher SLF4J impl is org.slf4j.impl.Log4jLoggerFactory
   [junit4]   2> 32174 INFO  (TEST-CdcrReplicationHandlerTest.doTest-seed#[6062827B2BA3024C]) [    ] o.a.s.l.LogWatcher Registering Log Listener [Log4j (org.slf4j.impl.Log4jLoggerFactory)]
   [junit4]   2> 32174 INFO  (TEST-CdcrReplicationHandlerTest.doTest-seed#[6062827B2BA3024C]) [    ] o.a.s.c.ZkContainer Zookeeper client=127.0.0.1:33024/solr
   [junit4]   2> 32174 INFO  (TEST-CdcrReplicationHandlerTest.doTest-seed#[6062827B2BA3024C]) [    ] o.a.s.c.ZkController zkHost includes chroot
   [junit4]   2> 32174 INFO  (TEST-CdcrReplicationHandlerTest.doTest-seed#[6062827B2BA3024C]) [    ] o.a.s.c.c.SolrZkClient Using default ZkCredentialsProvider
   [junit4]   2> 32174 INFO  (TEST-CdcrReplicationHandlerTest.doTest-seed#[6062827B2BA3024C]) [    ] o.a.s.c.c.ConnectionManager Waiting for client to connect to ZooKeeper
   [junit4]   2> 32176 INFO  (zkCallback-55-thread-1) [    ] o.a.s.c.c.ConnectionManager Watcher org.apache.solr.common.cloud.ConnectionManager@3ce1550c name:ZooKeeperConnection Watcher:127.0.0.1:33024 got event WatchedEvent state:SyncConnected type:None path:null path:null type:None
   [junit4]   2> 32176 INFO  (TEST-CdcrReplicationHandlerTest.doTest-seed#[6062827B2BA3024C]) [    ] o.a.s.c.c.ConnectionManager Client is connected to ZooKeeper
   [junit4]   2> 32176 INFO  (TEST-CdcrReplicationHandlerTest.doTest-seed#[6062827B2BA3024C]) [    ] o.a.s.c.c.SolrZkClient Using default ZkACLProvider
   [junit4]   2> 32194 INFO  (TEST-CdcrReplicationHandlerTest.doTest-seed#[6062827B2BA3024C]) [n:127.0.0.1:39691__%2Fnd    ] o.a.s.c.c.ConnectionManager Waiting for client to connect to ZooKeeper
   [junit4]   2> 32195 INFO  (zkCallback-56-thread-1-processing-n:127.0.0.1:39691__%2Fnd) [n:127.0.0.1:39691__%2Fnd    ] o.a.s.c.c.ConnectionManager Watcher org.apache.solr.common.cloud.ConnectionManager@2800adf3 name:ZooKeeperConnection Watcher:127.0.0.1:33024/solr got event WatchedEvent state:SyncConnected type:None path:null path:null type:None
   [junit4]   2> 32195 INFO  (TEST-CdcrReplicationHandlerTest.doTest-seed#[6062827B2BA3024C]) [n:127.0.0.1:39691__%2Fnd    ] o.a.s.c.c.ConnectionManager Client is connected to ZooKeeper
   [junit4]   2> 32199 INFO  (TEST-CdcrReplicationHandlerTest.doTest-seed#[6062827B2BA3024C]) [n:127.0.0.1:39691__%2Fnd    ] o.a.s.c.c.ZkStateReader Updating cluster state from ZooKeeper... 
   [junit4]   2> 33204 INFO  (TEST-CdcrReplicationHandlerTest.doTest-seed#[6062827B2BA3024C]) [n:127.0.0.1:39691__%2Fnd    ] o.a.s.c.ZkController Register node as live in ZooKeeper:/live_nodes/127.0.0.1:39691__%2Fnd
   [junit4]   2> 33205 INFO  (TEST-CdcrReplicationHandlerTest.doTest-seed#[6062827B2BA3024C]) [n:127.0.0.1:39691__%2Fnd    ] o.a.s.c.c.SolrZkClient makePath: /live_nodes/127.0.0.1:39691__%2Fnd
   [junit4]   2> 33210 INFO  (zkCallback-56-thread-1-processing-n:127.0.0.1:39691__%2Fnd) [n:127.0.0.1:39691__%2Fnd    ] o.a.s.c.c.ZkStateReader A live node change: WatchedEvent state:SyncConnected type:NodeChildrenChanged path:/live_nodes, has occurred - updating... (live nodes size: 1)
   [junit4]   2> 33210 INFO  (zkCallback-52-thread-2-processing-n:127.0.0.1:42289__%2Fnd) [n:127.0.0.1:42289__%2Fnd    ] o.a.s.c.c.ZkStateReader A live node change: WatchedEvent state:SyncConnected type:NodeChildrenChanged path:/live_nodes, has occurred - updating... (live nodes size: 1)
   [junit4]   2> 33211 INFO  (TEST-CdcrReplicationHandlerTest.doTest-seed#[6062827B2BA3024C]) [n:127.0.0.1:39691__%2Fnd    ] o.a.s.c.Overseer Overseer (id=null) closing
   [junit4]   2> 33211 INFO  (TEST-CdcrReplicationHandlerTest.doTest-seed#[6062827B2BA3024C]) [n:127.0.0.1:39691__%2Fnd    ] o.a.s.c.LeaderElector Joined leadership election with path: /overseer_elect/election/94495643119452168-127.0.0.1:39691__%2Fnd-n_0000000001
   [junit4]   2> 33212 INFO  (TEST-CdcrReplicationHandlerTest.doTest-seed#[6062827B2BA3024C]) [n:127.0.0.1:39691__%2Fnd    ] o.a.s.c.LeaderElector Watching path /overseer_elect/election/94495643119452165-127.0.0.1:42289__%2Fnd-n_0000000000 to know if I could be the leader
   [junit4]   2> 33244 INFO  (TEST-CdcrReplicationHandlerTest.doTest-seed#[6062827B2BA3024C]) [n:127.0.0.1:39691__%2Fnd    ] o.a.s.c.CoreContainer Security conf doesn't exist. Skipping setup for authorization module.
   [junit4]   2> 33244 INFO  (TEST-CdcrReplicationHandlerTest.doTest-seed#[6062827B2BA3024C]) [n:127.0.0.1:39691__%2Fnd    ] o.a.s.c.CoreContainer No authentication plugin used.
   [junit4]   2> 33245 INFO  (TEST-CdcrReplicationHandlerTest.doTest-seed#[6062827B2BA3024C]) [n:127.0.0.1:39691__%2Fnd    ] o.a.s.c.CoresLocator Looking for core definitions underneath /home/jenkins/workspace/Lucene-Solr-trunk-Linux/solr/build/solr-core/test/J0/temp/solr.cloud.CdcrReplicationHandlerTest_6062827B2BA3024C-001/jetty-002/cores
   [junit4]   2> 33246 INFO  (TEST-CdcrReplicationHandlerTest.doTest-seed#[6062827B2BA3024C]) [n:127.0.0.1:39691__%2Fnd    ] o.a.s.c.SolrCore Created CoreDescriptor: {name=collection1, config=solrconfig.xml, transient=false, schema=schema.xml, loadOnStartup=true, configSetProperties=configsetprops.json, instanceDir=/home/jenkins/workspace/Lucene-Solr-trunk-Linux/solr/build/solr-core/test/J0/temp/solr.cloud.CdcrReplicationHandlerTest_6062827B2BA3024C-001/jetty-002/cores/collection1, collection=tmp_collection, absoluteInstDir=/home/jenkins/workspace/Lucene-Solr-trunk-Linux/solr/build/solr-core/test/J0/temp/solr.cloud.CdcrReplicationHandlerTest_6062827B2BA3024C-001/jetty-002/cores/collection1/, coreNodeName=, dataDir=data/, shard=}
   [junit4]   2> 33246 INFO  (TEST-CdcrReplicationHandlerTest.doTest-seed#[6062827B2BA3024C]) [n:127.0.0.1:39691__%2Fnd    ] o.a.s.c.CoresLocator Found core collection1 in /home/jenkins/workspace/Lucene-Solr-trunk-Linux/solr/build/solr-core/test/J0/temp/solr.cloud.CdcrReplicationHandlerTest_6062827B2BA3024C-001/jetty-002/cores/collection1/
   [junit4]   2> 33246 INFO  (TEST-CdcrReplicationHandlerTest.doTest-seed#[6062827B2BA3024C]) [n:127.0.0.1:39691__%2Fnd    ] o.a.s.c.CoresLocator Found 1 core definitions
   [junit4]   2> 33247 INFO  (TEST-CdcrReplicationHandlerTest.doTest-seed#[6062827B2BA3024C]) [n:127.0.0.1:39691__%2Fnd    ] o.a.s.s.SolrDispatchFilter user.dir=/home/jenkins/workspace/Lucene-Solr-trunk-Linux/solr/build/solr-core/test/J0
   [junit4]   2> 33247 INFO  (TEST-CdcrReplicationHandlerTest.doTest-seed#[6062827B2BA3024C]) [n:127.0.0.1:39691__%2Fnd    ] o.a.s.s.SolrDispatchFilter SolrDispatchFilter.init() done
   [junit4]   2> 33247 INFO  (coreLoadExecutor-97-thread-1-processing-n:127.0.0.1:39691__%2Fnd) [n:127.0.0.1:39691__%2Fnd c:tmp_collection   x:collection1] o.a.s.c.ZkController publishing state=down
   [junit4]   2> 33248 INFO  (coreLoadExecutor-97-thread-1-processing-n:127.0.0.1:39691__%2Fnd) [n:127.0.0.1:39691__%2Fnd c:tmp_collection   x:collection1] o.a.s.c.ZkController numShards not found on descriptor - reading it from system property
   [junit4]   2> 33249 INFO  (coreLoadExecutor-97-thread-1-processing-n:127.0.0.1:39691__%2Fnd) [n:127.0.0.1:39691__%2Fnd c:tmp_collection   x:collection1] o.a.s.c.ZkController Registering watch for collection tmp_collection
   [junit4]   2> 33249 INFO  (coreLoadExecutor-97-thread-1-processing-n:127.0.0.1:39691__%2Fnd) [n:127.0.0.1:39691__%2Fnd c:tmp_collection   x:collection1] o.a.s.c.c.ZkStateReader addZkWatch tmp_collection
   [junit4]   2> 33250 INFO  (OverseerStateUpdate-94495643119452165-127.0.0.1:42289__%2Fnd-n_0000000000) [n:127.0.0.1:42289__%2Fnd    ] o.a.s.c.Overseer processMessage: queueSize: 1, message = {
   [junit4]   2>   "core":"collection1",
   [junit4]   2>   "roles":null,
   [junit4]   2>   "base_url":"https://127.0.0.1:39691/_/nd",
   [junit4]   2>   "node_name":"127.0.0.1:39691__%2Fnd",
   [junit4]   2>   "numShards":"1",
   [junit4]   2>   "state":"down",
   [junit4]   2>   "shard":null,
   [junit4]   2>   "collection":"tmp_collection",
   [junit4]   2>   "operation":"state"} current state version: 4
   [junit4]   2> 33250 INFO  (OverseerStateUpdate-94495643119452165-127.0.0.1:42289__%2Fnd-n_0000000000) [n:127.0.0.1:42289__%2Fnd    ] o.a.s.c.o.ReplicaMutator Update state numShards=1 message={
   [junit4]   2>   "core":"collection1",
   [junit4]   2>   "roles":null,
   [junit4]   2>   "base_url":"https://127.0.0.1:39691/_/nd",
   [junit4]   2>   "node_name":"127.0.0.1:39691__%2Fnd",
   [junit4]   2>   "numShards":"1",
   [junit4]   2>   "state":"down",
   [junit4]   2>   "shard":null,
   [junit4]   2>   "collection":"tmp_collection",
   [junit4]   2>   "operation":"state"}
   [junit4]   2> 33250 INFO  (OverseerStateUpdate-94495643119452165-127.0.0.1:42289__%2Fnd-n_0000000000) [n:127.0.0.1:42289__%2Fnd    ] o.a.s.c.o.ReplicaMutator Collection already exists with numShards=1
   [junit4]   2> 33251 INFO  (OverseerStateUpdate-94495643119452165-127.0.0.1:42289__%2Fnd-n_0000000000) [n:127.0.0.1:42289__%2Fnd    ] o.a.s.c.o.ReplicaMutator Assigning new node to shard shard=shard1
   [junit4]   2> 33251 INFO  (coreLoadExecutor-97-thread-1-processing-n:127.0.0.1:39691__%2Fnd) [n:127.0.0.1:39691__%2Fnd c:tmp_collection   x:collection1] o.a.s.c.c.ZkStateReader Deleting data for tmp_collection
   [junit4]   2> 33252 INFO  (coreLoadExecutor-97-thread-1-processing-n:127.0.0.1:39691__%2Fnd) [n:127.0.0.1:39691__%2Fnd c:tmp_collection   x:collection1] o.a.s.c.ZkController look for our core node name
   [junit4]   2> 33353 INFO  (zkCallback-52-thread-2-processing-n:127.0.0.1:42289__%2Fnd) [n:127.0.0.1:42289__%2Fnd    ] o.a.s.c.c.ZkStateReader A cluster state change: WatchedEvent state:SyncConnected type:NodeDataChanged path:/clusterstate.json, has occurred - updating... (live nodes size: 2)
   [junit4]   2> 33354 INFO  (zkCallback-56-thread-1-processing-n:127.0.0.1:39691__%2Fnd) [n:127.0.0.1:39691__%2Fnd    ] o.a.s.c.c.ZkStateReader A cluster state change: WatchedEvent state:SyncConnected type:NodeDataChanged path:/clusterstate.json, has occurred - updating... (live nodes size: 2)
   [junit4]   2> 34252 INFO  (coreLoadExecutor-97-thread-1-processing-n:127.0.0.1:39691__%2Fnd) [n:127.0.0.1:39691__%2Fnd c:tmp_collection   x:collection1] o.a.s.c.ZkController waiting to find shard id in clusterstate for collection1
   [junit4]   2> 34252 INFO  (coreLoadExecutor-97-thread-1-processing-n:127.0.0.1:39691__%2Fnd) [n:127.0.0.1:39691__%2Fnd c:tmp_collection   x:collection1] o.a.s.c.ZkController Check for collection zkNode:tmp_collection
   [junit4]   2> 34253 INFO  (coreLoadExecutor-97-thread-1-processing-n:127.0.0.1:39691__%2Fnd) [n:127.0.0.1:39691__%2Fnd c:tmp_collection   x:collection1] o.a.s.c.ZkController Collection zkNode exists
   [junit4]   2> 34253 INFO  (coreLoadExecutor-97-thread-1-processing-n:127.0.0.1:39691__%2Fnd) [n:127.0.0.1:39691__%2Fnd c:tmp_collection   x:collection1] o.a.s.c.c.ZkStateReader Load collection config from:/collections/tmp_collection
   [junit4]   2> 34254 INFO  (coreLoadExecutor-97-thread-1-processing-n:127.0.0.1:39691__%2Fnd) [n:127.0.0.1:39691__%2Fnd c:tmp_collection   x:collection1] o.a.s.c.c.ZkStateReader path=/collections/tmp_collection configName=conf1 specified config exists in ZooKeeper
   [junit4]   2> 34254 INFO  (coreLoadExecutor-97-thread-1-processing-n:127.0.0.1:39691__%2Fnd) [n:127.0.0.1:39691__%2Fnd c:tmp_collection   x:collection1] o.a.s.c.SolrResourceLoader new SolrResourceLoader for directory: '/home/jenkins/workspace/Lucene-Solr-trunk-Linux/solr/build/solr-core/test/J0/temp/solr.cloud.CdcrReplicationHandlerTest_6062827B2BA3024C-001/jetty-002/cores/collection1/'
   [junit4]   2> 34262 INFO  (coreLoadExecutor-97-thread-1-processing-n:127.0.0.1:39691__%2Fnd) [n:127.0.0.1:39691__%2Fnd c:tmp_collection   x:collection1] o.a.s.c.Config loaded config solrconfig.xml with version 0 
   [junit4]   2> 34267 INFO  (coreLoadExecutor-97-thread-1-processing-n:127.0.0.1:39691__%2Fnd) [n:127.0.0.1:39691__%2Fnd c:tmp_collection   x:collection1] o.a.s.c.SolrConfig current version of requestparams : -1
   [junit4]   2> 34273 INFO  (coreLoadExecutor-97-thread-1-processing-n:127.0.0.1:39691__%2Fnd) [n:127.0.0.1:39691__%2Fnd c:tmp_collection   x:collection1] o.a.s.c.SolrConfig Using Lucene MatchVersion: 6.0.0
   [junit4]   2> 34283 INFO  (coreLoadExecutor-97-thread-1-processing-n:127.0.0.1:39691__%2Fnd) [n:127.0.0.1:39691__%2Fnd c:tmp_collection   x:collection1] o.a.s.c.Config Loaded SolrConfig: solrconfig.xml
   [junit4]   2> 34284 INFO  (coreLoadExecutor-97-thread-1-processing-n:127.0.0.1:39691__%2Fnd) [n:127.0.0.1:39691__%2Fnd c:tmp_collection   x:collection1] o.a.s.s.IndexSchema Reading Solr Schema from /configs/conf1/schema.xml
   [junit4]   2> 34295 INFO  (coreLoadExecutor-97-thread-1-processing-n:127.0.0.1:39691__%2Fnd) [n:127.0.0.1:39691__%2Fnd c:tmp_collection   x:collection1] o.a.s.s.IndexSchema [collection1] Schema name=test
   [junit4]   2> 34366 INFO  (coreLoadExecutor-97-thread-1-processing-n:127.0.0.1:39691__%2Fnd) [n:127.0.0.1:39691__%2Fnd c:tmp_collection   x:collection1] o.a.s.s.IndexSchema default search field in schema is text
   [junit4]   2> 34367 INFO  (coreLoadExecutor-97-thread-1-processing-n:127.0.0.1:39691__%2Fnd) [n:127.0.0.1:39691__%2Fnd c:tmp_collection   x:collection1] o.a.s.s.IndexSchema unique key field: id
   [junit4]   2> 34368 INFO  (coreLoadExecutor-97-thread-1-processing-n:127.0.0.1:39691__%2Fnd) [n:127.0.0.1:39691__%2Fnd c:tmp_collection   x:collection1] o.a.s.s.FileExchangeRateProvider Reloading exchange rates from file currency.xml
   [junit4]   2> 34370 INFO  (coreLoadExecutor-97-thread-1-processing-n:127.0.0.1:39691__%2Fnd) [n:127.0.0.1:39691__%2Fnd c:tmp_collection   x:collection1] o.a.s.s.FileExchangeRateProvider Reloading exchange rates from file currency.xml
   [junit4]   2> 34396 INFO  (coreLoadExecutor-97-thread-1-processing-n:127.0.0.1:39691__%2Fnd) [n:127.0.0.1:39691__%2Fnd c:tmp_collection   x:collection1] o.a.s.c.ConfigSetProperties Did not find ConfigSet properties, assuming default properties: Can't find resource 'configsetprops.json' in classpath or '/configs/conf1', cwd=/home/jenkins/workspace/Lucene-Solr-trunk-Linux/solr/build/solr-core/test/J0
   [junit4]   2> 34396 INFO  (coreLoadExecutor-97-thread-1-processing-n:127.0.0.1:39691__%2Fnd) [n:127.0.0.1:39691__%2Fnd c:tmp_collection   x:collection1] o.a.s.c.CoreContainer Creating SolrCore 'collection1' using configuration from collection tmp_collection
   [junit4]   2> 34396 INFO  (coreLoadExecutor-97-thread-1-processing-n:127.0.0.1:39691__%2Fnd) [n:127.0.0.1:39691__%2Fnd c:tmp_collection s:shard1 r:core_node2 x:collection1] o.a.s.c.SolrCore solr.StandardDirectoryFactory
   [junit4]   2> 34396 INFO  (coreLoadExecutor-97-thread-1-processing-n:127.0.0.1:39691__%2Fnd) [n:127.0.0.1:39691__%2Fnd c:tmp_collection s:shard1 r:core_node2 x:collection1] o.a.s.c.SolrCore [[collection1] ] Opening new SolrCore at [/home/jenkins/workspace/Lucene-Solr-trunk-Linux/solr/build/solr-core/test/J0/temp/solr.cloud.CdcrReplicationHandlerTest_6062827B2BA3024C-001/jetty-002/cores/collection1/], dataDir=[null]
   [junit4]   2> 34397 INFO  (coreLoadExecutor-97-thread-1-processing-n:127.0.0.1:39691__%2Fnd) [n:127.0.0.1:39691__%2Fnd c:tmp_collection s:shard1 r:core_node2 x:collection1] o.a.s.c.JmxMonitoredMap JMX monitoring is enabled. Adding Solr mbeans to JMX Server: com.sun.jmx.mbeanserver.JmxMBeanServer@723a8a2d
   [junit4]   2> 34398 INFO  (coreLoadExecutor-97-thread-1-processing-n:127.0.0.1:39691__%2Fnd) [n:127.0.0.1:39691__%2Fnd c:tmp_collection s:shard1 r:core_node2 x:collection1] o.a.s.c.CachingDirectoryFactory return new directory for /home/jenkins/workspace/Lucene-Solr-trunk-Linux/solr/build/solr-core/test/J0/temp/solr.cloud.CdcrReplicationHandlerTest_6062827B2BA3024C-001/jetty-002/cores/collection1/data
   [junit4]   2> 34398 INFO  (coreLoadExecutor-97-thread-1-processing-n:127.0.0.1:39691__%2Fnd) [n:127.0.0.1:39691__%2Fnd c:tmp_collection s:shard1 r:core_node2 x:collection1] o.a.s.c.SolrCore New index directory detected: old=null new=/home/jenkins/workspace/Lucene-Solr-trunk-Linux/solr/build/solr-core/test/J0/temp/solr.cloud.CdcrReplicationHandlerTest_6062827B2BA3024C-001/jetty-002/cores/collection1/data/index/
   [junit4]   2> 34399 WARN  (coreLoadExecutor-97-thread-1-processing-n:127.0.0.1:39691__%2Fnd) [n:127.0.0.1:39691__%2Fnd c:tmp_collection s:shard1 r:core_node2 x:collection1] o.a.s.c.SolrCore [collection1] Solr index directory '/home/jenkins/workspace/Lucene-Solr-trunk-Linux/solr/build/solr-core/test/J0/temp/solr.cloud.CdcrReplicationHandlerTest_6062827B2BA3024C-001/jetty-002/cores/collection1/data/index' doesn't exist. Creating new index...
   [junit4]   2> 34399 INFO  (coreLoadExecutor-97-thread-1-processing-n:127.0.0.1:39691__%2Fnd) [n:127.0.0.1:39691__%2Fnd c:tmp_collection s:shard1 r:core_node2 x:collection1] o.a.s.c.CachingDirectoryFactory return new directory for /home/jenkins/workspace/Lucene-Solr-trunk-Linux/solr/build/solr-core/test/J0/temp/solr.cloud.CdcrReplicationHandlerTest_6062827B2BA3024C-001/jetty-002/cores/collection1/data/index
   [junit4]   2> 34400 INFO  (coreLoadExecutor-97-thread-1-processing-n:127.0.0.1:39691__%2Fnd) [n:127.0.0.1:39691__%2Fnd c:tmp_collection s:shard1 r:core_node2 x:collection1] o.a.s.u.RandomMergePolicy RandomMergePolicy wrapping class org.apache.lucene.index.TieredMergePolicy: [TieredMergePolicy: maxMergeAtOnce=22, maxMergeAtOnceExplicit=38, maxMergedSegmentMB=79.099609375, floorSegmentMB=0.3662109375, forceMergeDeletesPctAllowed=1.8697295793508206, segmentsPerTier=48.0, maxCFSSegmentSizeMB=8.796093022207999E12, noCFSRatio=0.4734002106331866
   [junit4]   2> 34426 INFO  (coreLoadExecutor-97-thread-1-processing-n:127.0.0.1:39691__%2Fnd) [n:127.0.0.1:39691__%2Fnd c:tmp_collection s:shard1 r:core_node2 x:collection1] o.a.s.c.SolrCore SolrDeletionPolicy.onCommit: commits: num=1
   [junit4]   2> 	commit{dir=/home/jenkins/workspace/Lucene-Solr-trunk-Linux/solr/build/solr-core/test/J0/temp/solr.cloud.CdcrReplicationHandlerTest_6062827B2BA3024C-001/jetty-002/cores/collection1/data/index,segFN=segments_1,generation=1}
   [junit4]   2> 34426 INFO  (coreLoadExecutor-97-thread-1-processing-n:127.0.0.1:39691__%2Fnd) [n:127.0.0.1:39691__%2Fnd c:tmp_collection s:shard1 r:core_node2 x:collection1] o.a.s.c.SolrCore newest commit generation = 1
   [junit4]   2> 34427 INFO  (OldIndexDirectoryCleanupThreadForCore-collection1) [n:127.0.0.1:39691__%2Fnd c:tmp_collection s:shard1 r:core_node2 x:collection1] o.a.s.c.SolrCore Looking for old index directories to cleanup for core collection1 in /home/jenkins/workspace/Lucene-Solr-trunk-Linux/solr/build/solr-core/test/J0/temp/solr.cloud.CdcrReplicationHandlerTest_6062827B2BA3024C-001/jetty-002/cores/collection1/data/
   [junit4]   2> 34431 INFO  (coreLoadExecutor-97-thread-1-processing-n:127.0.0.1:39691__%2Fnd) [n:127.0.0.1:39691__%2Fnd c:tmp_collection s:shard1 r:core_node2 x:collection1] o.a.s.u.p.UpdateRequestProcessorChain creating updateRequestProcessorChain "cdcr-processor-chain"
   [junit4]   2> 34431 INFO  (coreLoadExecutor-97-thread-1-processing-n:127.0.0.1:39691__%2Fnd) [n:127.0.0.1:39691__%2Fnd c:tmp_collection s:shard1 r:core_node2 x:collection1] o.a.s.c.SolrCore no updateRequestProcessorChain defined as default, creating implicit default
   [junit4]   2> 34433 INFO  (coreLoadExecutor-97-thread-1-processing-n:127.0.0.1:39691__%2Fnd) [n:127.0.0.1:39691__%2Fnd c:tmp_collection s:shard1 r:core_node2 x:collection1] o.a.s.h.l.XMLLoader xsltCacheLifetimeSeconds=60
   [junit4]   2> 34434 INFO  (coreLoadExecutor-97-thread-1-processing-n:127.0.0.1:39691__%2Fnd) [n:127.0.0.1:39691__%2Fnd c:tmp_collection s:shard1 r:core_node2 x:collection1] o.a.s.h.l.XMLLoader xsltCacheLifetimeSeconds=60
   [junit4]   2> 34435 INFO  (coreLoadExecutor-97-thread-1-processing-n:127.0.0.1:39691__%2Fnd) [n:127.0.0.1:39691__%2Fnd c:tmp_collection s:shard1 r:core_node2 x:collection1] o.a.s.h.l.XMLLoader xsltCacheLifetimeSeconds=60
   [junit4]   2> 34436 INFO  (coreLoadExecutor-97-thread-1-processing-n:127.0.0.1:39691__%2Fnd) [n:127.0.0.1:39691__%2Fnd c:tmp_collection s:shard1 r:core_node2 x:collection1] o.a.s.h.l.XMLLoader xsltCacheLifetimeSeconds=60
   [junit4]   2> 34442 INFO  (coreLoadExecutor-97-thread-1-processing-n:127.0.0.1:39691__%2Fnd) [n:127.0.0.1:39691__%2Fnd c:tmp_collection s:shard1 r:core_node2 x:collection1] o.a.s.c.RequestHandlers Registered paths: /admin/mbeans,standard,/update/csv,/update/json/docs,/admin/luke,/admin/segments,/get,/admin/system,/replication,/admin/properties,/config,/schema,/admin/plugins,/admin/logging,/update/json,/admin/threads,/admin/ping,/cdcr,/update,/admin/file
   [junit4]   2> 34442 INFO  (coreLoadExecutor-97-thread-1-processing-n:127.0.0.1:39691__%2Fnd) [n:127.0.0.1:39691__%2Fnd c:tmp_collection s:shard1 r:core_node2 x:collection1] o.a.s.c.SolrCore Using default statsCache cache: org.apache.solr.search.stats.LocalStatsCache
   [junit4]   2> 34443 INFO  (coreLoadExecutor-97-thread-1-processing-n:127.0.0.1:39691__%2Fnd) [n:127.0.0.1:39691__%2Fnd c:tmp_collection s:shard1 r:core_node2 x:collection1] o.a.s.u.UpdateHandler Using UpdateLog implementation: org.apache.solr.update.CdcrUpdateLog
   [junit4]   2> 34443 INFO  (coreLoadExecutor-97-thread-1-processing-n:127.0.0.1:39691__%2Fnd) [n:127.0.0.1:39691__%2Fnd c:tmp_collection s:shard1 r:core_node2 x:collection1] o.a.s.u.UpdateLog Initializing UpdateLog: dataDir= defaultSyncLevel=FLUSH numRecordsToKeep=100 maxNumLogsToKeep=10 numVersionBuckets=65536
   [junit4]   2> 34444 INFO  (coreLoadExecutor-97-thread-1-processing-n:127.0.0.1:39691__%2Fnd) [n:127.0.0.1:39691__%2Fnd c:tmp_collection s:shard1 r:core_node2 x:collection1] o.a.s.c.SolrCore Hard AutoCommit: disabled
   [junit4]   2> 34444 INFO  (coreLoadExecutor-97-thread-1-processing-n:127.0.0.1:39691__%2Fnd) [n:127.0.0.1:39691__%2Fnd c:tmp_collection s:shard1 r:core_node2 x:collection1] o.a.s.c.SolrCore Soft AutoCommit: disabled
   [junit4]   2> 34446 INFO  (coreLoadExecutor-97-thread-1-processing-n:127.0.0.1:39691__%2Fnd) [n:127.0.0.1:39691__%2Fnd c:tmp_collection s:shard1 r:core_node2 x:collection1] o.a.s.u.RandomMergePolicy RandomMergePolicy wrapping class org.apache.lucene.index.LogDocMergePolicy: [LogDocMergePolicy: minMergeSize=1000, mergeFactor=28, maxMergeSize=9223372036854775807, maxMergeSizeForForcedMerge=9223372036854775807, calibrateSizeByDeletes=true, maxMergeDocs=2147483647, maxCFSSegmentSizeMB=8.796093022207999E12, noCFSRatio=1.0]
   [junit4]   2> 34446 INFO  (coreLoadExecutor-97-thread-1-processing-n:127.0.0.1:39691__%2Fnd) [n:127.0.0.1:39691__%2Fnd c:tmp_collection s:shard1 r:core_node2 x:collection1] o.a.s.c.SolrCore SolrDeletionPolicy.onInit: commits: num=1
   [junit4]   2> 	commit{dir=/home/jenkins/workspace/Lucene-Solr-trunk-Linux/solr/build/solr-core/test/J0/temp/solr.cloud.CdcrReplicationHandlerTest_6062827B2BA3024C-001/jetty-002/cores/collection1/data/index,segFN=segments_1,generation=1}
   [junit4]   2> 34446 INFO  (coreLoadExecutor-97-thread-1-processing-n:127.0.0.1:39691__%2Fnd) [n:127.0.0.1:39691__%2Fnd c:tmp_collection s:shard1 r:core_node2 x:collection1] o.a.s.c.SolrCore newest commit generation = 1
   [junit4]   2> 34447 INFO  (coreLoadExecutor-97-thread-1-processing-n:127.0.0.1:39691__%2Fnd) [n:127.0.0.1:39691__%2Fnd c:tmp_collection s:shard1 r:core_node2 x:collection1] o.a.s.s.SolrIndexSearcher Opening Searcher@2c070e71[collection1] main
   [junit4]   2> 34447 INFO  (coreLoadExecutor-97-thread-1-processing-n:127.0.0.1:39691__%2Fnd) [n:127.0.0.1:39691__%2Fnd c:tmp_collection s:shard1 r:core_node2 x:collection1] o.a.s.c.c.ZkStateReader Load collection config from:/collections/tmp_collection
   [junit4]   2> 34448 INFO  (coreLoadExecutor-97-thread-1-processing-n:127.0.0.1:39691__%2Fnd) [n:127.0.0.1:39691__%2Fnd c:tmp_collection s:shard1 r:core_node2 x:collection1] o.a.s.c.c.ZkStateReader path=/collections/tmp_collection configName=conf1 specified config exists in ZooKeeper
   [junit4]   2> 34448 INFO  (coreLoadExecutor-97-thread-1-processing-n:127.0.0.1:39691__%2Fnd) [n:127.0.0.1:39691__%2Fnd c:tmp_collection s:shard1 r:core_node2 x:collection1] o.a.s.r.ManagedResourceStorage Setting up ZooKeeper-based storage for the RestManager with znodeBase: /configs/conf1
   [junit4]   2> 34448 INFO  (coreLoadExecutor-97-thread-1-processing-n:127.0.0.1:39691__%2Fnd) [n:127.0.0.1:39691__%2Fnd c:tmp_collection s:shard1 r:core_node2 x:collection1] o.a.s.r.ManagedResourceStorage Configured ZooKeeperStorageIO with znodeBase: /configs/conf1
   [junit4]   2> 34448 INFO  (coreLoadExecutor-97-thread-1-processing-n:127.0.0.1:39691__%2Fnd) [n:127.0.0.1:39691__%2Fnd c:tmp_collection s:shard1 r:core_node2 x:collection1] o.a.s.r.RestManager Initializing RestManager with initArgs: {}
   [junit4]   2> 34448 INFO  (coreLoadExecutor-97-thread-1-processing-n:127.0.0.1:39691__%2Fnd) [n:127.0.0.1:39691__%2Fnd c:tmp_collection s:shard1 r:core_node2 x:collection1] o.a.s.r.ManagedResourceStorage Reading _rest_managed.json using ZooKeeperStorageIO:path=/configs/conf1
   [junit4]   2> 34448 INFO  (coreLoadExecutor-97-thread-1-processing-n:127.0.0.1:39691__%2Fnd) [n:127.0.0.1:39691__%2Fnd c:tmp_collection s:shard1 r:core_node2 x:collection1] o.a.s.r.ManagedResourceStorage No data found for znode /configs/conf1/_rest_managed.json
   [junit4]   2> 34449 INFO  (coreLoadExecutor-97-thread-1-processing-n:127.0.0.1:39691__%2Fnd) [n:127.0.0.1:39691__%2Fnd c:tmp_collection s:shard1 r:core_node2 x:collection1] o.a.s.r.ManagedResourceStorage Loaded null at path _rest_managed.json using ZooKeeperStorageIO:path=/configs/conf1
   [junit4]   2> 34449 INFO  (coreLoadExecutor-97-thread-1-processing-n:127.0.0.1:39691__%2Fnd) [n:127.0.0.1:39691__%2Fnd c:tmp_collection s:shard1 r:core_node2 x:collection1] o.a.s.r.RestManager Initializing 0 registered ManagedResources
   [junit4]   2> 34449 INFO  (coreLoadExecutor-97-thread-1-processing-n:127.0.0.1:39691__%2Fnd) [n:127.0.0.1:39691__%2Fnd c:tmp_collection s:shard1 r:core_node2 x:collection1] o.a.s.h.ReplicationHandler Commits will be reserved for  10000
   [junit4]   2> 34451 INFO  (searcherExecutor-98-thread-1-processing-n:127.0.0.1:39691__%2Fnd x:collection1 s:shard1 c:tmp_collection r:core_node2) [n:127.0.0.1:39691__%2Fnd c:tmp_collection s:shard1 r:core_node2 x:collection1] o.a.s.c.SolrCore [collection1] Registered new searcher Searcher@2c070e71[collection1] main{ExitableDirectoryReader(UninvertingDirectoryReader())}
   [junit4]   2> 34451 INFO  (coreLoadExecutor-97-thread-1-processing-n:127.0.0.1:39691__%2Fnd) [n:127.0.0.1:39691__%2Fnd c:tmp_collection s:shard1 r:c

[...truncated too long message...]

KeeperException.java:51)
   [junit4]   2> 	at org.apache.zookeeper.ZooKeeper.exists(ZooKeeper.java:1045)
   [junit4]   2> 	at org.apache.solr.common.cloud.SolrZkClient$5.execute(SolrZkClient.java:319)
   [junit4]   2> 	at org.apache.solr.common.cloud.SolrZkClient$5.execute(SolrZkClient.java:316)
   [junit4]   2> 	at org.apache.solr.common.cloud.ZkCmdExecutor.retryOperation(ZkCmdExecutor.java:61)
   [junit4]   2> 	at org.apache.solr.common.cloud.SolrZkClient.exists(SolrZkClient.java:316)
   [junit4]   2> 	at org.apache.solr.cloud.OverseerNodePrioritizer.prioritizeOverseerNodes(OverseerNodePrioritizer.java:59)
   [junit4]   2> 	at org.apache.solr.cloud.OverseerTaskProcessor.run(OverseerTaskProcessor.java:159)
   [junit4]   2> 	at java.lang.Thread.run(Thread.java:745)
   [junit4]   2> 510067 INFO  (TEST-CdcrReplicationHandlerTest.doTest-seed#[6062827B2BA3024C]) [    ] o.e.j.s.ServerConnector Stopped ServerConnector@660bf1e5{SSL-http/1.1}{127.0.0.1:39691}
   [junit4]   2> 510067 INFO  (TEST-CdcrReplicationHandlerTest.doTest-seed#[6062827B2BA3024C]) [    ] o.e.j.s.h.ContextHandler Stopped o.e.j.s.ServletContextHandler@74b83318{/_/nd,null,UNAVAILABLE}
   [junit4]   2> 510068 INFO  (TEST-CdcrReplicationHandlerTest.doTest-seed#[6062827B2BA3024C]) [n:127.0.0.1:42289__%2Fnd c:source_collection s:shard1 r:core_node2 x:source_collection_shard1_replica2] o.a.s.SolrTestCaseJ4 ###Ending doTest
   [junit4]   2> 510070 INFO  (TEST-CdcrReplicationHandlerTest.doTest-seed#[6062827B2BA3024C]) [n:127.0.0.1:42289__%2Fnd c:source_collection s:shard1 r:core_node2 x:source_collection_shard1_replica2] o.a.s.c.ZkTestServer connecting to 127.0.0.1:33024 33024
   [junit4]   2> 510082 INFO  (Thread-92) [    ] o.a.s.c.ZkTestServer connecting to 127.0.0.1:33024 33024
   [junit4]   2> 510083 WARN  (Thread-92) [    ] o.a.s.c.ZkTestServer Watch limit violations: 
   [junit4]   2> Maximum concurrent create/delete watches above limit:
   [junit4]   2> 
   [junit4]   2> 	82	/solr/aliases.json
   [junit4]   2> 	14	/solr/configs/conf1
   [junit4]   2> 	6	/solr/collections/source_collection/leaders/shard1/leader
   [junit4]   2> 	6	/solr/security.json
   [junit4]   2> 	2	/solr/collections/tmp_collection/leaders/shard1/leader
   [junit4]   2> 
   [junit4]   2> Maximum concurrent data watches above limit:
   [junit4]   2> 
   [junit4]   2> 	82	/solr/clusterstate.json
   [junit4]   2> 	13	/solr/collections/source_collection/cdcr/state/buffer
   [junit4]   2> 	13	/solr/collections/source_collection/cdcr/state/process
   [junit4]   2> 	13	/solr/collections/source_collection/state.json
   [junit4]   2> 	4	/solr/collections/source_collection/leader_elect/shard1/election/94495643119452192-core_node1-n_0000000000
   [junit4]   2> 	3	/solr/overseer_elect/election/94495643119452192-127.0.0.1:42289__%2Fnd-n_0000000002
   [junit4]   2> 	2	/solr/collections/tmp_collection/cdcr/state/buffer
   [junit4]   2> 	2	/solr/collections/source_collection/leader_elect/shard1/election/94495643119452168-core_node1-n_0000000000
   [junit4]   2> 	2	/solr/collections/tmp_collection/cdcr/state/process
   [junit4]   2> 
   [junit4]   2> Maximum concurrent children watches above limit:
   [junit4]   2> 
   [junit4]   2> 	82	/solr/collections
   [junit4]   2> 	78	/solr/live_nodes
   [junit4]   2> 	3	/solr/overseer/queue
   [junit4]   2> 	3	/solr/overseer/collection-queue-work
   [junit4]   2> 	2	/solr/overseer/queue-work
   [junit4]   2> 
   [junit4]   2> NOTE: reproduce with: ant test  -Dtestcase=CdcrReplicationHandlerTest -Dtests.method=doTest -Dtests.seed=6062827B2BA3024C -Dtests.multiplier=3 -Dtests.slow=true -Dtests.locale=ca -Dtests.timezone=Pacific/Kiritimati -Dtests.asserts=true -Dtests.file.encoding=UTF-8
   [junit4] ERROR    481s J0 | CdcrReplicationHandlerTest.doTest <<<
   [junit4]    > Throwable #1: java.lang.AssertionError: There are still nodes recoverying - waited for 330 seconds
   [junit4]    > 	at org.apache.solr.cloud.AbstractDistribZkTestBase.waitForRecoveriesToFinish(AbstractDistribZkTestBase.java:172)
   [junit4]    > 	at org.apache.solr.cloud.AbstractDistribZkTestBase.waitForRecoveriesToFinish(AbstractDistribZkTestBase.java:133)
   [junit4]    > 	at org.apache.solr.cloud.AbstractDistribZkTestBase.waitForRecoveriesToFinish(AbstractDistribZkTestBase.java:128)
   [junit4]    > 	at org.apache.solr.cloud.BaseCdcrDistributedZkTest.waitForRecoveriesToFinish(BaseCdcrDistributedZkTest.java:465)
   [junit4]    > 	at org.apache.solr.cloud.BaseCdcrDistributedZkTest.restartServer(BaseCdcrDistributedZkTest.java:506)
   [junit4]    > 	at org.apache.solr.cloud.CdcrReplicationHandlerTest.doTestPartialReplicationAfterPeerSync(CdcrReplicationHandlerTest.java:182)
   [junit4]    > 	at org.apache.solr.cloud.CdcrReplicationHandlerTest.doTest(CdcrReplicationHandlerTest.java:53)
   [junit4]    > 	at org.apache.solr.BaseDistributedSearchTestCase$ShardsRepeatRule$ShardsFixedStatement.callStatement(BaseDistributedSearchTestCase.java:963)
   [junit4]    > 	at org.apache.solr.BaseDistributedSearchTestCase$ShardsRepeatRule$ShardsStatement.evaluate(BaseDistributedSearchTestCase.java:938)
   [junit4]    > 	at java.lang.Thread.run(Thread.java:745)Throwable #2: com.carrotsearch.randomizedtesting.UncaughtExceptionError: Captured an uncaught exception in thread: Thread[id=779, name=RecoveryThread-source_collection_shard1_replica1, state=RUNNABLE, group=TGRP-CdcrReplicationHandlerTest]
   [junit4]    > Caused by: org.apache.solr.common.cloud.ZooKeeperException: 
   [junit4]    > 	at __randomizedtesting.SeedInfo.seed([6062827B2BA3024C]:0)
   [junit4]    > 	at org.apache.solr.cloud.RecoveryStrategy.run(RecoveryStrategy.java:234)
   [junit4]    > Caused by: org.apache.solr.common.SolrException: java.io.FileNotFoundException: /home/jenkins/workspace/Lucene-Solr-trunk-Linux/solr/build/solr-core/test/J0/temp/solr.cloud.CdcrReplicationHandlerTest_6062827B2BA3024C-001/jetty-002/cores/source_collection_shard1_replica1/data/tlog/tlog.0000000000000000008.1511930382114619392 (No such file or directory)
   [junit4]    > 	at org.apache.solr.update.CdcrTransactionLog.reopenOutputStream(CdcrTransactionLog.java:244)
   [junit4]    > 	at org.apache.solr.update.CdcrTransactionLog.incref(CdcrTransactionLog.java:173)
   [junit4]    > 	at org.apache.solr.update.UpdateLog.getRecentUpdates(UpdateLog.java:1079)
   [junit4]    > 	at org.apache.solr.update.UpdateLog.seedBucketsWithHighestVersion(UpdateLog.java:1579)
   [junit4]    > 	at org.apache.solr.update.UpdateLog.seedBucketsWithHighestVersion(UpdateLog.java:1610)
   [junit4]    > 	at org.apache.solr.core.SolrCore.seedVersionBuckets(SolrCore.java:877)
   [junit4]    > 	at org.apache.solr.cloud.RecoveryStrategy.doRecovery(RecoveryStrategy.java:526)
   [junit4]    > 	at org.apache.solr.cloud.RecoveryStrategy.run(RecoveryStrategy.java:227)
   [junit4]    > Caused by: java.io.FileNotFoundException: /home/jenkins/workspace/Lucene-Solr-trunk-Linux/solr/build/solr-core/test/J0/temp/solr.cloud.CdcrReplicationHandlerTest_6062827B2BA3024C-001/jetty-002/cores/source_collection_shard1_replica1/data/tlog/tlog.0000000000000000008.1511930382114619392 (No such file or directory)
   [junit4]    > 	at java.io.RandomAccessFile.open0(Native Method)
   [junit4]    > 	at java.io.RandomAccessFile.open(RandomAccessFile.java:316)
   [junit4]    > 	at java.io.RandomAccessFile.<init>(RandomAccessFile.java:243)
   [junit4]    > 	at org.apache.solr.update.CdcrTransactionLog.reopenOutputStream(CdcrTransactionLog.java:236)
   [junit4]    > 	... 7 more
   [junit4]   2> 510103 INFO  (SUITE-CdcrReplicationHandlerTest-seed#[6062827B2BA3024C]-worker) [n:127.0.0.1:42289__%2Fnd c:source_collection s:shard1 r:core_node2 x:source_collection_shard1_replica2] o.a.s.SolrTestCaseJ4 ###deleteCore
   [junit4]   2> NOTE: leaving temporary files on disk at: /home/jenkins/workspace/Lucene-Solr-trunk-Linux/solr/build/solr-core/test/J0/temp/solr.cloud.CdcrReplicationHandlerTest_6062827B2BA3024C-001
   [junit4]   2> Sep 10, 2015 12:52:46 PM com.carrotsearch.randomizedtesting.ThreadLeakControl checkThreadLeaks
   [junit4]   2> WARNING: Will linger awaiting termination of 4 leaked thread(s).
   [junit4]   2> NOTE: test params are: codec=CheapBastard, sim=RandomSimilarityProvider(queryNorm=true,coord=crazy): {}, locale=ca, timezone=Pacific/Kiritimati
   [junit4]   2> NOTE: Linux 3.19.0-26-generic amd64/Oracle Corporation 1.8.0_60 (64-bit)/cpus=12,threads=1,free=162849128,total=536870912
   [junit4]   2> NOTE: All tests run in this JVM: [TestMiniSolrCloudClusterSSL, IndexSchemaTest, ExternalFileFieldSortTest, HighlighterMaxOffsetTest, TestPhraseSuggestions, OutOfBoxZkACLAndCredentialsProvidersTest, SaslZkACLProviderTest, CdcrReplicationHandlerTest]
   [junit4] Completed [126/545] on J0 in 481.59s, 1 test, 1 error <<< FAILURES!

[...truncated 1306 lines...]
BUILD FAILED
/home/jenkins/workspace/Lucene-Solr-trunk-Linux/build.xml:775: The following error occurred while executing this line:
/home/jenkins/workspace/Lucene-Solr-trunk-Linux/build.xml:719: The following error occurred while executing this line:
/home/jenkins/workspace/Lucene-Solr-trunk-Linux/build.xml:59: The following error occurred while executing this line:
/home/jenkins/workspace/Lucene-Solr-trunk-Linux/solr/build.xml:233: The following error occurred while executing this line:
/home/jenkins/workspace/Lucene-Solr-trunk-Linux/solr/common-build.xml:514: The following error occurred while executing this line:
/home/jenkins/workspace/Lucene-Solr-trunk-Linux/lucene/common-build.xml:1432: The following error occurred while executing this line:
/home/jenkins/workspace/Lucene-Solr-trunk-Linux/lucene/common-build.xml:987: There were test failures: 545 suites, 2143 tests, 1 error, 71 ignored (35 assumptions)

Total time: 48 minutes 40 seconds
Build step 'Invoke Ant' marked build as failure
Archiving artifacts
[WARNINGS] Skipping publisher since build result is FAILURE
Recording test results
Email was triggered for: Failure - Any
Sending email for trigger: Failure - Any



Mime
View raw message