lucene-dev mailing list archives

Site index · List index
Message view « Date » · « Thread »
Top « Date » · « Thread »
From Policeman Jenkins Server <jenk...@thetaphi.de>
Subject [JENKINS-EA] Lucene-Solr-5.x-Linux (32bit/jdk1.9.0-ea-b60) - Build # 13627 - Still Failing!
Date Sat, 15 Aug 2015 13:17:29 GMT
Build: http://jenkins.thetaphi.de/job/Lucene-Solr-5.x-Linux/13627/
Java: 32bit/jdk1.9.0-ea-b60 -client -XX:+UseParallelGC -Djava.locale.providers=JRE,SPI

2 tests failed.
FAILED:  org.apache.solr.cloud.CollectionsAPIDistributedZkTest.test

Error Message:
Error from server at https://127.0.0.1:46943: Could not fully remove collection: halfdeletedcollection2

Stack Trace:
org.apache.solr.client.solrj.impl.HttpSolrClient$RemoteSolrException: Error from server at https://127.0.0.1:46943: Could not fully remove collection: halfdeletedcollection2
	at __randomizedtesting.SeedInfo.seed([76C97B9BB43F6867:FE9D44411AC3059F]:0)
	at org.apache.solr.client.solrj.impl.HttpSolrClient.executeMethod(HttpSolrClient.java:560)
	at org.apache.solr.client.solrj.impl.HttpSolrClient.request(HttpSolrClient.java:234)
	at org.apache.solr.client.solrj.impl.HttpSolrClient.request(HttpSolrClient.java:226)
	at org.apache.solr.client.solrj.SolrClient.request(SolrClient.java:1220)
	at org.apache.solr.cloud.CollectionsAPIDistributedZkTest.makeRequest(CollectionsAPIDistributedZkTest.java:302)
	at org.apache.solr.cloud.CollectionsAPIDistributedZkTest.deleteCollectionWithDownNodes(CollectionsAPIDistributedZkTest.java:283)
	at org.apache.solr.cloud.CollectionsAPIDistributedZkTest.test(CollectionsAPIDistributedZkTest.java:175)
	at sun.reflect.NativeMethodAccessorImpl.invoke0(Native Method)
	at sun.reflect.NativeMethodAccessorImpl.invoke(NativeMethodAccessorImpl.java:62)
	at sun.reflect.DelegatingMethodAccessorImpl.invoke(DelegatingMethodAccessorImpl.java:43)
	at java.lang.reflect.Method.invoke(Method.java:502)
	at com.carrotsearch.randomizedtesting.RandomizedRunner.invoke(RandomizedRunner.java:1627)
	at com.carrotsearch.randomizedtesting.RandomizedRunner$6.evaluate(RandomizedRunner.java:836)
	at com.carrotsearch.randomizedtesting.RandomizedRunner$7.evaluate(RandomizedRunner.java:872)
	at com.carrotsearch.randomizedtesting.RandomizedRunner$8.evaluate(RandomizedRunner.java:886)
	at org.apache.solr.BaseDistributedSearchTestCase$ShardsRepeatRule$ShardsFixedStatement.callStatement(BaseDistributedSearchTestCase.java:963)
	at org.apache.solr.BaseDistributedSearchTestCase$ShardsRepeatRule$ShardsStatement.evaluate(BaseDistributedSearchTestCase.java:938)
	at com.carrotsearch.randomizedtesting.rules.SystemPropertiesRestoreRule$1.evaluate(SystemPropertiesRestoreRule.java:57)
	at org.apache.lucene.util.TestRuleSetupTeardownChained$1.evaluate(TestRuleSetupTeardownChained.java:50)
	at org.apache.lucene.util.AbstractBeforeAfterRule$1.evaluate(AbstractBeforeAfterRule.java:46)
	at org.apache.lucene.util.TestRuleThreadAndTestName$1.evaluate(TestRuleThreadAndTestName.java:49)
	at org.apache.lucene.util.TestRuleIgnoreAfterMaxFailures$1.evaluate(TestRuleIgnoreAfterMaxFailures.java:65)
	at org.apache.lucene.util.TestRuleMarkFailure$1.evaluate(TestRuleMarkFailure.java:48)
	at com.carrotsearch.randomizedtesting.rules.StatementAdapter.evaluate(StatementAdapter.java:36)
	at com.carrotsearch.randomizedtesting.ThreadLeakControl$StatementRunner.run(ThreadLeakControl.java:365)
	at com.carrotsearch.randomizedtesting.ThreadLeakControl.forkTimeoutingTask(ThreadLeakControl.java:798)
	at com.carrotsearch.randomizedtesting.ThreadLeakControl$3.evaluate(ThreadLeakControl.java:458)
	at com.carrotsearch.randomizedtesting.RandomizedRunner.runSingleTest(RandomizedRunner.java:845)
	at com.carrotsearch.randomizedtesting.RandomizedRunner$3.evaluate(RandomizedRunner.java:747)
	at com.carrotsearch.randomizedtesting.RandomizedRunner$4.evaluate(RandomizedRunner.java:781)
	at com.carrotsearch.randomizedtesting.RandomizedRunner$5.evaluate(RandomizedRunner.java:792)
	at com.carrotsearch.randomizedtesting.rules.StatementAdapter.evaluate(StatementAdapter.java:36)
	at com.carrotsearch.randomizedtesting.rules.SystemPropertiesRestoreRule$1.evaluate(SystemPropertiesRestoreRule.java:57)
	at org.apache.lucene.util.AbstractBeforeAfterRule$1.evaluate(AbstractBeforeAfterRule.java:46)
	at com.carrotsearch.randomizedtesting.rules.StatementAdapter.evaluate(StatementAdapter.java:36)
	at org.apache.lucene.util.TestRuleStoreClassName$1.evaluate(TestRuleStoreClassName.java:42)
	at com.carrotsearch.randomizedtesting.rules.NoShadowingOrOverridesOnMethodsRule$1.evaluate(NoShadowingOrOverridesOnMethodsRule.java:39)
	at com.carrotsearch.randomizedtesting.rules.NoShadowingOrOverridesOnMethodsRule$1.evaluate(NoShadowingOrOverridesOnMethodsRule.java:39)
	at com.carrotsearch.randomizedtesting.rules.StatementAdapter.evaluate(StatementAdapter.java:36)
	at com.carrotsearch.randomizedtesting.rules.StatementAdapter.evaluate(StatementAdapter.java:36)
	at com.carrotsearch.randomizedtesting.rules.StatementAdapter.evaluate(StatementAdapter.java:36)
	at org.apache.lucene.util.TestRuleAssertionsRequired$1.evaluate(TestRuleAssertionsRequired.java:54)
	at org.apache.lucene.util.TestRuleMarkFailure$1.evaluate(TestRuleMarkFailure.java:48)
	at org.apache.lucene.util.TestRuleIgnoreAfterMaxFailures$1.evaluate(TestRuleIgnoreAfterMaxFailures.java:65)
	at org.apache.lucene.util.TestRuleIgnoreTestSuites$1.evaluate(TestRuleIgnoreTestSuites.java:55)
	at com.carrotsearch.randomizedtesting.rules.StatementAdapter.evaluate(StatementAdapter.java:36)
	at com.carrotsearch.randomizedtesting.ThreadLeakControl$StatementRunner.run(ThreadLeakControl.java:365)
	at java.lang.Thread.run(Thread.java:745)


FAILED:  org.apache.solr.cloud.SolrCloudExampleTest.testLoadDocsIntoGettingStartedCollection

Error Message:
Delete action failed!

Stack Trace:
java.lang.AssertionError: Delete action failed!
	at __randomizedtesting.SeedInfo.seed([76C97B9BB43F6867:65AA49F48550D1C1]:0)
	at org.junit.Assert.fail(Assert.java:93)
	at org.junit.Assert.assertTrue(Assert.java:43)
	at org.apache.solr.cloud.SolrCloudExampleTest.doTestDeleteAction(SolrCloudExampleTest.java:169)
	at org.apache.solr.cloud.SolrCloudExampleTest.testLoadDocsIntoGettingStartedCollection(SolrCloudExampleTest.java:145)
	at sun.reflect.NativeMethodAccessorImpl.invoke0(Native Method)
	at sun.reflect.NativeMethodAccessorImpl.invoke(NativeMethodAccessorImpl.java:62)
	at sun.reflect.DelegatingMethodAccessorImpl.invoke(DelegatingMethodAccessorImpl.java:43)
	at java.lang.reflect.Method.invoke(Method.java:502)
	at com.carrotsearch.randomizedtesting.RandomizedRunner.invoke(RandomizedRunner.java:1627)
	at com.carrotsearch.randomizedtesting.RandomizedRunner$6.evaluate(RandomizedRunner.java:836)
	at com.carrotsearch.randomizedtesting.RandomizedRunner$7.evaluate(RandomizedRunner.java:872)
	at com.carrotsearch.randomizedtesting.RandomizedRunner$8.evaluate(RandomizedRunner.java:886)
	at org.apache.solr.BaseDistributedSearchTestCase$ShardsRepeatRule$ShardsFixedStatement.callStatement(BaseDistributedSearchTestCase.java:963)
	at org.apache.solr.BaseDistributedSearchTestCase$ShardsRepeatRule$ShardsStatement.evaluate(BaseDistributedSearchTestCase.java:938)
	at com.carrotsearch.randomizedtesting.rules.SystemPropertiesRestoreRule$1.evaluate(SystemPropertiesRestoreRule.java:57)
	at org.apache.lucene.util.TestRuleSetupTeardownChained$1.evaluate(TestRuleSetupTeardownChained.java:50)
	at org.apache.lucene.util.AbstractBeforeAfterRule$1.evaluate(AbstractBeforeAfterRule.java:46)
	at org.apache.lucene.util.TestRuleThreadAndTestName$1.evaluate(TestRuleThreadAndTestName.java:49)
	at org.apache.lucene.util.TestRuleIgnoreAfterMaxFailures$1.evaluate(TestRuleIgnoreAfterMaxFailures.java:65)
	at org.apache.lucene.util.TestRuleMarkFailure$1.evaluate(TestRuleMarkFailure.java:48)
	at com.carrotsearch.randomizedtesting.rules.StatementAdapter.evaluate(StatementAdapter.java:36)
	at com.carrotsearch.randomizedtesting.ThreadLeakControl$StatementRunner.run(ThreadLeakControl.java:365)
	at com.carrotsearch.randomizedtesting.ThreadLeakControl.forkTimeoutingTask(ThreadLeakControl.java:798)
	at com.carrotsearch.randomizedtesting.ThreadLeakControl$3.evaluate(ThreadLeakControl.java:458)
	at com.carrotsearch.randomizedtesting.RandomizedRunner.runSingleTest(RandomizedRunner.java:845)
	at com.carrotsearch.randomizedtesting.RandomizedRunner$3.evaluate(RandomizedRunner.java:747)
	at com.carrotsearch.randomizedtesting.RandomizedRunner$4.evaluate(RandomizedRunner.java:781)
	at com.carrotsearch.randomizedtesting.RandomizedRunner$5.evaluate(RandomizedRunner.java:792)
	at com.carrotsearch.randomizedtesting.rules.StatementAdapter.evaluate(StatementAdapter.java:36)
	at com.carrotsearch.randomizedtesting.rules.SystemPropertiesRestoreRule$1.evaluate(SystemPropertiesRestoreRule.java:57)
	at org.apache.lucene.util.AbstractBeforeAfterRule$1.evaluate(AbstractBeforeAfterRule.java:46)
	at com.carrotsearch.randomizedtesting.rules.StatementAdapter.evaluate(StatementAdapter.java:36)
	at org.apache.lucene.util.TestRuleStoreClassName$1.evaluate(TestRuleStoreClassName.java:42)
	at com.carrotsearch.randomizedtesting.rules.NoShadowingOrOverridesOnMethodsRule$1.evaluate(NoShadowingOrOverridesOnMethodsRule.java:39)
	at com.carrotsearch.randomizedtesting.rules.NoShadowingOrOverridesOnMethodsRule$1.evaluate(NoShadowingOrOverridesOnMethodsRule.java:39)
	at com.carrotsearch.randomizedtesting.rules.StatementAdapter.evaluate(StatementAdapter.java:36)
	at com.carrotsearch.randomizedtesting.rules.StatementAdapter.evaluate(StatementAdapter.java:36)
	at com.carrotsearch.randomizedtesting.rules.StatementAdapter.evaluate(StatementAdapter.java:36)
	at org.apache.lucene.util.TestRuleAssertionsRequired$1.evaluate(TestRuleAssertionsRequired.java:54)
	at org.apache.lucene.util.TestRuleMarkFailure$1.evaluate(TestRuleMarkFailure.java:48)
	at org.apache.lucene.util.TestRuleIgnoreAfterMaxFailures$1.evaluate(TestRuleIgnoreAfterMaxFailures.java:65)
	at org.apache.lucene.util.TestRuleIgnoreTestSuites$1.evaluate(TestRuleIgnoreTestSuites.java:55)
	at com.carrotsearch.randomizedtesting.rules.StatementAdapter.evaluate(StatementAdapter.java:36)
	at com.carrotsearch.randomizedtesting.ThreadLeakControl$StatementRunner.run(ThreadLeakControl.java:365)
	at java.lang.Thread.run(Thread.java:745)




Build Log:
[...truncated 10210 lines...]
   [junit4] Suite: org.apache.solr.cloud.SolrCloudExampleTest
   [junit4]   2> Creating dataDir: /home/jenkins/workspace/Lucene-Solr-5.x-Linux/solr/build/solr-core/test/J0/temp/solr.cloud.SolrCloudExampleTest_76C97B9BB43F6867-001/init-core-data-001
   [junit4]   2> 434613 INFO  (SUITE-SolrCloudExampleTest-seed#[76C97B9BB43F6867]-worker) [    ] o.a.s.SolrTestCaseJ4 Randomized ssl (false) and clientAuth (false)
   [junit4]   2> 434613 INFO  (SUITE-SolrCloudExampleTest-seed#[76C97B9BB43F6867]-worker) [    ] o.a.s.BaseDistributedSearchTestCase Setting hostContext system property: /
   [junit4]   2> 434615 INFO  (TEST-SolrCloudExampleTest.testLoadDocsIntoGettingStartedCollection-seed#[76C97B9BB43F6867]) [    ] o.a.s.c.ZkTestServer STARTING ZK TEST SERVER
   [junit4]   2> 434615 INFO  (Thread-888) [    ] o.a.s.c.ZkTestServer client port:0.0.0.0/0.0.0.0:0
   [junit4]   2> 434615 INFO  (Thread-888) [    ] o.a.s.c.ZkTestServer Starting server
   [junit4]   2> 434715 INFO  (TEST-SolrCloudExampleTest.testLoadDocsIntoGettingStartedCollection-seed#[76C97B9BB43F6867]) [    ] o.a.s.c.ZkTestServer start zk server on port:38183
   [junit4]   2> 434715 INFO  (TEST-SolrCloudExampleTest.testLoadDocsIntoGettingStartedCollection-seed#[76C97B9BB43F6867]) [    ] o.a.s.c.c.SolrZkClient Using default ZkCredentialsProvider
   [junit4]   2> 434716 INFO  (TEST-SolrCloudExampleTest.testLoadDocsIntoGettingStartedCollection-seed#[76C97B9BB43F6867]) [    ] o.a.s.c.c.ConnectionManager Waiting for client to connect to ZooKeeper
   [junit4]   2> 434718 INFO  (zkCallback-197-thread-1) [    ] o.a.s.c.c.ConnectionManager Watcher org.apache.solr.common.cloud.ConnectionManager@171734d name:ZooKeeperConnection Watcher:127.0.0.1:38183 got event WatchedEvent state:SyncConnected type:None path:null path:null type:None
   [junit4]   2> 434718 INFO  (TEST-SolrCloudExampleTest.testLoadDocsIntoGettingStartedCollection-seed#[76C97B9BB43F6867]) [    ] o.a.s.c.c.ConnectionManager Client is connected to ZooKeeper
   [junit4]   2> 434719 INFO  (TEST-SolrCloudExampleTest.testLoadDocsIntoGettingStartedCollection-seed#[76C97B9BB43F6867]) [    ] o.a.s.c.c.SolrZkClient Using default ZkACLProvider
   [junit4]   2> 434719 INFO  (TEST-SolrCloudExampleTest.testLoadDocsIntoGettingStartedCollection-seed#[76C97B9BB43F6867]) [    ] o.a.s.c.c.SolrZkClient makePath: /solr
   [junit4]   2> 434720 INFO  (TEST-SolrCloudExampleTest.testLoadDocsIntoGettingStartedCollection-seed#[76C97B9BB43F6867]) [    ] o.a.s.c.c.SolrZkClient Using default ZkCredentialsProvider
   [junit4]   2> 434721 INFO  (TEST-SolrCloudExampleTest.testLoadDocsIntoGettingStartedCollection-seed#[76C97B9BB43F6867]) [    ] o.a.s.c.c.ConnectionManager Waiting for client to connect to ZooKeeper
   [junit4]   2> 434722 INFO  (zkCallback-198-thread-1) [    ] o.a.s.c.c.ConnectionManager Watcher org.apache.solr.common.cloud.ConnectionManager@eafca1 name:ZooKeeperConnection Watcher:127.0.0.1:38183/solr got event WatchedEvent state:SyncConnected type:None path:null path:null type:None
   [junit4]   2> 434722 INFO  (TEST-SolrCloudExampleTest.testLoadDocsIntoGettingStartedCollection-seed#[76C97B9BB43F6867]) [    ] o.a.s.c.c.ConnectionManager Client is connected to ZooKeeper
   [junit4]   2> 434722 INFO  (TEST-SolrCloudExampleTest.testLoadDocsIntoGettingStartedCollection-seed#[76C97B9BB43F6867]) [    ] o.a.s.c.c.SolrZkClient Using default ZkACLProvider
   [junit4]   2> 434722 INFO  (TEST-SolrCloudExampleTest.testLoadDocsIntoGettingStartedCollection-seed#[76C97B9BB43F6867]) [    ] o.a.s.c.c.SolrZkClient makePath: /collections/collection1
   [junit4]   2> 434724 INFO  (TEST-SolrCloudExampleTest.testLoadDocsIntoGettingStartedCollection-seed#[76C97B9BB43F6867]) [    ] o.a.s.c.c.SolrZkClient makePath: /collections/collection1/shards
   [junit4]   2> 434724 INFO  (TEST-SolrCloudExampleTest.testLoadDocsIntoGettingStartedCollection-seed#[76C97B9BB43F6867]) [    ] o.a.s.c.c.SolrZkClient makePath: /collections/control_collection
   [junit4]   2> 434725 INFO  (TEST-SolrCloudExampleTest.testLoadDocsIntoGettingStartedCollection-seed#[76C97B9BB43F6867]) [    ] o.a.s.c.c.SolrZkClient makePath: /collections/control_collection/shards
   [junit4]   2> 434726 INFO  (TEST-SolrCloudExampleTest.testLoadDocsIntoGettingStartedCollection-seed#[76C97B9BB43F6867]) [    ] o.a.s.c.AbstractZkTestCase put /home/jenkins/workspace/Lucene-Solr-5.x-Linux/solr/core/src/test-files/solr/collection1/conf/solrconfig-tlog.xml to /configs/conf1/solrconfig.xml
   [junit4]   2> 434726 INFO  (TEST-SolrCloudExampleTest.testLoadDocsIntoGettingStartedCollection-seed#[76C97B9BB43F6867]) [    ] o.a.s.c.c.SolrZkClient makePath: /configs/conf1/solrconfig.xml
   [junit4]   2> 434727 INFO  (TEST-SolrCloudExampleTest.testLoadDocsIntoGettingStartedCollection-seed#[76C97B9BB43F6867]) [    ] o.a.s.c.AbstractZkTestCase put /home/jenkins/workspace/Lucene-Solr-5.x-Linux/solr/core/src/test-files/solr/collection1/conf/schema.xml to /configs/conf1/schema.xml
   [junit4]   2> 434728 INFO  (TEST-SolrCloudExampleTest.testLoadDocsIntoGettingStartedCollection-seed#[76C97B9BB43F6867]) [    ] o.a.s.c.c.SolrZkClient makePath: /configs/conf1/schema.xml
   [junit4]   2> 434729 INFO  (TEST-SolrCloudExampleTest.testLoadDocsIntoGettingStartedCollection-seed#[76C97B9BB43F6867]) [    ] o.a.s.c.AbstractZkTestCase put /home/jenkins/workspace/Lucene-Solr-5.x-Linux/solr/core/src/test-files/solr/collection1/conf/solrconfig.snippet.randomindexconfig.xml to /configs/conf1/solrconfig.snippet.randomindexconfig.xml
   [junit4]   2> 434729 INFO  (TEST-SolrCloudExampleTest.testLoadDocsIntoGettingStartedCollection-seed#[76C97B9BB43F6867]) [    ] o.a.s.c.c.SolrZkClient makePath: /configs/conf1/solrconfig.snippet.randomindexconfig.xml
   [junit4]   2> 434730 INFO  (TEST-SolrCloudExampleTest.testLoadDocsIntoGettingStartedCollection-seed#[76C97B9BB43F6867]) [    ] o.a.s.c.AbstractZkTestCase put /home/jenkins/workspace/Lucene-Solr-5.x-Linux/solr/core/src/test-files/solr/collection1/conf/stopwords.txt to /configs/conf1/stopwords.txt
   [junit4]   2> 434730 INFO  (TEST-SolrCloudExampleTest.testLoadDocsIntoGettingStartedCollection-seed#[76C97B9BB43F6867]) [    ] o.a.s.c.c.SolrZkClient makePath: /configs/conf1/stopwords.txt
   [junit4]   2> 434731 INFO  (TEST-SolrCloudExampleTest.testLoadDocsIntoGettingStartedCollection-seed#[76C97B9BB43F6867]) [    ] o.a.s.c.AbstractZkTestCase put /home/jenkins/workspace/Lucene-Solr-5.x-Linux/solr/core/src/test-files/solr/collection1/conf/protwords.txt to /configs/conf1/protwords.txt
   [junit4]   2> 434731 INFO  (TEST-SolrCloudExampleTest.testLoadDocsIntoGettingStartedCollection-seed#[76C97B9BB43F6867]) [    ] o.a.s.c.c.SolrZkClient makePath: /configs/conf1/protwords.txt
   [junit4]   2> 434732 INFO  (TEST-SolrCloudExampleTest.testLoadDocsIntoGettingStartedCollection-seed#[76C97B9BB43F6867]) [    ] o.a.s.c.AbstractZkTestCase put /home/jenkins/workspace/Lucene-Solr-5.x-Linux/solr/core/src/test-files/solr/collection1/conf/currency.xml to /configs/conf1/currency.xml
   [junit4]   2> 434732 INFO  (TEST-SolrCloudExampleTest.testLoadDocsIntoGettingStartedCollection-seed#[76C97B9BB43F6867]) [    ] o.a.s.c.c.SolrZkClient makePath: /configs/conf1/currency.xml
   [junit4]   2> 434733 INFO  (TEST-SolrCloudExampleTest.testLoadDocsIntoGettingStartedCollection-seed#[76C97B9BB43F6867]) [    ] o.a.s.c.AbstractZkTestCase put /home/jenkins/workspace/Lucene-Solr-5.x-Linux/solr/core/src/test-files/solr/collection1/conf/enumsConfig.xml to /configs/conf1/enumsConfig.xml
   [junit4]   2> 434733 INFO  (TEST-SolrCloudExampleTest.testLoadDocsIntoGettingStartedCollection-seed#[76C97B9BB43F6867]) [    ] o.a.s.c.c.SolrZkClient makePath: /configs/conf1/enumsConfig.xml
   [junit4]   2> 434734 INFO  (TEST-SolrCloudExampleTest.testLoadDocsIntoGettingStartedCollection-seed#[76C97B9BB43F6867]) [    ] o.a.s.c.AbstractZkTestCase put /home/jenkins/workspace/Lucene-Solr-5.x-Linux/solr/core/src/test-files/solr/collection1/conf/open-exchange-rates.json to /configs/conf1/open-exchange-rates.json
   [junit4]   2> 434734 INFO  (TEST-SolrCloudExampleTest.testLoadDocsIntoGettingStartedCollection-seed#[76C97B9BB43F6867]) [    ] o.a.s.c.c.SolrZkClient makePath: /configs/conf1/open-exchange-rates.json
   [junit4]   2> 434735 INFO  (TEST-SolrCloudExampleTest.testLoadDocsIntoGettingStartedCollection-seed#[76C97B9BB43F6867]) [    ] o.a.s.c.AbstractZkTestCase put /home/jenkins/workspace/Lucene-Solr-5.x-Linux/solr/core/src/test-files/solr/collection1/conf/mapping-ISOLatin1Accent.txt to /configs/conf1/mapping-ISOLatin1Accent.txt
   [junit4]   2> 434735 INFO  (TEST-SolrCloudExampleTest.testLoadDocsIntoGettingStartedCollection-seed#[76C97B9BB43F6867]) [    ] o.a.s.c.c.SolrZkClient makePath: /configs/conf1/mapping-ISOLatin1Accent.txt
   [junit4]   2> 434736 INFO  (TEST-SolrCloudExampleTest.testLoadDocsIntoGettingStartedCollection-seed#[76C97B9BB43F6867]) [    ] o.a.s.c.AbstractZkTestCase put /home/jenkins/workspace/Lucene-Solr-5.x-Linux/solr/core/src/test-files/solr/collection1/conf/old_synonyms.txt to /configs/conf1/old_synonyms.txt
   [junit4]   2> 434736 INFO  (TEST-SolrCloudExampleTest.testLoadDocsIntoGettingStartedCollection-seed#[76C97B9BB43F6867]) [    ] o.a.s.c.c.SolrZkClient makePath: /configs/conf1/old_synonyms.txt
   [junit4]   2> 434737 INFO  (TEST-SolrCloudExampleTest.testLoadDocsIntoGettingStartedCollection-seed#[76C97B9BB43F6867]) [    ] o.a.s.c.AbstractZkTestCase put /home/jenkins/workspace/Lucene-Solr-5.x-Linux/solr/core/src/test-files/solr/collection1/conf/synonyms.txt to /configs/conf1/synonyms.txt
   [junit4]   2> 434737 INFO  (TEST-SolrCloudExampleTest.testLoadDocsIntoGettingStartedCollection-seed#[76C97B9BB43F6867]) [    ] o.a.s.c.c.SolrZkClient makePath: /configs/conf1/synonyms.txt
   [junit4]   2> 434793 INFO  (TEST-SolrCloudExampleTest.testLoadDocsIntoGettingStartedCollection-seed#[76C97B9BB43F6867]) [    ] o.a.s.SolrTestCaseJ4 Writing core.properties file to /home/jenkins/workspace/Lucene-Solr-5.x-Linux/solr/build/solr-core/test/J0/temp/solr.cloud.SolrCloudExampleTest_76C97B9BB43F6867-001/control-001/cores/collection1
   [junit4]   2> 434794 INFO  (TEST-SolrCloudExampleTest.testLoadDocsIntoGettingStartedCollection-seed#[76C97B9BB43F6867]) [    ] o.e.j.s.Server jetty-9.2.11.v20150529
   [junit4]   2> 434795 INFO  (TEST-SolrCloudExampleTest.testLoadDocsIntoGettingStartedCollection-seed#[76C97B9BB43F6867]) [    ] o.e.j.s.h.ContextHandler Started o.e.j.s.ServletContextHandler@390d66{/,null,AVAILABLE}
   [junit4]   2> 434797 INFO  (TEST-SolrCloudExampleTest.testLoadDocsIntoGettingStartedCollection-seed#[76C97B9BB43F6867]) [    ] o.e.j.s.ServerConnector Started ServerConnector@1a0736c{HTTP/1.1}{127.0.0.1:60446}
   [junit4]   2> 434797 INFO  (TEST-SolrCloudExampleTest.testLoadDocsIntoGettingStartedCollection-seed#[76C97B9BB43F6867]) [    ] o.e.j.s.Server Started @436210ms
   [junit4]   2> 434797 INFO  (TEST-SolrCloudExampleTest.testLoadDocsIntoGettingStartedCollection-seed#[76C97B9BB43F6867]) [    ] o.a.s.c.s.e.JettySolrRunner Jetty properties: {solr.data.dir=/home/jenkins/workspace/Lucene-Solr-5.x-Linux/solr/build/solr-core/test/J0/temp/solr.cloud.SolrCloudExampleTest_76C97B9BB43F6867-001/tempDir-001/control/data, hostContext=/, hostPort=60446, coreRootDirectory=/home/jenkins/workspace/Lucene-Solr-5.x-Linux/solr/build/solr-core/test/J0/temp/solr.cloud.SolrCloudExampleTest_76C97B9BB43F6867-001/control-001/cores}
   [junit4]   2> 434798 INFO  (TEST-SolrCloudExampleTest.testLoadDocsIntoGettingStartedCollection-seed#[76C97B9BB43F6867]) [    ] o.a.s.s.SolrDispatchFilter SolrDispatchFilter.init(): sun.misc.Launcher$AppClassLoader@1fe3ee3
   [junit4]   2> 434798 INFO  (TEST-SolrCloudExampleTest.testLoadDocsIntoGettingStartedCollection-seed#[76C97B9BB43F6867]) [    ] o.a.s.c.SolrResourceLoader new SolrResourceLoader for directory: '/home/jenkins/workspace/Lucene-Solr-5.x-Linux/solr/build/solr-core/test/J0/temp/solr.cloud.SolrCloudExampleTest_76C97B9BB43F6867-001/control-001/'
   [junit4]   2> 434817 INFO  (TEST-SolrCloudExampleTest.testLoadDocsIntoGettingStartedCollection-seed#[76C97B9BB43F6867]) [    ] o.a.s.c.c.SolrZkClient Using default ZkCredentialsProvider
   [junit4]   2> 434817 INFO  (TEST-SolrCloudExampleTest.testLoadDocsIntoGettingStartedCollection-seed#[76C97B9BB43F6867]) [    ] o.a.s.c.c.ConnectionManager Waiting for client to connect to ZooKeeper
   [junit4]   2> 434819 INFO  (zkCallback-199-thread-1) [    ] o.a.s.c.c.ConnectionManager Watcher org.apache.solr.common.cloud.ConnectionManager@76be0e name:ZooKeeperConnection Watcher:127.0.0.1:38183/solr got event WatchedEvent state:SyncConnected type:None path:null path:null type:None
   [junit4]   2> 434819 INFO  (TEST-SolrCloudExampleTest.testLoadDocsIntoGettingStartedCollection-seed#[76C97B9BB43F6867]) [    ] o.a.s.c.c.ConnectionManager Client is connected to ZooKeeper
   [junit4]   2> 434819 INFO  (TEST-SolrCloudExampleTest.testLoadDocsIntoGettingStartedCollection-seed#[76C97B9BB43F6867]) [    ] o.a.s.c.c.SolrZkClient Using default ZkACLProvider
   [junit4]   2> 434820 INFO  (TEST-SolrCloudExampleTest.testLoadDocsIntoGettingStartedCollection-seed#[76C97B9BB43F6867]) [    ] o.a.s.s.SolrDispatchFilter Loading solr.xml from SolrHome (not found in ZooKeeper)
   [junit4]   2> 434821 INFO  (TEST-SolrCloudExampleTest.testLoadDocsIntoGettingStartedCollection-seed#[76C97B9BB43F6867]) [    ] o.a.s.c.SolrXmlConfig Loading container configuration from /home/jenkins/workspace/Lucene-Solr-5.x-Linux/solr/build/solr-core/test/J0/temp/solr.cloud.SolrCloudExampleTest_76C97B9BB43F6867-001/control-001/solr.xml
   [junit4]   2> 434825 INFO  (TEST-SolrCloudExampleTest.testLoadDocsIntoGettingStartedCollection-seed#[76C97B9BB43F6867]) [    ] o.a.s.c.CoresLocator Config-defined core root directory: /home/jenkins/workspace/Lucene-Solr-5.x-Linux/solr/build/solr-core/test/J0/temp/solr.cloud.SolrCloudExampleTest_76C97B9BB43F6867-001/control-001/cores
   [junit4]   2> 434826 INFO  (TEST-SolrCloudExampleTest.testLoadDocsIntoGettingStartedCollection-seed#[76C97B9BB43F6867]) [    ] o.a.s.c.CoreContainer New CoreContainer 14554565
   [junit4]   2> 434826 INFO  (TEST-SolrCloudExampleTest.testLoadDocsIntoGettingStartedCollection-seed#[76C97B9BB43F6867]) [    ] o.a.s.c.CoreContainer Loading cores into CoreContainer [instanceDir=/home/jenkins/workspace/Lucene-Solr-5.x-Linux/solr/build/solr-core/test/J0/temp/solr.cloud.SolrCloudExampleTest_76C97B9BB43F6867-001/control-001/]
   [junit4]   2> 434826 INFO  (TEST-SolrCloudExampleTest.testLoadDocsIntoGettingStartedCollection-seed#[76C97B9BB43F6867]) [    ] o.a.s.c.CoreContainer loading shared library: /home/jenkins/workspace/Lucene-Solr-5.x-Linux/solr/build/solr-core/test/J0/temp/solr.cloud.SolrCloudExampleTest_76C97B9BB43F6867-001/control-001/lib
   [junit4]   2> 434826 WARN  (TEST-SolrCloudExampleTest.testLoadDocsIntoGettingStartedCollection-seed#[76C97B9BB43F6867]) [    ] o.a.s.c.SolrResourceLoader Can't find (or read) directory to add to classloader: lib (resolved as: /home/jenkins/workspace/Lucene-Solr-5.x-Linux/solr/build/solr-core/test/J0/temp/solr.cloud.SolrCloudExampleTest_76C97B9BB43F6867-001/control-001/lib).
   [junit4]   2> 434832 INFO  (TEST-SolrCloudExampleTest.testLoadDocsIntoGettingStartedCollection-seed#[76C97B9BB43F6867]) [    ] o.a.s.h.c.HttpShardHandlerFactory created with socketTimeout : 90000,urlScheme : ,connTimeout : 15000,maxConnectionsPerHost : 20,maxConnections : 10000,corePoolSize : 0,maximumPoolSize : 2147483647,maxThreadIdleTime : 5,sizeOfQueue : -1,fairnessPolicy : false,useRetries : false,
   [junit4]   2> 434833 INFO  (TEST-SolrCloudExampleTest.testLoadDocsIntoGettingStartedCollection-seed#[76C97B9BB43F6867]) [    ] o.a.s.u.UpdateShardHandler Creating UpdateShardHandler HTTP client with params: socketTimeout=340000&connTimeout=45000&retry=true
   [junit4]   2> 434834 INFO  (TEST-SolrCloudExampleTest.testLoadDocsIntoGettingStartedCollection-seed#[76C97B9BB43F6867]) [    ] o.a.s.l.LogWatcher SLF4J impl is org.slf4j.impl.Log4jLoggerFactory
   [junit4]   2> 434834 INFO  (TEST-SolrCloudExampleTest.testLoadDocsIntoGettingStartedCollection-seed#[76C97B9BB43F6867]) [    ] o.a.s.l.LogWatcher Registering Log Listener [Log4j (org.slf4j.impl.Log4jLoggerFactory)]
   [junit4]   2> 434834 INFO  (TEST-SolrCloudExampleTest.testLoadDocsIntoGettingStartedCollection-seed#[76C97B9BB43F6867]) [    ] o.a.s.c.ZkContainer Zookeeper client=127.0.0.1:38183/solr
   [junit4]   2> 434834 INFO  (TEST-SolrCloudExampleTest.testLoadDocsIntoGettingStartedCollection-seed#[76C97B9BB43F6867]) [    ] o.a.s.c.ZkController zkHost includes chroot
   [junit4]   2> 434834 INFO  (TEST-SolrCloudExampleTest.testLoadDocsIntoGettingStartedCollection-seed#[76C97B9BB43F6867]) [    ] o.a.s.c.c.SolrZkClient Using default ZkCredentialsProvider
   [junit4]   2> 434834 INFO  (TEST-SolrCloudExampleTest.testLoadDocsIntoGettingStartedCollection-seed#[76C97B9BB43F6867]) [    ] o.a.s.c.c.ConnectionManager Waiting for client to connect to ZooKeeper
   [junit4]   2> 434836 INFO  (zkCallback-201-thread-1) [    ] o.a.s.c.c.ConnectionManager Watcher org.apache.solr.common.cloud.ConnectionManager@180707f name:ZooKeeperConnection Watcher:127.0.0.1:38183 got event WatchedEvent state:SyncConnected type:None path:null path:null type:None
   [junit4]   2> 434836 INFO  (TEST-SolrCloudExampleTest.testLoadDocsIntoGettingStartedCollection-seed#[76C97B9BB43F6867]) [    ] o.a.s.c.c.ConnectionManager Client is connected to ZooKeeper
   [junit4]   2> 434837 INFO  (TEST-SolrCloudExampleTest.testLoadDocsIntoGettingStartedCollection-seed#[76C97B9BB43F6867]) [    ] o.a.s.c.c.SolrZkClient Using default ZkACLProvider
   [junit4]   2> 434838 INFO  (TEST-SolrCloudExampleTest.testLoadDocsIntoGettingStartedCollection-seed#[76C97B9BB43F6867]) [n:127.0.0.1:60446_    ] o.a.s.c.c.ConnectionManager Waiting for client to connect to ZooKeeper
   [junit4]   2> 434839 INFO  (zkCallback-202-thread-1-processing-n:127.0.0.1:60446_) [n:127.0.0.1:60446_    ] o.a.s.c.c.ConnectionManager Watcher org.apache.solr.common.cloud.ConnectionManager@3601db name:ZooKeeperConnection Watcher:127.0.0.1:38183/solr got event WatchedEvent state:SyncConnected type:None path:null path:null type:None
   [junit4]   2> 434839 INFO  (TEST-SolrCloudExampleTest.testLoadDocsIntoGettingStartedCollection-seed#[76C97B9BB43F6867]) [n:127.0.0.1:60446_    ] o.a.s.c.c.ConnectionManager Client is connected to ZooKeeper
   [junit4]   2> 434840 INFO  (TEST-SolrCloudExampleTest.testLoadDocsIntoGettingStartedCollection-seed#[76C97B9BB43F6867]) [n:127.0.0.1:60446_    ] o.a.s.c.c.SolrZkClient makePath: /overseer/queue
   [junit4]   2> 434842 INFO  (TEST-SolrCloudExampleTest.testLoadDocsIntoGettingStartedCollection-seed#[76C97B9BB43F6867]) [n:127.0.0.1:60446_    ] o.a.s.c.c.SolrZkClient makePath: /overseer/collection-queue-work
   [junit4]   2> 434843 INFO  (TEST-SolrCloudExampleTest.testLoadDocsIntoGettingStartedCollection-seed#[76C97B9BB43F6867]) [n:127.0.0.1:60446_    ] o.a.s.c.c.SolrZkClient makePath: /overseer/collection-map-running
   [junit4]   2> 434844 INFO  (TEST-SolrCloudExampleTest.testLoadDocsIntoGettingStartedCollection-seed#[76C97B9BB43F6867]) [n:127.0.0.1:60446_    ] o.a.s.c.c.SolrZkClient makePath: /overseer/collection-map-completed
   [junit4]   2> 434845 INFO  (TEST-SolrCloudExampleTest.testLoadDocsIntoGettingStartedCollection-seed#[76C97B9BB43F6867]) [n:127.0.0.1:60446_    ] o.a.s.c.c.SolrZkClient makePath: /overseer/collection-map-failure
   [junit4]   2> 434846 INFO  (TEST-SolrCloudExampleTest.testLoadDocsIntoGettingStartedCollection-seed#[76C97B9BB43F6867]) [n:127.0.0.1:60446_    ] o.a.s.c.c.SolrZkClient makePath: /live_nodes
   [junit4]   2> 434847 INFO  (TEST-SolrCloudExampleTest.testLoadDocsIntoGettingStartedCollection-seed#[76C97B9BB43F6867]) [n:127.0.0.1:60446_    ] o.a.s.c.c.SolrZkClient makePath: /aliases.json
   [junit4]   2> 434848 INFO  (TEST-SolrCloudExampleTest.testLoadDocsIntoGettingStartedCollection-seed#[76C97B9BB43F6867]) [n:127.0.0.1:60446_    ] o.a.s.c.c.SolrZkClient makePath: /clusterstate.json
   [junit4]   2> 434848 INFO  (TEST-SolrCloudExampleTest.testLoadDocsIntoGettingStartedCollection-seed#[76C97B9BB43F6867]) [n:127.0.0.1:60446_    ] o.a.s.c.c.SolrZkClient makePath: /security.json
   [junit4]   2> 434849 INFO  (TEST-SolrCloudExampleTest.testLoadDocsIntoGettingStartedCollection-seed#[76C97B9BB43F6867]) [n:127.0.0.1:60446_    ] o.a.s.c.ZkController Register node as live in ZooKeeper:/live_nodes/127.0.0.1:60446_
   [junit4]   2> 434849 INFO  (TEST-SolrCloudExampleTest.testLoadDocsIntoGettingStartedCollection-seed#[76C97B9BB43F6867]) [n:127.0.0.1:60446_    ] o.a.s.c.c.SolrZkClient makePath: /live_nodes/127.0.0.1:60446_
   [junit4]   2> 434850 INFO  (TEST-SolrCloudExampleTest.testLoadDocsIntoGettingStartedCollection-seed#[76C97B9BB43F6867]) [n:127.0.0.1:60446_    ] o.a.s.c.c.SolrZkClient makePath: /overseer_elect
   [junit4]   2> 434851 INFO  (TEST-SolrCloudExampleTest.testLoadDocsIntoGettingStartedCollection-seed#[76C97B9BB43F6867]) [n:127.0.0.1:60446_    ] o.a.s.c.c.SolrZkClient makePath: /overseer_elect/election
   [junit4]   2> 434851 INFO  (TEST-SolrCloudExampleTest.testLoadDocsIntoGettingStartedCollection-seed#[76C97B9BB43F6867]) [n:127.0.0.1:60446_    ] o.a.s.c.Overseer Overseer (id=null) closing
   [junit4]   2> 434852 INFO  (TEST-SolrCloudExampleTest.testLoadDocsIntoGettingStartedCollection-seed#[76C97B9BB43F6867]) [n:127.0.0.1:60446_    ] o.a.s.c.LeaderElector Joined leadership election with path: /overseer_elect/election/94348470581788676-127.0.0.1:60446_-n_0000000000
   [junit4]   2> 434852 INFO  (TEST-SolrCloudExampleTest.testLoadDocsIntoGettingStartedCollection-seed#[76C97B9BB43F6867]) [n:127.0.0.1:60446_    ] o.a.s.c.OverseerElectionContext I am going to be the leader 127.0.0.1:60446_
   [junit4]   2> 434852 INFO  (TEST-SolrCloudExampleTest.testLoadDocsIntoGettingStartedCollection-seed#[76C97B9BB43F6867]) [n:127.0.0.1:60446_    ] o.a.s.c.c.SolrZkClient makePath: /overseer_elect/leader
   [junit4]   2> 434853 INFO  (TEST-SolrCloudExampleTest.testLoadDocsIntoGettingStartedCollection-seed#[76C97B9BB43F6867]) [n:127.0.0.1:60446_    ] o.a.s.c.Overseer Overseer (id=94348470581788676-127.0.0.1:60446_-n_0000000000) starting
   [junit4]   2> 434854 INFO  (TEST-SolrCloudExampleTest.testLoadDocsIntoGettingStartedCollection-seed#[76C97B9BB43F6867]) [n:127.0.0.1:60446_    ] o.a.s.c.c.SolrZkClient makePath: /overseer/queue-work
   [junit4]   2> 434857 INFO  (TEST-SolrCloudExampleTest.testLoadDocsIntoGettingStartedCollection-seed#[76C97B9BB43F6867]) [n:127.0.0.1:60446_    ] o.a.s.c.OverseerAutoReplicaFailoverThread Starting OverseerAutoReplicaFailoverThread autoReplicaFailoverWorkLoopDelay=10000 autoReplicaFailoverWaitAfterExpiration=30000 autoReplicaFailoverBadNodeExpiration=60000
   [junit4]   2> 434857 INFO  (OverseerCollectionProcessor-94348470581788676-127.0.0.1:60446_-n_0000000000) [n:127.0.0.1:60446_    ] o.a.s.c.OverseerProcessor Process current queue of overseer operations
   [junit4]   2> 434857 INFO  (TEST-SolrCloudExampleTest.testLoadDocsIntoGettingStartedCollection-seed#[76C97B9BB43F6867]) [n:127.0.0.1:60446_    ] o.a.s.c.c.ZkStateReader Updating cluster state from ZooKeeper... 
   [junit4]   2> 434857 INFO  (OverseerStateUpdate-94348470581788676-127.0.0.1:60446_-n_0000000000) [n:127.0.0.1:60446_    ] o.a.s.c.Overseer Starting to work on the main queue
   [junit4]   2> 434895 INFO  (TEST-SolrCloudExampleTest.testLoadDocsIntoGettingStartedCollection-seed#[76C97B9BB43F6867]) [n:127.0.0.1:60446_    ] o.a.s.c.CoreContainer Security conf doesn't exist. Skipping setup for authorization module.
   [junit4]   2> 434895 INFO  (TEST-SolrCloudExampleTest.testLoadDocsIntoGettingStartedCollection-seed#[76C97B9BB43F6867]) [n:127.0.0.1:60446_    ] o.a.s.c.CoreContainer No authentication plugin used.
   [junit4]   2> 434896 INFO  (TEST-SolrCloudExampleTest.testLoadDocsIntoGettingStartedCollection-seed#[76C97B9BB43F6867]) [n:127.0.0.1:60446_    ] o.a.s.c.CoresLocator Looking for core definitions underneath /home/jenkins/workspace/Lucene-Solr-5.x-Linux/solr/build/solr-core/test/J0/temp/solr.cloud.SolrCloudExampleTest_76C97B9BB43F6867-001/control-001/cores
   [junit4]   2> 434896 INFO  (TEST-SolrCloudExampleTest.testLoadDocsIntoGettingStartedCollection-seed#[76C97B9BB43F6867]) [n:127.0.0.1:60446_    ] o.a.s.c.SolrCore Created CoreDescriptor: {name=collection1, config=solrconfig.xml, transient=false, schema=schema.xml, loadOnStartup=true, configSetProperties=configsetprops.json, instanceDir=/home/jenkins/workspace/Lucene-Solr-5.x-Linux/solr/build/solr-core/test/J0/temp/solr.cloud.SolrCloudExampleTest_76C97B9BB43F6867-001/control-001/cores/collection1, collection=control_collection, absoluteInstDir=/home/jenkins/workspace/Lucene-Solr-5.x-Linux/solr/build/solr-core/test/J0/temp/solr.cloud.SolrCloudExampleTest_76C97B9BB43F6867-001/control-001/cores/collection1/, coreNodeName=, dataDir=data/, shard=}
   [junit4]   2> 434897 INFO  (TEST-SolrCloudExampleTest.testLoadDocsIntoGettingStartedCollection-seed#[76C97B9BB43F6867]) [n:127.0.0.1:60446_    ] o.a.s.c.CoresLocator Found core collection1 in /home/jenkins/workspace/Lucene-Solr-5.x-Linux/solr/build/solr-core/test/J0/temp/solr.cloud.SolrCloudExampleTest_76C97B9BB43F6867-001/control-001/cores/collection1/
   [junit4]   2> 434897 INFO  (TEST-SolrCloudExampleTest.testLoadDocsIntoGettingStartedCollection-seed#[76C97B9BB43F6867]) [n:127.0.0.1:60446_    ] o.a.s.c.CoresLocator Found 1 core definitions
   [junit4]   2> 434898 INFO  (coreLoadExecutor-1002-thread-1-processing-n:127.0.0.1:60446_) [n:127.0.0.1:60446_ c:control_collection   x:collection1] o.a.s.c.ZkController publishing state=down
   [junit4]   2> 434898 INFO  (coreLoadExecutor-1002-thread-1-processing-n:127.0.0.1:60446_) [n:127.0.0.1:60446_ c:control_collection   x:collection1] o.a.s.c.ZkController numShards not found on descriptor - reading it from system property
   [junit4]   2> 434898 INFO  (TEST-SolrCloudExampleTest.testLoadDocsIntoGettingStartedCollection-seed#[76C97B9BB43F6867]) [n:127.0.0.1:60446_    ] o.a.s.s.SolrDispatchFilter user.dir=/home/jenkins/workspace/Lucene-Solr-5.x-Linux/solr/build/solr-core/test/J0
   [junit4]   2> 434898 INFO  (TEST-SolrCloudExampleTest.testLoadDocsIntoGettingStartedCollection-seed#[76C97B9BB43F6867]) [n:127.0.0.1:60446_    ] o.a.s.s.SolrDispatchFilter SolrDispatchFilter.init() done
   [junit4]   2> 434898 INFO  (zkCallback-202-thread-1-processing-n:127.0.0.1:60446_) [n:127.0.0.1:60446_    ] o.a.s.c.DistributedQueue NodeChildrenChanged fired on path /overseer/queue state SyncConnected
   [junit4]   2> 434898 INFO  (coreLoadExecutor-1002-thread-1-processing-n:127.0.0.1:60446_) [n:127.0.0.1:60446_ c:control_collection   x:collection1] o.a.s.c.ZkController look for our core node name
   [junit4]   2> 434899 INFO  (OverseerStateUpdate-94348470581788676-127.0.0.1:60446_-n_0000000000) [n:127.0.0.1:60446_    ] o.a.s.c.Overseer processMessage: queueSize: 1, message = {
   [junit4]   2>   "core":"collection1",
   [junit4]   2>   "roles":null,
   [junit4]   2>   "base_url":"http://127.0.0.1:60446",
   [junit4]   2>   "node_name":"127.0.0.1:60446_",
   [junit4]   2>   "numShards":"1",
   [junit4]   2>   "state":"down",
   [junit4]   2>   "shard":null,
   [junit4]   2>   "collection":"control_collection",
   [junit4]   2>   "operation":"state"} current state version: 0
   [junit4]   2> 434899 INFO  (OverseerStateUpdate-94348470581788676-127.0.0.1:60446_-n_0000000000) [n:127.0.0.1:60446_    ] o.a.s.c.o.ReplicaMutator Update state numShards=1 message={
   [junit4]   2>   "core":"collection1",
   [junit4]   2>   "roles":null,
   [junit4]   2>   "base_url":"http://127.0.0.1:60446",
   [junit4]   2>   "node_name":"127.0.0.1:60446_",
   [junit4]   2>   "numShards":"1",
   [junit4]   2>   "state":"down",
   [junit4]   2>   "shard":null,
   [junit4]   2>   "collection":"control_collection",
   [junit4]   2>   "operation":"state"}
   [junit4]   2> 434900 INFO  (OverseerStateUpdate-94348470581788676-127.0.0.1:60446_-n_0000000000) [n:127.0.0.1:60446_    ] o.a.s.c.o.ClusterStateMutator building a new cName: control_collection
   [junit4]   2> 434900 INFO  (OverseerStateUpdate-94348470581788676-127.0.0.1:60446_-n_0000000000) [n:127.0.0.1:60446_    ] o.a.s.c.o.ReplicaMutator Assigning new node to shard shard=shard1
   [junit4]   2> 434901 INFO  (zkCallback-202-thread-1-processing-n:127.0.0.1:60446_) [n:127.0.0.1:60446_    ] o.a.s.c.c.ZkStateReader A cluster state change: WatchedEvent state:SyncConnected type:NodeDataChanged path:/clusterstate.json, has occurred - updating... (live nodes size: 1)
   [junit4]   2> 435899 INFO  (coreLoadExecutor-1002-thread-1-processing-n:127.0.0.1:60446_) [n:127.0.0.1:60446_ c:control_collection   x:collection1] o.a.s.c.ZkController waiting to find shard id in clusterstate for collection1
   [junit4]   2> 435899 INFO  (coreLoadExecutor-1002-thread-1-processing-n:127.0.0.1:60446_) [n:127.0.0.1:60446_ c:control_collection   x:collection1] o.a.s.c.ZkController Check for collection zkNode:control_collection
   [junit4]   2> 435900 INFO  (coreLoadExecutor-1002-thread-1-processing-n:127.0.0.1:60446_) [n:127.0.0.1:60446_ c:control_collection   x:collection1] o.a.s.c.ZkController Collection zkNode exists
   [junit4]   2> 435900 INFO  (coreLoadExecutor-1002-thread-1-processing-n:127.0.0.1:60446_) [n:127.0.0.1:60446_ c:control_collection   x:collection1] o.a.s.c.c.ZkStateReader Load collection config from:/collections/control_collection
   [junit4]   2> 435900 INFO  (coreLoadExecutor-1002-thread-1-processing-n:127.0.0.1:60446_) [n:127.0.0.1:60446_ c:control_collection   x:collection1] o.a.s.c.c.ZkStateReader path=/collections/control_collection configName=conf1 specified config exists in ZooKeeper
   [junit4]   2> 435900 INFO  (coreLoadExecutor-1002-thread-1-processing-n:127.0.0.1:60446_) [n:127.0.0.1:60446_ c:control_collection   x:collection1] o.a.s.c.SolrResourceLoader new SolrResourceLoader for directory: '/home/jenkins/workspace/Lucene-Solr-5.x-Linux/solr/build/solr-core/test/J0/temp/solr.cloud.SolrCloudExampleTest_76C97B9BB43F6867-001/control-001/cores/collection1/'
   [junit4]   2> 435913 INFO  (coreLoadExecutor-1002-thread-1-processing-n:127.0.0.1:60446_) [n:127.0.0.1:60446_ c:control_collection   x:collection1] o.a.s.c.Config loaded config solrconfig.xml with version 0 
   [junit4]   2> 435917 INFO  (coreLoadExecutor-1002-thread-1-processing-n:127.0.0.1:60446_) [n:127.0.0.1:60446_ c:control_collection   x:collection1] o.a.s.c.SolrConfig current version of requestparams : -1
   [junit4]   2> 435921 INFO  (coreLoadExecutor-1002-thread-1-processing-n:127.0.0.1:60446_) [n:127.0.0.1:60446_ c:control_collection   x:collection1] o.a.s.c.SolrConfig Using Lucene MatchVersion: 5.4.0
   [junit4]   2> 435928 INFO  (coreLoadExecutor-1002-thread-1-processing-n:127.0.0.1:60446_) [n:127.0.0.1:60446_ c:control_collection   x:collection1] o.a.s.c.Config Loaded SolrConfig: solrconfig.xml
   [junit4]   2> 435929 INFO  (coreLoadExecutor-1002-thread-1-processing-n:127.0.0.1:60446_) [n:127.0.0.1:60446_ c:control_collection   x:collection1] o.a.s.s.IndexSchema Reading Solr Schema from /configs/conf1/schema.xml
   [junit4]   2> 435935 INFO  (coreLoadExecutor-1002-thread-1-processing-n:127.0.0.1:60446_) [n:127.0.0.1:60446_ c:control_collection   x:collection1] o.a.s.s.IndexSchema [collection1] Schema name=test
   [junit4]   2> 436013 INFO  (coreLoadExecutor-1002-thread-1-processing-n:127.0.0.1:60446_) [n:127.0.0.1:60446_ c:control_collection   x:collection1] o.a.s.s.OpenExchangeRatesOrgProvider Initialized with rates=open-exchange-rates.json, refreshInterval=1440.
   [junit4]   2> 436018 INFO  (coreLoadExecutor-1002-thread-1-processing-n:127.0.0.1:60446_) [n:127.0.0.1:60446_ c:control_collection   x:collection1] o.a.s.s.IndexSchema default search field in schema is text
   [junit4]   2> 436019 INFO  (coreLoadExecutor-1002-thread-1-processing-n:127.0.0.1:60446_) [n:127.0.0.1:60446_ c:control_collection   x:collection1] o.a.s.s.IndexSchema unique key field: id
   [junit4]   2> 436024 INFO  (coreLoadExecutor-1002-thread-1-processing-n:127.0.0.1:60446_) [n:127.0.0.1:60446_ c:control_collection   x:collection1] o.a.s.s.FileExchangeRateProvider Reloading exchange rates from file currency.xml
   [junit4]   2> 436026 INFO  (coreLoadExecutor-1002-thread-1-processing-n:127.0.0.1:60446_) [n:127.0.0.1:60446_ c:control_collection   x:collection1] o.a.s.s.FileExchangeRateProvider Reloading exchange rates from file currency.xml
   [junit4]   2> 436027 INFO  (coreLoadExecutor-1002-thread-1-processing-n:127.0.0.1:60446_) [n:127.0.0.1:60446_ c:control_collection   x:collection1] o.a.s.s.OpenExchangeRatesOrgProvider Reloading exchange rates from open-exchange-rates.json
   [junit4]   2> 436028 WARN  (coreLoadExecutor-1002-thread-1-processing-n:127.0.0.1:60446_) [n:127.0.0.1:60446_ c:control_collection   x:collection1] o.a.s.s.OpenExchangeRatesOrgProvider Unknown key IMPORTANT NOTE
   [junit4]   2> 436028 WARN  (coreLoadExecutor-1002-thread-1-processing-n:127.0.0.1:60446_) [n:127.0.0.1:60446_ c:control_collection   x:collection1] o.a.s.s.OpenExchangeRatesOrgProvider Expected key, got STRING
   [junit4]   2> 436028 INFO  (coreLoadExecutor-1002-thread-1-processing-n:127.0.0.1:60446_) [n:127.0.0.1:60446_ c:control_collection   x:collection1] o.a.s.s.OpenExchangeRatesOrgProvider Reloading exchange rates from open-exchange-rates.json
   [junit4]   2> 436028 WARN  (coreLoadExecutor-1002-thread-1-processing-n:127.0.0.1:60446_) [n:127.0.0.1:60446_ c:control_collection   x:collection1] o.a.s.s.OpenExchangeRatesOrgProvider Unknown key IMPORTANT NOTE
   [junit4]   2> 436028 WARN  (coreLoadExecutor-1002-thread-1-processing-n:127.0.0.1:60446_) [n:127.0.0.1:60446_ c:control_collection   x:collection1] o.a.s.s.OpenExchangeRatesOrgProvider Expected key, got STRING
   [junit4]   2> 436029 INFO  (coreLoadExecutor-1002-thread-1-processing-n:127.0.0.1:60446_) [n:127.0.0.1:60446_ c:control_collection   x:collection1] o.a.s.c.ConfigSetProperties Did not find ConfigSet properties, assuming default properties: Can't find resource 'configsetprops.json' in classpath or '/configs/conf1', cwd=/home/jenkins/workspace/Lucene-Solr-5.x-Linux/solr/build/solr-core/test/J0
   [junit4]   2> 436029 INFO  (coreLoadExecutor-1002-thread-1-processing-n:127.0.0.1:60446_) [n:127.0.0.1:60446_ c:control_collection   x:collection1] o.a.s.c.CoreContainer Creating SolrCore 'collection1' using configuration from collection control_collection
   [junit4]   2> 436030 INFO  (coreLoadExecutor-1002-thread-1-processing-n:127.0.0.1:60446_) [n:127.0.0.1:60446_ c:control_collection s:shard1 r:core_node1 x:collection1] o.a.s.c.SolrCore org.apache.solr.core.MockDirectoryFactory
   [junit4]   2> 436030 INFO  (coreLoadExecutor-1002-thread-1-processing-n:127.0.0.1:60446_) [n:127.0.0.1:60446_ c:control_collection s:shard1 r:core_node1 x:collection1] o.a.s.c.SolrCore [[collection1] ] Opening new SolrCore at [/home/jenkins/workspace/Lucene-Solr-5.x-Linux/solr/build/solr-core/test/J0/temp/solr.cloud.SolrCloudExampleTest_76C97B9BB43F6867-001/control-001/cores/collection1/], dataDir=[null]
   [junit4]   2> 436031 INFO  (coreLoadExecutor-1002-thread-1-processing-n:127.0.0.1:60446_) [n:127.0.0.1:60446_ c:control_collection s:shard1 r:core_node1 x:collection1] o.a.s.c.JmxMonitoredMap JMX monitoring is enabled. Adding Solr mbeans to JMX Server: com.sun.jmx.mbeanserver.JmxMBeanServer@224a70
   [junit4]   2> 436031 INFO  (coreLoadExecutor-1002-thread-1-processing-n:127.0.0.1:60446_) [n:127.0.0.1:60446_ c:control_collection s:shard1 r:core_node1 x:collection1] o.a.s.c.CachingDirectoryFactory return new directory for /home/jenkins/workspace/Lucene-Solr-5.x-Linux/solr/build/solr-core/test/J0/temp/solr.cloud.SolrCloudExampleTest_76C97B9BB43F6867-001/control-001/cores/collection1/data
   [junit4]   2> 436031 INFO  (coreLoadExecutor-1002-thread-1-processing-n:127.0.0.1:60446_) [n:127.0.0.1:60446_ c:control_collection s:shard1 r:core_node1 x:collection1] o.a.s.c.SolrCore New index directory detected: old=null new=/home/jenkins/workspace/Lucene-Solr-5.x-Linux/solr/build/solr-core/test/J0/temp/solr.cloud.SolrCloudExampleTest_76C97B9BB43F6867-001/control-001/cores/collection1/data/index/
   [junit4]   2> 436031 WARN  (coreLoadExecutor-1002-thread-1-processing-n:127.0.0.1:60446_) [n:127.0.0.1:60446_ c:control_collection s:shard1 r:core_node1 x:collection1] o.a.s.c.SolrCore [collection1] Solr index directory '/home/jenkins/workspace/Lucene-Solr-5.x-Linux/solr/build/solr-core/test/J0/temp/solr.cloud.SolrCloudExampleTest_76C97B9BB43F6867-001/control-001/cores/collection1/data/index' doesn't exist. Creating new index...
   [junit4]   2> 436032 INFO  (coreLoadExecutor-1002-thread-1-processing-n:127.0.0.1:60446_) [n:127.0.0.1:60446_ c:control_collection s:shard1 r:core_node1 x:collection1] o.a.s.c.CachingDirectoryFactory return new directory for /home/jenkins/workspace/Lucene-Solr-5.x-Linux/solr/build/solr-core/test/J0/temp/solr.cloud.SolrCloudExampleTest_76C97B9BB43F6867-001/control-001/cores/collection1/data/index
   [junit4]   2> 436032 INFO  (coreLoadExecutor-1002-thread-1-processing-n:127.0.0.1:60446_) [n:127.0.0.1:60446_ c:control_collection s:shard1 r:core_node1 x:collection1] o.a.s.u.RandomMergePolicy RandomMergePolicy wrapping class org.apache.lucene.index.LogDocMergePolicy: [LogDocMergePolicy: minMergeSize=1000, mergeFactor=40, maxMergeSize=9223372036854775807, maxMergeSizeForForcedMerge=9223372036854775807, calibrateSizeByDeletes=false, maxMergeDocs=2147483647, maxCFSSegmentSizeMB=8.796093022207999E12, noCFSRatio=0.6709045115427466]
   [junit4]   2> 436033 INFO  (coreLoadExecutor-1002-thread-1-processing-n:127.0.0.1:60446_) [n:127.0.0.1:60446_ c:control_collection s:shard1 r:core_node1 x:collection1] o.a.s.c.SolrCore SolrDeletionPolicy.onCommit: commits: num=1
   [junit4]   2> 	commit{dir=MockDirectoryWrapper(RAMDirectory@3728a8 lockFactory=org.apache.lucene.store.SingleInstanceLockFactory@6359ef),segFN=segments_1,generation=1}
   [junit4]   2> 436033 INFO  (coreLoadExecutor-1002-thread-1-processing-n:127.0.0.1:60446_) [n:127.0.0.1:60446_ c:control_collection s:shard1 r:core_node1 x:collection1] o.a.s.c.SolrCore newest commit generation = 1
   [junit4]   2> 436033 INFO  (OldIndexDirectoryCleanupThreadForCore-collection1) [n:127.0.0.1:60446_ c:control_collection s:shard1 r:core_node1 x:collection1] o.a.s.c.SolrCore Looking for old index directories to cleanup for core collection1 in /home/jenkins/workspace/Lucene-Solr-5.x-Linux/solr/build/solr-core/test/J0/temp/solr.cloud.SolrCloudExampleTest_76C97B9BB43F6867-001/control-001/cores/collection1/data/
   [junit4]   2> 436033 WARN  (OldIndexDirectoryCleanupThreadForCore-collection1) [n:127.0.0.1:60446_ c:control_collection s:shard1 r:core_node1 x:collection1] o.a.s.c.DirectoryFactory /home/jenkins/workspace/Lucene-Solr-5.x-Linux/solr/build/solr-core/test/J0/temp/solr.cloud.SolrCloudExampleTest_76C97B9BB43F6867-001/control-001/cores/collection1/data/ does not point to a valid data directory; skipping clean-up of old index directories.
   [junit4]   2> 436036 INFO  (coreLoadExecutor-1002-thread-1-processing-n:127.0.0.1:60446_) [n:127.0.0.1:60446_ c:control_collection s:shard1 r:core_node1 x:collection1] o.a.s.u.p.UpdateRequestProcessorChain creating updateRequestProcessorChain "nodistrib"
   [junit4]   2> 436036 INFO  (coreLoadExecutor-1002-thread-1-processing-n:127.0.0.1:60446_) [n:127.0.0.1:60446_ c:control_collection s:shard1 r:core_node1 x:collection1] o.a.s.u.p.UpdateRequestProcessorChain creating updateRequestProcessorChain "dedupe"
   [junit4]   2> 436036 INFO  (coreLoadExecutor-1002-thread-1-processing-n:127.0.0.1:60446_) [n:127.0.0.1:60446_ c:control_collection s:shard1 r:core_node1 x:collection1] o.a.s.u.p.UpdateRequestProcessorChain inserting DistributedUpdateProcessorFactory into updateRequestProcessorChain "dedupe"
   [junit4]   2> 436036 INFO  (coreLoadExecutor-1002-thread-1-processing-n:127.0.0.1:60446_) [n:127.0.0.1:60446_ c:control_collection s:shard1 r:core_node1 x:collection1] o.a.s.u.p.UpdateRequestProcessorChain creating updateRequestProcessorChain "stored_sig"
   [junit4]   2> 436036 INFO  (coreLoadExecutor-1002-thread-1-processing-n:127.0.0.1:60446_) [n:127.0.0.1:60446_ c:control_collection s:shard1 r:core_node1 x:collection1] o.a.s.u.p.UpdateRequestProcessorChain inserting DistributedUpdateProcessorFactory into updateRequestProcessorChain "stored_sig"
   [junit4]   2> 436036 INFO  (coreLoadExecutor-1002-thread-1-processing-n:127.0.0.1:60446_) [n:127.0.0.1:60446_ c:control_collection s:shard1 r:core_node1 x:collection1] o.a.s.u.p.UpdateRequestProcessorChain creating updateRequestProcessorChain "distrib-dup-test-chain-explicit"
   [junit4]   2> 436037 INFO  (coreLoadExecutor-1002-thread-1-processing-n:127.0.0.1:60446_) [n:127.0.0.1:60446_ c:control_collection s:shard1 r:core_node1 x:collection1] o.a.s.u.p.UpdateRequestProcessorChain creating updateRequestProcessorChain "distrib-dup-test-chain-implicit"
   [junit4]   2> 436037 INFO  (coreLoadExecutor-1002-thread-1-processing-n:127.0.0.1:60446_) [n:127.0.0.1:60446_ c:control_collection s:shard1 r:core_node1 x:collection1] o.a.s.u.p.UpdateRequestProcessorChain inserting DistributedUpdateProcessorFactory into updateRequestProcessorChain "distrib-dup-test-chain-implicit"
   [junit4]   2> 436037 INFO  (coreLoadExecutor-1002-thread-1-processing-n:127.0.0.1:60446_) [n:127.0.0.1:60446_ c:control_collection s:shard1 r:core_node1 x:collection1] o.a.s.c.SolrCore no updateRequestProcessorChain defined as default, creating implicit default
   [junit4]   2> 436038 INFO  (coreLoadExecutor-1002-thread-1-processing-n:127.0.0.1:60446_) [n:127.0.0.1:60446_ c:control_collection s:shard1 r:core_node1 x:collection1] o.a.s.h.l.XMLLoader xsltCacheLifetimeSeconds=60
   [junit4]   2> 436039 INFO  (coreLoadExecutor-1002-thread-1-processing-n:127.0.0.1:60446_) [n:127.0.0.1:60446_ c:control_collection s:shard1 r:core_node1 x:collection1] o.a.s.h.l.XMLLoader xsltCacheLifetimeSeconds=60
   [junit4]   2> 436040 INFO  (coreLoadExecutor-1002-thread-1-processing-n:127.0.0.1:60446_) [n:127.0.0.1:60446_ c:control_collection s:shard1 r:core_node1 x:collection1] o.a.s.h.l.XMLLoader xsltCacheLifetimeSeconds=60
   [junit4]   2> 436041 INFO  (coreLoadExecutor-1002-thread-1-processing-n:127.0.0.1:60446_) [n:127.0.0.1:60446_ c:control_collection s:shard1 r:core_node1 x:collection1] o.a.s.h.l.XMLLoader xsltCacheLifetimeSeconds=60
   [junit4]   2> 436044 INFO  (coreLoadExecutor-1002-thread-1-processing-n:127.0.0.1:60446_) [n:127.0.0.1:60446_ c:control_collection s:shard1 r:core_node1 x:collection1] o.a.s.c.RequestHandlers Registered paths: /admin/mbeans,standard,/update/csv,/update/json/docs,/admin/luke,/admin/segments,/get,/admin/system,/replication,/admin/properties,/config,/schema,/admin/plugins,/admin/logging,/update/json,/admin/threads,/admin/ping,/update,/admin/file
   [junit4]   2> 436045 INFO  (coreLoadExecutor-1002-thread-1-processing-n:127.0.0.1:60446_) [n:127.0.0.1:60446_ c:control_collection s:shard1 r:core_node1 x:collection1] o.a.s.c.SolrCore Using default statsCache cache: org.apache.solr.search.stats.LocalStatsCache
   [junit4]   2> 436045 INFO  (coreLoadExecutor-1002-thread-1-processing-n:127.0.0.1:60446_) [n:127.0.0.1:60446_ c:control_collection s:shard1 r:core_node1 x:collection1] o.a.s.u.UpdateHandler Using UpdateLog implementation: org.apache.solr.update.UpdateLog
   [junit4]   2> 436046 INFO  (coreLoadExecutor-1002-thread-1-processing-n:127.0.0.1:60446_) [n:127.0.0.1:60446_ c:control_collection s:shard1 r:core_node1 x:collection1] o.a.s.u.UpdateLog Initializing UpdateLog: dataDir= defaultSyncLevel=FLUSH numRecordsToKeep=100 maxNumLogsToKeep=10 numVersionBuckets=65536
   [junit4]   2> 436046 INFO  (coreLoadExecutor-1002-thread-1-processing-n:127.0.0.1:60446_) [n:127.0.0.1:60446_ c:control_collection s:shard1 r:core_node1 x:collection1] o.a.s.c.SolrCore Hard AutoCommit: disabled
   [junit4]   2> 436046 INFO  (coreLoadExecutor-1002-thread-1-processing-n:127.0.0.1:60446_) [n:127.0.0.1:60446_ c:control_collection s:shard1 r:core_node1 x:collection1] o.a.s.c.SolrCore Soft AutoCommit: disabled
   [junit4]   2> 436047 INFO  (coreLoadExecutor-1002-thread-1-processing-n:127.0.0.1:60446_) [n:127.0.0.1:60446_ c:control_collection s:shard1 r:core_node1 x:collection1] o.a.s.u.RandomMergePolicy RandomMergePolicy wrapping class org.apache.lucene.index.TieredMergePolicy: [TieredMergePolicy: maxMergeAtOnce=28, maxMergeAtOnceExplicit=44, maxMergedSegmentMB=59.66015625, floorSegmentMB=1.9599609375, forceMergeDeletesPctAllowed=12.162918105686972, segmentsPerTier=29.0, maxCFSSegmentSizeMB=8.796093022207999E12, noCFSRatio=0.15653467462738535
   [junit4]   2> 436047 INFO  (coreLoadExecutor-1002-thread-1-processing-n:127.0.0.1:60446_) [n:127.0.0.1:60446_ c:control_collection s:shard1 r:core_node1 x:collection1] o.a.s.c.SolrCore SolrDeletionPolicy.onInit: commits: num=1
   [junit4]   2> 	commit{dir=MockDirectoryWrapper(RAMDirectory@3728a8 lockFactory=org.apache.lucene.store.SingleInstanceLockFactory@6359ef),segFN=segments_1,generation=1}
   [junit4]   2> 436047 INFO  (coreLoadExecutor-1002-thread-1-processing-n:127.0.0.1:60446_) [n:127.0.0.1:60446_ c:control_collection s:shard1 r:core_node1 x:collection1] o.a.s.c.SolrCore newest commit generation = 1
   [junit4]   2> 436047 INFO  (coreLoadExecutor-1002-thread-1-processing-n:127.0.0.1:60446_) [n:127.0.0.1:60446_ c:control_collection s:shard1 r:core_node1 x:collection1] o.a.s.s.SolrIndexSearcher Opening Searcher@109dee7[collection1] main
   [junit4]   2> 436048 INFO  (coreLoadExecutor-1002-thread-1-processing-n:127.0.0.1:60446_) [n:127.0.0.1:60446_ c:control_collection s:shard1 r:core_node1 x:collection1] o.a.s.c.c.ZkStateReader Load collection config from:/collections/control_collection
   [junit4]   2> 436048 INFO  (coreLoadExecutor-1002-thread-1-processing-n:127.0.0.1:60446_) [n:127.0.0.1:60446_ c:control_collection s:shard1 r:core_node1 x:collection1] o.a.s.c.c.ZkStateReader path=/collections/control_collection configName=conf1 specified config exists in ZooKeeper
   [junit4]   2> 436048 INFO  (coreLoadExecutor-1002-thread-1-processing-n:127.0.0.1:60446_) [n:127.0.0.1:60446_ c:control_collection s:shard1 r:core_node1 x:collection1] o.a.s.r.ManagedResourceStorage Setting up ZooKeeper-based storage for the RestManager with znodeBase: /configs/conf1
   [junit4]   2> 436049 INFO  (coreLoadExecutor-1002-thread-1-processing-n:127.0.0.1:60446_) [n:127.0.0.1:60446_ c:control_collection s:shard1 r:core_node1 x:collection1] o.a.s.r.ManagedResourceStorage Configured ZooKeeperStorageIO with znodeBase: /configs/conf1
   [junit4]   2> 436049 INFO  (coreLoadExecutor-1002-thread-1-processing-n:127.0.0.1:60446_) [n:127.0.0.1:60446_ c:control_collection s:shard1 r:core_node1 x:collection1] o.a.s.r.RestManager Initializing RestManager with initArgs: {}
   [junit4]   2> 436049 INFO  (coreLoadExecutor-1002-thread-1-processing-n:127.0.0.1:60446_) [n:127.0.0.1:60446_ c:control_collection s:shard1 r:core_node1 x:collection1] o.a.s.r.ManagedResourceStorage Reading _rest_managed.json using ZooKeeperStorageIO:path=/configs/conf1
   [junit4]   2> 436049 INFO  (coreLoadExecutor-1002-thread-1-processing-n:127.0.0.1:60446_) [n:127.0.0.1:60446_ c:control_collection s:shard1 r:core_node1 x:collection1] o.a.s.r.ManagedResourceStorage No data found for znode /configs/conf1/_rest_managed.json
   [junit4]   2> 436049 INFO  (coreLoadExecutor-1002-thread-1-processing-n:127.0.0.1:60446_) [n:127.0.0.1:60446_ c:control_collection s:shard1 r:core_node1 x:collection1] o.a.s.r.ManagedResourceStorage Loaded null at path _rest_managed.json using ZooKeeperStorageIO:path=/configs/conf1
   [junit4]   2> 436050 INFO  (coreLoadExecutor-1002-thread-1-processing-n:127.0.0.1:60446_) [n:127.0.0.1:60446_ c:control_collection s:shard1 r:core_node1 x:collection1] o.a.s.r.RestManager Initializing 0 registered ManagedResources
   [junit4]   2> 436050 INFO  (coreLoadExecutor-1002-thread-1-processing-n:127.0.0.1:60446_) [n:127.0.0.1:60446_ c:control_collection s:shard1 r:core_node1 x:collection1] o.a.s.h.ReplicationHandler Commits will be reserved for  10000
   [junit4]   2> 436050 INFO  (searcherExecutor-1003-thread-1-processing-n:127.0.0.1:60446_ x:collection1 s:shard1 c:control_collection r:core_node1) [n:127.0.0.1:60446_ c:control_collection s:shard1 r:core_node1 x:collection1] o.a.s.c.SolrCore [collection1] Registered new searcher Searcher@109dee7[collection1] main{ExitableDirectoryReader(UninvertingDirectoryReader())}
   [junit4]   2> 436051 INFO  (coreLoadExecutor-1002-thread-1-processing-n:127.0.0.1:60446_) [n:127.0.0.1:60446_ c:control_collection s:shard1 r:core_node1 x:collection1] o.a.s.u.UpdateLog Looking up max value of version field to seed version buckets
   [junit4]   2> 436051 INFO  (coreLoadExecutor-1002-thread-1-processing-n:127.0.0.1:60446_) [n:127.0.0.1:60446_ c:control_collection s:shard1 r:core_node1 x:collection1] o.a.s.u.VersionInfo Refreshing highest value of _version_ for 65536 version buckets from index
   [junit4]   2> 436051 INFO  (coreLoadExecutor-1002-thread-1-processing-n:127.0.0.1:60446_) [n:127.0.0.1:60446_ c:control_collection s:shard1 r:core_node1 x:collection1] o.a.s.u.VersionInfo No terms found for _version_, cannot seed version bucket highest value from index
   [junit4]   2> 436051 INFO  (coreLoadExecutor-1002-thread-1-processing-n:127.0.0.1:60446_) [n:127.0.0.1:60446_ c:control_collection s:shard1 r:core_node1 x:collection1] o.a.s.u.UpdateLog Could not find max version in index or recent updates, using new clock 1509575530813325312
   [junit4]   2> 436053 INFO  (coreLoadExecutor-1002-thread-1-processing-n:127.0.0.1:60446_) [n:127.0.0.1:60446_ c:control_collection s:shard1 r:core_node1 x:collection1] o.a.s.u.UpdateLog Took 1.0ms to seed version buckets with highest version 1509575530813325312
   [junit4]   2> 436053 INFO  (coreLoadExecutor-1002-thread-1-processing-n:127.0.0.1:60446_) [n:127.0.0.1:60446_ c:control_collection s:shard1 r:core_node1 x:collection1] o.a.s.c.ZkController watch zkdir /configs/conf1
   [junit4]   2> 436053 INFO  (coreLoadExecutor-1002-thread-1-processing-n:127.0.0.1:60446_) [n:127.0.0.1:60446_ c:control_collection s:shard1 r:core_node1 x:collection1] o.a.s.c.CoreContainer registering core: collection1
   [junit4]   2> 436053 INFO  (coreZkRegister-996-thread-1-processing-n:127.0.0.1:60446_ x:collection1 s:shard1 c:control_collection r:core_node1) [n:127.0.0.1:60446_ c:control_collection s:shard1 r:core_node1 x:collection1] o.a.s.c.ZkController Register replica - core:collection1 address:http://127.0.0.1:60446 collection:control_collection shard:shard1
   [junit4]   2> 436054 INFO  (coreZkRegister-996-thread-1-processing-n:127.0.0.1:60446_ x:collection1 s:shard1 c:control_collection r:core_node1) [n:127.0.0.1:60446_ c:control_collection s:shard1 r:core_node1 x:collection1] o.a.s.c.c.SolrZkClient makePath: /collections/control_collection/leader_elect/shard1/election
   [junit4]   2> 436055 INFO  (coreZkRegister-996-thread-1-processing-n:127.0.0.1:60446_ x:collection1 s:shard1 c:control_collection r:core_node1) [n:127.0.0.1:60446_ c:control_collection s:shard1 r:core_node1 x:collection1] o.a.s.c.LeaderElector Joined leadership election with path: /collections/control_collection/leader_elect/shard1/election/94348470581788676-core_node1-n_0000000000
   [junit4]   2> 436056 INFO  (coreZkRegister-996-thread-1-processing-n:127.0.0.1:60446_ x:collection1 s:shard1 c:control_collection r:core_node1) [n:127.0.0.1:60446_ c:control_collection s:shard1 r:core_node1 x:collection1] o.a.s.c.ShardLeaderElectionContext Running the leader process for shard shard1
   [junit4]   2> 436057 INFO  (zkCallback-202-thread-1-processing-n:127.0.0.1:60446_) [n:127.0.0.1:60446_    ] o.a.s.c.DistributedQueue NodeChildrenChanged fired on path /overseer/queue state SyncConnected
   [junit4]   2> 436057 INFO  (coreZkRegister-996-thread-1-processing-n:127.0.0.1:60446_ x:collection1 s:shard1 c:control_collection r:core_node1) [n:127.0.0.1:60446_ c:control_collection s:shard1 r:core_node1 x:collection1] o.a.s.c.ShardLeaderElectionContext Enough replicas found to continue.
   [junit4]   2> 436057 INFO  (coreZkRegister-996-thread-1-processing-n:127.0.0.1:60446_ x:collection1 s:shard1 c:control_collection r:core_node1) [n:127.0.0.1:60446_ c:control_collection s:shard1 r:core_node1 x:collection1] o.a.s.c.ShardLeaderElectionContext I may be the new leader - try and sync
   [junit4]   2> 436057 INFO  (coreZkRegister-996-thread-1-processing-n:127.0.0.1:60446_ x:collection1 s:shard1 c:control_collection r:core_node1) [n:127.0.0.1:60446_ c:control_collection s:shard1 r:core_node1 x:collection1] o.a.s.c.SyncStrategy Sync replicas to http://127.0.0.1:60446/collection1/
   [junit4]   2> 436057 INFO  (OverseerStateUpdate-94348470581788676-127.0.0.1:60446_-n_0000000000) [n:127.0.0.1:60446_    ] o.a.s.c.Overseer processMessage: queueSize: 1, message = {
   [junit4]   2>   "operation":"leader",
   [junit4]   2>   "shard":"shard1",
   [junit4]   2>   "collection":"control_collection"} current state version: 1
   [junit4]   2> 436057 INFO  (coreZkRegister-996-thread-1-processing-n:127.0.0.1:60446_ x:collection1 s:shard1 c:control_collection r:core_node1) [n:127.0.0.1:60446_ c:control_collection s:shard1 r:core_node1 x:collection1] o.a.s.c.SyncStrategy Sync Success - now sync replicas to me
   [junit4]   2> 436057 INFO  (coreZkRegister-996-thread-1-processing-n:127.0.0.1:60446_ x:collection1 s:shard1 c:control_collection r:core_node1) [n:127.0.0.1:60446_ c:control_collection s:shard1 r:core_node1 x:collection1] o.a.s.c.SyncStrategy http://127.0.0.1:60446/collection1/ has no replicas
   [junit4]   2> 436058 INFO  (coreZkRegister-996-thread-1-processing-n:127.0.0.1:60446_ x:collection1 s:shard1 c:control_collection r:core_node1) [n:127.0.0.1:60446_ c:control_collection s:shard1 r:core_node1 x:collection1] o.a.s.c.ShardLeaderElectionContext I am the new leader: http://127.0.0.1:60446/collection1/ shard1
   [junit4]   2> 436058 INFO  (coreZkRegister-996-thread-1-processing-n:127.0.0.1:60446_ x:collection1 s:shard1 c:control_collection r:core_node1) [n:127.0.0.1:60446_ c:control_collection s:shard1 r:core_node1 x:collection1] o.a.s.c.c.SolrZkClient makePath: /collections/control_collection/leaders/shard1
   [junit4]   2> 436059 INFO  (zkCallback-202-thread-1-processing-n:127.0.0.1:60446_) [n:127.0.0.1:60446_    ] o.a.s.c.DistributedQueue NodeChildrenChanged fired on path /overseer/queue state SyncConnected
   [junit4]   2> 436060 INFO  (OverseerStateUpdate-94348470581788676-127.0.0.1:60446_-n_0000000000) [n:127.0.0.1:60446_    ] o.a.s.c.Overseer processMessage: queueSize: 1, message = {
   [junit4]   2>   "operation":"leader",
   [junit4]   2>   "shard":"shard1",
   [junit4]   2>   "collection":"control_collection",
   [junit4]   2>   "base_url":"http://127.0.0.1:60446",
   [junit4]   2>   "core":"collection1",
   [junit4]   2>   "state":"active"} current state version: 1
   [junit4]   2> 436162 INFO  (zkCallback-202-thread-1-processing-n:127.0.0.1:60446_) [n:127.0.0.1:60446_    ] o.a.s.c.c.ZkStateReader A cluster state change: WatchedEvent state:SyncConnected type:NodeDataChanged path:/clusterstate.json, has occurred - updating... (live nodes size: 1)
   [junit4]   2> 436210 INFO  (coreZkRegister-996-thread-1-processing-n:127.0.0.1:60446_ x:collection1 s:shard1 c:control_collection r:core_node1) [n:127.0.0.1:60446_ c:control_collection s:shard1 r:core_node1 x:collection1] o.a.s.c.ZkController We are http://127.0.0.1:60446/collection1/ and leader is http://127.0.0.1:60446/collection1/
   [junit4]   2> 436210 INFO  (coreZkRegister-996-thread-1-processing-n:127.0.0.1:60446_ x:collection1 s:shard1 c:control_collection r:core_node1) [n:127.0.0.1:60446_ c:control_collection s:shard1 r:core_node1 x:collection1] o.a.s.c.ZkController No LogReplay needed for core=collection1 baseURL=http://127.0.0.1:60446
   [junit4]   2> 436210 INFO  (coreZkRegister-996-thread-1-processing-n:127.0.0.1:60446_ x:collection1 s:shard1 c:control_collection r:core_node1) [n:127.0.0.1:60446_ c:control_collection s:shard1 r:core_node1 x:collection1] o.a.s.c.ZkController I am the leader, no recovery necessary
   [junit4]   2> 436210 INFO  (coreZkRegister-996-thread-1-processing-n:127.0.0.1:60446_ x:collection1 s:shard1 c:control_collection r:core_node1) [n:127.0.0.1:60446_ c:control_collection s:shard1 r:core_node1 x:collection1] o.a.s.c.ZkController publishing state=active
   [junit4]   2> 436211 INFO  (coreZkRegister-996-thread-1-processing-n:127.0.0.1:60446_ x:collection1 s:shard1 c:control_collection r:core_node1) [n:127.0.0.1:60446_ c:control_collection s:shard1 r:core_node1 x:collection1] o.a.s.c.ZkController numShards not found on descriptor - reading it from system property
   [junit4]   2> 436211 INFO  (zkCallback-202-thread-1-processing-n:127.0.0.1:60446_) [n:127.0.0.1:60446_    ] o.a.s.c.DistributedQueue NodeChildrenChanged fired on path /overseer/queue state SyncConnected
   [junit4]   2> 436212 INFO  (OverseerStateUpdate-94348470581788676-127.0.0.1:60446_-n_0000000000) [n:127.0.0.1:60446_    ] o.a.s.c.Overseer processMessage: queueSize: 1, message = {
   [junit4]   2>   "core":"collection1",
   [junit4]   2>   "core_node_name":"core_node1",
   [junit4]   2>   "roles":null,
   [junit4]   2>   "base_url":"http://127.0.0.1:60446",
   [junit4]   2>   "node_name":"127.0.0.1:60446_",
   [junit4]   2>   "numShards":"1",
   [junit4]   2>   "state":"active",
   [junit4]   2>   "shard":"shard1",
   [junit4]   2>   "collection":"control_collection",
   [junit4]   2>   "operation":"state"} current state version: 2
   [junit4]   2> 436212 INFO  (OverseerStateUpdate-94348470581788676-127.0.0.1:60446_-n_0000000000) [n:127.0.0.1:60446_    ] o.a.s.c.o.ReplicaMutator Update state numShards=1 message={
   [junit4]   2>   "core":"collection1",
   [junit4]   2>   "core_node_name":"core_node1",
   [junit4]   2>   "roles":null,
   [junit4]   2>   "base_url":"http://127.0.0.1:60446",
   [junit4]   2>   "node_name":"127.0.0.1:60446_",
   [junit4]   2>   "numShards":"1",
   [junit4]   2>   "state":"active",
   [junit4]   2>   "shard":"shard1",
   [junit4]   2>   "collection":"control_collection",
   [junit4]   2>   "operation":"state"}
   [junit4]   2> 436314 INFO  (zkCallback-202-thread-1-processing-n:127.0.0.1:60446_) [n:127.0.0.1:60446_    ] o.a.s.c.c.ZkStateReader A cluster state change: WatchedEvent state:SyncConnected type:NodeDataChanged path:/clusterstate.json, has occurred - updating... (live nodes size: 1)
   [junit4]   2> 436400 INFO  (TEST-SolrCloudExampleTest.testLoadDocsIntoGettingStartedCollection-seed#[76C97B9BB43F6867]) [    ] o.a.s.c.c.SolrZkClient Using default ZkCredentialsProvider
   [junit4]   2> 436400 INFO  (TEST-SolrCloudExampleTest.testLoadDocsIntoGettingStartedCollection-seed#[76C97B9BB43F6867]) [    ] o.a.s.c.c.ConnectionManager Waiting for client to connect to ZooKeeper
   [junit4]   2> 436402 INFO  (zkCallback-204-thread-1) [    ] o.a.s.c.c.ConnectionManager Watcher org.apache.solr.common.cloud.ConnectionManager@1c506a8 name:ZooKeeperConnection Watcher:127.0.0.1:38183/solr got event WatchedEvent state:SyncConnected type:None path:null path:null type:None
   [junit4]   2> 436402 INFO  (TEST-SolrCloudExampleTest.testLoadDocsIntoGettingStartedCollection-seed#[76C97B9BB43F6867]) [    ] o.a.s.c.c.ConnectionManager Client is connected to ZooKeeper
   [junit4]   2> 436403 INFO  (TEST-SolrCloudExampleTest.testLoadDocsIntoGettingStartedCollection-seed#[76C97B9BB43F6867]) [    ] o.a.s.c.c.SolrZkClient Using default ZkACLProvider
   [junit4]   2> 436403 INFO  (TEST-SolrCloudExampleTest.testLoadDocsIntoGettingStartedCollection-seed#[76C97B9BB43F6867]) [    ] o.a.s.c.c.ZkStateReader Updating cluster state from ZooKeeper... 
   [junit4]   2> 436404 INFO  (TEST-SolrCloudExampleTest.testLoadDocsIntoGettingStartedCollection-seed#[76C97B9BB43F6867]) [    ] o.a.s.c.ChaosMonkey monkey: init - expire sessions:false cause connection loss:false
   [junit4]   2> 436457 INFO  (TEST-SolrCloudExampleTest.testLoadDocsIntoGettingStartedCollection-seed#[76C97B9BB43F6867]) [    ] o.a.s.SolrTestCaseJ4 Writing core.properties file to /home/jenkins/workspace/Lucene-Solr-5.x-Linux/solr/build/solr-core/test/J0/temp/solr.cloud.SolrCloudExampleTest_76C97B9BB43F6867-001/shard-1-001/cores/collection1
   [junit4]   2> 436458 INFO  (TEST-SolrCloudExampleTest.testLoadDocsIntoGettingStartedCollection-seed#[76C97B9BB43F6867]) [    ] o.a.s.c.AbstractFullDistribZkTestBase create jetty 1 in directory /home/jenkins/workspace/Lucene-Solr-5.x-Linux/solr/build/solr-core/test/J0/temp/solr.cloud.SolrCloudExampleTest_76C97B9BB43F6867-001/shard-1-001
   [junit4]   2> 436459 INFO  (TEST-SolrCloudExampleTest.testLoadDocsIntoGettingStartedCollection-seed#[76C97B9BB43F6867]) [    ] o.e.j.s.Server jetty-9.2.11.v20150529
   [junit4]   2> 436460 INFO  (TEST-SolrCloudExampleTest.testLoadDocsIntoGettingStartedCollection-seed#[76C97B9BB43F6867]) [    ] o.e.j.s.h.ContextHandler Started o.e.j.s.ServletContextHandler@1d061e8{/,null,AVAILABLE}
   [junit4]   2> 436460 INFO  (TEST-SolrCloudExampleTest.testLoadDocsIntoGettingStartedCollection-seed#[76C97B9BB43F6867]) [    ] o.e.j.s.ServerConnector Started ServerConnector@e0466e{HTTP/1.1}{127.0.0.1:54791}
   [junit4]   2> 436460 INFO  (TEST-SolrCloudExampleTest.testLoadDocsIntoGettingStartedCollection-seed#[76C97B9BB43F6867]) [    ] o.e.j.s.Server Started @437873ms
   [junit4]   2> 436460 INFO  (TEST-SolrCloudExampleTest.testLoadDocsIntoGettingStartedCollection-seed#[76C97B9BB43F6867]) [    ] o.a.s.c.s.e.JettySolrRunner Jetty properties: {solr.data.dir=/home/jenkins/workspace/Lucene-Solr-5.x-Linux/solr/build/solr-core/test/J0/temp/solr.cloud.SolrCloudExampleTest_76C97B9BB43F6867-001/tempDir-001/jetty1, solrconfig=solrconfig.xml, hostContext=/, hostPort=54791, coreRootDirectory=/home/jenkins/workspace/Lucene-Solr-5.x-Linux/solr/build/solr-core/test/J0/temp/solr.cloud.SolrCloudExampleTest_76C97B9BB43F6867-001/shard-1-001/cores}
   [junit4]   2> 436461 INFO  (TEST-SolrCloudExampleTest.testLoadDocsIntoGettingStartedCollection-seed#[76C97B9BB43F6867]) [    ] o.a.s.s.SolrDispatchFilter SolrDispatchFilter.init(): sun.misc.Launcher$AppClassLoader@1fe3ee3
   [junit4]   2> 436461 INFO  (TEST-SolrCloudExampleTest.testLoadDocsIntoGettingStartedCollection-seed#[76C97B9BB43F6867]) [    ] o.a.s.c.SolrResourceLoader new SolrResourceLoader for directory: '/home/jenkins/workspace/Lucene-Solr-5.x-Linux/solr/build/solr-core/test/J0/temp/solr.cloud.SolrCloudExampleTest_76C97B9BB43F6867-001/shard-1-001/'
   [junit4]   2> 436473 INFO  (TEST-SolrCloudExampleTest.testLoadDocsIntoGettingStartedCollection-seed#[76C97B9BB43F6867]) [    ] o.a.s.c.c.SolrZkClient Using default ZkCredentialsProvider
   [junit4]   2> 436473 INFO  (TEST-SolrCloudExampleTest.testLoadDocsIntoGettingStartedCollection-seed#[76C97B9BB43F6867]) [    ] o.a.s.c.c.ConnectionManager Waiting for client to connect to ZooKeeper
   [junit4]   2> 436475 INFO  (zkCallback-205-thread-1) [    ] o.a.s.c.c.ConnectionManager Watcher org.apache.solr.common.cloud.ConnectionManager@1f08674 name:ZooKeeperConnection Watcher:127.0.0.1:38183/solr got event WatchedEvent state:SyncConnected type:None path:null path:null type:None
   [junit4]   2> 436475 INFO  (TEST-SolrCloudExampleTest.testLoadDocsIntoGettingStartedCollection-seed#[76C97B9BB43F6867]) [    ] o.a.s.c.c.ConnectionManager Client is connected to ZooKeeper
   [junit4]   2> 436475 INFO  (TEST-SolrCloudExampleTest.testLoadDocsIntoGettingStartedCollection-seed#[76C97B9BB43F6867]) [    ] o.a.s.c.c.SolrZkClient Using default ZkACLProvider
   [junit4]   2> 436476 INFO  (TEST-SolrCloudExampleTest.testLoadDocsIntoGettingStartedCollection-seed#[76C97B9BB43F6867]) [    ] o.a.s.s.SolrDispatchFilter Loading solr.xml from SolrHome (not found in ZooKeeper)
   [junit4]   2> 436477 INFO  (TEST-SolrCloudExampleTest.testLoadDocsIntoGettingStartedCollection-seed#[76C97B9BB43F6867]) [    ] o.a.s.c.SolrXmlConfig Loading container configuration from /home/jenkins/workspace/Lucene-Solr-5.x-Linux/solr/build/solr-core/test/J0/temp/solr.cloud.SolrCloudExampleTest_76C97B9BB43F6867-001/shard-1-001/solr.xml
   [junit4]   2> 436481 INFO  (TEST-SolrCloudExampleTest.testLoadDocsIntoGettingStartedCollection-seed#[76C97B9BB43F6867]) [    ] o.a.s.c.CoresLocator Config-defined core root directory: /home/jenkins/workspace/Lucene-Solr-5.x-Linux/solr/build/solr-core/test/J0/temp/solr.cloud.SolrCloudExampleTest_76C97B9BB43F6867-001/shard-1-001/cores
   [junit4]   2> 436481 INFO  (TEST-SolrCloudExampleTest.testLoadDocsIntoGettingStartedCollection-seed#[76C97B9BB43F6867]) [    ] o.a.s.c.CoreContainer New CoreContainer 14286935
   [junit4]   2> 436481 INFO  (TEST-SolrCloudExampleTest.testLoadDocsIntoGettingStartedCollection-seed#[76C97B9BB43F6867]) [    ] o.a.s.c.CoreContainer Loading cores into CoreContainer [instanceDir=/home/jenkins/workspace/Lucene-Solr-5.x-Linux/solr/build/solr-core/test/J0/temp/solr.cloud.SolrCloudExampleTest_76C97B9BB43F6867-001/shard-1-001/]
   [junit4]   2> 436481 INFO  (TEST-SolrCloudExampleTest.testLoadDocsIntoGettingStartedCollection-seed#[76C97B9BB43F6867]) [    ] o.a.s.c.CoreContainer loading shared library: /home/jenkins/workspace/Lucene-Solr-5.x-Linux/solr/build/solr-core/test/J0/temp/solr.cloud.SolrCloudExampleTest_76C97B9BB43F6867-001/shard-1-001/lib
   [junit4]   2> 436481 WARN  (TEST-SolrCloudExampleTest.testLoadDocsIntoGettingStartedCollection-seed#[76C97B9BB43F6867]) [    ] o.a.s.c.SolrResourceLoader Can't find (or read) directory to add to classloader: lib (resolved as: /home/jenkins/workspace/Lucene-Solr-5.x-Linux/solr/build/solr-core/test/J0/temp/solr.cloud.SolrCloudExampleTest_76C97B9BB43F6867-001/shard-1-001/lib).
   [junit4]   2> 436487 INFO  (TEST-SolrCloudExampleTest.testLoadDocsIntoGettingStartedCollection-seed#[76C97B9BB43F6867]) [    ] o.a.s.h.c.HttpShardHandlerFactory created with socketTimeout : 90000,urlScheme : ,connTimeout : 15000,maxConnectionsPerHost : 20,maxConnections : 10000,corePoolSize : 0,maximumPoolSize : 2147483647,maxThreadIdleTime : 5,sizeOfQueue : -1,fairnessPolicy : false,useRetries : false,
   [junit4]   2> 436488 INFO  (TEST-SolrCloudExampleTest.testLoadDocsIntoGettingStartedCollection-seed#[76C97B9BB43F6867]) [    ] o.a.s.u.UpdateShardHandler Creating UpdateShardHandler HTTP client with params: socketTimeout=340000&connTimeout=45000&retry=true
   [junit4]   2> 436488 INFO  (TEST-SolrCloudExampleTest.testLoadDocsIntoGettingStartedCollection-seed#[76C97B9BB43F6867]) [    ] o.a.s.l.LogWatcher SLF4J impl is org.slf4j.impl.Log4jLoggerFactory
   [junit4]   2> 436488 INFO  (TEST-SolrCloudExampleTest.testLoadDocsIntoGettingStartedCollection-seed#[76C97B9BB43F6867]) [    ] o.a.s.l.LogWatcher Registering Log Listener [Log4j (org.slf4j.impl.Log4jLoggerFactory)]
   [junit4]   2> 436488 INFO  (TEST-SolrCloudExampleTest.testLoadDocsIntoGettingStartedCollection-seed#[76C97B9BB43F6867]) [    ] o.a.s.c.ZkContainer Zookeeper client=127.0.0.1:38183/solr
   [junit4]   2> 436488 INFO  (TEST-SolrCloudExampleTest.testLoadDocsIntoGettingStartedCollection-seed#[76C97B9BB43F6867]) [    ] o.a.s.c.ZkController zkHost includes chroot
   [junit4]   2> 436488 INFO  (TEST-SolrCloudExampleTest.testLoadDocsIntoGettingStartedCollection-seed#[76C97B9BB43F6867]) [    ] o.a.s.c.c.SolrZkClient Using default ZkCredentialsProvider
   [junit4]   2> 436489 INFO  (TEST-SolrCloudExampleTest.testLoadDocsIntoGettingStartedCollection-seed#[76C97B9BB43F6867]) [    ] o.a.s.c.c.ConnectionManager Waiting for client to connect to ZooKeeper
   [junit4]   2> 436490 INFO  (zkCallback-207-thread-1) [    ] o.a.s.c.c.ConnectionManager Watcher org.apache.solr.common.cloud.ConnectionManager@1ed259 name:ZooKeeperConnection Watcher:127.0.0.1:38183 got event WatchedEvent state:SyncConnected type:None path:null path:null type:None
   [junit4]   2> 436491 INFO  (TEST-SolrCloudExampleTest.testLoadDocsIntoGettingStartedCollection-seed#[76C97B9BB43F6867]) [    ] o.a.s.c.c.ConnectionManager Client is connected to ZooKeeper
   [junit4]   2> 436491 INFO  (TEST-SolrCloudExampleTest.testLoadDocsIntoGettingStartedCollection-seed#[76C97B9BB43F6867]) [    ] o.a.s.c.c.SolrZkClient Using default ZkACLProvider
   [junit4]   2> 436492 INFO  (TEST-SolrCloudExampleTest.testLoadDocsIntoGettingStartedCollection-seed#[76C97B9BB43F6867]) [n:127.0.0.1:54791_    ] o.a.s.c.c.ConnectionManager Waiting for client to connect to ZooKeeper
   [junit4]   2> 436494 INFO  (zkCallback-208-thread-1-processing-n:127.0.0.1:54791_) [n:127.0.0.1:54791_    ] o.a.s.c.c.ConnectionManager Watcher org.apache.solr.common.cloud.ConnectionManager@49ccbc name:ZooKeeperConnection Watcher:127.0.0.1:38183/solr got event WatchedEvent state:SyncConnected type:None path:null path:null type:None
   [junit4]   2> 436494 INFO  (TEST-SolrCloudExampleTest.testLoadDocsIntoGettingStartedCollection-seed#[76C97B9BB43F6867]) [n:127.0.0.1:54791_    ] o.a.s.c.c.ConnectionManager Client is connected to ZooKeeper
   [junit4]   2> 436496 INFO  (TEST-SolrCloudExampleTest.testLoadDocsIntoGettingStartedCollection-seed#[76C97B9BB43F6867]) [n:127.0.0.1:54791_    ] o.a.s.c.c.ZkStateReader Updating cluster state from ZooKeeper... 
   [junit4]   2> 437499 INFO  (TEST-SolrCloudExampleTest.testLoadDocsIntoGettingStartedCollection-seed#[76C97B9BB43F6867]) [n:127.0.0.1:54791_    ] o.a.s.c.ZkController Register node as live in ZooKeeper:/live_nodes/127.0.0.1:54791_
   [junit4]   2> 437499 INFO  (TEST-SolrCloudExampleTest.testLoadDocsIntoGettingStartedCollection-seed#[76C97B9BB43F6867]) [n:127.0.0.1:54791_    ] o.a.s.c.c.SolrZkClient makePath: /live_nodes/127.0.0.1:54791_
   [junit4]   2> 437500 INFO  (zkCallback-204-thread-1) [    ] o.a.s.c.c.ZkStateReader A live node change: WatchedEvent state:SyncConnected type:NodeChildrenChanged path:/live_nodes, has occurred - updating... (live nodes size: 1)
   [junit4]   2> 437500 INFO  (zkCallback-208-thread-1-processing-n:127.0.0.1:54791_) [n:127.0.0.1:54791_    ] o.a.s.c.c.ZkStateReader A live node change: WatchedEvent state:SyncConnected type:NodeChildrenChanged path:/live_nodes, has occurred - updating... (live nodes size: 1)
   [junit4]   2> 437500 INFO  (zkCallback-202-thread-1-processing-n:127.0.0.1:60446_) [n:127.0.0.1:60446_    ] o.a.s.c.c.ZkStateReader A live node change: WatchedEvent state:SyncConnected type:NodeChildrenChanged path:/live_nodes, has occurred - updating... (live nodes size: 1)
   [junit4]   2> 437501 INFO  (TEST-SolrCloudExampleTest.testLoadDocsIntoGettingStartedCollection-seed#[76C97B9BB43F6867]) [n:127.0.0.1:54791_    ] o.a.s.c.Overseer Overseer (id=null) closing
   [junit4]   2> 437501 INFO  (TEST-SolrCloudExampleTest.testLoadDocsIntoGettingStartedCollection-seed#[76C97B9BB43F6867]) [n:127.0.0.1:54791_    ] o.a.s.c.LeaderElector Joined leadership election with path: /overseer_elect/election/94348470581788680-127.0.0.1:54791_-n_0000000001
   [junit4]   2> 437502 INFO  (TEST-SolrCloudExampleTest.testLoadDocsIntoGettingStartedCollection-seed#[76C97B9BB43F6867]) [n:127.0.0.1:54791_    ] o.a.s.c.LeaderElector Watching path /overseer_elect/election/94348470581788676-127.0.0.1:60446_-n_0000000000 to know if I could be the leader
   [junit4]   2> 437540 INFO  (TEST-SolrCloudExampleTest.testLoadDocsIntoGettingStartedCollection-seed#[76C97B9BB43F6867]) [n:127.0.0.1:54791_    ] o.a.s.c.CoreContainer Security conf doesn't exist. Skipping setup for authorization module.
   [junit4]   2> 437540 INFO  (TEST-SolrCloudExampleTest.testLoadDocsIntoGettingStartedCollection-seed#[76C97B9BB43F6867]) [n:127.0.0.1:54791_    ] o.a.s.c.CoreContainer No authentication plugin used.
   [junit4]   2> 437541 INFO  (TEST-SolrCloudExampleTest.testLoadDocsIntoGettingStartedCollection-seed#[76C97B9BB43F6867]) [n:127.0.0.1:54791_    ] o.a.s.c.CoresLocator Looking for core definitions underneath /home/jenkins/workspace/Lucene-Solr-5.x-Linux/solr/build/solr-core/test/J0/temp/solr.cloud.SolrCloudExampleTest_76C97B9BB43F6867-001/shard-1-001/cores
   [junit4]   2> 437541 INFO  (TEST-SolrCloudExampleTest.testLoadDocsIntoGettingStartedCollection-seed#[76C97B9BB43F6867]) [n:127.0.0.1:54791_    ] o.a.s.c.SolrCore Created CoreDescriptor: {name=collection1, config=solrconfig.xml, transient=false, schema=schema.xml, loadOnStartup=true, configSetProperties=configsetprops.json, instanceDir=/home/jenkins/workspace/Lucene-Solr-5.x-Linux/solr/build/solr-core/test/J0/temp/solr.cloud.SolrCloudExampleTest_76C97B9BB43F6867-001/shard-1-001/cores/collection1, collection=collection1, absoluteInstDir=/home/jenkins/workspace/Lucene-Solr-5.x-Linux/solr/build/solr-core/test/J0/temp/solr.cloud.SolrCloudExampleTest_76C97B9BB43F6867-001/shard-1-001/cores/collection1/, coreNodeName=, dataDir=data/, shard=}
   [junit4]   2> 437542 INFO  (TEST-SolrCloudExampleTest.testLoadDocsIntoGettingStartedCollection-seed#[76C97B9BB43F6867]) [n:127.0.0.1:54791_    ] o.a.s.c.CoresLocator Found core collection1 in /home/jenkins/workspace/Lucene-Solr-5.x-Linux/solr/build/solr-core/test/J0/temp/solr.cloud.SolrCloudExampleTest_76C97B9BB43F6867-001/shard-1-001/cores/collection1/
   [junit4]   2> 437542 INFO  (TEST-SolrCloudExampleTest.testLoadDocsIntoGettingStartedCollection-seed#[76C97B9BB43F6867]) [n:127.0.0.1:54791_    ] o.a.s.c.CoresLocator Found 1 core definitions
   [junit4]   2> 437542 INFO  (coreLoadExecutor-1013-thread-1-processing-n:127.0.0.1:54791_) [n:127.0.0.1:54791_ c:collection1   x:collection1] o.a.s.c.ZkController publishing state=down
   [junit4]   2> 437542 INFO  (TEST-SolrCloudExampleTest.testLoadDocsIntoGettingStartedCollection-seed#[76C97B9BB43F6867]) [n:127.0.0.1:54791_    ] o.a.s.s.SolrDispatchFilter user.dir=/home/jenkins/workspace/Lucene-Solr-5.x-Linux/solr/build/solr-core/test/J0
   [junit4]   2> 437543 INFO  (TEST-SolrCloudExampleTest.testLoadDocsIntoGettingStartedCollection-seed#[76C97B9BB43F6867]) [n:127.0.0.1:54791_    ] o.a.s.s.SolrDispatchFilter SolrDispatchFilter.init() done
   [junit4]   2> 437543 INFO  (coreLoadExecutor-1013-thread-1-processing-n:127.0.0.1:54791_) [n:127.0.0.1:54791_ c:collection1   x:collection1] o.a.s.c.ZkController numShards not found on descriptor - reading it from system property
   [junit4]   2> 437544 INFO  (zkCallback-202-thread-1-processing-n:127.0.0.1:60446_) [n:127.0.0.1:60446_    ] o.a.s.c.DistributedQueue NodeChildrenChanged fired on path /overseer/queue state SyncConnected
   [junit4]   2> 437544 INFO  (coreLoadExecutor-1013-thread-1-processing-n:127.0.0.1:54791_) [n:127.0.0.1:54791_ c:collection1   x:collection1] o.a.s.c.ZkController look for our core node name
   [junit4]   2> 437544 INFO  (OverseerStateUpdate-94348470581788676-127.0.0.1:60446_-n_0000000000) [n:127.0.0.1:60446_    ] o.a.s.c.Overseer processMessage: queueSize: 1, message = {
   [junit4]   2>   "core":"collection1",
   [junit4]   2>   "roles":null,
   [junit4]   2>   "base_url":"http://127.0.0.1:54791",
   [junit4]   2>   "node_name":"127.0.0.1:54791_",
   [junit4]   2>   "numShards":"2",
   [junit4]   2>   "state":"down",
   [junit4]   2>   "shard":null,
   [junit4]   2>   "collection":"collection1",
   [junit4]   2>   "operation":"state"} current state version: 3
   [junit4]   2> 437545 INFO  (OverseerStateUpdate-94348470581788676-127.0.0.1:60446_-n_0000000000) [n:127.0.0.1:60446_    ] o.a.s.c.o.ReplicaMutator Update state numShards=2 message={
   [junit4]   2>   "core":"collection1",
   [junit4]   2>   "roles":null,
   [junit4]   2>   "base_url":"http://127.0.0.1:54791",
   [junit4]   2>   "node_name":"127.0.0.1:54791_",
   [junit4]   2>   "numShards":"2",
   [junit4]   2>   "state":"down",
   [junit4]   2>   "shard":null,
   [junit4]   2>   "collection":"collection1",
   [junit4]   2>   "operation":"state"}
   [junit4]   2> 437545 INFO  (OverseerStateUpdate-94348470581788676-127.0.0.1:60446_-n_0000000000) [n:127.0.0.1:60446_    ] o.a.s.c.o.ClusterStateMutator building a new cName: collection1
   [junit4]   2> 437545 INFO  (OverseerStateUpdate-94348470581788676-127.0.0.1:60446_-n_0000000000) [n:127.0.0.1:60446_    ] o.a.s.c.o.ReplicaMutator Assigning new node to shard shard=shard2
   [junit4]   2> 437647 INFO  (zkCallback-204-thread-1) [    ] o.a.s.c.c.ZkStateReader A cluster state change: WatchedEvent state:SyncConnected type:NodeDataChanged path:/clusterstate.json, has occurred - updating... (live nodes size: 2)
   [junit4]   2> 437647 INFO  (zkCallback-208-thread-1-processing-n:127.0.0.1:54791_) [n:127.0.0.1:54791_    ] o.a.s.c.c.ZkStateReader A cluster state change: WatchedEvent state:SyncConnected type:NodeDataChanged path:/clusterstate.json, has occurred - updating... (live nodes size: 2)
   [junit4]   2> 437647 INFO  (zkCallback-202-thread-1-processing-n:127.0.0.1:60446_) [n:127.0.0.1:60446_    ] o.a.s.c.c.ZkStateReader A cluster state change: WatchedEvent state:SyncConnected type:NodeDataChanged path:/clusterstate.json, has occurred - updating... (live nodes size: 2)
   [junit4]   2> 438544 INFO  (coreLoadExecutor-1013-thread-1-processing-n:127.0.0.1:54791_) [n:127.0.0.1:54791_ c:collection1   x:collection1] o.a.s.c.ZkController waiting to find shard id in clusterstate for collection1
   [junit4]   2> 438544 INFO  (coreLoadExecutor-1013-thread-1-processing-n:127.0.0.1:54791_) [n:127.0.0.1:54791_ c:collection1   x:collection1] o.a.s.c.ZkController Check for collection zkNode:collection1
   [junit4]   2> 438545 INFO  (coreLoadExecutor-1013-thread-1-processing-n:127.0.0.1:54791_) [n:127.0.0.1:54791_ c:collection1   x:collection1] o.a.s.c.ZkController Collection zkNode exists
   [junit4]   2> 438545 INFO  (coreLoadExecutor-1013-thread-1-processing-n:127.0.0.1:54791_) [n:127.0.0.1:54791_ c:collection1   x:collection1] o.a.s.c.c.ZkStateReader Load collection config from:/collections/collection1
   [junit4]   2> 438545 INFO  (coreLoadExecutor-1013-thread-1-processing-n:127.0.0.1:54791_) [n:127.0.0.1:54791_ c:collection1   x:collection1] o.a.s.c.c.ZkStateReader path=/collections/collection1 configName=conf1 specified config exists in ZooKeeper
   [junit4]   2> 438546 INFO  (coreLoadExecutor-1013-thread-1-processing-n:127.0.0.1:54791_) [n:127.0.0.1:54791_ c:collection1   x:collection1] o.a.s.c.SolrResourceLoader new SolrResourceLoader for directory: '/home/jenkins/workspace/Lucene-Solr-5.x-Linux/solr/build/solr-core/test/J0/temp/solr.cloud.SolrCloudExampleTest_76C97B9BB43F6867-001/shard-1-001/cores/collection1/'
   [junit4]   2> 438557 INFO  (coreLoadExecutor-1013-thread-1-processing-n:127.0.0.1:54791_) [n:127.0.0.1:54791_ c:collection1   x:collection1] o.a.s.c.Config loaded config solrconfig.xml with version 0 
   [junit4]   2> 438561 INFO  (coreLoadExecutor-1013-thread-1-processing-n:127.0.0.1:54791_) [n:127.0.0.1:54791_ c:collection1   x:collection1] o.a.s.c.SolrConfig current version of requestparams : -1
   [junit4]   2> 438564 INFO  (coreLoadExecutor-1013-thread-1-processing-n:127.0.0.1:54791_) [n:127.0.0.1:54791_ c:collection1   x:collection1] o.a.s.c.SolrConfig Using Lucene MatchVersion: 5.4.0
   [junit4]   2> 438574 INFO  (coreLoadExecutor-1013-thread-1-processing-n:127.0.0.1:54791_) [n:127.0.0.1:54791_ c:collection1   x:collection1] o.a.s.c.Config Loaded SolrConfig: solrconfig.xml
   [junit4]   2> 438575 INFO  (coreLoadExecutor-1013-thread-1-processing-n:127.0.0.1:54791_) [n:127.0.0.1:54791_ c:collection1   x:collection1] o.a.s.s.IndexSchema Reading Solr Schema from /configs/conf1/schema.xml
   [junit4]   2> 438580 INFO  (coreLoadExecutor-1013-thread-1-processing-n:127.0.0.1:54791_) [n:127.0.0.1:54791_ c:collection1   x:collection1] o.a.s.s.IndexSchema [collection1] Schema name=test
   [junit4]   2> 438648 INFO  (coreLoadExecutor-1013-thread-1-processing-n:127.0.0.1:54791_) [n:127.0.0.1:54791_ c:collection1   x:collection1] o.a.s.s.OpenExchangeRatesOrgProvider Initialized with rates=open-exchange-rates.json, refreshInterva

[...truncated too long message...]

at org.apache.solr.common.cloud.ZkCmdExecutor.retryOperation(ZkCmdExecutor.java:61)
   [junit4]   2> 	at org.apache.solr.common.cloud.SolrZkClient.getData(SolrZkClient.java:342)
   [junit4]   2> 	at org.apache.solr.common.cloud.ZkStateReader.getClusterProps(ZkStateReader.java:730)
   [junit4]   2> 	... 3 more
   [junit4]   2> 
   [junit4]   2> 873382 INFO  (OverseerStateUpdate-94348491784912917-127.0.0.1:48147_-n_0000000004) [n:127.0.0.1:48147_    ] o.a.s.c.Overseer Overseer Loop exiting : 127.0.0.1:48147_
   [junit4]   2> 873393 INFO  (zkCallback-936-thread-5-processing-n:127.0.0.1:48147_) [n:127.0.0.1:48147_    ] o.a.s.c.c.ZkStateReader A live node change: WatchedEvent state:SyncConnected type:NodeChildrenChanged path:/live_nodes, has occurred - updating... (live nodes size: 1)
   [junit4]   2> 873393 WARN  (zkCallback-936-thread-5-processing-n:127.0.0.1:48147_) [n:127.0.0.1:48147_    ] o.a.s.c.c.ZkStateReader ZooKeeper watch triggered, but Solr cannot talk to ZK
   [junit4]   2> 873394 INFO  (TEST-CollectionsAPIDistributedZkTest.test-seed#[76C97B9BB43F6867]) [    ] o.e.j.s.ServerConnector Stopped ServerConnector@76e0dc{SSL-http/1.1}{127.0.0.1:0}
   [junit4]   2> 873394 INFO  (TEST-CollectionsAPIDistributedZkTest.test-seed#[76C97B9BB43F6867]) [    ] o.e.j.s.h.ContextHandler Stopped o.e.j.s.ServletContextHandler@9f81eb{/,null,UNAVAILABLE}
   [junit4]   2> 873397 INFO  (TEST-CollectionsAPIDistributedZkTest.test-seed#[76C97B9BB43F6867]) [n:127.0.0.1:48147_ c:acollectionafterbaddelete s:shard1 r:core_node2 x:acollectionafterbaddelete_shard1_replica1] o.a.s.c.ZkTestServer connecting to 127.0.0.1:37503 37503
   [junit4]   2> 873403 INFO  (Thread-2480) [n:127.0.0.1:40607_ c:awholynewcollection_0 s:shard2 r:core_node4 x:awholynewcollection_0_shard2_replica1] o.a.s.c.ZkTestServer connecting to 127.0.0.1:37503 37503
   [junit4]   2> 873404 WARN  (Thread-2480) [n:127.0.0.1:40607_ c:awholynewcollection_0 s:shard2 r:core_node4 x:awholynewcollection_0_shard2_replica1] o.a.s.c.ZkTestServer Watch limit violations: 
   [junit4]   2> Maximum concurrent create/delete watches above limit:
   [junit4]   2> 
   [junit4]   2> 	5	/solr/configs/conf2
   [junit4]   2> 	5	/solr/aliases.json
   [junit4]   2> 
   [junit4]   2> Maximum concurrent data watches above limit:
   [junit4]   2> 
   [junit4]   2> 	32	/solr/collections/awholynewstresscollection_collection1_0/state.json
   [junit4]   2> 	24	/solr/collections/awholynewstresscollection_collection0_0/state.json
   [junit4]   2> 	5	/solr/collections/halfdeletedcollection2/state.json
   [junit4]   2> 	5	/solr/clusterstate.json
   [junit4]   2> 	3	/solr/collections/nodes_used_collection/state.json
   [junit4]   2> 	3	/solr/collections/collection1/state.json
   [junit4]   2> 	2	/solr/collections/acollectionafterbaddelete/state.json
   [junit4]   2> 	2	/solr/collections/halfdeletedcollection/state.json
   [junit4]   2> 	2	/solr/collections/awholynewcollection_2/state.json
   [junit4]   2> 
   [junit4]   2> Maximum concurrent children watches above limit:
   [junit4]   2> 
   [junit4]   2> 	5	/solr/live_nodes
   [junit4]   2> 
   [junit4]   2> NOTE: reproduce with: ant test  -Dtestcase=CollectionsAPIDistributedZkTest -Dtests.method=test -Dtests.seed=76C97B9BB43F6867 -Dtests.multiplier=3 -Dtests.slow=true -Dtests.locale=es_PR -Dtests.timezone=Africa/Kampala -Dtests.asserts=true -Dtests.file.encoding=ISO-8859-1
   [junit4] ERROR    115s J1 | CollectionsAPIDistributedZkTest.test <<<
   [junit4]    > Throwable #1: org.apache.solr.client.solrj.impl.HttpSolrClient$RemoteSolrException: Error from server at https://127.0.0.1:46943: Could not fully remove collection: halfdeletedcollection2
   [junit4]    > 	at __randomizedtesting.SeedInfo.seed([76C97B9BB43F6867:FE9D44411AC3059F]:0)
   [junit4]    > 	at org.apache.solr.client.solrj.impl.HttpSolrClient.executeMethod(HttpSolrClient.java:560)
   [junit4]    > 	at org.apache.solr.client.solrj.impl.HttpSolrClient.request(HttpSolrClient.java:234)
   [junit4]    > 	at org.apache.solr.client.solrj.impl.HttpSolrClient.request(HttpSolrClient.java:226)
   [junit4]    > 	at org.apache.solr.client.solrj.SolrClient.request(SolrClient.java:1220)
   [junit4]    > 	at org.apache.solr.cloud.CollectionsAPIDistributedZkTest.makeRequest(CollectionsAPIDistributedZkTest.java:302)
   [junit4]    > 	at org.apache.solr.cloud.CollectionsAPIDistributedZkTest.deleteCollectionWithDownNodes(CollectionsAPIDistributedZkTest.java:283)
   [junit4]    > 	at org.apache.solr.cloud.CollectionsAPIDistributedZkTest.test(CollectionsAPIDistributedZkTest.java:175)
   [junit4]    > 	at org.apache.solr.BaseDistributedSearchTestCase$ShardsRepeatRule$ShardsFixedStatement.callStatement(BaseDistributedSearchTestCase.java:963)
   [junit4]    > 	at org.apache.solr.BaseDistributedSearchTestCase$ShardsRepeatRule$ShardsStatement.evaluate(BaseDistributedSearchTestCase.java:938)
   [junit4]    > 	at java.lang.Thread.run(Thread.java:745)
   [junit4]   2> 873411 INFO  (SUITE-CollectionsAPIDistributedZkTest-seed#[76C97B9BB43F6867]-worker) [n:127.0.0.1:48147_ c:acollectionafterbaddelete s:shard1 r:core_node2 x:acollectionafterbaddelete_shard1_replica1] o.a.s.SolrTestCaseJ4 ###deleteCore
   [junit4]   2> NOTE: leaving temporary files on disk at: /home/jenkins/workspace/Lucene-Solr-5.x-Linux/solr/build/solr-core/test/J1/temp/solr.cloud.CollectionsAPIDistributedZkTest_76C97B9BB43F6867-001
   [junit4]   2> Aug 15, 2015 1:04:09 PM com.carrotsearch.randomizedtesting.ThreadLeakControl checkThreadLeaks
   [junit4]   2> WARNING: Will linger awaiting termination of 2 leaked thread(s).
   [junit4]   2> NOTE: test params are: codec=Asserting(Lucene53): {other_tl1=FSTOrd50, range_facet_l_dv=PostingsFormat(name=LuceneFixedGap), _version_=FSTOrd50, multiDefault=PostingsFormat(name=Direct), a_t=PostingsFormat(name=Direct), intDefault=FSTOrd50, a_i1=PostingsFormat(name=Direct), id=PostingsFormat(name=LuceneFixedGap), range_facet_i_dv=PostingsFormat(name=Direct), text=PostingsFormat(name=Memory doPackFST= true), range_facet_l=PostingsFormat(name=Direct), timestamp=PostingsFormat(name=Direct)}, docValues:{range_facet_l_dv=DocValuesFormat(name=Direct), range_facet_i_dv=DocValuesFormat(name=Asserting), timestamp=DocValuesFormat(name=Asserting)}, sim=DefaultSimilarity, locale=es_PR, timezone=Africa/Kampala
   [junit4]   2> NOTE: Linux 3.16.0-44-generic i386/Oracle Corporation 1.9.0-ea (32-bit)/cpus=12,threads=1,free=207525296,total=369360896
   [junit4]   2> NOTE: All tests run in this JVM: [HdfsCollectionsAPIDistributedZkTest, TestReqParamsAPI, DistributedFacetPivotSmallTest, FieldMutatingUpdateProcessorTest, DistributedFacetPivotLargeTest, TestLMDirichletSimilarityFactory, TestCustomSort, SpellPossibilityIteratorTest, TestLMJelinekMercerSimilarityFactory, ScriptEngineTest, FacetPivotSmallTest, AsyncCallRequestStatusResponseTest, TestExceedMaxTermLength, CloudMLTQParserTest, ReturnFieldsTest, TestHashPartitioner, TestRuleBasedAuthorizationPlugin, ZkStateReaderTest, TestSchemaVersionResource, DirectSolrConnectionTest, CopyFieldTest, TestSortByMinMaxFunction, DistributedQueryComponentOptimizationTest, ShardRoutingTest, HdfsRecoveryZkTest, DistributedMLTComponentTest, TestAuthorizationFramework, TestLFUCache, CollectionsAPIAsyncDistributedZkTest, LeaderFailoverAfterPartitionTest, CurrencyFieldOpenExchangeTest, TestValueSourceCache, TestFieldTypeResource, DistributedQueueTest, TestRemoveLastDynamicCopyField, EchoParamsTest, TestLRUCache, CacheHeaderTest, SSLMigrationTest, TestBulkSchemaAPI, FileUtilsTest, TestManagedSchemaFieldResource, TestInitQParser, TestIndexSearcher, TestFastLRUCache, HdfsDirectoryTest, FieldAnalysisRequestHandlerTest, TestTolerantSearch, BadComponentTest, TestCoreDiscovery, TestSuggestSpellingConverter, TestEmbeddedSolrServerConstructors, UpdateParamsTest, OutOfBoxZkACLAndCredentialsProvidersTest, TestReplicaProperties, DisMaxRequestHandlerTest, AnalyticsQueryTest, TestScoreJoinQPScore, DistributedFacetPivotSmallAdvancedTest, TestSearchPerf, TestFoldingMultitermQuery, DocValuesMissingTest, AlternateDirectoryTest, TestFiltering, TestRandomRequestDistribution, TestMaxScoreQueryParser, AddSchemaFieldsUpdateProcessorFactoryTest, SuggestComponentTest, TestJsonRequest, BufferStoreTest, TestRecoveryHdfs, ResourceLoaderTest, HLLUtilTest, RankQueryTest, TestLeaderElectionZkExpiry, ClusterStateUpdateTest, JsonLoaderTest, DistributedTermsComponentTest, TestSolrConfigHandlerCloud, DocValuesMultiTest, CollectionReloadTest, DistribCursorPagingTest, SpellCheckComponentTest, TestMissingGroups, TestCollationFieldDocValues, HdfsWriteToMultipleCollectionsTest, SolrXmlInZkTest, BasicFunctionalityTest, BasicDistributedZkTest, CollectionsAPIDistributedZkTest]
   [junit4] Completed [274/533] on J1 in 115.67s, 1 test, 1 error <<< FAILURES!

[...truncated 802 lines...]
BUILD FAILED
/home/jenkins/workspace/Lucene-Solr-5.x-Linux/build.xml:785: The following error occurred while executing this line:
/home/jenkins/workspace/Lucene-Solr-5.x-Linux/build.xml:729: The following error occurred while executing this line:
/home/jenkins/workspace/Lucene-Solr-5.x-Linux/build.xml:59: The following error occurred while executing this line:
/home/jenkins/workspace/Lucene-Solr-5.x-Linux/solr/build.xml:233: The following error occurred while executing this line:
/home/jenkins/workspace/Lucene-Solr-5.x-Linux/solr/common-build.xml:524: The following error occurred while executing this line:
/home/jenkins/workspace/Lucene-Solr-5.x-Linux/lucene/common-build.xml:1449: The following error occurred while executing this line:
/home/jenkins/workspace/Lucene-Solr-5.x-Linux/lucene/common-build.xml:1003: There were test failures: 533 suites, 2114 tests, 1 error, 1 failure, 67 ignored (31 assumptions)

Total time: 49 minutes 30 seconds
Build step 'Invoke Ant' marked build as failure
Archiving artifacts
[WARNINGS] Skipping publisher since build result is FAILURE
Recording test results
Email was triggered for: Failure - Any
Sending email for trigger: Failure - Any



Mime
View raw message