lucene-dev mailing list archives

Site index · List index
Message view « Date » · « Thread »
Top « Date » · « Thread »
From Apache Jenkins Server <jenk...@builds.apache.org>
Subject [JENKINS] Lucene-Solr-Tests-5.x-Java7 - Build # 3404 - Failure
Date Fri, 07 Aug 2015 21:23:52 GMT
Build: https://builds.apache.org/job/Lucene-Solr-Tests-5.x-Java7/3404/

1 tests failed.
FAILED:  org.apache.solr.search.TestSolrQueryParser.testFilter

Error Message:
Query SortedIntDocSetTopFilter does not implement createWeight

Stack Trace:
java.lang.UnsupportedOperationException: Query SortedIntDocSetTopFilter does not implement createWeight
	at __randomizedtesting.SeedInfo.seed([7DB87C7DA961ACAF:B56A19EB36688BF5]:0)
	at org.apache.lucene.search.Query.createWeight(Query.java:79)
	at org.apache.lucene.search.IndexSearcher.createWeight(IndexSearcher.java:855)
	at org.apache.lucene.search.ConstantScoreQuery.createWeight(ConstantScoreQuery.java:117)
	at org.apache.solr.query.FilterQuery.createWeight(FilterQuery.java:96)
	at org.apache.lucene.search.IndexSearcher.createWeight(IndexSearcher.java:855)
	at org.apache.lucene.search.BooleanWeight.<init>(BooleanWeight.java:56)
	at org.apache.lucene.search.BooleanQuery.createWeight(BooleanQuery.java:203)
	at org.apache.lucene.search.IndexSearcher.createWeight(IndexSearcher.java:855)
	at org.apache.lucene.search.IndexSearcher.createNormalizedWeight(IndexSearcher.java:838)
	at org.apache.lucene.search.IndexSearcher.search(IndexSearcher.java:486)
	at org.apache.solr.search.SolrIndexSearcher.getDocSetNC(SolrIndexSearcher.java:1259)
	at org.apache.solr.search.SolrIndexSearcher.getPositiveDocSet(SolrIndexSearcher.java:941)
	at org.apache.solr.search.SolrIndexSearcher.getProcessedFilter(SolrIndexSearcher.java:1103)
	at org.apache.solr.search.SolrIndexSearcher.getDocListNC(SolrIndexSearcher.java:1625)
	at org.apache.solr.search.SolrIndexSearcher.getDocListC(SolrIndexSearcher.java:1501)
	at org.apache.solr.search.SolrIndexSearcher.search(SolrIndexSearcher.java:555)
	at org.apache.solr.handler.component.QueryComponent.process(QueryComponent.java:522)
	at org.apache.solr.handler.component.SearchHandler.handleRequestBody(SearchHandler.java:277)
	at org.apache.solr.handler.RequestHandlerBase.handleRequest(RequestHandlerBase.java:143)
	at org.apache.solr.core.SolrCore.execute(SolrCore.java:2068)
	at org.apache.solr.util.TestHarness.query(TestHarness.java:320)
	at org.apache.solr.util.TestHarness.query(TestHarness.java:302)
	at org.apache.solr.SolrTestCaseJ4.assertJQ(SolrTestCaseJ4.java:831)
	at org.apache.solr.SolrTestCaseJ4.assertJQ(SolrTestCaseJ4.java:800)
	at org.apache.solr.search.TestSolrQueryParser.testFilter(TestSolrQueryParser.java:224)
	at sun.reflect.NativeMethodAccessorImpl.invoke0(Native Method)
	at sun.reflect.NativeMethodAccessorImpl.invoke(NativeMethodAccessorImpl.java:57)
	at sun.reflect.DelegatingMethodAccessorImpl.invoke(DelegatingMethodAccessorImpl.java:43)
	at java.lang.reflect.Method.invoke(Method.java:606)
	at com.carrotsearch.randomizedtesting.RandomizedRunner.invoke(RandomizedRunner.java:1627)
	at com.carrotsearch.randomizedtesting.RandomizedRunner$6.evaluate(RandomizedRunner.java:836)
	at com.carrotsearch.randomizedtesting.RandomizedRunner$7.evaluate(RandomizedRunner.java:872)
	at com.carrotsearch.randomizedtesting.RandomizedRunner$8.evaluate(RandomizedRunner.java:886)
	at com.carrotsearch.randomizedtesting.rules.SystemPropertiesRestoreRule$1.evaluate(SystemPropertiesRestoreRule.java:57)
	at org.apache.lucene.util.TestRuleSetupTeardownChained$1.evaluate(TestRuleSetupTeardownChained.java:50)
	at org.apache.lucene.util.AbstractBeforeAfterRule$1.evaluate(AbstractBeforeAfterRule.java:46)
	at org.apache.lucene.util.TestRuleThreadAndTestName$1.evaluate(TestRuleThreadAndTestName.java:49)
	at org.apache.lucene.util.TestRuleIgnoreAfterMaxFailures$1.evaluate(TestRuleIgnoreAfterMaxFailures.java:65)
	at org.apache.lucene.util.TestRuleMarkFailure$1.evaluate(TestRuleMarkFailure.java:48)
	at com.carrotsearch.randomizedtesting.rules.StatementAdapter.evaluate(StatementAdapter.java:36)
	at com.carrotsearch.randomizedtesting.ThreadLeakControl$StatementRunner.run(ThreadLeakControl.java:365)
	at com.carrotsearch.randomizedtesting.ThreadLeakControl.forkTimeoutingTask(ThreadLeakControl.java:798)
	at com.carrotsearch.randomizedtesting.ThreadLeakControl$3.evaluate(ThreadLeakControl.java:458)
	at com.carrotsearch.randomizedtesting.RandomizedRunner.runSingleTest(RandomizedRunner.java:845)
	at com.carrotsearch.randomizedtesting.RandomizedRunner$3.evaluate(RandomizedRunner.java:747)
	at com.carrotsearch.randomizedtesting.RandomizedRunner$4.evaluate(RandomizedRunner.java:781)
	at com.carrotsearch.randomizedtesting.RandomizedRunner$5.evaluate(RandomizedRunner.java:792)
	at com.carrotsearch.randomizedtesting.rules.StatementAdapter.evaluate(StatementAdapter.java:36)
	at com.carrotsearch.randomizedtesting.rules.SystemPropertiesRestoreRule$1.evaluate(SystemPropertiesRestoreRule.java:57)
	at org.apache.lucene.util.AbstractBeforeAfterRule$1.evaluate(AbstractBeforeAfterRule.java:46)
	at com.carrotsearch.randomizedtesting.rules.StatementAdapter.evaluate(StatementAdapter.java:36)
	at org.apache.lucene.util.TestRuleStoreClassName$1.evaluate(TestRuleStoreClassName.java:42)
	at com.carrotsearch.randomizedtesting.rules.NoShadowingOrOverridesOnMethodsRule$1.evaluate(NoShadowingOrOverridesOnMethodsRule.java:39)
	at com.carrotsearch.randomizedtesting.rules.NoShadowingOrOverridesOnMethodsRule$1.evaluate(NoShadowingOrOverridesOnMethodsRule.java:39)
	at com.carrotsearch.randomizedtesting.rules.StatementAdapter.evaluate(StatementAdapter.java:36)
	at com.carrotsearch.randomizedtesting.rules.StatementAdapter.evaluate(StatementAdapter.java:36)
	at com.carrotsearch.randomizedtesting.rules.StatementAdapter.evaluate(StatementAdapter.java:36)
	at org.apache.lucene.util.TestRuleAssertionsRequired$1.evaluate(TestRuleAssertionsRequired.java:54)
	at org.apache.lucene.util.TestRuleMarkFailure$1.evaluate(TestRuleMarkFailure.java:48)
	at org.apache.lucene.util.TestRuleIgnoreAfterMaxFailures$1.evaluate(TestRuleIgnoreAfterMaxFailures.java:65)
	at org.apache.lucene.util.TestRuleIgnoreTestSuites$1.evaluate(TestRuleIgnoreTestSuites.java:55)
	at com.carrotsearch.randomizedtesting.rules.StatementAdapter.evaluate(StatementAdapter.java:36)
	at com.carrotsearch.randomizedtesting.ThreadLeakControl$StatementRunner.run(ThreadLeakControl.java:365)
	at java.lang.Thread.run(Thread.java:745)




Build Log:
[...truncated 10619 lines...]
   [junit4] Suite: org.apache.solr.search.TestSolrQueryParser
   [junit4]   2> Creating dataDir: /x1/jenkins/jenkins-slave/workspace/Lucene-Solr-Tests-5.x-Java7/solr/build/solr-core/test/J2/temp/solr.search.TestSolrQueryParser_7DB87C7DA961ACAF-001/init-core-data-001
   [junit4]   2> 776252 INFO  (SUITE-TestSolrQueryParser-seed#[7DB87C7DA961ACAF]-worker) [    ] o.a.s.SolrTestCaseJ4 Randomized ssl (false) and clientAuth (false)
   [junit4]   2> 776253 INFO  (SUITE-TestSolrQueryParser-seed#[7DB87C7DA961ACAF]-worker) [    ] o.a.s.SolrTestCaseJ4 ####initCore
   [junit4]   2> 776253 INFO  (SUITE-TestSolrQueryParser-seed#[7DB87C7DA961ACAF]-worker) [    ] o.a.s.c.SolrResourceLoader new SolrResourceLoader for directory: '/x1/jenkins/jenkins-slave/workspace/Lucene-Solr-Tests-5.x-Java7/solr/core/src/test-files/solr/collection1/'
   [junit4]   2> 776253 INFO  (SUITE-TestSolrQueryParser-seed#[7DB87C7DA961ACAF]-worker) [    ] o.a.s.c.SolrResourceLoader Adding 'file:/x1/jenkins/jenkins-slave/workspace/Lucene-Solr-Tests-5.x-Java7/solr/core/src/test-files/solr/collection1/lib/.svn/' to classloader
   [junit4]   2> 776254 INFO  (SUITE-TestSolrQueryParser-seed#[7DB87C7DA961ACAF]-worker) [    ] o.a.s.c.SolrResourceLoader Adding 'file:/x1/jenkins/jenkins-slave/workspace/Lucene-Solr-Tests-5.x-Java7/solr/core/src/test-files/solr/collection1/lib/classes/' to classloader
   [junit4]   2> 776290 INFO  (SUITE-TestSolrQueryParser-seed#[7DB87C7DA961ACAF]-worker) [    ] o.a.s.c.SolrResourceLoader Adding 'file:/x1/jenkins/jenkins-slave/workspace/Lucene-Solr-Tests-5.x-Java7/solr/core/src/test-files/solr/collection1/lib/README' to classloader
   [junit4]   2> 776387 INFO  (SUITE-TestSolrQueryParser-seed#[7DB87C7DA961ACAF]-worker) [    ] o.a.s.c.SolrConfig current version of requestparams : -1
   [junit4]   2> 776433 INFO  (SUITE-TestSolrQueryParser-seed#[7DB87C7DA961ACAF]-worker) [    ] o.a.s.c.SolrConfig Using Lucene MatchVersion: 5.4.0
   [junit4]   2> 776623 INFO  (SUITE-TestSolrQueryParser-seed#[7DB87C7DA961ACAF]-worker) [    ] o.a.s.c.Config Loaded SolrConfig: solrconfig.xml
   [junit4]   2> 776624 INFO  (SUITE-TestSolrQueryParser-seed#[7DB87C7DA961ACAF]-worker) [    ] o.a.s.s.IndexSchema Reading Solr Schema from /x1/jenkins/jenkins-slave/workspace/Lucene-Solr-Tests-5.x-Java7/solr/core/src/test-files/solr/collection1/conf/schema12.xml
   [junit4]   2> 776648 INFO  (SUITE-TestSolrQueryParser-seed#[7DB87C7DA961ACAF]-worker) [    ] o.a.s.s.IndexSchema [null] Schema name=test
   [junit4]   2> 777398 INFO  (SUITE-TestSolrQueryParser-seed#[7DB87C7DA961ACAF]-worker) [    ] o.a.s.s.IndexSchema default search field in schema is text
   [junit4]   2> 777400 INFO  (SUITE-TestSolrQueryParser-seed#[7DB87C7DA961ACAF]-worker) [    ] o.a.s.s.IndexSchema unique key field: id
   [junit4]   2> 777401 WARN  (SUITE-TestSolrQueryParser-seed#[7DB87C7DA961ACAF]-worker) [    ] o.a.s.s.IndexSchema Field text is not multivalued and destination for multiple copyFields (2)
   [junit4]   2> 777414 INFO  (SUITE-TestSolrQueryParser-seed#[7DB87C7DA961ACAF]-worker) [    ] o.a.s.s.FileExchangeRateProvider Reloading exchange rates from file currency.xml
   [junit4]   2> 777417 INFO  (SUITE-TestSolrQueryParser-seed#[7DB87C7DA961ACAF]-worker) [    ] o.a.s.s.FileExchangeRateProvider Reloading exchange rates from file currency.xml
   [junit4]   2> 777440 INFO  (SUITE-TestSolrQueryParser-seed#[7DB87C7DA961ACAF]-worker) [    ] o.a.s.c.SolrResourceLoader JNDI not configured for solr (NoInitialContextEx)
   [junit4]   2> 777441 INFO  (SUITE-TestSolrQueryParser-seed#[7DB87C7DA961ACAF]-worker) [    ] o.a.s.c.SolrResourceLoader using system property solr.solr.home: /x1/jenkins/jenkins-slave/workspace/Lucene-Solr-Tests-5.x-Java7/solr/core/src/test-files/solr
   [junit4]   2> 777441 INFO  (SUITE-TestSolrQueryParser-seed#[7DB87C7DA961ACAF]-worker) [    ] o.a.s.c.SolrResourceLoader new SolrResourceLoader for directory: '/x1/jenkins/jenkins-slave/workspace/Lucene-Solr-Tests-5.x-Java7/solr/core/src/test-files/solr/'
   [junit4]   2> 777470 INFO  (SUITE-TestSolrQueryParser-seed#[7DB87C7DA961ACAF]-worker) [    ] o.a.s.c.CoreContainer New CoreContainer 1590856224
   [junit4]   2> 777471 INFO  (SUITE-TestSolrQueryParser-seed#[7DB87C7DA961ACAF]-worker) [    ] o.a.s.c.CoreContainer Loading cores into CoreContainer [instanceDir=/x1/jenkins/jenkins-slave/workspace/Lucene-Solr-Tests-5.x-Java7/solr/core/src/test-files/solr/]
   [junit4]   2> 777471 INFO  (SUITE-TestSolrQueryParser-seed#[7DB87C7DA961ACAF]-worker) [    ] o.a.s.c.CoreContainer loading shared library: /x1/jenkins/jenkins-slave/workspace/Lucene-Solr-Tests-5.x-Java7/solr/core/src/test-files/solr/lib
   [junit4]   2> 777471 WARN  (SUITE-TestSolrQueryParser-seed#[7DB87C7DA961ACAF]-worker) [    ] o.a.s.c.SolrResourceLoader Can't find (or read) directory to add to classloader: lib (resolved as: /x1/jenkins/jenkins-slave/workspace/Lucene-Solr-Tests-5.x-Java7/solr/core/src/test-files/solr/lib).
   [junit4]   2> 777479 INFO  (SUITE-TestSolrQueryParser-seed#[7DB87C7DA961ACAF]-worker) [    ] o.a.s.h.c.HttpShardHandlerFactory created with socketTimeout : 600000,connTimeout : 60000,maxConnectionsPerHost : 20,maxConnections : 10000,corePoolSize : 0,maximumPoolSize : 2147483647,maxThreadIdleTime : 5,sizeOfQueue : -1,fairnessPolicy : false,useRetries : false,
   [junit4]   2> 777480 INFO  (SUITE-TestSolrQueryParser-seed#[7DB87C7DA961ACAF]-worker) [    ] o.a.s.u.UpdateShardHandler Creating UpdateShardHandler HTTP client with params: socketTimeout=30000&connTimeout=30000&retry=true
   [junit4]   2> 777481 INFO  (SUITE-TestSolrQueryParser-seed#[7DB87C7DA961ACAF]-worker) [    ] o.a.s.l.LogWatcher SLF4J impl is org.slf4j.impl.Log4jLoggerFactory
   [junit4]   2> 777481 INFO  (SUITE-TestSolrQueryParser-seed#[7DB87C7DA961ACAF]-worker) [    ] o.a.s.l.LogWatcher Registering Log Listener [Log4j (org.slf4j.impl.Log4jLoggerFactory)]
   [junit4]   2> 777481 INFO  (SUITE-TestSolrQueryParser-seed#[7DB87C7DA961ACAF]-worker) [    ] o.a.s.c.CoreContainer Security conf doesn't exist. Skipping setup for authorization module.
   [junit4]   2> 777481 INFO  (SUITE-TestSolrQueryParser-seed#[7DB87C7DA961ACAF]-worker) [    ] o.a.s.c.CoreContainer No authentication plugin used.
   [junit4]   2> 777482 INFO  (SUITE-TestSolrQueryParser-seed#[7DB87C7DA961ACAF]-worker) [    ] o.a.s.c.SolrCore Created CoreDescriptor: {configSetProperties=configsetprops.json, schema=schema12.xml, config=solrconfig.xml, shard=shard1, collection=collection1, loadOnStartup=true, transient=false, absoluteInstDir=/x1/jenkins/jenkins-slave/workspace/Lucene-Solr-Tests-5.x-Java7/solr/core/src/test-files/solr/collection1/, name=collection1, instanceDir=collection1, dataDir=/x1/jenkins/jenkins-slave/workspace/Lucene-Solr-Tests-5.x-Java7/solr/build/solr-core/test/J2/temp/solr.search.TestSolrQueryParser_7DB87C7DA961ACAF-001/init-core-data-001}
   [junit4]   2> 777494 INFO  (coreLoadExecutor-1937-thread-1) [    ] o.a.s.c.SolrResourceLoader new SolrResourceLoader for directory: '/x1/jenkins/jenkins-slave/workspace/Lucene-Solr-Tests-5.x-Java7/solr/core/src/test-files/solr/collection1/'
   [junit4]   2> 777519 INFO  (coreLoadExecutor-1937-thread-1) [    ] o.a.s.c.SolrResourceLoader Adding 'file:/x1/jenkins/jenkins-slave/workspace/Lucene-Solr-Tests-5.x-Java7/solr/core/src/test-files/solr/collection1/lib/.svn/' to classloader
   [junit4]   2> 777519 INFO  (coreLoadExecutor-1937-thread-1) [    ] o.a.s.c.SolrResourceLoader Adding 'file:/x1/jenkins/jenkins-slave/workspace/Lucene-Solr-Tests-5.x-Java7/solr/core/src/test-files/solr/collection1/lib/classes/' to classloader
   [junit4]   2> 777519 INFO  (coreLoadExecutor-1937-thread-1) [    ] o.a.s.c.SolrResourceLoader Adding 'file:/x1/jenkins/jenkins-slave/workspace/Lucene-Solr-Tests-5.x-Java7/solr/core/src/test-files/solr/collection1/lib/README' to classloader
   [junit4]   2> 777555 INFO  (coreLoadExecutor-1937-thread-1) [    ] o.a.s.c.SolrConfig current version of requestparams : -1
   [junit4]   2> 777603 INFO  (coreLoadExecutor-1937-thread-1) [    ] o.a.s.c.SolrConfig Using Lucene MatchVersion: 5.4.0
   [junit4]   2> 777713 INFO  (coreLoadExecutor-1937-thread-1) [    ] o.a.s.c.Config Loaded SolrConfig: solrconfig.xml
   [junit4]   2> 777713 INFO  (coreLoadExecutor-1937-thread-1) [    ] o.a.s.s.IndexSchema Reading Solr Schema from /x1/jenkins/jenkins-slave/workspace/Lucene-Solr-Tests-5.x-Java7/solr/core/src/test-files/solr/collection1/conf/schema12.xml
   [junit4]   2> 777728 INFO  (coreLoadExecutor-1937-thread-1) [    ] o.a.s.s.IndexSchema [collection1] Schema name=test
   [junit4]   2> 778327 INFO  (coreLoadExecutor-1937-thread-1) [    ] o.a.s.s.IndexSchema default search field in schema is text
   [junit4]   2> 778329 INFO  (coreLoadExecutor-1937-thread-1) [    ] o.a.s.s.IndexSchema unique key field: id
   [junit4]   2> 778334 WARN  (coreLoadExecutor-1937-thread-1) [    ] o.a.s.s.IndexSchema Field text is not multivalued and destination for multiple copyFields (2)
   [junit4]   2> 778345 INFO  (coreLoadExecutor-1937-thread-1) [    ] o.a.s.s.FileExchangeRateProvider Reloading exchange rates from file currency.xml
   [junit4]   2> 778351 INFO  (coreLoadExecutor-1937-thread-1) [    ] o.a.s.s.FileExchangeRateProvider Reloading exchange rates from file currency.xml
   [junit4]   2> 778368 INFO  (coreLoadExecutor-1937-thread-1) [    ] o.a.s.c.ConfigSetProperties Did not find ConfigSet properties, assuming default properties: Can't find resource 'configsetprops.json' in classpath or '/x1/jenkins/jenkins-slave/workspace/Lucene-Solr-Tests-5.x-Java7/solr/core/src/test-files/solr/collection1/conf'
   [junit4]   2> 778368 INFO  (coreLoadExecutor-1937-thread-1) [    ] o.a.s.c.CoreContainer Creating SolrCore 'collection1' using configuration from instancedir /x1/jenkins/jenkins-slave/workspace/Lucene-Solr-Tests-5.x-Java7/solr/core/src/test-files/solr/collection1/
   [junit4]   2> 778369 INFO  (coreLoadExecutor-1937-thread-1) [    x:collection1] o.a.s.c.SolrCore org.apache.solr.core.MockDirectoryFactory
   [junit4]   2> 778369 INFO  (coreLoadExecutor-1937-thread-1) [    x:collection1] o.a.s.c.SolrCore [[collection1] ] Opening new SolrCore at [/x1/jenkins/jenkins-slave/workspace/Lucene-Solr-Tests-5.x-Java7/solr/core/src/test-files/solr/collection1/], dataDir=[null]
   [junit4]   2> 778369 INFO  (coreLoadExecutor-1937-thread-1) [    x:collection1] o.a.s.c.JmxMonitoredMap JMX monitoring is enabled. Adding Solr mbeans to JMX Server: com.sun.jmx.mbeanserver.JmxMBeanServer@2ee330df
   [junit4]   2> 778370 INFO  (coreLoadExecutor-1937-thread-1) [    x:collection1] o.a.s.c.CachingDirectoryFactory return new directory for /x1/jenkins/jenkins-slave/workspace/Lucene-Solr-Tests-5.x-Java7/solr/build/solr-core/test/J2/temp/solr.search.TestSolrQueryParser_7DB87C7DA961ACAF-001/init-core-data-001
   [junit4]   2> 778376 INFO  (coreLoadExecutor-1937-thread-1) [    x:collection1] o.a.s.c.SolrCore New index directory detected: old=null new=/x1/jenkins/jenkins-slave/workspace/Lucene-Solr-Tests-5.x-Java7/solr/build/solr-core/test/J2/temp/solr.search.TestSolrQueryParser_7DB87C7DA961ACAF-001/init-core-data-001/index/
   [junit4]   2> 778376 WARN  (coreLoadExecutor-1937-thread-1) [    x:collection1] o.a.s.c.SolrCore [collection1] Solr index directory '/x1/jenkins/jenkins-slave/workspace/Lucene-Solr-Tests-5.x-Java7/solr/build/solr-core/test/J2/temp/solr.search.TestSolrQueryParser_7DB87C7DA961ACAF-001/init-core-data-001/index' doesn't exist. Creating new index...
   [junit4]   2> 778376 INFO  (coreLoadExecutor-1937-thread-1) [    x:collection1] o.a.s.c.CachingDirectoryFactory return new directory for /x1/jenkins/jenkins-slave/workspace/Lucene-Solr-Tests-5.x-Java7/solr/build/solr-core/test/J2/temp/solr.search.TestSolrQueryParser_7DB87C7DA961ACAF-001/init-core-data-001/index
   [junit4]   2> 778376 INFO  (coreLoadExecutor-1937-thread-1) [    x:collection1] o.a.s.u.RandomMergePolicy RandomMergePolicy wrapping class org.apache.lucene.index.LogDocMergePolicy: [LogDocMergePolicy: minMergeSize=1000, mergeFactor=33, maxMergeSize=9223372036854775807, maxMergeSizeForForcedMerge=9223372036854775807, calibrateSizeByDeletes=false, maxMergeDocs=2147483647, maxCFSSegmentSizeMB=8.796093022207999E12, noCFSRatio=0.37943911317889545]
   [junit4]   2> 778382 INFO  (coreLoadExecutor-1937-thread-1) [    x:collection1] o.a.s.c.SolrCore SolrDeletionPolicy.onCommit: commits: num=1
   [junit4]   2> 	commit{dir=MockDirectoryWrapper(RAMDirectory@75c9ca17 lockFactory=org.apache.lucene.store.SingleInstanceLockFactory@12f2e86b),segFN=segments_1,generation=1}
   [junit4]   2> 778382 INFO  (coreLoadExecutor-1937-thread-1) [    x:collection1] o.a.s.c.SolrCore newest commit generation = 1
   [junit4]   2> 778391 INFO  (coreLoadExecutor-1937-thread-1) [    x:collection1] o.a.s.u.p.UpdateRequestProcessorChain creating updateRequestProcessorChain "dedupe"
   [junit4]   2> 778391 INFO  (coreLoadExecutor-1937-thread-1) [    x:collection1] o.a.s.u.p.UpdateRequestProcessorChain inserting DistributedUpdateProcessorFactory into updateRequestProcessorChain "dedupe"
   [junit4]   2> 778391 INFO  (coreLoadExecutor-1937-thread-1) [    x:collection1] o.a.s.u.p.UpdateRequestProcessorChain creating updateRequestProcessorChain "dedupe-allfields"
   [junit4]   2> 778391 INFO  (coreLoadExecutor-1937-thread-1) [    x:collection1] o.a.s.u.p.UpdateRequestProcessorChain inserting DistributedUpdateProcessorFactory into updateRequestProcessorChain "dedupe-allfields"
   [junit4]   2> 778391 INFO  (coreLoadExecutor-1937-thread-1) [    x:collection1] o.a.s.u.p.UpdateRequestProcessorChain creating updateRequestProcessorChain "stored_sig"
   [junit4]   2> 778391 INFO  (coreLoadExecutor-1937-thread-1) [    x:collection1] o.a.s.u.p.UpdateRequestProcessorChain inserting DistributedUpdateProcessorFactory into updateRequestProcessorChain "stored_sig"
   [junit4]   2> 778392 INFO  (coreLoadExecutor-1937-thread-1) [    x:collection1] o.a.s.u.p.UpdateRequestProcessorChain creating updateRequestProcessorChain "uniq-fields"
   [junit4]   2> 778392 INFO  (coreLoadExecutor-1937-thread-1) [    x:collection1] o.a.s.u.p.UpdateRequestProcessorChain inserting DistributedUpdateProcessorFactory into updateRequestProcessorChain "uniq-fields"
   [junit4]   2> 778392 INFO  (coreLoadExecutor-1937-thread-1) [    x:collection1] o.a.s.u.p.UpdateRequestProcessorChain creating updateRequestProcessorChain "distrib-dup-test-chain-explicit"
   [junit4]   2> 778392 INFO  (coreLoadExecutor-1937-thread-1) [    x:collection1] o.a.s.u.p.UpdateRequestProcessorChain creating updateRequestProcessorChain "distrib-dup-test-chain-implicit"
   [junit4]   2> 778392 INFO  (coreLoadExecutor-1937-thread-1) [    x:collection1] o.a.s.u.p.UpdateRequestProcessorChain inserting DistributedUpdateProcessorFactory into updateRequestProcessorChain "distrib-dup-test-chain-implicit"
   [junit4]   2> 778393 INFO  (coreLoadExecutor-1937-thread-1) [    x:collection1] o.a.s.c.SolrCore no updateRequestProcessorChain defined as default, creating implicit default
   [junit4]   2> 778394 INFO  (OldIndexDirectoryCleanupThreadForCore-collection1) [    x:collection1] o.a.s.c.SolrCore Looking for old index directories to cleanup for core collection1 in /x1/jenkins/jenkins-slave/workspace/Lucene-Solr-Tests-5.x-Java7/solr/build/solr-core/test/J2/temp/solr.search.TestSolrQueryParser_7DB87C7DA961ACAF-001/init-core-data-001/
   [junit4]   2> 778397 INFO  (coreLoadExecutor-1937-thread-1) [    x:collection1] o.a.s.h.l.XMLLoader xsltCacheLifetimeSeconds=60
   [junit4]   2> 778409 INFO  (coreLoadExecutor-1937-thread-1) [    x:collection1] o.a.s.h.l.XMLLoader xsltCacheLifetimeSeconds=60
   [junit4]   2> 778412 INFO  (coreLoadExecutor-1937-thread-1) [    x:collection1] o.a.s.h.l.XMLLoader xsltCacheLifetimeSeconds=60
   [junit4]   2> 778414 INFO  (coreLoadExecutor-1937-thread-1) [    x:collection1] o.a.s.h.l.XMLLoader xsltCacheLifetimeSeconds=60
   [junit4]   2> 778431 INFO  (coreLoadExecutor-1937-thread-1) [    x:collection1] o.a.s.c.PluginBag requestHandler : 'lazy' created with startup=lazy 
   [junit4]   2> 778433 INFO  (coreLoadExecutor-1937-thread-1) [    x:collection1] o.a.s.c.RequestHandlers Registered paths: /search-facet-def,/update/json/docs,spellCheckCompRH1,defaults,lazy,/update,/search-facet-invariants,/admin/mbeans,/update/json,/admin/system,/admin/luke,spellCheckCompRH,/admin/plugins,/config,/admin/segments,spellCheckWithWordbreak,/mlt,/schema,/admin/logging,/admin/properties,tvrh,/debug/dump,/get,/admin/file,mock,/terms,/replication,dismax,spellCheckWithWordbreak_Direct,/admin/threads,spellCheckCompRH_Direct,/update/csv,standard,/admin/ping,mltrh
   [junit4]   2> 778436 WARN  (coreLoadExecutor-1937-thread-1) [    x:collection1] o.a.s.c.SolrCore solrconfig.xml uses deprecated <admin/gettableFiles>, Please update your config to use the ShowFileRequestHandler.
   [junit4]   2> 778441 INFO  (coreLoadExecutor-1937-thread-1) [    x:collection1] o.a.s.c.SolrCore Using default statsCache cache: org.apache.solr.search.stats.LocalStatsCache
   [junit4]   2> 778450 INFO  (coreLoadExecutor-1937-thread-1) [    x:collection1] o.a.s.c.SolrCore Hard AutoCommit: disabled
   [junit4]   2> 778450 INFO  (coreLoadExecutor-1937-thread-1) [    x:collection1] o.a.s.c.SolrCore Soft AutoCommit: disabled
   [junit4]   2> 778451 INFO  (coreLoadExecutor-1937-thread-1) [    x:collection1] o.a.s.u.RandomMergePolicy RandomMergePolicy wrapping class org.apache.lucene.index.TieredMergePolicy: [TieredMergePolicy: maxMergeAtOnce=24, maxMergeAtOnceExplicit=49, maxMergedSegmentMB=67.4541015625, floorSegmentMB=1.88671875, forceMergeDeletesPctAllowed=27.245941856281476, segmentsPerTier=49.0, maxCFSSegmentSizeMB=8.796093022207999E12, noCFSRatio=0.0
   [junit4]   2> 778451 INFO  (coreLoadExecutor-1937-thread-1) [    x:collection1] o.a.s.c.SolrCore SolrDeletionPolicy.onInit: commits: num=1
   [junit4]   2> 	commit{dir=MockDirectoryWrapper(RAMDirectory@75c9ca17 lockFactory=org.apache.lucene.store.SingleInstanceLockFactory@12f2e86b),segFN=segments_1,generation=1}
   [junit4]   2> 778451 INFO  (coreLoadExecutor-1937-thread-1) [    x:collection1] o.a.s.c.SolrCore newest commit generation = 1
   [junit4]   2> 778451 INFO  (coreLoadExecutor-1937-thread-1) [    x:collection1] o.a.s.s.SolrIndexSearcher Opening Searcher@7e151542[collection1] main
   [junit4]   2> 778452 INFO  (coreLoadExecutor-1937-thread-1) [    x:collection1] o.a.s.r.RestManager Initializing RestManager with initArgs: {storageIO=org.apache.solr.rest.ManagedResourceStorage$InMemoryStorageIO}
   [junit4]   2> 778452 INFO  (coreLoadExecutor-1937-thread-1) [    x:collection1] o.a.s.r.ManagedResourceStorage Reading _rest_managed.json using InMemoryStorage
   [junit4]   2> 778452 INFO  (coreLoadExecutor-1937-thread-1) [    x:collection1] o.a.s.r.RestManager Initializing 0 registered ManagedResources
   [junit4]   2> 778452 INFO  (coreLoadExecutor-1937-thread-1) [    x:collection1] o.a.s.h.c.SpellCheckComponent Initializing spell checkers
   [junit4]   2> 778460 INFO  (coreLoadExecutor-1937-thread-1) [    x:collection1] o.a.s.s.DirectSolrSpellChecker init: {name=direct,classname=DirectSolrSpellChecker,field=lowerfilt,minQueryLength=3}
   [junit4]   2> 778518 INFO  (coreLoadExecutor-1937-thread-1) [    x:collection1] o.a.s.h.ReplicationHandler Commits will be reserved for  10000
   [junit4]   2> 778518 INFO  (searcherExecutor-1938-thread-1-processing-x:collection1) [    x:collection1] o.a.s.h.c.SpellCheckComponent Loading spell index for spellchecker: default
   [junit4]   2> 778519 INFO  (searcherExecutor-1938-thread-1-processing-x:collection1) [    x:collection1] o.a.s.h.c.SpellCheckComponent Loading spell index for spellchecker: direct
   [junit4]   2> 778519 INFO  (searcherExecutor-1938-thread-1-processing-x:collection1) [    x:collection1] o.a.s.h.c.SpellCheckComponent Loading spell index for spellchecker: wordbreak
   [junit4]   2> 778519 INFO  (searcherExecutor-1938-thread-1-processing-x:collection1) [    x:collection1] o.a.s.h.c.SpellCheckComponent Loading spell index for spellchecker: multipleFields
   [junit4]   2> 778519 INFO  (coreLoadExecutor-1937-thread-1) [    x:collection1] o.a.s.c.CoreContainer registering core: collection1
   [junit4]   2> 778519 INFO  (searcherExecutor-1938-thread-1-processing-x:collection1) [    x:collection1] o.a.s.h.c.SpellCheckComponent Loading spell index for spellchecker: jarowinkler
   [junit4]   2> 778520 INFO  (searcherExecutor-1938-thread-1-processing-x:collection1) [    x:collection1] o.a.s.h.c.SpellCheckComponent Loading spell index for spellchecker: external
   [junit4]   2> 778520 INFO  (searcherExecutor-1938-thread-1-processing-x:collection1) [    x:collection1] o.a.s.h.c.SpellCheckComponent Loading spell index for spellchecker: freq
   [junit4]   2> 778521 INFO  (searcherExecutor-1938-thread-1-processing-x:collection1) [    x:collection1] o.a.s.h.c.SpellCheckComponent Loading spell index for spellchecker: fqcn
   [junit4]   2> 778521 INFO  (SUITE-TestSolrQueryParser-seed#[7DB87C7DA961ACAF]-worker) [    ] o.a.s.SolrTestCaseJ4 ####initCore end
   [junit4]   2> 778521 INFO  (searcherExecutor-1938-thread-1-processing-x:collection1) [    x:collection1] o.a.s.h.c.SpellCheckComponent Loading spell index for spellchecker: perDict
   [junit4]   2> 778522 INFO  (SUITE-TestSolrQueryParser-seed#[7DB87C7DA961ACAF]-worker) [    ] o.a.s.u.p.LogUpdateProcessor [collection1] webapp=null path=null params={} {add=[1]} 0 0
   [junit4]   2> 778522 INFO  (searcherExecutor-1938-thread-1-processing-x:collection1) [    x:collection1] o.a.s.c.SolrCore [collection1] Registered new searcher Searcher@7e151542[collection1] main{ExitableDirectoryReader(UninvertingDirectoryReader())}
   [junit4]   2> 778525 INFO  (SUITE-TestSolrQueryParser-seed#[7DB87C7DA961ACAF]-worker) [    ] o.a.s.u.p.LogUpdateProcessor [collection1] webapp=null path=null params={} {add=[2]} 0 0
   [junit4]   2> 778526 INFO  (SUITE-TestSolrQueryParser-seed#[7DB87C7DA961ACAF]-worker) [    ] o.a.s.u.p.LogUpdateProcessor [collection1] webapp=null path=null params={} {add=[3]} 0 0
   [junit4]   2> 778527 INFO  (SUITE-TestSolrQueryParser-seed#[7DB87C7DA961ACAF]-worker) [    ] o.a.s.u.p.LogUpdateProcessor [collection1] webapp=null path=null params={} {add=[10]} 0 0
   [junit4]   2> 778528 INFO  (SUITE-TestSolrQueryParser-seed#[7DB87C7DA961ACAF]-worker) [    ] o.a.s.u.p.LogUpdateProcessor [collection1] webapp=null path=null params={} {add=[11]} 0 0
   [junit4]   2> 778543 INFO  (SUITE-TestSolrQueryParser-seed#[7DB87C7DA961ACAF]-worker) [    ] o.a.s.u.p.LogUpdateProcessor [collection1] webapp=null path=null params={} {add=[12]} 0 0
   [junit4]   2> 778544 INFO  (SUITE-TestSolrQueryParser-seed#[7DB87C7DA961ACAF]-worker) [    ] o.a.s.u.p.LogUpdateProcessor [collection1] webapp=null path=null params={} {add=[13]} 0 0
   [junit4]   2> 778545 INFO  (SUITE-TestSolrQueryParser-seed#[7DB87C7DA961ACAF]-worker) [    ] o.a.s.u.UpdateHandler start commit{,optimize=false,openSearcher=true,waitSearcher=true,expungeDeletes=false,softCommit=false,prepareCommit=false}
   [junit4]   2> 778564 INFO  (SUITE-TestSolrQueryParser-seed#[7DB87C7DA961ACAF]-worker) [    ] o.a.s.c.SolrCore SolrDeletionPolicy.onCommit: commits: num=2
   [junit4]   2> 	commit{dir=MockDirectoryWrapper(RAMDirectory@75c9ca17 lockFactory=org.apache.lucene.store.SingleInstanceLockFactory@12f2e86b),segFN=segments_1,generation=1}
   [junit4]   2> 	commit{dir=MockDirectoryWrapper(RAMDirectory@75c9ca17 lockFactory=org.apache.lucene.store.SingleInstanceLockFactory@12f2e86b),segFN=segments_2,generation=2}
   [junit4]   2> 778565 INFO  (SUITE-TestSolrQueryParser-seed#[7DB87C7DA961ACAF]-worker) [    ] o.a.s.c.SolrCore newest commit generation = 2
   [junit4]   2> 778568 INFO  (SUITE-TestSolrQueryParser-seed#[7DB87C7DA961ACAF]-worker) [    ] o.a.s.s.SolrIndexSearcher Opening Searcher@2ea5a06d[collection1] main
   [junit4]   2> 778570 INFO  (searcherExecutor-1938-thread-1) [    ] o.a.s.c.SolrCore [collection1] Registered new searcher Searcher@2ea5a06d[collection1] main{ExitableDirectoryReader(UninvertingDirectoryReader(Uninverting(_0(5.4.0):C7)))}
   [junit4]   2> 778571 INFO  (SUITE-TestSolrQueryParser-seed#[7DB87C7DA961ACAF]-worker) [    ] o.a.s.u.UpdateHandler end_commit_flush
   [junit4]   2> 778571 INFO  (SUITE-TestSolrQueryParser-seed#[7DB87C7DA961ACAF]-worker) [    ] o.a.s.u.p.LogUpdateProcessor [collection1] webapp=null path=null params={} {commit=} 0 25
   [junit4]   2> 778581 INFO  (TEST-TestSolrQueryParser.testSolr4121-seed#[7DB87C7DA961ACAF]) [    ] o.a.s.SolrTestCaseJ4 ###Starting testSolr4121
   [junit4]   2> 778582 INFO  (TEST-TestSolrQueryParser.testSolr4121-seed#[7DB87C7DA961ACAF]) [    ] o.a.s.c.S.Request [collection1] webapp=null path=null params={indent=true&wt=xml&q=eee_s:'balance'} hits=1 status=0 QTime=0 
   [junit4]   2> 778583 INFO  (TEST-TestSolrQueryParser.testSolr4121-seed#[7DB87C7DA961ACAF]) [    ] o.a.s.SolrTestCaseJ4 ###Ending testSolr4121
   [junit4]   2> 778592 INFO  (TEST-TestSolrQueryParser.testFilter-seed#[7DB87C7DA961ACAF]) [    ] o.a.s.SolrTestCaseJ4 ###Starting testFilter
   [junit4]   2> 778612 ERROR (TEST-TestSolrQueryParser.testFilter-seed#[7DB87C7DA961ACAF]) [    ] o.a.s.c.SolrCore java.lang.UnsupportedOperationException: Query SortedIntDocSetTopFilter does not implement createWeight
   [junit4]   2> 	at org.apache.lucene.search.Query.createWeight(Query.java:79)
   [junit4]   2> 	at org.apache.lucene.search.IndexSearcher.createWeight(IndexSearcher.java:855)
   [junit4]   2> 	at org.apache.lucene.search.ConstantScoreQuery.createWeight(ConstantScoreQuery.java:117)
   [junit4]   2> 	at org.apache.solr.query.FilterQuery.createWeight(FilterQuery.java:96)
   [junit4]   2> 	at org.apache.lucene.search.IndexSearcher.createWeight(IndexSearcher.java:855)
   [junit4]   2> 	at org.apache.lucene.search.BooleanWeight.<init>(BooleanWeight.java:56)
   [junit4]   2> 	at org.apache.lucene.search.BooleanQuery.createWeight(BooleanQuery.java:203)
   [junit4]   2> 	at org.apache.lucene.search.IndexSearcher.createWeight(IndexSearcher.java:855)
   [junit4]   2> 	at org.apache.lucene.search.IndexSearcher.createNormalizedWeight(IndexSearcher.java:838)
   [junit4]   2> 	at org.apache.lucene.search.IndexSearcher.search(IndexSearcher.java:486)
   [junit4]   2> 	at org.apache.solr.search.SolrIndexSearcher.getDocSetNC(SolrIndexSearcher.java:1259)
   [junit4]   2> 	at org.apache.solr.search.SolrIndexSearcher.getPositiveDocSet(SolrIndexSearcher.java:941)
   [junit4]   2> 	at org.apache.solr.search.SolrIndexSearcher.getProcessedFilter(SolrIndexSearcher.java:1103)
   [junit4]   2> 	at org.apache.solr.search.SolrIndexSearcher.getDocListNC(SolrIndexSearcher.java:1625)
   [junit4]   2> 	at org.apache.solr.search.SolrIndexSearcher.getDocListC(SolrIndexSearcher.java:1501)
   [junit4]   2> 	at org.apache.solr.search.SolrIndexSearcher.search(SolrIndexSearcher.java:555)
   [junit4]   2> 	at org.apache.solr.handler.component.QueryComponent.process(QueryComponent.java:522)
   [junit4]   2> 	at org.apache.solr.handler.component.SearchHandler.handleRequestBody(SearchHandler.java:277)
   [junit4]   2> 	at org.apache.solr.handler.RequestHandlerBase.handleRequest(RequestHandlerBase.java:143)
   [junit4]   2> 	at org.apache.solr.core.SolrCore.execute(SolrCore.java:2068)
   [junit4]   2> 	at org.apache.solr.util.TestHarness.query(TestHarness.java:320)
   [junit4]   2> 	at org.apache.solr.util.TestHarness.query(TestHarness.java:302)
   [junit4]   2> 	at org.apache.solr.SolrTestCaseJ4.assertJQ(SolrTestCaseJ4.java:831)
   [junit4]   2> 	at org.apache.solr.SolrTestCaseJ4.assertJQ(SolrTestCaseJ4.java:800)
   [junit4]   2> 	at org.apache.solr.search.TestSolrQueryParser.testFilter(TestSolrQueryParser.java:224)
   [junit4]   2> 	at sun.reflect.NativeMethodAccessorImpl.invoke0(Native Method)
   [junit4]   2> 	at sun.reflect.NativeMethodAccessorImpl.invoke(NativeMethodAccessorImpl.java:57)
   [junit4]   2> 	at sun.reflect.DelegatingMethodAccessorImpl.invoke(DelegatingMethodAccessorImpl.java:43)
   [junit4]   2> 	at java.lang.reflect.Method.invoke(Method.java:606)
   [junit4]   2> 	at com.carrotsearch.randomizedtesting.RandomizedRunner.invoke(RandomizedRunner.java:1627)
   [junit4]   2> 	at com.carrotsearch.randomizedtesting.RandomizedRunner$6.evaluate(RandomizedRunner.java:836)
   [junit4]   2> 	at com.carrotsearch.randomizedtesting.RandomizedRunner$7.evaluate(RandomizedRunner.java:872)
   [junit4]   2> 	at com.carrotsearch.randomizedtesting.RandomizedRunner$8.evaluate(RandomizedRunner.java:886)
   [junit4]   2> 	at com.carrotsearch.randomizedtesting.rules.SystemPropertiesRestoreRule$1.evaluate(SystemPropertiesRestoreRule.java:57)
   [junit4]   2> 	at org.apache.lucene.util.TestRuleSetupTeardownChained$1.evaluate(TestRuleSetupTeardownChained.java:50)
   [junit4]   2> 	at org.apache.lucene.util.AbstractBeforeAfterRule$1.evaluate(AbstractBeforeAfterRule.java:46)
   [junit4]   2> 	at org.apache.lucene.util.TestRuleThreadAndTestName$1.evaluate(TestRuleThreadAndTestName.java:49)
   [junit4]   2> 	at org.apache.lucene.util.TestRuleIgnoreAfterMaxFailures$1.evaluate(TestRuleIgnoreAfterMaxFailures.java:65)
   [junit4]   2> 	at org.apache.lucene.util.TestRuleMarkFailure$1.evaluate(TestRuleMarkFailure.java:48)
   [junit4]   2> 	at com.carrotsearch.randomizedtesting.rules.StatementAdapter.evaluate(StatementAdapter.java:36)
   [junit4]   2> 	at com.carrotsearch.randomizedtesting.ThreadLeakControl$StatementRunner.run(ThreadLeakControl.java:365)
   [junit4]   2> 	at com.carrotsearch.randomizedtesting.ThreadLeakControl.forkTimeoutingTask(ThreadLeakControl.java:798)
   [junit4]   2> 	at com.carrotsearch.randomizedtesting.ThreadLeakControl$3.evaluate(ThreadLeakControl.java:458)
   [junit4]   2> 	at com.carrotsearch.randomizedtesting.RandomizedRunner.runSingleTest(RandomizedRunner.java:845)
   [junit4]   2> 	at com.carrotsearch.randomizedtesting.RandomizedRunner$3.evaluate(RandomizedRunner.java:747)
   [junit4]   2> 	at com.carrotsearch.randomizedtesting.RandomizedRunner$4.evaluate(RandomizedRunner.java:781)
   [junit4]   2> 	at com.carrotsearch.randomizedtesting.RandomizedRunner$5.evaluate(RandomizedRunner.java:792)
   [junit4]   2> 	at com.carrotsearch.randomizedtesting.rules.StatementAdapter.evaluate(StatementAdapter.java:36)
   [junit4]   2> 	at com.carrotsearch.randomizedtesting.rules.SystemPropertiesRestoreRule$1.evaluate(SystemPropertiesRestoreRule.java:57)
   [junit4]   2> 	at org.apache.lucene.util.AbstractBeforeAfterRule$1.evaluate(AbstractBeforeAfterRule.java:46)
   [junit4]   2> 	at com.carrotsearch.randomizedtesting.rules.StatementAdapter.evaluate(StatementAdapter.java:36)
   [junit4]   2> 	at org.apache.lucene.util.TestRuleStoreClassName$1.evaluate(TestRuleStoreClassName.java:42)
   [junit4]   2> 	at com.carrotsearch.randomizedtesting.rules.NoShadowingOrOverridesOnMethodsRule$1.evaluate(NoShadowingOrOverridesOnMethodsRule.java:39)
   [junit4]   2> 	at com.carrotsearch.randomizedtesting.rules.NoShadowingOrOverridesOnMethodsRule$1.evaluate(NoShadowingOrOverridesOnMethodsRule.java:39)
   [junit4]   2> 	at com.carrotsearch.randomizedtesting.rules.StatementAdapter.evaluate(StatementAdapter.java:36)
   [junit4]   2> 	at com.carrotsearch.randomizedtesting.rules.StatementAdapter.evaluate(StatementAdapter.java:36)
   [junit4]   2> 	at com.carrotsearch.randomizedtesting.rules.StatementAdapter.evaluate(StatementAdapter.java:36)
   [junit4]   2> 	at org.apache.lucene.util.TestRuleAssertionsRequired$1.evaluate(TestRuleAssertionsRequired.java:54)
   [junit4]   2> 	at org.apache.lucene.util.TestRuleMarkFailure$1.evaluate(TestRuleMarkFailure.java:48)
   [junit4]   2> 	at org.apache.lucene.util.TestRuleIgnoreAfterMaxFailures$1.evaluate(TestRuleIgnoreAfterMaxFailures.java:65)
   [junit4]   2> 	at org.apache.lucene.util.TestRuleIgnoreTestSuites$1.evaluate(TestRuleIgnoreTestSuites.java:55)
   [junit4]   2> 	at com.carrotsearch.randomizedtesting.rules.StatementAdapter.evaluate(StatementAdapter.java:36)
   [junit4]   2> 	at com.carrotsearch.randomizedtesting.ThreadLeakControl$StatementRunner.run(ThreadLeakControl.java:365)
   [junit4]   2> 	at java.lang.Thread.run(Thread.java:745)
   [junit4]   2> 
   [junit4]   2> 778613 INFO  (TEST-TestSolrQueryParser.testFilter-seed#[7DB87C7DA961ACAF]) [    ] o.a.s.c.S.Request [collection1] webapp=null path=null params={fq=filter(just_to_clear_the_cache)+filter(id:100000)+filter(id:100010)&wt=xml&q=*:*+0} status=500 QTime=21 
   [junit4]   2> 778613 ERROR (TEST-TestSolrQueryParser.testFilter-seed#[7DB87C7DA961ACAF]) [    ] o.a.s.SolrTestCaseJ4 REQUEST FAILED: fq=filter(just_to_clear_the_cache)+filter(id:100000)+filter(id:100010)&wt=xml&q=*:*+0
   [junit4]   2> 778614 INFO  (TEST-TestSolrQueryParser.testFilter-seed#[7DB87C7DA961ACAF]) [    ] o.a.s.SolrTestCaseJ4 ###Ending testFilter
   [junit4]   2> NOTE: reproduce with: ant test  -Dtestcase=TestSolrQueryParser -Dtests.method=testFilter -Dtests.seed=7DB87C7DA961ACAF -Dtests.multiplier=2 -Dtests.slow=true -Dtests.locale=es_NI -Dtests.timezone=Africa/Tripoli -Dtests.asserts=true -Dtests.file.encoding=UTF-8
   [junit4] ERROR   0.07s J2 | TestSolrQueryParser.testFilter <<<
   [junit4]    > Throwable #1: java.lang.UnsupportedOperationException: Query SortedIntDocSetTopFilter does not implement createWeight
   [junit4]    > 	at __randomizedtesting.SeedInfo.seed([7DB87C7DA961ACAF:B56A19EB36688BF5]:0)
   [junit4]    > 	at org.apache.lucene.search.Query.createWeight(Query.java:79)
   [junit4]    > 	at org.apache.lucene.search.IndexSearcher.createWeight(IndexSearcher.java:855)
   [junit4]    > 	at org.apache.lucene.search.ConstantScoreQuery.createWeight(ConstantScoreQuery.java:117)
   [junit4]    > 	at org.apache.solr.query.FilterQuery.createWeight(FilterQuery.java:96)
   [junit4]    > 	at org.apache.lucene.search.IndexSearcher.createWeight(IndexSearcher.java:855)
   [junit4]    > 	at org.apache.lucene.search.BooleanWeight.<init>(BooleanWeight.java:56)
   [junit4]    > 	at org.apache.lucene.search.BooleanQuery.createWeight(BooleanQuery.java:203)
   [junit4]    > 	at org.apache.lucene.search.IndexSearcher.createWeight(IndexSearcher.java:855)
   [junit4]    > 	at org.apache.lucene.search.IndexSearcher.createNormalizedWeight(IndexSearcher.java:838)
   [junit4]    > 	at org.apache.lucene.search.IndexSearcher.search(IndexSearcher.java:486)
   [junit4]    > 	at org.apache.solr.search.SolrIndexSearcher.getDocSetNC(SolrIndexSearcher.java:1259)
   [junit4]    > 	at org.apache.solr.search.SolrIndexSearcher.getPositiveDocSet(SolrIndexSearcher.java:941)
   [junit4]    > 	at org.apache.solr.search.SolrIndexSearcher.getProcessedFilter(SolrIndexSearcher.java:1103)
   [junit4]    > 	at org.apache.solr.search.SolrIndexSearcher.getDocListNC(SolrIndexSearcher.java:1625)
   [junit4]    > 	at org.apache.solr.search.SolrIndexSearcher.getDocListC(SolrIndexSearcher.java:1501)
   [junit4]    > 	at org.apache.solr.search.SolrIndexSearcher.search(SolrIndexSearcher.java:555)
   [junit4]    > 	at org.apache.solr.handler.component.QueryComponent.process(QueryComponent.java:522)
   [junit4]    > 	at org.apache.solr.handler.component.SearchHandler.handleRequestBody(SearchHandler.java:277)
   [junit4]    > 	at org.apache.solr.handler.RequestHandlerBase.handleRequest(RequestHandlerBase.java:143)
   [junit4]    > 	at org.apache.solr.core.SolrCore.execute(SolrCore.java:2068)
   [junit4]    > 	at org.apache.solr.util.TestHarness.query(TestHarness.java:320)
   [junit4]    > 	at org.apache.solr.util.TestHarness.query(TestHarness.java:302)
   [junit4]    > 	at org.apache.solr.SolrTestCaseJ4.assertJQ(SolrTestCaseJ4.java:831)
   [junit4]    > 	at org.apache.solr.SolrTestCaseJ4.assertJQ(SolrTestCaseJ4.java:800)
   [junit4]    > 	at org.apache.solr.search.TestSolrQueryParser.testFilter(TestSolrQueryParser.java:224)
   [junit4]    > 	at java.lang.Thread.run(Thread.java:745)
   [junit4]   2> 778661 INFO  (TEST-TestSolrQueryParser.testSyntax-seed#[7DB87C7DA961ACAF]) [    ] o.a.s.SolrTestCaseJ4 ###Starting testSyntax
   [junit4]   2> 778662 INFO  (TEST-TestSolrQueryParser.testSyntax-seed#[7DB87C7DA961ACAF]) [    ] o.a.s.c.S.Request [collection1] webapp=null path=null params={wt=xml&df=doesnotexist_s&q=*} hits=7 status=0 QTime=0 
   [junit4]   2> 778663 INFO  (TEST-TestSolrQueryParser.testSyntax-seed#[7DB87C7DA961ACAF]) [    ] o.a.s.c.S.Request [collection1] webapp=null path=null params={wt=xml&q=doesnotexist_s:*} hits=0 status=0 QTime=0 
   [junit4]   2> 778664 INFO  (TEST-TestSolrQueryParser.testSyntax-seed#[7DB87C7DA961ACAF]) [    ] o.a.s.c.S.Request [collection1] webapp=null path=null params={wt=xml&q=doesnotexist_s:(+*+*+*+)} hits=0 status=0 QTime=0 
   [junit4]   2> 778665 INFO  (TEST-TestSolrQueryParser.testSyntax-seed#[7DB87C7DA961ACAF]) [    ] o.a.s.c.S.Request [collection1] webapp=null path=null params={wt=xml&debug=query&q=foo_dt:"2013-03-08T00:46:15Z/DAY%2B000MILLISECONDS%2B00SECONDS%2B00MINUTES%2B00HOURS%2B0000000000YEARS%2B6MONTHS%2B3DAYS"} hits=0 status=0 QTime=1 
   [junit4]   2> 778666 INFO  (TEST-TestSolrQueryParser.testSyntax-seed#[7DB87C7DA961ACAF]) [    ] o.a.s.SolrTestCaseJ4 ###Ending testSyntax
   [junit4]   2> 778671 INFO  (TEST-TestSolrQueryParser.testNestedQueryModifiers-seed#[7DB87C7DA961ACAF]) [    ] o.a.s.SolrTestCaseJ4 ###Starting testNestedQueryModifiers
   [junit4]   2> 778684 INFO  (TEST-TestSolrQueryParser.testNestedQueryModifiers-seed#[7DB87C7DA961ACAF]) [    ] o.a.s.c.S.Request [collection1] webapp=null path=null params={wt=xml&debug=query&q=_query_:"\"how+brown\"~2"} hits=1 status=0 QTime=12 
   [junit4]   2> 778685 INFO  (TEST-TestSolrQueryParser.testNestedQueryModifiers-seed#[7DB87C7DA961ACAF]) [    ] o.a.s.c.S.Request [collection1] webapp=null path=null params={wt=xml&debug=query&qq="how+brown"~2&q=_query_:"{!v%3D$qq}"} hits=1 status=0 QTime=0 
   [junit4]   2> 778685 INFO  (TEST-TestSolrQueryParser.testNestedQueryModifiers-seed#[7DB87C7DA961ACAF]) [    ] o.a.s.c.S.Request [collection1] webapp=null path=null params={wt=xml&debug=query&qq="how+brown"~2&q=_query_:"{!v%3D$qq}"~1} hits=1 status=0 QTime=0 
   [junit4]   2> 778689 INFO  (TEST-TestSolrQueryParser.testNestedQueryModifiers-seed#[7DB87C7DA961ACAF]) [    ] o.a.s.c.S.Request [collection1] webapp=null path=null params={wt=xml&debug=query&qq="how+brown"~2&q=++{!v%3D$qq}~1} hits=1 status=0 QTime=2 
   [junit4]   2> 778690 INFO  (TEST-TestSolrQueryParser.testNestedQueryModifiers-seed#[7DB87C7DA961ACAF]) [    ] o.a.s.c.S.Request [collection1] webapp=null path=null params={fq=id:1&wt=xml&debug=query&qq=text:x^2&fl=id,score&q=_query_:"{!v%3D$qq}"^3} hits=0 status=0 QTime=0 
   [junit4]   2> 778691 INFO  (TEST-TestSolrQueryParser.testNestedQueryModifiers-seed#[7DB87C7DA961ACAF]) [    ] o.a.s.c.S.Request [collection1] webapp=null path=null params={fq=id:1&wt=xml&debug=query&qq=text:x^2&fl=id,score&q=++{!v%3D$qq}^3} hits=0 status=0 QTime=0 
   [junit4]   2> 778691 INFO  (TEST-TestSolrQueryParser.testNestedQueryModifiers-seed#[7DB87C7DA961ACAF]) [    ] o.a.s.SolrTestCaseJ4 ###Ending testNestedQueryModifiers
   [junit4]   2> 778696 INFO  (TEST-TestSolrQueryParser.testPhrase-seed#[7DB87C7DA961ACAF]) [    ] o.a.s.SolrTestCaseJ4 ###Starting testPhrase
   [junit4]   2> 778699 INFO  (TEST-TestSolrQueryParser.testPhrase-seed#[7DB87C7DA961ACAF]) [    ] o.a.s.c.S.Request [collection1] webapp=null path=null params={indent=true&wt=xml&q=text:now-cow} hits=1 status=0 QTime=3 
   [junit4]   2> 778702 INFO  (TEST-TestSolrQueryParser.testPhrase-seed#[7DB87C7DA961ACAF]) [    ] o.a.s.c.S.Request [collection1] webapp=null path=null params={indent=true&wt=xml&q=text_np:now-cow} hits=2 status=0 QTime=0 
   [junit4]   2> 778703 INFO  (TEST-TestSolrQueryParser.testPhrase-seed#[7DB87C7DA961ACAF]) [    ] o.a.s.SolrTestCaseJ4 ###Ending testPhrase
   [junit4]   2> 778711 INFO  (TEST-TestSolrQueryParser.testCSQ-seed#[7DB87C7DA961ACAF]) [    ] o.a.s.SolrTestCaseJ4 ###Starting testCSQ
   [junit4]   2> 778712 INFO  (TEST-TestSolrQueryParser.testCSQ-seed#[7DB87C7DA961ACAF]) [    ] o.a.s.SolrTestCaseJ4 ###Ending testCSQ
   [junit4]   2> 778717 INFO  (TEST-TestSolrQueryParser.testComments-seed#[7DB87C7DA961ACAF]) [    ] o.a.s.SolrTestCaseJ4 ###Starting testComments
   [junit4]   2> 778718 INFO  (TEST-TestSolrQueryParser.testComments-seed#[7DB87C7DA961ACAF]) [    ] o.a.s.c.S.Request [collection1] webapp=null path=null params={wt=xml&q=id:1+id:2+/*+*:*+*/+id:3} hits=3 status=0 QTime=0 
   [junit4]   2> 778718 INFO  (TEST-TestSolrQueryParser.testComments-seed#[7DB87C7DA961ACAF]) [    ] o.a.s.c.S.Request [collection1] webapp=null path=null params={wt=xml&q=id:1+/**.*/} hits=1 status=0 QTime=0 
   [junit4]   2> 778719 INFO  (TEST-TestSolrQueryParser.testComments-seed#[7DB87C7DA961ACAF]) [    ] o.a.s.c.S.Request [collection1] webapp=null path=null params={wt=xml&q=+"/*"+id:1+id:2+"*/"+id:3} hits=3 status=0 QTime=0 
   [junit4]   2> 778719 INFO  (TEST-TestSolrQueryParser.testComments-seed#[7DB87C7DA961ACAF]) [    ] o.a.s.c.S.Request [collection1] webapp=null path=null params={wt=xml&q=id:1+/*+id:2+/*+*/+/*+/**/+id:3+*/+id:10+*/+id:11} hits=2 status=0 QTime=0 
   [junit4]   2> 778720 INFO  (TEST-TestSolrQueryParser.testComments-seed#[7DB87C7DA961ACAF]) [    ] o.a.s.SolrTestCaseJ4 ###Ending testComments
   [junit4]   2> 778728 INFO  (TEST-TestSolrQueryParser.testLocalParamsInQP-seed#[7DB87C7DA961ACAF]) [    ] o.a.s.SolrTestCaseJ4 ###Starting testLocalParamsInQP
   [junit4]   2> 778729 INFO  (TEST-TestSolrQueryParser.testLocalParamsInQP-seed#[7DB87C7DA961ACAF]) [    ] o.a.s.c.S.Request [collection1] webapp=null path=null params={wt=xml&qq=now&q=qaz+{!term+f%3Dtext+v%3D$qq}+wsx} hits=2 status=0 QTime=0 
   [junit4]   2> 778730 INFO  (TEST-TestSolrQueryParser.testLocalParamsInQP-seed#[7DB87C7DA961ACAF]) [    ] o.a.s.c.S.Request [collection1] webapp=null path=null params={wt=xml&qq=nomatch&q=qaz+{!term+f%3Dtext+v%3D$qq}+wsx} hits=0 status=0 QTime=0 
   [junit4]   2> 778730 INFO  (TEST-TestSolrQueryParser.testLocalParamsInQP-seed#[7DB87C7DA961ACAF]) [    ] o.a.s.c.S.Request [collection1] webapp=null path=null params={wt=xml&qq=now&q=qaz+{!term+f%3Dtext}now+wsx} hits=2 status=0 QTime=0 
   [junit4]   2> 778731 INFO  (TEST-TestSolrQueryParser.testLocalParamsInQP-seed#[7DB87C7DA961ACAF]) [    ] o.a.s.c.S.Request [collection1] webapp=null path=null params={wt=xml&q=qaz+{!term+f%3Dfoo_s+v%3D'a+\'+"+\\+{!+)+}+(+{+z'}+wsx} hits=1 status=0 QTime=0 
   [junit4]   2> 778739 INFO  (TEST-TestSolrQueryParser.testLocalParamsInQP-seed#[7DB87C7DA961ACAF]) [    ] o.a.s.c.S.Request [collection1] webapp=null path=null params={wt=xml&q=qaz+{!term+f%3Dfoo_s+v%3D"a+'+\"+\\+{!+)+}+(+{+z"}+wsx} hits=1 status=0 QTime=6 
   [junit4]   2> 778744 INFO  (TEST-TestSolrQueryParser.testLocalParamsInQP-seed#[7DB87C7DA961ACAF]) [    ] o.a.s.c.S.Request [collection1] webapp=null path=null params={wt=xml&q=qaz+{!join+from%3Dwww_s+to%3Deee_s}{!join+from%3Dqqq_s+to%3Dwww_s}id:10} hits=1 status=0 QTime=5 
   [junit4]   2> 778745 INFO  (TEST-TestSolrQueryParser.testLocalParamsInQP-seed#[7DB87C7DA961ACAF]) [    ] o.a.s.SolrTestCaseJ4 ###Ending testLocalParamsInQP
   [junit4]   2> 778745 INFO  (SUITE-TestSolrQueryParser-seed#[7DB87C7DA961ACAF]-worker) [    ] o.a.s.SolrTestCaseJ4 ###deleteCore
   [junit4]   2> 778745 INFO  (SUITE-TestSolrQueryParser-seed#[7DB87C7DA961ACAF]-worker) [    ] o.a.s.c.CoreContainer Shutting down CoreContainer instance=1590856224
   [junit4]   2> 778746 INFO  (SUITE-TestSolrQueryParser-seed#[7DB87C7DA961ACAF]-worker) [    x:collection1] o.a.s.c.SolrCore [collection1]  CLOSING SolrCore org.apache.solr.core.SolrCore@66956894
   [junit4]   2> 778746 INFO  (SUITE-TestSolrQueryParser-seed#[7DB87C7DA961ACAF]-worker) [    x:collection1] o.a.s.u.UpdateHandler closing DirectUpdateHandler2{commits=1,autocommits=0,soft autocommits=0,optimizes=0,rollbacks=0,expungeDeletes=0,docsPending=0,adds=0,deletesById=0,deletesByQuery=0,errors=0,cumulative_adds=7,cumulative_deletesById=0,cumulative_deletesByQuery=0,cumulative_errors=0}
   [junit4]   2> 778746 INFO  (SUITE-TestSolrQueryParser-seed#[7DB87C7DA961ACAF]-worker) [    x:collection1] o.a.s.u.SolrCoreState Closing SolrCoreState
   [junit4]   2> 778746 INFO  (SUITE-TestSolrQueryParser-seed#[7DB87C7DA961ACAF]-worker) [    x:collection1] o.a.s.u.DefaultSolrCoreState SolrCoreState ref count has reached 0 - closing IndexWriter
   [junit4]   2> 778746 INFO  (SUITE-TestSolrQueryParser-seed#[7DB87C7DA961ACAF]-worker) [    x:collection1] o.a.s.u.DefaultSolrCoreState closing IndexWriter with IndexWriterCloser
   [junit4]   2> 778747 INFO  (SUITE-TestSolrQueryParser-seed#[7DB87C7DA961ACAF]-worker) [    x:collection1] o.a.s.c.SolrCore [collection1] Closing main searcher on request.
   [junit4]   2> 778761 INFO  (SUITE-TestSolrQueryParser-seed#[7DB87C7DA961ACAF]-worker) [    x:collection1] o.a.s.c.CachingDirectoryFactory Closing MockDirectoryFactory - 2 directories currently being tracked
   [junit4]   2> 778761 INFO  (SUITE-TestSolrQueryParser-seed#[7DB87C7DA961ACAF]-worker) [    x:collection1] o.a.s.c.CachingDirectoryFactory looking to close /x1/jenkins/jenkins-slave/workspace/Lucene-Solr-Tests-5.x-Java7/solr/build/solr-core/test/J2/temp/solr.search.TestSolrQueryParser_7DB87C7DA961ACAF-001/init-core-data-001 [CachedDir<<refCount=0;path=/x1/jenkins/jenkins-slave/workspace/Lucene-Solr-Tests-5.x-Java7/solr/build/solr-core/test/J2/temp/solr.search.TestSolrQueryParser_7DB87C7DA961ACAF-001/init-core-data-001;done=false>>]
   [junit4]   2> 778761 INFO  (SUITE-TestSolrQueryParser-seed#[7DB87C7DA961ACAF]-worker) [    x:collection1] o.a.s.c.CachingDirectoryFactory Closing directory: /x1/jenkins/jenkins-slave/workspace/Lucene-Solr-Tests-5.x-Java7/solr/build/solr-core/test/J2/temp/solr.search.TestSolrQueryParser_7DB87C7DA961ACAF-001/init-core-data-001
   [junit4]   2> 778761 INFO  (SUITE-TestSolrQueryParser-seed#[7DB87C7DA961ACAF]-worker) [    x:collection1] o.a.s.c.CachingDirectoryFactory looking to close /x1/jenkins/jenkins-slave/workspace/Lucene-Solr-Tests-5.x-Java7/solr/build/solr-core/test/J2/temp/solr.search.TestSolrQueryParser_7DB87C7DA961ACAF-001/init-core-data-001/index [CachedDir<<refCount=0;path=/x1/jenkins/jenkins-slave/workspace/Lucene-Solr-Tests-5.x-Java7/solr/build/solr-core/test/J2/temp/solr.search.TestSolrQueryParser_7DB87C7DA961ACAF-001/init-core-data-001/index;done=false>>]
   [junit4]   2> 778761 INFO  (SUITE-TestSolrQueryParser-seed#[7DB87C7DA961ACAF]-worker) [    x:collection1] o.a.s.c.CachingDirectoryFactory Closing directory: /x1/jenkins/jenkins-slave/workspace/Lucene-Solr-Tests-5.x-Java7/solr/build/solr-core/test/J2/temp/solr.search.TestSolrQueryParser_7DB87C7DA961ACAF-001/init-core-data-001/index
   [junit4]   2> NOTE: leaving temporary files on disk at: /x1/jenkins/jenkins-slave/workspace/Lucene-Solr-Tests-5.x-Java7/solr/build/solr-core/test/J2/temp/solr.search.TestSolrQueryParser_7DB87C7DA961ACAF-001
   [junit4]   2> NOTE: test params are: codec=Asserting(Lucene53): {text=Lucene50(blocksize=128), qqq_s=Lucene50(blocksize=128), text_np=Lucene50(blocksize=128), foo_s=Lucene50(blocksize=128), id=PostingsFormat(name=Memory doPackFST= true), eee_s=Lucene50(blocksize=128), www_s=PostingsFormat(name=Memory doPackFST= true)}, docValues:{}, sim=DefaultSimilarity, locale=es_NI, timezone=Africa/Tripoli
   [junit4]   2> NOTE: Linux 3.13.0-52-generic amd64/Oracle Corporation 1.7.0_72 (64-bit)/cpus=4,threads=1,free=205296144,total=520617984
   [junit4]   2> NOTE: All tests run in this JVM: [DateRangeFieldTest, DistributedDebugComponentTest, OpenExchangeRatesOrgProviderTest, TestIntervalFaceting, TestCollationFieldDocValues, TestRemoveLastDynamicCopyField, FileBasedSpellCheckerTest, DataDrivenBlockJoinTest, UnloadDistributedZkTest, BlockDirectoryTest, NotRequiredUniqueKeyTest, MoreLikeThisHandlerTest, TestCSVResponseWriter, OverseerTest, TestRequestStatusCollectionAPI, TestDocSet, TestSolrQueryParserResource, TestFileDictionaryLookup, TestConfigReload, LeaderElectionTest, SortByFunctionTest, RemoteQueryErrorTest, TestClusterStateMutator, TestBulkSchemaConcurrent, TestCloudPivotFacet, DistributedIntervalFacetingTest, TestSchemaNameResource, SuggesterTest, TestConfigSets, TestSortingResponseWriter, BufferStoreTest, SampleTest, TestQueryUtils, DirectSolrSpellCheckerTest, DirectUpdateHandlerOptimizeTest, FacetPivotSmallTest, TestSimpleTrackingShardHandler, TestMaxScoreQueryParser, SearchHandlerTest, SpellCheckCollatorTest, TestSolrCLIRunExample, HighlighterMaxOffsetTest, TestOrdValues, FullSolrCloudDistribCmdsTest, AutoCommitTest, RecoveryZkTest, TestDefaultSimilarityFactory, RulesTest, SoftAutoCommitTest, DistributedQueryComponentCustomSortTest, PluginInfoTest, TestCollationField, BasicDistributedZk2Test, LoggingHandlerTest, PrimUtilsTest, RegexBoostProcessorTest, TestBulkSchemaAPI, TestFieldTypeCollectionResource, TestSolrQueryParser]
   [junit4] Completed [211/531] on J2 in 2.58s, 8 tests, 1 error <<< FAILURES!

[...truncated 1019 lines...]
BUILD FAILED
/x1/jenkins/jenkins-slave/workspace/Lucene-Solr-Tests-5.x-Java7/build.xml:726: The following error occurred while executing this line:
/x1/jenkins/jenkins-slave/workspace/Lucene-Solr-Tests-5.x-Java7/build.xml:670: The following error occurred while executing this line:
/x1/jenkins/jenkins-slave/workspace/Lucene-Solr-Tests-5.x-Java7/build.xml:59: The following error occurred while executing this line:
/x1/jenkins/jenkins-slave/workspace/Lucene-Solr-Tests-5.x-Java7/solr/build.xml:230: The following error occurred while executing this line:
/x1/jenkins/jenkins-slave/workspace/Lucene-Solr-Tests-5.x-Java7/solr/common-build.xml:524: The following error occurred while executing this line:
/x1/jenkins/jenkins-slave/workspace/Lucene-Solr-Tests-5.x-Java7/lucene/common-build.xml:1449: The following error occurred while executing this line:
/x1/jenkins/jenkins-slave/workspace/Lucene-Solr-Tests-5.x-Java7/lucene/common-build.xml:1003: There were test failures: 531 suites, 2105 tests, 1 error, 42 ignored (30 assumptions)

Total time: 58 minutes 36 seconds
Build step 'Invoke Ant' marked build as failure
Archiving artifacts
Sending artifact delta relative to Lucene-Solr-Tests-5.x-Java7 #3403
Archived 4 artifacts
Archive block size is 32768
Received 0 blocks and 339129305 bytes
Compression is 0.0%
Took 56 sec
Recording test results
Email was triggered for: Failure
Sending email for trigger: Failure



Mime
View raw message