lucene-dev mailing list archives

Site index · List index
Message view « Date » · « Thread »
Top « Date » · « Thread »
From Policeman Jenkins Server <jenk...@thetaphi.de>
Subject [JENKINS] Lucene-Solr-trunk-Linux (32bit/jdk1.8.0_51) - Build # 13840 - Failure!
Date Thu, 13 Aug 2015 10:07:44 GMT
Build: http://jenkins.thetaphi.de/job/Lucene-Solr-trunk-Linux/13840/
Java: 32bit/jdk1.8.0_51 -server -XX:+UseSerialGC

1 tests failed.
FAILED:  org.apache.solr.cloud.CdcrReplicationHandlerTest.doTest

Error Message:
There are still nodes recoverying - waited for 330 seconds

Stack Trace:
java.lang.AssertionError: There are still nodes recoverying - waited for 330 seconds
	at __randomizedtesting.SeedInfo.seed([944A27A1410A307C:330E9F052CB123C5]:0)
	at org.junit.Assert.fail(Assert.java:93)
	at org.apache.solr.cloud.AbstractDistribZkTestBase.waitForRecoveriesToFinish(AbstractDistribZkTestBase.java:172)
	at org.apache.solr.cloud.AbstractDistribZkTestBase.waitForRecoveriesToFinish(AbstractDistribZkTestBase.java:133)
	at org.apache.solr.cloud.AbstractDistribZkTestBase.waitForRecoveriesToFinish(AbstractDistribZkTestBase.java:128)
	at org.apache.solr.cloud.BaseCdcrDistributedZkTest.waitForRecoveriesToFinish(BaseCdcrDistributedZkTest.java:465)
	at org.apache.solr.cloud.BaseCdcrDistributedZkTest.clearSourceCollection(BaseCdcrDistributedZkTest.java:319)
	at org.apache.solr.cloud.CdcrReplicationHandlerTest.doTestPartialReplication(CdcrReplicationHandlerTest.java:86)
	at org.apache.solr.cloud.CdcrReplicationHandlerTest.doTest(CdcrReplicationHandlerTest.java:51)
	at sun.reflect.NativeMethodAccessorImpl.invoke0(Native Method)
	at sun.reflect.NativeMethodAccessorImpl.invoke(NativeMethodAccessorImpl.java:62)
	at sun.reflect.DelegatingMethodAccessorImpl.invoke(DelegatingMethodAccessorImpl.java:43)
	at java.lang.reflect.Method.invoke(Method.java:497)
	at com.carrotsearch.randomizedtesting.RandomizedRunner.invoke(RandomizedRunner.java:1627)
	at com.carrotsearch.randomizedtesting.RandomizedRunner$6.evaluate(RandomizedRunner.java:836)
	at com.carrotsearch.randomizedtesting.RandomizedRunner$7.evaluate(RandomizedRunner.java:872)
	at com.carrotsearch.randomizedtesting.RandomizedRunner$8.evaluate(RandomizedRunner.java:886)
	at org.apache.solr.BaseDistributedSearchTestCase$ShardsRepeatRule$ShardsFixedStatement.callStatement(BaseDistributedSearchTestCase.java:963)
	at org.apache.solr.BaseDistributedSearchTestCase$ShardsRepeatRule$ShardsStatement.evaluate(BaseDistributedSearchTestCase.java:938)
	at com.carrotsearch.randomizedtesting.rules.SystemPropertiesRestoreRule$1.evaluate(SystemPropertiesRestoreRule.java:57)
	at org.apache.lucene.util.TestRuleSetupTeardownChained$1.evaluate(TestRuleSetupTeardownChained.java:50)
	at org.apache.lucene.util.AbstractBeforeAfterRule$1.evaluate(AbstractBeforeAfterRule.java:46)
	at org.apache.lucene.util.TestRuleThreadAndTestName$1.evaluate(TestRuleThreadAndTestName.java:49)
	at org.apache.lucene.util.TestRuleIgnoreAfterMaxFailures$1.evaluate(TestRuleIgnoreAfterMaxFailures.java:65)
	at org.apache.lucene.util.TestRuleMarkFailure$1.evaluate(TestRuleMarkFailure.java:48)
	at com.carrotsearch.randomizedtesting.rules.StatementAdapter.evaluate(StatementAdapter.java:36)
	at com.carrotsearch.randomizedtesting.ThreadLeakControl$StatementRunner.run(ThreadLeakControl.java:365)
	at com.carrotsearch.randomizedtesting.ThreadLeakControl.forkTimeoutingTask(ThreadLeakControl.java:798)
	at com.carrotsearch.randomizedtesting.ThreadLeakControl$3.evaluate(ThreadLeakControl.java:458)
	at com.carrotsearch.randomizedtesting.RandomizedRunner.runSingleTest(RandomizedRunner.java:845)
	at com.carrotsearch.randomizedtesting.RandomizedRunner$3.evaluate(RandomizedRunner.java:747)
	at com.carrotsearch.randomizedtesting.RandomizedRunner$4.evaluate(RandomizedRunner.java:781)
	at com.carrotsearch.randomizedtesting.RandomizedRunner$5.evaluate(RandomizedRunner.java:792)
	at com.carrotsearch.randomizedtesting.rules.StatementAdapter.evaluate(StatementAdapter.java:36)
	at com.carrotsearch.randomizedtesting.rules.SystemPropertiesRestoreRule$1.evaluate(SystemPropertiesRestoreRule.java:57)
	at org.apache.lucene.util.AbstractBeforeAfterRule$1.evaluate(AbstractBeforeAfterRule.java:46)
	at com.carrotsearch.randomizedtesting.rules.StatementAdapter.evaluate(StatementAdapter.java:36)
	at org.apache.lucene.util.TestRuleStoreClassName$1.evaluate(TestRuleStoreClassName.java:42)
	at com.carrotsearch.randomizedtesting.rules.NoShadowingOrOverridesOnMethodsRule$1.evaluate(NoShadowingOrOverridesOnMethodsRule.java:39)
	at com.carrotsearch.randomizedtesting.rules.NoShadowingOrOverridesOnMethodsRule$1.evaluate(NoShadowingOrOverridesOnMethodsRule.java:39)
	at com.carrotsearch.randomizedtesting.rules.StatementAdapter.evaluate(StatementAdapter.java:36)
	at com.carrotsearch.randomizedtesting.rules.StatementAdapter.evaluate(StatementAdapter.java:36)
	at com.carrotsearch.randomizedtesting.rules.StatementAdapter.evaluate(StatementAdapter.java:36)
	at org.apache.lucene.util.TestRuleAssertionsRequired$1.evaluate(TestRuleAssertionsRequired.java:54)
	at org.apache.lucene.util.TestRuleMarkFailure$1.evaluate(TestRuleMarkFailure.java:48)
	at org.apache.lucene.util.TestRuleIgnoreAfterMaxFailures$1.evaluate(TestRuleIgnoreAfterMaxFailures.java:65)
	at org.apache.lucene.util.TestRuleIgnoreTestSuites$1.evaluate(TestRuleIgnoreTestSuites.java:55)
	at com.carrotsearch.randomizedtesting.rules.StatementAdapter.evaluate(StatementAdapter.java:36)
	at com.carrotsearch.randomizedtesting.ThreadLeakControl$StatementRunner.run(ThreadLeakControl.java:365)
	at java.lang.Thread.run(Thread.java:745)




Build Log:
[...truncated 11064 lines...]
   [junit4] Suite: org.apache.solr.cloud.CdcrReplicationHandlerTest
   [junit4]   2> Creating dataDir: /home/jenkins/workspace/Lucene-Solr-trunk-Linux/solr/build/solr-core/test/J0/temp/solr.cloud.CdcrReplicationHandlerTest_944A27A1410A307C-001/init-core-data-001
   [junit4]   2> 1093973 INFO  (SUITE-CdcrReplicationHandlerTest-seed#[944A27A1410A307C]-worker) [    ] o.a.s.SolrTestCaseJ4 Randomized ssl (false) and clientAuth (false)
   [junit4]   2> 1093973 INFO  (SUITE-CdcrReplicationHandlerTest-seed#[944A27A1410A307C]-worker) [    ] o.a.s.BaseDistributedSearchTestCase Setting hostContext system property: /afv/g
   [junit4]   2> 1093974 INFO  (TEST-CdcrReplicationHandlerTest.doTest-seed#[944A27A1410A307C]) [    ] o.a.s.c.ZkTestServer STARTING ZK TEST SERVER
   [junit4]   2> 1093974 INFO  (Thread-4362) [    ] o.a.s.c.ZkTestServer client port:0.0.0.0/0.0.0.0:0
   [junit4]   2> 1093974 INFO  (Thread-4362) [    ] o.a.s.c.ZkTestServer Starting server
   [junit4]   2> 1094074 INFO  (TEST-CdcrReplicationHandlerTest.doTest-seed#[944A27A1410A307C]) [    ] o.a.s.c.ZkTestServer start zk server on port:32877
   [junit4]   2> 1094074 INFO  (TEST-CdcrReplicationHandlerTest.doTest-seed#[944A27A1410A307C]) [    ] o.a.s.c.c.SolrZkClient Using default ZkCredentialsProvider
   [junit4]   2> 1094075 INFO  (TEST-CdcrReplicationHandlerTest.doTest-seed#[944A27A1410A307C]) [    ] o.a.s.c.c.ConnectionManager Waiting for client to connect to ZooKeeper
   [junit4]   2> 1094076 INFO  (zkCallback-954-thread-1) [    ] o.a.s.c.c.ConnectionManager Watcher org.apache.solr.common.cloud.ConnectionManager@b42f67 name:ZooKeeperConnection Watcher:127.0.0.1:32877 got event WatchedEvent state:SyncConnected type:None path:null path:null type:None
   [junit4]   2> 1094076 INFO  (TEST-CdcrReplicationHandlerTest.doTest-seed#[944A27A1410A307C]) [    ] o.a.s.c.c.ConnectionManager Client is connected to ZooKeeper
   [junit4]   2> 1094077 INFO  (TEST-CdcrReplicationHandlerTest.doTest-seed#[944A27A1410A307C]) [    ] o.a.s.c.c.SolrZkClient Using default ZkACLProvider
   [junit4]   2> 1094077 INFO  (TEST-CdcrReplicationHandlerTest.doTest-seed#[944A27A1410A307C]) [    ] o.a.s.c.c.SolrZkClient makePath: /solr
   [junit4]   2> 1094078 INFO  (TEST-CdcrReplicationHandlerTest.doTest-seed#[944A27A1410A307C]) [    ] o.a.s.c.c.SolrZkClient Using default ZkCredentialsProvider
   [junit4]   2> 1094078 INFO  (TEST-CdcrReplicationHandlerTest.doTest-seed#[944A27A1410A307C]) [    ] o.a.s.c.c.ConnectionManager Waiting for client to connect to ZooKeeper
   [junit4]   2> 1094079 INFO  (zkCallback-955-thread-1) [    ] o.a.s.c.c.ConnectionManager Watcher org.apache.solr.common.cloud.ConnectionManager@1d9bca6 name:ZooKeeperConnection Watcher:127.0.0.1:32877/solr got event WatchedEvent state:SyncConnected type:None path:null path:null type:None
   [junit4]   2> 1094079 INFO  (TEST-CdcrReplicationHandlerTest.doTest-seed#[944A27A1410A307C]) [    ] o.a.s.c.c.ConnectionManager Client is connected to ZooKeeper
   [junit4]   2> 1094079 INFO  (TEST-CdcrReplicationHandlerTest.doTest-seed#[944A27A1410A307C]) [    ] o.a.s.c.c.SolrZkClient Using default ZkACLProvider
   [junit4]   2> 1094080 INFO  (TEST-CdcrReplicationHandlerTest.doTest-seed#[944A27A1410A307C]) [    ] o.a.s.c.c.SolrZkClient makePath: /collections/collection1
   [junit4]   2> 1094080 INFO  (TEST-CdcrReplicationHandlerTest.doTest-seed#[944A27A1410A307C]) [    ] o.a.s.c.c.SolrZkClient makePath: /collections/collection1/shards
   [junit4]   2> 1094081 INFO  (TEST-CdcrReplicationHandlerTest.doTest-seed#[944A27A1410A307C]) [    ] o.a.s.c.c.SolrZkClient makePath: /collections/control_collection
   [junit4]   2> 1094081 INFO  (TEST-CdcrReplicationHandlerTest.doTest-seed#[944A27A1410A307C]) [    ] o.a.s.c.c.SolrZkClient makePath: /collections/control_collection/shards
   [junit4]   2> 1094081 INFO  (TEST-CdcrReplicationHandlerTest.doTest-seed#[944A27A1410A307C]) [    ] o.a.s.c.AbstractZkTestCase put /home/jenkins/workspace/Lucene-Solr-trunk-Linux/solr/core/src/test-files/solr/collection1/conf/solrconfig-cdcr.xml to /configs/conf1/solrconfig.xml
   [junit4]   2> 1094082 INFO  (TEST-CdcrReplicationHandlerTest.doTest-seed#[944A27A1410A307C]) [    ] o.a.s.c.c.SolrZkClient makePath: /configs/conf1/solrconfig.xml
   [junit4]   2> 1094082 INFO  (TEST-CdcrReplicationHandlerTest.doTest-seed#[944A27A1410A307C]) [    ] o.a.s.c.AbstractZkTestCase put /home/jenkins/workspace/Lucene-Solr-trunk-Linux/solr/core/src/test-files/solr/collection1/conf/schema15.xml to /configs/conf1/schema.xml
   [junit4]   2> 1094082 INFO  (TEST-CdcrReplicationHandlerTest.doTest-seed#[944A27A1410A307C]) [    ] o.a.s.c.c.SolrZkClient makePath: /configs/conf1/schema.xml
   [junit4]   2> 1094083 INFO  (TEST-CdcrReplicationHandlerTest.doTest-seed#[944A27A1410A307C]) [    ] o.a.s.c.AbstractZkTestCase put /home/jenkins/workspace/Lucene-Solr-trunk-Linux/solr/core/src/test-files/solr/collection1/conf/solrconfig.snippet.randomindexconfig.xml to /configs/conf1/solrconfig.snippet.randomindexconfig.xml
   [junit4]   2> 1094083 INFO  (TEST-CdcrReplicationHandlerTest.doTest-seed#[944A27A1410A307C]) [    ] o.a.s.c.c.SolrZkClient makePath: /configs/conf1/solrconfig.snippet.randomindexconfig.xml
   [junit4]   2> 1094084 INFO  (TEST-CdcrReplicationHandlerTest.doTest-seed#[944A27A1410A307C]) [    ] o.a.s.c.AbstractZkTestCase put /home/jenkins/workspace/Lucene-Solr-trunk-Linux/solr/core/src/test-files/solr/collection1/conf/stopwords.txt to /configs/conf1/stopwords.txt
   [junit4]   2> 1094084 INFO  (TEST-CdcrReplicationHandlerTest.doTest-seed#[944A27A1410A307C]) [    ] o.a.s.c.c.SolrZkClient makePath: /configs/conf1/stopwords.txt
   [junit4]   2> 1094085 INFO  (TEST-CdcrReplicationHandlerTest.doTest-seed#[944A27A1410A307C]) [    ] o.a.s.c.AbstractZkTestCase put /home/jenkins/workspace/Lucene-Solr-trunk-Linux/solr/core/src/test-files/solr/collection1/conf/protwords.txt to /configs/conf1/protwords.txt
   [junit4]   2> 1094085 INFO  (TEST-CdcrReplicationHandlerTest.doTest-seed#[944A27A1410A307C]) [    ] o.a.s.c.c.SolrZkClient makePath: /configs/conf1/protwords.txt
   [junit4]   2> 1094085 INFO  (TEST-CdcrReplicationHandlerTest.doTest-seed#[944A27A1410A307C]) [    ] o.a.s.c.AbstractZkTestCase put /home/jenkins/workspace/Lucene-Solr-trunk-Linux/solr/core/src/test-files/solr/collection1/conf/currency.xml to /configs/conf1/currency.xml
   [junit4]   2> 1094085 INFO  (TEST-CdcrReplicationHandlerTest.doTest-seed#[944A27A1410A307C]) [    ] o.a.s.c.c.SolrZkClient makePath: /configs/conf1/currency.xml
   [junit4]   2> 1094086 INFO  (TEST-CdcrReplicationHandlerTest.doTest-seed#[944A27A1410A307C]) [    ] o.a.s.c.AbstractZkTestCase put /home/jenkins/workspace/Lucene-Solr-trunk-Linux/solr/core/src/test-files/solr/collection1/conf/enumsConfig.xml to /configs/conf1/enumsConfig.xml
   [junit4]   2> 1094086 INFO  (TEST-CdcrReplicationHandlerTest.doTest-seed#[944A27A1410A307C]) [    ] o.a.s.c.c.SolrZkClient makePath: /configs/conf1/enumsConfig.xml
   [junit4]   2> 1094086 INFO  (TEST-CdcrReplicationHandlerTest.doTest-seed#[944A27A1410A307C]) [    ] o.a.s.c.AbstractZkTestCase put /home/jenkins/workspace/Lucene-Solr-trunk-Linux/solr/core/src/test-files/solr/collection1/conf/open-exchange-rates.json to /configs/conf1/open-exchange-rates.json
   [junit4]   2> 1094087 INFO  (TEST-CdcrReplicationHandlerTest.doTest-seed#[944A27A1410A307C]) [    ] o.a.s.c.c.SolrZkClient makePath: /configs/conf1/open-exchange-rates.json
   [junit4]   2> 1094087 INFO  (TEST-CdcrReplicationHandlerTest.doTest-seed#[944A27A1410A307C]) [    ] o.a.s.c.AbstractZkTestCase put /home/jenkins/workspace/Lucene-Solr-trunk-Linux/solr/core/src/test-files/solr/collection1/conf/mapping-ISOLatin1Accent.txt to /configs/conf1/mapping-ISOLatin1Accent.txt
   [junit4]   2> 1094087 INFO  (TEST-CdcrReplicationHandlerTest.doTest-seed#[944A27A1410A307C]) [    ] o.a.s.c.c.SolrZkClient makePath: /configs/conf1/mapping-ISOLatin1Accent.txt
   [junit4]   2> 1094088 INFO  (TEST-CdcrReplicationHandlerTest.doTest-seed#[944A27A1410A307C]) [    ] o.a.s.c.AbstractZkTestCase put /home/jenkins/workspace/Lucene-Solr-trunk-Linux/solr/core/src/test-files/solr/collection1/conf/old_synonyms.txt to /configs/conf1/old_synonyms.txt
   [junit4]   2> 1094088 INFO  (TEST-CdcrReplicationHandlerTest.doTest-seed#[944A27A1410A307C]) [    ] o.a.s.c.c.SolrZkClient makePath: /configs/conf1/old_synonyms.txt
   [junit4]   2> 1094088 INFO  (TEST-CdcrReplicationHandlerTest.doTest-seed#[944A27A1410A307C]) [    ] o.a.s.c.AbstractZkTestCase put /home/jenkins/workspace/Lucene-Solr-trunk-Linux/solr/core/src/test-files/solr/collection1/conf/synonyms.txt to /configs/conf1/synonyms.txt
   [junit4]   2> 1094089 INFO  (TEST-CdcrReplicationHandlerTest.doTest-seed#[944A27A1410A307C]) [    ] o.a.s.c.c.SolrZkClient makePath: /configs/conf1/synonyms.txt
   [junit4]   2> 1094089 INFO  (TEST-CdcrReplicationHandlerTest.doTest-seed#[944A27A1410A307C]) [    ] o.a.s.SolrTestCaseJ4 ###Starting doTest
   [junit4]   2> 1094140 INFO  (TEST-CdcrReplicationHandlerTest.doTest-seed#[944A27A1410A307C]) [    ] o.a.s.SolrTestCaseJ4 Writing core.properties file to /home/jenkins/workspace/Lucene-Solr-trunk-Linux/solr/build/solr-core/test/J0/temp/solr.cloud.CdcrReplicationHandlerTest_944A27A1410A307C-001/jetty-001/cores/collection1
   [junit4]   2> 1094141 INFO  (TEST-CdcrReplicationHandlerTest.doTest-seed#[944A27A1410A307C]) [    ] o.e.j.s.Server jetty-9.2.11.v20150529
   [junit4]   2> 1094141 INFO  (TEST-CdcrReplicationHandlerTest.doTest-seed#[944A27A1410A307C]) [    ] o.e.j.s.h.ContextHandler Started o.e.j.s.ServletContextHandler@1258e99{/afv/g,null,AVAILABLE}
   [junit4]   2> 1094142 INFO  (TEST-CdcrReplicationHandlerTest.doTest-seed#[944A27A1410A307C]) [    ] o.e.j.s.ServerConnector Started ServerConnector@15a260{HTTP/1.1}{127.0.0.1:50718}
   [junit4]   2> 1094142 INFO  (TEST-CdcrReplicationHandlerTest.doTest-seed#[944A27A1410A307C]) [    ] o.e.j.s.Server Started @1095736ms
   [junit4]   2> 1094142 INFO  (TEST-CdcrReplicationHandlerTest.doTest-seed#[944A27A1410A307C]) [    ] o.a.s.c.s.e.JettySolrRunner Jetty properties: {shards=shard1, hostContext=/afv/g, hostPort=50718, coreRootDirectory=/home/jenkins/workspace/Lucene-Solr-trunk-Linux/solr/build/solr-core/test/J0/temp/solr.cloud.CdcrReplicationHandlerTest_944A27A1410A307C-001/jetty-001/cores}
   [junit4]   2> 1094142 INFO  (TEST-CdcrReplicationHandlerTest.doTest-seed#[944A27A1410A307C]) [    ] o.a.s.s.SolrDispatchFilter SolrDispatchFilter.init(): sun.misc.Launcher$AppClassLoader@e2f2a
   [junit4]   2> 1094142 INFO  (TEST-CdcrReplicationHandlerTest.doTest-seed#[944A27A1410A307C]) [    ] o.a.s.c.SolrResourceLoader new SolrResourceLoader for directory: '/home/jenkins/workspace/Lucene-Solr-trunk-Linux/solr/build/solr-core/test/J0/temp/solr.cloud.CdcrReplicationHandlerTest_944A27A1410A307C-001/jetty-001/'
   [junit4]   2> 1094150 INFO  (TEST-CdcrReplicationHandlerTest.doTest-seed#[944A27A1410A307C]) [    ] o.a.s.c.c.SolrZkClient Using default ZkCredentialsProvider
   [junit4]   2> 1094150 INFO  (TEST-CdcrReplicationHandlerTest.doTest-seed#[944A27A1410A307C]) [    ] o.a.s.c.c.ConnectionManager Waiting for client to connect to ZooKeeper
   [junit4]   2> 1094151 INFO  (zkCallback-956-thread-1) [    ] o.a.s.c.c.ConnectionManager Watcher org.apache.solr.common.cloud.ConnectionManager@1610d7b name:ZooKeeperConnection Watcher:127.0.0.1:32877/solr got event WatchedEvent state:SyncConnected type:None path:null path:null type:None
   [junit4]   2> 1094151 INFO  (TEST-CdcrReplicationHandlerTest.doTest-seed#[944A27A1410A307C]) [    ] o.a.s.c.c.ConnectionManager Client is connected to ZooKeeper
   [junit4]   2> 1094152 INFO  (TEST-CdcrReplicationHandlerTest.doTest-seed#[944A27A1410A307C]) [    ] o.a.s.c.c.SolrZkClient Using default ZkACLProvider
   [junit4]   2> 1094152 INFO  (TEST-CdcrReplicationHandlerTest.doTest-seed#[944A27A1410A307C]) [    ] o.a.s.s.SolrDispatchFilter Loading solr.xml from SolrHome (not found in ZooKeeper)
   [junit4]   2> 1094152 INFO  (TEST-CdcrReplicationHandlerTest.doTest-seed#[944A27A1410A307C]) [    ] o.a.s.c.SolrXmlConfig Loading container configuration from /home/jenkins/workspace/Lucene-Solr-trunk-Linux/solr/build/solr-core/test/J0/temp/solr.cloud.CdcrReplicationHandlerTest_944A27A1410A307C-001/jetty-001/solr.xml
   [junit4]   2> 1094155 INFO  (TEST-CdcrReplicationHandlerTest.doTest-seed#[944A27A1410A307C]) [    ] o.a.s.c.CoresLocator Config-defined core root directory: /home/jenkins/workspace/Lucene-Solr-trunk-Linux/solr/build/solr-core/test/J0/temp/solr.cloud.CdcrReplicationHandlerTest_944A27A1410A307C-001/jetty-001/cores
   [junit4]   2> 1094155 INFO  (TEST-CdcrReplicationHandlerTest.doTest-seed#[944A27A1410A307C]) [    ] o.a.s.c.CoreContainer New CoreContainer 17273756
   [junit4]   2> 1094155 INFO  (TEST-CdcrReplicationHandlerTest.doTest-seed#[944A27A1410A307C]) [    ] o.a.s.c.CoreContainer Loading cores into CoreContainer [instanceDir=/home/jenkins/workspace/Lucene-Solr-trunk-Linux/solr/build/solr-core/test/J0/temp/solr.cloud.CdcrReplicationHandlerTest_944A27A1410A307C-001/jetty-001/]
   [junit4]   2> 1094155 INFO  (TEST-CdcrReplicationHandlerTest.doTest-seed#[944A27A1410A307C]) [    ] o.a.s.c.CoreContainer loading shared library: /home/jenkins/workspace/Lucene-Solr-trunk-Linux/solr/build/solr-core/test/J0/temp/solr.cloud.CdcrReplicationHandlerTest_944A27A1410A307C-001/jetty-001/lib
   [junit4]   2> 1094155 WARN  (TEST-CdcrReplicationHandlerTest.doTest-seed#[944A27A1410A307C]) [    ] o.a.s.c.SolrResourceLoader Can't find (or read) directory to add to classloader: lib (resolved as: /home/jenkins/workspace/Lucene-Solr-trunk-Linux/solr/build/solr-core/test/J0/temp/solr.cloud.CdcrReplicationHandlerTest_944A27A1410A307C-001/jetty-001/lib).
   [junit4]   2> 1094159 INFO  (TEST-CdcrReplicationHandlerTest.doTest-seed#[944A27A1410A307C]) [    ] o.a.s.h.c.HttpShardHandlerFactory created with socketTimeout : 90000,urlScheme : ,connTimeout : 15000,maxConnectionsPerHost : 20,maxConnections : 10000,corePoolSize : 0,maximumPoolSize : 2147483647,maxThreadIdleTime : 5,sizeOfQueue : -1,fairnessPolicy : false,useRetries : false,
   [junit4]   2> 1094160 INFO  (TEST-CdcrReplicationHandlerTest.doTest-seed#[944A27A1410A307C]) [    ] o.a.s.u.UpdateShardHandler Creating UpdateShardHandler HTTP client with params: socketTimeout=340000&connTimeout=45000&retry=true
   [junit4]   2> 1094161 INFO  (TEST-CdcrReplicationHandlerTest.doTest-seed#[944A27A1410A307C]) [    ] o.a.s.l.LogWatcher SLF4J impl is org.slf4j.impl.Log4jLoggerFactory
   [junit4]   2> 1094161 INFO  (TEST-CdcrReplicationHandlerTest.doTest-seed#[944A27A1410A307C]) [    ] o.a.s.l.LogWatcher Registering Log Listener [Log4j (org.slf4j.impl.Log4jLoggerFactory)]
   [junit4]   2> 1094161 INFO  (TEST-CdcrReplicationHandlerTest.doTest-seed#[944A27A1410A307C]) [    ] o.a.s.c.ZkContainer Zookeeper client=127.0.0.1:32877/solr
   [junit4]   2> 1094161 INFO  (TEST-CdcrReplicationHandlerTest.doTest-seed#[944A27A1410A307C]) [    ] o.a.s.c.ZkController zkHost includes chroot
   [junit4]   2> 1094161 INFO  (TEST-CdcrReplicationHandlerTest.doTest-seed#[944A27A1410A307C]) [    ] o.a.s.c.c.SolrZkClient Using default ZkCredentialsProvider
   [junit4]   2> 1094162 INFO  (TEST-CdcrReplicationHandlerTest.doTest-seed#[944A27A1410A307C]) [    ] o.a.s.c.c.ConnectionManager Waiting for client to connect to ZooKeeper
   [junit4]   2> 1094162 INFO  (zkCallback-958-thread-1) [    ] o.a.s.c.c.ConnectionManager Watcher org.apache.solr.common.cloud.ConnectionManager@3bb128 name:ZooKeeperConnection Watcher:127.0.0.1:32877 got event WatchedEvent state:SyncConnected type:None path:null path:null type:None
   [junit4]   2> 1094162 INFO  (TEST-CdcrReplicationHandlerTest.doTest-seed#[944A27A1410A307C]) [    ] o.a.s.c.c.ConnectionManager Client is connected to ZooKeeper
   [junit4]   2> 1094163 INFO  (TEST-CdcrReplicationHandlerTest.doTest-seed#[944A27A1410A307C]) [    ] o.a.s.c.c.SolrZkClient Using default ZkACLProvider
   [junit4]   2> 1094164 INFO  (TEST-CdcrReplicationHandlerTest.doTest-seed#[944A27A1410A307C]) [n:127.0.0.1:50718_afv%2Fg    ] o.a.s.c.c.ConnectionManager Waiting for client to connect to ZooKeeper
   [junit4]   2> 1094164 INFO  (zkCallback-959-thread-1-processing-n:127.0.0.1:50718_afv%2Fg) [n:127.0.0.1:50718_afv%2Fg    ] o.a.s.c.c.ConnectionManager Watcher org.apache.solr.common.cloud.ConnectionManager@2edf56 name:ZooKeeperConnection Watcher:127.0.0.1:32877/solr got event WatchedEvent state:SyncConnected type:None path:null path:null type:None
   [junit4]   2> 1094164 INFO  (TEST-CdcrReplicationHandlerTest.doTest-seed#[944A27A1410A307C]) [n:127.0.0.1:50718_afv%2Fg    ] o.a.s.c.c.ConnectionManager Client is connected to ZooKeeper
   [junit4]   2> 1094165 INFO  (TEST-CdcrReplicationHandlerTest.doTest-seed#[944A27A1410A307C]) [n:127.0.0.1:50718_afv%2Fg    ] o.a.s.c.c.SolrZkClient makePath: /overseer/queue
   [junit4]   2> 1094166 INFO  (TEST-CdcrReplicationHandlerTest.doTest-seed#[944A27A1410A307C]) [n:127.0.0.1:50718_afv%2Fg    ] o.a.s.c.c.SolrZkClient makePath: /overseer/collection-queue-work
   [junit4]   2> 1094166 INFO  (TEST-CdcrReplicationHandlerTest.doTest-seed#[944A27A1410A307C]) [n:127.0.0.1:50718_afv%2Fg    ] o.a.s.c.c.SolrZkClient makePath: /overseer/collection-map-running
   [junit4]   2> 1094167 INFO  (TEST-CdcrReplicationHandlerTest.doTest-seed#[944A27A1410A307C]) [n:127.0.0.1:50718_afv%2Fg    ] o.a.s.c.c.SolrZkClient makePath: /overseer/collection-map-completed
   [junit4]   2> 1094167 INFO  (TEST-CdcrReplicationHandlerTest.doTest-seed#[944A27A1410A307C]) [n:127.0.0.1:50718_afv%2Fg    ] o.a.s.c.c.SolrZkClient makePath: /overseer/collection-map-failure
   [junit4]   2> 1094168 INFO  (TEST-CdcrReplicationHandlerTest.doTest-seed#[944A27A1410A307C]) [n:127.0.0.1:50718_afv%2Fg    ] o.a.s.c.c.SolrZkClient makePath: /live_nodes
   [junit4]   2> 1094169 INFO  (TEST-CdcrReplicationHandlerTest.doTest-seed#[944A27A1410A307C]) [n:127.0.0.1:50718_afv%2Fg    ] o.a.s.c.c.SolrZkClient makePath: /aliases.json
   [junit4]   2> 1094169 INFO  (TEST-CdcrReplicationHandlerTest.doTest-seed#[944A27A1410A307C]) [n:127.0.0.1:50718_afv%2Fg    ] o.a.s.c.c.SolrZkClient makePath: /clusterstate.json
   [junit4]   2> 1094169 INFO  (TEST-CdcrReplicationHandlerTest.doTest-seed#[944A27A1410A307C]) [n:127.0.0.1:50718_afv%2Fg    ] o.a.s.c.c.SolrZkClient makePath: /security.json
   [junit4]   2> 1094170 INFO  (TEST-CdcrReplicationHandlerTest.doTest-seed#[944A27A1410A307C]) [n:127.0.0.1:50718_afv%2Fg    ] o.a.s.c.ZkController Register node as live in ZooKeeper:/live_nodes/127.0.0.1:50718_afv%2Fg
   [junit4]   2> 1094170 INFO  (TEST-CdcrReplicationHandlerTest.doTest-seed#[944A27A1410A307C]) [n:127.0.0.1:50718_afv%2Fg    ] o.a.s.c.c.SolrZkClient makePath: /live_nodes/127.0.0.1:50718_afv%2Fg
   [junit4]   2> 1094171 INFO  (TEST-CdcrReplicationHandlerTest.doTest-seed#[944A27A1410A307C]) [n:127.0.0.1:50718_afv%2Fg    ] o.a.s.c.c.SolrZkClient makePath: /overseer_elect
   [junit4]   2> 1094171 INFO  (TEST-CdcrReplicationHandlerTest.doTest-seed#[944A27A1410A307C]) [n:127.0.0.1:50718_afv%2Fg    ] o.a.s.c.c.SolrZkClient makePath: /overseer_elect/election
   [junit4]   2> 1094171 INFO  (TEST-CdcrReplicationHandlerTest.doTest-seed#[944A27A1410A307C]) [n:127.0.0.1:50718_afv%2Fg    ] o.a.s.c.Overseer Overseer (id=null) closing
   [junit4]   2> 1094172 INFO  (TEST-CdcrReplicationHandlerTest.doTest-seed#[944A27A1410A307C]) [n:127.0.0.1:50718_afv%2Fg    ] o.a.s.c.LeaderElector Joined leadership election with path: /overseer_elect/election/94336437902442500-127.0.0.1:50718_afv%2Fg-n_0000000000
   [junit4]   2> 1094172 INFO  (TEST-CdcrReplicationHandlerTest.doTest-seed#[944A27A1410A307C]) [n:127.0.0.1:50718_afv%2Fg    ] o.a.s.c.OverseerElectionContext I am going to be the leader 127.0.0.1:50718_afv%2Fg
   [junit4]   2> 1094172 INFO  (TEST-CdcrReplicationHandlerTest.doTest-seed#[944A27A1410A307C]) [n:127.0.0.1:50718_afv%2Fg    ] o.a.s.c.c.SolrZkClient makePath: /overseer_elect/leader
   [junit4]   2> 1094173 INFO  (TEST-CdcrReplicationHandlerTest.doTest-seed#[944A27A1410A307C]) [n:127.0.0.1:50718_afv%2Fg    ] o.a.s.c.Overseer Overseer (id=94336437902442500-127.0.0.1:50718_afv%2Fg-n_0000000000) starting
   [junit4]   2> 1094174 INFO  (TEST-CdcrReplicationHandlerTest.doTest-seed#[944A27A1410A307C]) [n:127.0.0.1:50718_afv%2Fg    ] o.a.s.c.c.SolrZkClient makePath: /overseer/queue-work
   [junit4]   2> 1094175 INFO  (TEST-CdcrReplicationHandlerTest.doTest-seed#[944A27A1410A307C]) [n:127.0.0.1:50718_afv%2Fg    ] o.a.s.c.OverseerAutoReplicaFailoverThread Starting OverseerAutoReplicaFailoverThread autoReplicaFailoverWorkLoopDelay=10000 autoReplicaFailoverWaitAfterExpiration=30000 autoReplicaFailoverBadNodeExpiration=60000
   [junit4]   2> 1094176 INFO  (OverseerCollectionProcessor-94336437902442500-127.0.0.1:50718_afv%2Fg-n_0000000000) [n:127.0.0.1:50718_afv%2Fg    ] o.a.s.c.OverseerProcessor Process current queue of overseer operations
   [junit4]   2> 1094176 INFO  (TEST-CdcrReplicationHandlerTest.doTest-seed#[944A27A1410A307C]) [n:127.0.0.1:50718_afv%2Fg    ] o.a.s.c.c.ZkStateReader Updating cluster state from ZooKeeper... 
   [junit4]   2> 1094176 INFO  (OverseerStateUpdate-94336437902442500-127.0.0.1:50718_afv%2Fg-n_0000000000) [n:127.0.0.1:50718_afv%2Fg    ] o.a.s.c.Overseer Starting to work on the main queue
   [junit4]   2> 1094199 INFO  (TEST-CdcrReplicationHandlerTest.doTest-seed#[944A27A1410A307C]) [n:127.0.0.1:50718_afv%2Fg    ] o.a.s.c.CoreContainer Security conf doesn't exist. Skipping setup for authorization module.
   [junit4]   2> 1094199 INFO  (TEST-CdcrReplicationHandlerTest.doTest-seed#[944A27A1410A307C]) [n:127.0.0.1:50718_afv%2Fg    ] o.a.s.c.CoreContainer No authentication plugin used.
   [junit4]   2> 1094199 INFO  (TEST-CdcrReplicationHandlerTest.doTest-seed#[944A27A1410A307C]) [n:127.0.0.1:50718_afv%2Fg    ] o.a.s.c.CoresLocator Looking for core definitions underneath /home/jenkins/workspace/Lucene-Solr-trunk-Linux/solr/build/solr-core/test/J0/temp/solr.cloud.CdcrReplicationHandlerTest_944A27A1410A307C-001/jetty-001/cores
   [junit4]   2> 1094200 INFO  (TEST-CdcrReplicationHandlerTest.doTest-seed#[944A27A1410A307C]) [n:127.0.0.1:50718_afv%2Fg    ] o.a.s.c.SolrCore Created CoreDescriptor: {name=collection1, config=solrconfig.xml, transient=false, schema=schema.xml, loadOnStartup=true, configSetProperties=configsetprops.json, instanceDir=/home/jenkins/workspace/Lucene-Solr-trunk-Linux/solr/build/solr-core/test/J0/temp/solr.cloud.CdcrReplicationHandlerTest_944A27A1410A307C-001/jetty-001/cores/collection1, collection=tmp_collection, absoluteInstDir=/home/jenkins/workspace/Lucene-Solr-trunk-Linux/solr/build/solr-core/test/J0/temp/solr.cloud.CdcrReplicationHandlerTest_944A27A1410A307C-001/jetty-001/cores/collection1/, coreNodeName=, dataDir=data/, shard=}
   [junit4]   2> 1094200 INFO  (TEST-CdcrReplicationHandlerTest.doTest-seed#[944A27A1410A307C]) [n:127.0.0.1:50718_afv%2Fg    ] o.a.s.c.CoresLocator Found core collection1 in /home/jenkins/workspace/Lucene-Solr-trunk-Linux/solr/build/solr-core/test/J0/temp/solr.cloud.CdcrReplicationHandlerTest_944A27A1410A307C-001/jetty-001/cores/collection1/
   [junit4]   2> 1094200 INFO  (TEST-CdcrReplicationHandlerTest.doTest-seed#[944A27A1410A307C]) [n:127.0.0.1:50718_afv%2Fg    ] o.a.s.c.CoresLocator Found 1 core definitions
   [junit4]   2> 1094200 INFO  (coreLoadExecutor-4790-thread-1-processing-n:127.0.0.1:50718_afv%2Fg) [n:127.0.0.1:50718_afv%2Fg c:tmp_collection   x:collection1] o.a.s.c.ZkController publishing state=down
   [junit4]   2> 1094201 INFO  (TEST-CdcrReplicationHandlerTest.doTest-seed#[944A27A1410A307C]) [n:127.0.0.1:50718_afv%2Fg    ] o.a.s.s.SolrDispatchFilter user.dir=/home/jenkins/workspace/Lucene-Solr-trunk-Linux/solr/build/solr-core/test/J0
   [junit4]   2> 1094201 INFO  (TEST-CdcrReplicationHandlerTest.doTest-seed#[944A27A1410A307C]) [n:127.0.0.1:50718_afv%2Fg    ] o.a.s.s.SolrDispatchFilter SolrDispatchFilter.init() done
   [junit4]   2> 1094201 INFO  (coreLoadExecutor-4790-thread-1-processing-n:127.0.0.1:50718_afv%2Fg) [n:127.0.0.1:50718_afv%2Fg c:tmp_collection   x:collection1] o.a.s.c.ZkController numShards not found on descriptor - reading it from system property
   [junit4]   2> 1094201 INFO  (zkCallback-959-thread-1-processing-n:127.0.0.1:50718_afv%2Fg) [n:127.0.0.1:50718_afv%2Fg    ] o.a.s.c.DistributedQueue NodeChildrenChanged fired on path /overseer/queue state SyncConnected
   [junit4]   2> 1094201 INFO  (coreLoadExecutor-4790-thread-1-processing-n:127.0.0.1:50718_afv%2Fg) [n:127.0.0.1:50718_afv%2Fg c:tmp_collection   x:collection1] o.a.s.c.ZkController look for our core node name
   [junit4]   2> 1094202 INFO  (OverseerStateUpdate-94336437902442500-127.0.0.1:50718_afv%2Fg-n_0000000000) [n:127.0.0.1:50718_afv%2Fg    ] o.a.s.c.Overseer processMessage: queueSize: 1, message = {
   [junit4]   2>   "core":"collection1",
   [junit4]   2>   "roles":null,
   [junit4]   2>   "base_url":"http://127.0.0.1:50718/afv/g",
   [junit4]   2>   "node_name":"127.0.0.1:50718_afv%2Fg",
   [junit4]   2>   "numShards":"1",
   [junit4]   2>   "state":"down",
   [junit4]   2>   "shard":null,
   [junit4]   2>   "collection":"tmp_collection",
   [junit4]   2>   "operation":"state"} current state version: 0
   [junit4]   2> 1094202 INFO  (OverseerStateUpdate-94336437902442500-127.0.0.1:50718_afv%2Fg-n_0000000000) [n:127.0.0.1:50718_afv%2Fg    ] o.a.s.c.o.ReplicaMutator Update state numShards=1 message={
   [junit4]   2>   "core":"collection1",
   [junit4]   2>   "roles":null,
   [junit4]   2>   "base_url":"http://127.0.0.1:50718/afv/g",
   [junit4]   2>   "node_name":"127.0.0.1:50718_afv%2Fg",
   [junit4]   2>   "numShards":"1",
   [junit4]   2>   "state":"down",
   [junit4]   2>   "shard":null,
   [junit4]   2>   "collection":"tmp_collection",
   [junit4]   2>   "operation":"state"}
   [junit4]   2> 1094202 INFO  (OverseerStateUpdate-94336437902442500-127.0.0.1:50718_afv%2Fg-n_0000000000) [n:127.0.0.1:50718_afv%2Fg    ] o.a.s.c.o.ClusterStateMutator building a new cName: tmp_collection
   [junit4]   2> 1094202 INFO  (OverseerStateUpdate-94336437902442500-127.0.0.1:50718_afv%2Fg-n_0000000000) [n:127.0.0.1:50718_afv%2Fg    ] o.a.s.c.o.ReplicaMutator Assigning new node to shard shard=shard1
   [junit4]   2> 1094203 INFO  (zkCallback-959-thread-1-processing-n:127.0.0.1:50718_afv%2Fg) [n:127.0.0.1:50718_afv%2Fg    ] o.a.s.c.c.ZkStateReader A cluster state change: WatchedEvent state:SyncConnected type:NodeDataChanged path:/clusterstate.json, has occurred - updating... (live nodes size: 1)
   [junit4]   2> 1095201 INFO  (coreLoadExecutor-4790-thread-1-processing-n:127.0.0.1:50718_afv%2Fg) [n:127.0.0.1:50718_afv%2Fg c:tmp_collection   x:collection1] o.a.s.c.ZkController waiting to find shard id in clusterstate for collection1
   [junit4]   2> 1095202 INFO  (coreLoadExecutor-4790-thread-1-processing-n:127.0.0.1:50718_afv%2Fg) [n:127.0.0.1:50718_afv%2Fg c:tmp_collection   x:collection1] o.a.s.c.ZkController Check for collection zkNode:tmp_collection
   [junit4]   2> 1095202 INFO  (coreLoadExecutor-4790-thread-1-processing-n:127.0.0.1:50718_afv%2Fg) [n:127.0.0.1:50718_afv%2Fg c:tmp_collection   x:collection1] o.a.s.c.ZkController Creating collection in ZooKeeper:tmp_collection
   [junit4]   2> 1095202 INFO  (coreLoadExecutor-4790-thread-1-processing-n:127.0.0.1:50718_afv%2Fg) [n:127.0.0.1:50718_afv%2Fg c:tmp_collection   x:collection1] o.a.s.c.ZkController Looking for collection configName
   [junit4]   2> 1095203 INFO  (coreLoadExecutor-4790-thread-1-processing-n:127.0.0.1:50718_afv%2Fg) [n:127.0.0.1:50718_afv%2Fg c:tmp_collection   x:collection1] o.a.s.c.ZkController Only one config set found in zk - using it:conf1
   [junit4]   2> 1095203 INFO  (coreLoadExecutor-4790-thread-1-processing-n:127.0.0.1:50718_afv%2Fg) [n:127.0.0.1:50718_afv%2Fg c:tmp_collection   x:collection1] o.a.s.c.c.SolrZkClient makePath: /collections/tmp_collection
   [junit4]   2> 1095203 INFO  (coreLoadExecutor-4790-thread-1-processing-n:127.0.0.1:50718_afv%2Fg) [n:127.0.0.1:50718_afv%2Fg c:tmp_collection   x:collection1] o.a.s.c.c.ZkStateReader Load collection config from:/collections/tmp_collection
   [junit4]   2> 1095204 INFO  (coreLoadExecutor-4790-thread-1-processing-n:127.0.0.1:50718_afv%2Fg) [n:127.0.0.1:50718_afv%2Fg c:tmp_collection   x:collection1] o.a.s.c.c.ZkStateReader path=/collections/tmp_collection configName=conf1 specified config exists in ZooKeeper
   [junit4]   2> 1095204 INFO  (coreLoadExecutor-4790-thread-1-processing-n:127.0.0.1:50718_afv%2Fg) [n:127.0.0.1:50718_afv%2Fg c:tmp_collection   x:collection1] o.a.s.c.SolrResourceLoader new SolrResourceLoader for directory: '/home/jenkins/workspace/Lucene-Solr-trunk-Linux/solr/build/solr-core/test/J0/temp/solr.cloud.CdcrReplicationHandlerTest_944A27A1410A307C-001/jetty-001/cores/collection1/'
   [junit4]   2> 1095211 INFO  (coreLoadExecutor-4790-thread-1-processing-n:127.0.0.1:50718_afv%2Fg) [n:127.0.0.1:50718_afv%2Fg c:tmp_collection   x:collection1] o.a.s.c.Config loaded config solrconfig.xml with version 0 
   [junit4]   2> 1095213 INFO  (coreLoadExecutor-4790-thread-1-processing-n:127.0.0.1:50718_afv%2Fg) [n:127.0.0.1:50718_afv%2Fg c:tmp_collection   x:collection1] o.a.s.c.SolrConfig current version of requestparams : -1
   [junit4]   2> 1095215 INFO  (coreLoadExecutor-4790-thread-1-processing-n:127.0.0.1:50718_afv%2Fg) [n:127.0.0.1:50718_afv%2Fg c:tmp_collection   x:collection1] o.a.s.c.SolrConfig Using Lucene MatchVersion: 6.0.0
   [junit4]   2> 1095220 INFO  (coreLoadExecutor-4790-thread-1-processing-n:127.0.0.1:50718_afv%2Fg) [n:127.0.0.1:50718_afv%2Fg c:tmp_collection   x:collection1] o.a.s.c.Config Loaded SolrConfig: solrconfig.xml
   [junit4]   2> 1095220 INFO  (coreLoadExecutor-4790-thread-1-processing-n:127.0.0.1:50718_afv%2Fg) [n:127.0.0.1:50718_afv%2Fg c:tmp_collection   x:collection1] o.a.s.s.IndexSchema Reading Solr Schema from /configs/conf1/schema.xml
   [junit4]   2> 1095223 INFO  (coreLoadExecutor-4790-thread-1-processing-n:127.0.0.1:50718_afv%2Fg) [n:127.0.0.1:50718_afv%2Fg c:tmp_collection   x:collection1] o.a.s.s.IndexSchema [collection1] Schema name=test
   [junit4]   2> 1095291 INFO  (coreLoadExecutor-4790-thread-1-processing-n:127.0.0.1:50718_afv%2Fg) [n:127.0.0.1:50718_afv%2Fg c:tmp_collection   x:collection1] o.a.s.s.IndexSchema default search field in schema is text
   [junit4]   2> 1095292 INFO  (coreLoadExecutor-4790-thread-1-processing-n:127.0.0.1:50718_afv%2Fg) [n:127.0.0.1:50718_afv%2Fg c:tmp_collection   x:collection1] o.a.s.s.IndexSchema unique key field: id
   [junit4]   2> 1095293 INFO  (coreLoadExecutor-4790-thread-1-processing-n:127.0.0.1:50718_afv%2Fg) [n:127.0.0.1:50718_afv%2Fg c:tmp_collection   x:collection1] o.a.s.s.FileExchangeRateProvider Reloading exchange rates from file currency.xml
   [junit4]   2> 1095294 INFO  (coreLoadExecutor-4790-thread-1-processing-n:127.0.0.1:50718_afv%2Fg) [n:127.0.0.1:50718_afv%2Fg c:tmp_collection   x:collection1] o.a.s.s.FileExchangeRateProvider Reloading exchange rates from file currency.xml
   [junit4]   2> 1095301 INFO  (coreLoadExecutor-4790-thread-1-processing-n:127.0.0.1:50718_afv%2Fg) [n:127.0.0.1:50718_afv%2Fg c:tmp_collection   x:collection1] o.a.s.c.ConfigSetProperties Did not find ConfigSet properties, assuming default properties: Can't find resource 'configsetprops.json' in classpath or '/configs/conf1', cwd=/home/jenkins/workspace/Lucene-Solr-trunk-Linux/solr/build/solr-core/test/J0
   [junit4]   2> 1095302 INFO  (coreLoadExecutor-4790-thread-1-processing-n:127.0.0.1:50718_afv%2Fg) [n:127.0.0.1:50718_afv%2Fg c:tmp_collection   x:collection1] o.a.s.c.CoreContainer Creating SolrCore 'collection1' using configuration from collection tmp_collection
   [junit4]   2> 1095302 INFO  (coreLoadExecutor-4790-thread-1-processing-n:127.0.0.1:50718_afv%2Fg) [n:127.0.0.1:50718_afv%2Fg c:tmp_collection s:shard1 r:core_node1 x:collection1] o.a.s.c.SolrCore solr.StandardDirectoryFactory
   [junit4]   2> 1095302 INFO  (coreLoadExecutor-4790-thread-1-processing-n:127.0.0.1:50718_afv%2Fg) [n:127.0.0.1:50718_afv%2Fg c:tmp_collection s:shard1 r:core_node1 x:collection1] o.a.s.c.SolrCore [[collection1] ] Opening new SolrCore at [/home/jenkins/workspace/Lucene-Solr-trunk-Linux/solr/build/solr-core/test/J0/temp/solr.cloud.CdcrReplicationHandlerTest_944A27A1410A307C-001/jetty-001/cores/collection1/], dataDir=[null]
   [junit4]   2> 1095302 INFO  (coreLoadExecutor-4790-thread-1-processing-n:127.0.0.1:50718_afv%2Fg) [n:127.0.0.1:50718_afv%2Fg c:tmp_collection s:shard1 r:core_node1 x:collection1] o.a.s.c.JmxMonitoredMap JMX monitoring is enabled. Adding Solr mbeans to JMX Server: com.sun.jmx.mbeanserver.JmxMBeanServer@b12a1c
   [junit4]   2> 1095303 INFO  (coreLoadExecutor-4790-thread-1-processing-n:127.0.0.1:50718_afv%2Fg) [n:127.0.0.1:50718_afv%2Fg c:tmp_collection s:shard1 r:core_node1 x:collection1] o.a.s.c.CachingDirectoryFactory return new directory for /home/jenkins/workspace/Lucene-Solr-trunk-Linux/solr/build/solr-core/test/J0/temp/solr.cloud.CdcrReplicationHandlerTest_944A27A1410A307C-001/jetty-001/cores/collection1/data
   [junit4]   2> 1095303 INFO  (coreLoadExecutor-4790-thread-1-processing-n:127.0.0.1:50718_afv%2Fg) [n:127.0.0.1:50718_afv%2Fg c:tmp_collection s:shard1 r:core_node1 x:collection1] o.a.s.c.SolrCore New index directory detected: old=null new=/home/jenkins/workspace/Lucene-Solr-trunk-Linux/solr/build/solr-core/test/J0/temp/solr.cloud.CdcrReplicationHandlerTest_944A27A1410A307C-001/jetty-001/cores/collection1/data/index/
   [junit4]   2> 1095303 WARN  (coreLoadExecutor-4790-thread-1-processing-n:127.0.0.1:50718_afv%2Fg) [n:127.0.0.1:50718_afv%2Fg c:tmp_collection s:shard1 r:core_node1 x:collection1] o.a.s.c.SolrCore [collection1] Solr index directory '/home/jenkins/workspace/Lucene-Solr-trunk-Linux/solr/build/solr-core/test/J0/temp/solr.cloud.CdcrReplicationHandlerTest_944A27A1410A307C-001/jetty-001/cores/collection1/data/index' doesn't exist. Creating new index...
   [junit4]   2> 1095303 INFO  (coreLoadExecutor-4790-thread-1-processing-n:127.0.0.1:50718_afv%2Fg) [n:127.0.0.1:50718_afv%2Fg c:tmp_collection s:shard1 r:core_node1 x:collection1] o.a.s.c.CachingDirectoryFactory return new directory for /home/jenkins/workspace/Lucene-Solr-trunk-Linux/solr/build/solr-core/test/J0/temp/solr.cloud.CdcrReplicationHandlerTest_944A27A1410A307C-001/jetty-001/cores/collection1/data/index
   [junit4]   2> 1095304 INFO  (coreLoadExecutor-4790-thread-1-processing-n:127.0.0.1:50718_afv%2Fg) [n:127.0.0.1:50718_afv%2Fg c:tmp_collection s:shard1 r:core_node1 x:collection1] o.a.s.u.RandomMergePolicy RandomMergePolicy wrapping class org.apache.lucene.index.LogByteSizeMergePolicy: [LogByteSizeMergePolicy: minMergeSize=1677721, mergeFactor=26, maxMergeSize=2147483648, maxMergeSizeForForcedMerge=9223372036854775807, calibrateSizeByDeletes=true, maxMergeDocs=2147483647, maxCFSSegmentSizeMB=8.796093022207999E12, noCFSRatio=0.10243047388713143]
   [junit4]   2> 1095333 INFO  (coreLoadExecutor-4790-thread-1-processing-n:127.0.0.1:50718_afv%2Fg) [n:127.0.0.1:50718_afv%2Fg c:tmp_collection s:shard1 r:core_node1 x:collection1] o.a.s.c.SolrCore SolrDeletionPolicy.onCommit: commits: num=1
   [junit4]   2> 	commit{dir=/home/jenkins/workspace/Lucene-Solr-trunk-Linux/solr/build/solr-core/test/J0/temp/solr.cloud.CdcrReplicationHandlerTest_944A27A1410A307C-001/jetty-001/cores/collection1/data/index,segFN=segments_1,generation=1}
   [junit4]   2> 1095333 INFO  (coreLoadExecutor-4790-thread-1-processing-n:127.0.0.1:50718_afv%2Fg) [n:127.0.0.1:50718_afv%2Fg c:tmp_collection s:shard1 r:core_node1 x:collection1] o.a.s.c.SolrCore newest commit generation = 1
   [junit4]   2> 1095333 INFO  (OldIndexDirectoryCleanupThreadForCore-collection1) [n:127.0.0.1:50718_afv%2Fg c:tmp_collection s:shard1 r:core_node1 x:collection1] o.a.s.c.SolrCore Looking for old index directories to cleanup for core collection1 in /home/jenkins/workspace/Lucene-Solr-trunk-Linux/solr/build/solr-core/test/J0/temp/solr.cloud.CdcrReplicationHandlerTest_944A27A1410A307C-001/jetty-001/cores/collection1/data/
   [junit4]   2> 1095335 INFO  (coreLoadExecutor-4790-thread-1-processing-n:127.0.0.1:50718_afv%2Fg) [n:127.0.0.1:50718_afv%2Fg c:tmp_collection s:shard1 r:core_node1 x:collection1] o.a.s.u.p.UpdateRequestProcessorChain creating updateRequestProcessorChain "cdcr-processor-chain"
   [junit4]   2> 1095344 INFO  (coreLoadExecutor-4790-thread-1-processing-n:127.0.0.1:50718_afv%2Fg) [n:127.0.0.1:50718_afv%2Fg c:tmp_collection s:shard1 r:core_node1 x:collection1] o.a.s.c.SolrCore no updateRequestProcessorChain defined as default, creating implicit default
   [junit4]   2> 1095347 INFO  (coreLoadExecutor-4790-thread-1-processing-n:127.0.0.1:50718_afv%2Fg) [n:127.0.0.1:50718_afv%2Fg c:tmp_collection s:shard1 r:core_node1 x:collection1] o.a.s.h.l.XMLLoader xsltCacheLifetimeSeconds=60
   [junit4]   2> 1095348 INFO  (coreLoadExecutor-4790-thread-1-processing-n:127.0.0.1:50718_afv%2Fg) [n:127.0.0.1:50718_afv%2Fg c:tmp_collection s:shard1 r:core_node1 x:collection1] o.a.s.h.l.XMLLoader xsltCacheLifetimeSeconds=60
   [junit4]   2> 1095348 INFO  (coreLoadExecutor-4790-thread-1-processing-n:127.0.0.1:50718_afv%2Fg) [n:127.0.0.1:50718_afv%2Fg c:tmp_collection s:shard1 r:core_node1 x:collection1] o.a.s.h.l.XMLLoader xsltCacheLifetimeSeconds=60
   [junit4]   2> 1095349 INFO  (coreLoadExecutor-4790-thread-1-processing-n:127.0.0.1:50718_afv%2Fg) [n:127.0.0.1:50718_afv%2Fg c:tmp_collection s:shard1 r:core_node1 x:collection1] o.a.s.h.l.XMLLoader xsltCacheLifetimeSeconds=60
   [junit4]   2> 1095355 INFO  (coreLoadExecutor-4790-thread-1-processing-n:127.0.0.1:50718_afv%2Fg) [n:127.0.0.1:50718_afv%2Fg c:tmp_collection s:shard1 r:core_node1 x:collection1] o.a.s.c.RequestHandlers Registered paths: /admin/mbeans,standard,/update/csv,/update/json/docs,/admin/luke,/admin/segments,/get,/admin/system,/replication,/admin/properties,/config,/schema,/admin/plugins,/admin/logging,/update/json,/admin/threads,/admin/ping,/cdcr,/update,/admin/file
   [junit4]   2> 1095355 INFO  (coreLoadExecutor-4790-thread-1-processing-n:127.0.0.1:50718_afv%2Fg) [n:127.0.0.1:50718_afv%2Fg c:tmp_collection s:shard1 r:core_node1 x:collection1] o.a.s.c.SolrCore Using default statsCache cache: org.apache.solr.search.stats.LocalStatsCache
   [junit4]   2> 1095356 INFO  (coreLoadExecutor-4790-thread-1-processing-n:127.0.0.1:50718_afv%2Fg) [n:127.0.0.1:50718_afv%2Fg c:tmp_collection s:shard1 r:core_node1 x:collection1] o.a.s.u.UpdateHandler Using UpdateLog implementation: org.apache.solr.update.CdcrUpdateLog
   [junit4]   2> 1095356 INFO  (coreLoadExecutor-4790-thread-1-processing-n:127.0.0.1:50718_afv%2Fg) [n:127.0.0.1:50718_afv%2Fg c:tmp_collection s:shard1 r:core_node1 x:collection1] o.a.s.u.UpdateLog Initializing UpdateLog: dataDir= defaultSyncLevel=FLUSH numRecordsToKeep=100 maxNumLogsToKeep=10 numVersionBuckets=65536
   [junit4]   2> 1095356 INFO  (coreLoadExecutor-4790-thread-1-processing-n:127.0.0.1:50718_afv%2Fg) [n:127.0.0.1:50718_afv%2Fg c:tmp_collection s:shard1 r:core_node1 x:collection1] o.a.s.c.SolrCore Hard AutoCommit: disabled
   [junit4]   2> 1095356 INFO  (coreLoadExecutor-4790-thread-1-processing-n:127.0.0.1:50718_afv%2Fg) [n:127.0.0.1:50718_afv%2Fg c:tmp_collection s:shard1 r:core_node1 x:collection1] o.a.s.c.SolrCore Soft AutoCommit: disabled
   [junit4]   2> 1095357 INFO  (coreLoadExecutor-4790-thread-1-processing-n:127.0.0.1:50718_afv%2Fg) [n:127.0.0.1:50718_afv%2Fg c:tmp_collection s:shard1 r:core_node1 x:collection1] o.a.s.u.RandomMergePolicy RandomMergePolicy wrapping class org.apache.lucene.index.TieredMergePolicy: [TieredMergePolicy: maxMergeAtOnce=29, maxMergeAtOnceExplicit=33, maxMergedSegmentMB=99.125, floorSegmentMB=1.5224609375, forceMergeDeletesPctAllowed=9.695349370458151, segmentsPerTier=45.0, maxCFSSegmentSizeMB=8.796093022207999E12, noCFSRatio=0.19822055494660829
   [junit4]   2> 1095357 INFO  (coreLoadExecutor-4790-thread-1-processing-n:127.0.0.1:50718_afv%2Fg) [n:127.0.0.1:50718_afv%2Fg c:tmp_collection s:shard1 r:core_node1 x:collection1] o.a.s.c.SolrCore SolrDeletionPolicy.onInit: commits: num=1
   [junit4]   2> 	commit{dir=/home/jenkins/workspace/Lucene-Solr-trunk-Linux/solr/build/solr-core/test/J0/temp/solr.cloud.CdcrReplicationHandlerTest_944A27A1410A307C-001/jetty-001/cores/collection1/data/index,segFN=segments_1,generation=1}
   [junit4]   2> 1095357 INFO  (coreLoadExecutor-4790-thread-1-processing-n:127.0.0.1:50718_afv%2Fg) [n:127.0.0.1:50718_afv%2Fg c:tmp_collection s:shard1 r:core_node1 x:collection1] o.a.s.c.SolrCore newest commit generation = 1
   [junit4]   2> 1095357 INFO  (coreLoadExecutor-4790-thread-1-processing-n:127.0.0.1:50718_afv%2Fg) [n:127.0.0.1:50718_afv%2Fg c:tmp_collection s:shard1 r:core_node1 x:collection1] o.a.s.s.SolrIndexSearcher Opening Searcher@17c1a16[collection1] main
   [junit4]   2> 1095357 INFO  (coreLoadExecutor-4790-thread-1-processing-n:127.0.0.1:50718_afv%2Fg) [n:127.0.0.1:50718_afv%2Fg c:tmp_collection s:shard1 r:core_node1 x:collection1] o.a.s.c.c.ZkStateReader Load collection config from:/collections/tmp_collection
   [junit4]   2> 1095358 INFO  (coreLoadExecutor-4790-thread-1-processing-n:127.0.0.1:50718_afv%2Fg) [n:127.0.0.1:50718_afv%2Fg c:tmp_collection s:shard1 r:core_node1 x:collection1] o.a.s.c.c.ZkStateReader path=/collections/tmp_collection configName=conf1 specified config exists in ZooKeeper
   [junit4]   2> 1095358 INFO  (coreLoadExecutor-4790-thread-1-processing-n:127.0.0.1:50718_afv%2Fg) [n:127.0.0.1:50718_afv%2Fg c:tmp_collection s:shard1 r:core_node1 x:collection1] o.a.s.r.ManagedResourceStorage Setting up ZooKeeper-based storage for the RestManager with znodeBase: /configs/conf1
   [junit4]   2> 1095358 INFO  (coreLoadExecutor-4790-thread-1-processing-n:127.0.0.1:50718_afv%2Fg) [n:127.0.0.1:50718_afv%2Fg c:tmp_collection s:shard1 r:core_node1 x:collection1] o.a.s.r.ManagedResourceStorage Configured ZooKeeperStorageIO with znodeBase: /configs/conf1
   [junit4]   2> 1095358 INFO  (coreLoadExecutor-4790-thread-1-processing-n:127.0.0.1:50718_afv%2Fg) [n:127.0.0.1:50718_afv%2Fg c:tmp_collection s:shard1 r:core_node1 x:collection1] o.a.s.r.RestManager Initializing RestManager with initArgs: {}
   [junit4]   2> 1095358 INFO  (coreLoadExecutor-4790-thread-1-processing-n:127.0.0.1:50718_afv%2Fg) [n:127.0.0.1:50718_afv%2Fg c:tmp_collection s:shard1 r:core_node1 x:collection1] o.a.s.r.ManagedResourceStorage Reading _rest_managed.json using ZooKeeperStorageIO:path=/configs/conf1
   [junit4]   2> 1095359 INFO  (coreLoadExecutor-4790-thread-1-processing-n:127.0.0.1:50718_afv%2Fg) [n:127.0.0.1:50718_afv%2Fg c:tmp_collection s:shard1 r:core_node1 x:collection1] o.a.s.r.ManagedResourceStorage No data found for znode /configs/conf1/_rest_managed.json
   [junit4]   2> 1095359 INFO  (coreLoadExecutor-4790-thread-1-processing-n:127.0.0.1:50718_afv%2Fg) [n:127.0.0.1:50718_afv%2Fg c:tmp_collection s:shard1 r:core_node1 x:collection1] o.a.s.r.ManagedResourceStorage Loaded null at path _rest_managed.json using ZooKeeperStorageIO:path=/configs/conf1
   [junit4]   2> 1095359 INFO  (coreLoadExecutor-4790-thread-1-processing-n:127.0.0.1:50718_afv%2Fg) [n:127.0.0.1:50718_afv%2Fg c:tmp_collection s:shard1 r:core_node1 x:collection1] o.a.s.r.RestManager Initializing 0 registered ManagedResources
   [junit4]   2> 1095359 INFO  (coreLoadExecutor-4790-thread-1-processing-n:127.0.0.1:50718_afv%2Fg) [n:127.0.0.1:50718_afv%2Fg c:tmp_collection s:shard1 r:core_node1 x:collection1] o.a.s.h.ReplicationHandler Commits will be reserved for  10000
   [junit4]   2> 1095361 INFO  (coreLoadExecutor-4790-thread-1-processing-n:127.0.0.1:50718_afv%2Fg) [n:127.0.0.1:50718_afv%2Fg c:tmp_collection s:shard1 r:core_node1 x:collection1] o.a.s.c.c.SolrZkClient makePath: /collections/tmp_collection/cdcr/state
   [junit4]   2> 1095362 INFO  (coreLoadExecutor-4790-thread-1-processing-n:127.0.0.1:50718_afv%2Fg) [n:127.0.0.1:50718_afv%2Fg c:tmp_collection s:shard1 r:core_node1 x:collection1] o.a.s.h.CdcrBufferStateManager Created znode /collections/tmp_collection/cdcr/state/buffer
   [junit4]   2> 1095365 INFO  (coreLoadExecutor-4790-thread-1-processing-n:127.0.0.1:50718_afv%2Fg) [n:127.0.0.1:50718_afv%2Fg c:tmp_collection s:shard1 r:core_node1 x:collection1] o.a.s.h.CdcrProcessStateManager Created znode /collections/tmp_collection/cdcr/state/process
   [junit4]   2> 1095373 INFO  (searcherExecutor-4791-thread-1-processing-n:127.0.0.1:50718_afv%2Fg x:collection1 s:shard1 c:tmp_collection r:core_node1) [n:127.0.0.1:50718_afv%2Fg c:tmp_collection s:shard1 r:core_node1 x:collection1] o.a.s.c.SolrCore [collection1] Registered new searcher Searcher@17c1a16[collection1] main{ExitableDirectoryReader(UninvertingDirectoryReader())}
   [junit4]   2> 1095373 INFO  (coreLoadExecutor-4790-thread-1-processing-n:127.0.0.1:50718_afv%2Fg) [n:127.0.0.1:50718_afv%2Fg c:tmp_collection s:shard1 r:core_node1 x:collection1] o.a.s.u.UpdateLog Looking up max value of version field to seed version buckets
   [junit4]   2> 1095373 INFO  (coreLoadExecutor-4790-thread-1-processing-n:127.0.0.1:50718_afv%2Fg) [n:127.0.0.1:50718_afv%2Fg c:tmp_collection s:shard1 r:core_node1 x:collection1] o.a.s.u.VersionInfo Refreshing highest value of _version_ for 65536 version buckets from index
   [junit4]   2> 1095373 INFO  (coreLoadExecutor-4790-thread-1-processing-n:127.0.0.1:50718_afv%2Fg) [n:127.0.0.1:50718_afv%2Fg c:tmp_collection s:shard1 r:core_node1 x:collection1] o.a.s.u.VersionInfo No terms found for _version_, cannot seed version bucket highest value from index
   [junit4]   2> 1095373 INFO  (coreLoadExecutor-4790-thread-1-processing-n:127.0.0.1:50718_afv%2Fg) [n:127.0.0.1:50718_afv%2Fg c:tmp_collection s:shard1 r:core_node1 x:collection1] o.a.s.u.UpdateLog Could not find max version in index or recent updates, using new clock 1509383007904989184
   [junit4]   2> 1095375 INFO  (coreLoadExecutor-4790-thread-1-processing-n:127.0.0.1:50718_afv%2Fg) [n:127.0.0.1:50718_afv%2Fg c:tmp_collection s:shard1 r:core_node1 x:collection1] o.a.s.u.UpdateLog Took 1.0ms to seed version buckets with highest version 1509383007904989184
   [junit4]   2> 1095375 INFO  (coreLoadExecutor-4790-thread-1-processing-n:127.0.0.1:50718_afv%2Fg) [n:127.0.0.1:50718_afv%2Fg c:tmp_collection s:shard1 r:core_node1 x:collection1] o.a.s.c.ZkController watch zkdir /configs/conf1
   [junit4]   2> 1095375 INFO  (coreLoadExecutor-4790-thread-1-processing-n:127.0.0.1:50718_afv%2Fg) [n:127.0.0.1:50718_afv%2Fg c:tmp_collection s:shard1 r:core_node1 x:collection1] o.a.s.c.CoreContainer registering core: collection1
   [junit4]   2> 1095376 INFO  (coreZkRegister-4784-thread-1-processing-n:127.0.0.1:50718_afv%2Fg x:collection1 s:shard1 c:tmp_collection r:core_node1) [n:127.0.0.1:50718_afv%2Fg c:tmp_collection s:shard1 r:core_node1 x:collection1] o.a.s.c.ZkController Register replica - core:collection1 address:http://127.0.0.1:50718/afv/g collection:tmp_collection shard:shard1
   [junit4]   2> 1095376 INFO  (coreZkRegister-4784-thread-1-processing-n:127.0.0.1:50718_afv%2Fg x:collection1 s:shard1 c:tmp_collection r:core_node1) [n:127.0.0.1:50718_afv%2Fg c:tmp_collection s:shard1 r:core_node1 x:collection1] o.a.s.c.c.SolrZkClient makePath: /collections/tmp_collection/leader_elect/shard1/election
   [junit4]   2> 1095377 INFO  (coreZkRegister-4784-thread-1-processing-n:127.0.0.1:50718_afv%2Fg x:collection1 s:shard1 c:tmp_collection r:core_node1) [n:127.0.0.1:50718_afv%2Fg c:tmp_collection s:shard1 r:core_node1 x:collection1] o.a.s.c.LeaderElector Joined leadership election with path: /collections/tmp_collection/leader_elect/shard1/election/94336437902442500-core_node1-n_0000000000
   [junit4]   2> 1095377 INFO  (coreZkRegister-4784-thread-1-processing-n:127.0.0.1:50718_afv%2Fg x:collection1 s:shard1 c:tmp_collection r:core_node1) [n:127.0.0.1:50718_afv%2Fg c:tmp_collection s:shard1 r:core_node1 x:collection1] o.a.s.c.ShardLeaderElectionContext Running the leader process for shard shard1
   [junit4]   2> 1095378 INFO  (zkCallback-959-thread-1-processing-n:127.0.0.1:50718_afv%2Fg) [n:127.0.0.1:50718_afv%2Fg    ] o.a.s.c.DistributedQueue NodeChildrenChanged fired on path /overseer/queue state SyncConnected
   [junit4]   2> 1095378 INFO  (coreZkRegister-4784-thread-1-processing-n:127.0.0.1:50718_afv%2Fg x:collection1 s:shard1 c:tmp_collection r:core_node1) [n:127.0.0.1:50718_afv%2Fg c:tmp_collection s:shard1 r:core_node1 x:collection1] o.a.s.c.ShardLeaderElectionContext Enough replicas found to continue.
   [junit4]   2> 1095378 INFO  (coreZkRegister-4784-thread-1-processing-n:127.0.0.1:50718_afv%2Fg x:collection1 s:shard1 c:tmp_collection r:core_node1) [n:127.0.0.1:50718_afv%2Fg c:tmp_collection s:shard1 r:core_node1 x:collection1] o.a.s.c.ShardLeaderElectionContext I may be the new leader - try and sync
   [junit4]   2> 1095378 INFO  (coreZkRegister-4784-thread-1-processing-n:127.0.0.1:50718_afv%2Fg x:collection1 s:shard1 c:tmp_collection r:core_node1) [n:127.0.0.1:50718_afv%2Fg c:tmp_collection s:shard1 r:core_node1 x:collection1] o.a.s.c.SyncStrategy Sync replicas to http://127.0.0.1:50718/afv/g/collection1/
   [junit4]   2> 1095378 INFO  (OverseerStateUpdate-94336437902442500-127.0.0.1:50718_afv%2Fg-n_0000000000) [n:127.0.0.1:50718_afv%2Fg    ] o.a.s.c.Overseer processMessage: queueSize: 1, message = {
   [junit4]   2>   "operation":"leader",
   [junit4]   2>   "shard":"shard1",
   [junit4]   2>   "collection":"tmp_collection"} current state version: 1
   [junit4]   2> 1095378 INFO  (coreZkRegister-4784-thread-1-processing-n:127.0.0.1:50718_afv%2Fg x:collection1 s:shard1 c:tmp_collection r:core_node1) [n:127.0.0.1:50718_afv%2Fg c:tmp_collection s:shard1 r:core_node1 x:collection1] o.a.s.c.SyncStrategy Sync Success - now sync replicas to me
   [junit4]   2> 1095379 INFO  (coreZkRegister-4784-thread-1-processing-n:127.0.0.1:50718_afv%2Fg x:collection1 s:shard1 c:tmp_collection r:core_node1) [n:127.0.0.1:50718_afv%2Fg c:tmp_collection s:shard1 r:core_node1 x:collection1] o.a.s.c.SyncStrategy http://127.0.0.1:50718/afv/g/collection1/ has no replicas
   [junit4]   2> 1095379 INFO  (coreZkRegister-4784-thread-1-processing-n:127.0.0.1:50718_afv%2Fg x:collection1 s:shard1 c:tmp_collection r:core_node1) [n:127.0.0.1:50718_afv%2Fg c:tmp_collection s:shard1 r:core_node1 x:collection1] o.a.s.c.ShardLeaderElectionContext I am the new leader: http://127.0.0.1:50718/afv/g/collection1/ shard1
   [junit4]   2> 1095379 INFO  (coreZkRegister-4784-thread-1-processing-n:127.0.0.1:50718_afv%2Fg x:collection1 s:shard1 c:tmp_collection r:core_node1) [n:127.0.0.1:50718_afv%2Fg c:tmp_collection s:shard1 r:core_node1 x:collection1] o.a.s.c.c.SolrZkClient makePath: /collections/tmp_collection/leaders/shard1
   [junit4]   2> 1095380 INFO  (zkCallback-959-thread-1-processing-n:127.0.0.1:50718_afv%2Fg) [n:127.0.0.1:50718_afv%2Fg    ] o.a.s.h.CdcrProcessStateManager Received new leader state @ tmp_collection:shard1
   [junit4]   2> 1095381 INFO  (zkCallback-959-thread-2-processing-n:127.0.0.1:50718_afv%2Fg) [n:127.0.0.1:50718_afv%2Fg    ] o.a.s.c.DistributedQueue NodeChildrenChanged fired on path /overseer/queue state SyncConnected
   [junit4]   2> 1095381 INFO  (OverseerStateUpdate-94336437902442500-127.0.0.1:50718_afv%2Fg-n_0000000000) [n:127.0.0.1:50718_afv%2Fg    ] o.a.s.c.Overseer processMessage: queueSize: 1, message = {
   [junit4]   2>   "operation":"leader",
   [junit4]   2>   "shard":"shard1",
   [junit4]   2>   "collection":"tmp_collection",
   [junit4]   2>   "base_url":"http://127.0.0.1:50718/afv/g",
   [junit4]   2>   "core":"collection1",
   [junit4]   2>   "state":"active"} current state version: 1
   [junit4]   2> 1095482 INFO  (zkCallback-959-thread-2-processing-n:127.0.0.1:50718_afv%2Fg) [n:127.0.0.1:50718_afv%2Fg    ] o.a.s.c.c.ZkStateReader A cluster state change: WatchedEvent state:SyncConnected type:NodeDataChanged path:/clusterstate.json, has occurred - updating... (live nodes size: 1)
   [junit4]   2> 1095531 INFO  (coreZkRegister-4784-thread-1-processing-n:127.0.0.1:50718_afv%2Fg x:collection1 s:shard1 c:tmp_collection r:core_node1) [n:127.0.0.1:50718_afv%2Fg c:tmp_collection s:shard1 r:core_node1 x:collection1] o.a.s.c.ZkController We are http://127.0.0.1:50718/afv/g/collection1/ and leader is http://127.0.0.1:50718/afv/g/collection1/
   [junit4]   2> 1095531 INFO  (coreZkRegister-4784-thread-1-processing-n:127.0.0.1:50718_afv%2Fg x:collection1 s:shard1 c:tmp_collection r:core_node1) [n:127.0.0.1:50718_afv%2Fg c:tmp_collection s:shard1 r:core_node1 x:collection1] o.a.s.c.ZkController No LogReplay needed for core=collection1 baseURL=http://127.0.0.1:50718/afv/g
   [junit4]   2> 1095532 INFO  (coreZkRegister-4784-thread-1-processing-n:127.0.0.1:50718_afv%2Fg x:collection1 s:shard1 c:tmp_collection r:core_node1) [n:127.0.0.1:50718_afv%2Fg c:tmp_collection s:shard1 r:core_node1 x:collection1] o.a.s.c.ZkController I am the leader, no recovery necessary
   [junit4]   2> 1095532 INFO  (coreZkRegister-4784-thread-1-processing-n:127.0.0.1:50718_afv%2Fg x:collection1 s:shard1 c:tmp_collection r:core_node1) [n:127.0.0.1:50718_afv%2Fg c:tmp_collection s:shard1 r:core_node1 x:collection1] o.a.s.c.ZkController publishing state=active
   [junit4]   2> 1095532 INFO  (coreZkRegister-4784-thread-1-processing-n:127.0.0.1:50718_afv%2Fg x:collection1 s:shard1 c:tmp_collection r:core_node1) [n:127.0.0.1:50718_afv%2Fg c:tmp_collection s:shard1 r:core_node1 x:collection1] o.a.s.c.ZkController numShards not found on descriptor - reading it from system property
   [junit4]   2> 1095532 INFO  (zkCallback-959-thread-2-processing-n:127.0.0.1:50718_afv%2Fg) [n:127.0.0.1:50718_afv%2Fg    ] o.a.s.c.DistributedQueue NodeChildrenChanged fired on path /overseer/queue state SyncConnected
   [junit4]   2> 1095533 INFO  (OverseerStateUpdate-94336437902442500-127.0.0.1:50718_afv%2Fg-n_0000000000) [n:127.0.0.1:50718_afv%2Fg    ] o.a.s.c.Overseer processMessage: queueSize: 1, message = {
   [junit4]   2>   "core":"collection1",
   [junit4]   2>   "core_node_name":"core_node1",
   [junit4]   2>   "roles":null,
   [junit4]   2>   "base_url":"http://127.0.0.1:50718/afv/g",
   [junit4]   2>   "node_name":"127.0.0.1:50718_afv%2Fg",
   [junit4]   2>   "numShards":"1",
   [junit4]   2>   "state":"active",
   [junit4]   2>   "shard":"shard1",
   [junit4]   2>   "collection":"tmp_collection",
   [junit4]   2>   "operation":"state"} current state version: 2
   [junit4]   2> 1095533 INFO  (OverseerStateUpdate-94336437902442500-127.0.0.1:50718_afv%2Fg-n_0000000000) [n:127.0.0.1:50718_afv%2Fg    ] o.a.s.c.o.ReplicaMutator Update state numShards=1 message={
   [junit4]   2>   "core":"collection1",
   [junit4]   2>   "core_node_name":"core_node1",
   [junit4]   2>   "roles":null,
   [junit4]   2>   "base_url":"http://127.0.0.1:50718/afv/g",
   [junit4]   2>   "node_name":"127.0.0.1:50718_afv%2Fg",
   [junit4]   2>   "numShards":"1",
   [junit4]   2>   "state":"active",
   [junit4]   2>   "shard":"shard1",
   [junit4]   2>   "collection":"tmp_collection",
   [junit4]   2>   "operation":"state"}
   [junit4]   2> 1095634 INFO  (zkCallback-959-thread-2-processing-n:127.0.0.1:50718_afv%2Fg) [n:127.0.0.1:50718_afv%2Fg    ] o.a.s.c.c.ZkStateReader A cluster state change: WatchedEvent state:SyncConnected type:NodeDataChanged path:/clusterstate.json, has occurred - updating... (live nodes size: 1)
   [junit4]   2> 1095757 INFO  (TEST-CdcrReplicationHandlerTest.doTest-seed#[944A27A1410A307C]) [    ] o.a.s.SolrTestCaseJ4 Writing core.properties file to /home/jenkins/workspace/Lucene-Solr-trunk-Linux/solr/build/solr-core/test/J0/temp/solr.cloud.CdcrReplicationHandlerTest_944A27A1410A307C-001/jetty-002/cores/collection1
   [junit4]   2> 1095758 INFO  (TEST-CdcrReplicationHandlerTest.doTest-seed#[944A27A1410A307C]) [    ] o.e.j.s.Server jetty-9.2.11.v20150529
   [junit4]   2> 1095759 INFO  (TEST-CdcrReplicationHandlerTest.doTest-seed#[944A27A1410A307C]) [    ] o.e.j.s.h.ContextHandler Started o.e.j.s.ServletContextHandler@15d325f{/afv/g,null,AVAILABLE}
   [junit4]   2> 1095759 INFO  (TEST-CdcrReplicationHandlerTest.doTest-seed#[944A27A1410A307C]) [    ] o.e.j.s.ServerConnector Started ServerConnector@11e933a{HTTP/1.1}{127.0.0.1:48978}
   [junit4]   2> 1095759 INFO  (TEST-CdcrReplicationHandlerTest.doTest-seed#[944A27A1410A307C]) [    ] o.e.j.s.Server Started @1097353ms
   [junit4]   2> 1095760 INFO  (TEST-CdcrReplicationHandlerTest.doTest-seed#[944A27A1410A307C]) [    ] o.a.s.c.s.e.JettySolrRunner Jetty properties: {shards=shard2, hostContext=/afv/g, hostPort=48978, coreRootDirectory=/home/jenkins/workspace/Lucene-Solr-trunk-Linux/solr/build/solr-core/test/J0/temp/solr.cloud.CdcrReplicationHandlerTest_944A27A1410A307C-001/jetty-002/cores}
   [junit4]   2> 1095760 INFO  (TEST-CdcrReplicationHandlerTest.doTest-seed#[944A27A1410A307C]) [    ] o.a.s.s.SolrDispatchFilter SolrDispatchFilter.init(): sun.misc.Launcher$AppClassLoader@e2f2a
   [junit4]   2> 1095760 INFO  (TEST-CdcrReplicationHandlerTest.doTest-seed#[944A27A1410A307C]) [    ] o.a.s.c.SolrResourceLoader new SolrResourceLoader for directory: '/home/jenkins/workspace/Lucene-Solr-trunk-Linux/solr/build/solr-core/test/J0/temp/solr.cloud.CdcrReplicationHandlerTest_944A27A1410A307C-001/jetty-002/'
   [junit4]   2> 1095770 INFO  (TEST-CdcrReplicationHandlerTest.doTest-seed#[944A27A1410A307C]) [    ] o.a.s.c.c.SolrZkClient Using default ZkCredentialsProvider
   [junit4]   2> 1095771 INFO  (TEST-CdcrReplicationHandlerTest.doTest-seed#[944A27A1410A307C]) [    ] o.a.s.c.c.ConnectionManager Waiting for client to connect to ZooKeeper
   [junit4]   2> 1095772 INFO  (zkCallback-960-thread-1) [    ] o.a.s.c.c.ConnectionManager Watcher org.apache.solr.common.cloud.ConnectionManager@1e6f716 name:ZooKeeperConnection Watcher:127.0.0.1:32877/solr got event WatchedEvent state:SyncConnected type:None path:null path:null type:None
   [junit4]   2> 1095772 INFO  (TEST-CdcrReplicationHandlerTest.doTest-seed#[944A27A1410A307C]) [    ] o.a.s.c.c.ConnectionManager Client is connected to ZooKeeper
   [junit4]   2> 1095772 INFO  (TEST-CdcrReplicationHandlerTest.doTest-seed#[944A27A1410A307C]) [    ] o.a.s.c.c.SolrZkClient Using default ZkACLProvider
   [junit4]   2> 1095773 INFO  (TEST-CdcrReplicationHandlerTest.doTest-seed#[944A27A1410A307C]) [    ] o.a.s.s.SolrDispatchFilter Loading solr.xml from SolrHome (not found in ZooKeeper)
   [junit4]   2> 1095773 INFO  (TEST-CdcrReplicationHandlerTest.doTest-seed#[944A27A1410A307C]) [    ] o.a.s.c.SolrXmlConfig Loading container configuration from /home/jenkins/workspace/Lucene-Solr-trunk-Linux/solr/build/solr-core/test/J0/temp/solr.cloud.CdcrReplicationHandlerTest_944A27A1410A307C-001/jetty-002/solr.xml
   [junit4]   2> 1095777 INFO  (TEST-CdcrReplicationHandlerTest.doTest-seed#[944A27A1410A307C]) [    ] o.a.s.c.CoresLocator Config-defined core root directory: /home/jenkins/workspace/Lucene-Solr-trunk-Linux/solr/build/solr-core/test/J0/temp/solr.cloud.CdcrReplicationHandlerTest_944A27A1410A307C-001/jetty-002/cores
   [junit4]   2> 1095777 INFO  (TEST-CdcrReplicationHandlerTest.doTest-seed#[944A27A1410A307C]) [    ] o.a.s.c.CoreContainer New CoreContainer 24995499
   [junit4]   2> 1095777 INFO  (TEST-CdcrReplicationHandlerTest.doTest-seed#[944A27A1410A307C]) [    ] o.a.s.c.CoreContainer Loading cores into CoreContainer [instanceDir=/home/jenkins/workspace/Lucene-Solr-trunk-Linux/solr/build/solr-core/test/J0/temp/solr.cloud.CdcrReplicationHandlerTest_944A27A1410A307C-001/jetty-002/]
   [junit4]   2> 1095778 INFO  (TEST-CdcrReplicationHandlerTest.doTest-seed#[944A27A1410A307C]) [    ] o.a.s.c.CoreContainer loading shared library: /home/jenkins/workspace/Lucene-Solr-trunk-Linux/solr/build/solr-core/test/J0/temp/solr.cloud.CdcrReplicationHandlerTest_944A27A1410A307C-001/jetty-002/lib
   [junit4]   2> 1095778 WARN  (TEST-CdcrReplicationHandlerTest.doTest-seed#[944A27A1410A307C]) [    ] o.a.s.c.SolrResourceLoader Can't find (or read) directory to add to classloader: lib (resolved as: /home/jenkins/workspace/Lucene-Solr-trunk-Linux/solr/build/solr-core/test/J0/temp/solr.cloud.CdcrReplicationHandlerTest_944A27A1410A307C-001/jetty-002/lib).
   [junit4]   2> 1095784 INFO  (TEST-CdcrReplicationHandlerTest.doTest-seed#[944A27A1410A307C]) [    ] o.a.s.h.c.HttpShardHandlerFactory created with socketTimeout : 90000,urlScheme : ,connTimeout : 15000,maxConnectionsPerHost : 20,maxConnections : 10000,corePoolSize : 0,maximumPoolSize : 2147483647,maxThreadIdleTime : 5,sizeOfQueue : -1,fairnessPolicy : false,useRetries : false,
   [junit4]   2> 1095785 INFO  (TEST-CdcrReplicationHandlerTest.doTest-seed#[944A27A1410A307C]) [    ] o.a.s.u.UpdateShardHandler Creating UpdateShardHandler HTTP client with params: socketTimeout=340000&connTimeout=45000&retry=true
   [junit4]   2> 1095786 INFO  (TEST-CdcrReplicationHandlerTest.doTest-seed#[944A27A1410A307C]) [    ] o.a.s.l.LogWatcher SLF4J impl is org.slf4j.impl.Log4jLoggerFactory
   [junit4]   2> 1095786 INFO  (TEST-CdcrReplicationHandlerTest.doTest-seed#[944A27A1410A307C]) [    ] o.a.s.l.LogWatcher Registering Log Listener [Log4j (org.slf4j.impl.Log4jLoggerFactory)]
   [junit4]   2> 1095786 INFO  (TEST-CdcrReplicationHandlerTest.doTest-seed#[944A27A1410A307C]) [    ] o.a.s.c.ZkContainer Zookeeper client=127.0.0.1:32877/solr
   [junit4]   2> 1095786 INFO  (TEST-CdcrReplicationHandlerTest.doTest-seed#[944A27A1410A307C]) [    ] o.a.s.c.ZkController zkHost includes chroot
   [junit4]   2> 1095787 INFO  (TEST-CdcrReplicationHandlerTest.doTest-seed#[944A27A1410A307C]) [    ] o.a.s.c.c.SolrZkClient Using default ZkCredentialsProvider
   [junit4]   2> 1095787 INFO  (TEST-CdcrReplicationHandlerTest.doTest-seed#[944A27A1410A307C]) [    ] o.a.s.c.c.ConnectionManager Waiting for client to connect to ZooKeeper
   [junit4]   2> 1095788 INFO  (zkCallback-962-thread-1) [    ] o.a.s.c.c.ConnectionManager Watcher org.apache.solr.common.cloud.ConnectionManager@18a09b1 name:ZooKeeperConnection Watcher:127.0.0.1:32877 got event WatchedEvent state:SyncConnected type:None path:null path:null type:None
   [junit4]   2> 1095788 INFO  (TEST-CdcrReplicationHandlerTest.doTest-seed#[944A27A1410A307C]) [    ] o.a.s.c.c.ConnectionManager Client is connected to ZooKeeper
   [junit4]   2> 1095789 INFO  (TEST-CdcrReplicationHandlerTest.doTest-seed#[944A27A1410A307C]) [    ] o.a.s.c.c.SolrZkClient Using default ZkACLProvider
   [junit4]   2> 1095790 INFO  (TEST-CdcrReplicationHandlerTest.doTest-seed#[944A27A1410A307C]) [n:127.0.0.1:48978_afv%2Fg    ] o.a.s.c.c.ConnectionManager Waiting for client to connect to ZooKeeper
   [junit4]   2> 1095791 INFO  (zkCallback-963-thread-1-processing-n:127.0.0.1:48978_afv%2Fg) [n:127.0.0.1:48978_afv%2Fg    ] o.a.s.c.c.ConnectionManager Watcher org.apache.solr.common.cloud.ConnectionManager@9267c1 name:ZooKeeperConnection Watcher:127.0.0.1:32877/solr got event WatchedEvent state:SyncConnected type:None path:null path:null type:None
   [junit4]   2> 1095791 INFO  (TEST-CdcrReplicationHandlerTest.doTest-seed#[944A27A1410A307C]) [n:127.0.0.1:48978_afv%2Fg    ] o.a.s.c.c.ConnectionManager Client is connected to ZooKeeper
   [junit4]   2> 1095793 INFO  (TEST-CdcrReplicationHandlerTest.doTest-seed#[944A27A1410A307C]) [n:127.0.0.1:48978_afv%2Fg    ] o.a.s.c.c.ZkStateReader Updating cluster state from ZooKeeper... 
   [junit4]   2> 1096795 INFO  (TEST-CdcrReplicationHandlerTest.doTest-seed#[944A27A1410A307C]) [n:127.0.0.1:48978_afv%2Fg    ] o.a.s.c.ZkController Register node as live in ZooKeeper:/live_nodes/127.0.0.1:48978_afv%2Fg
   [junit4]   2> 1096795 INFO  (TEST-CdcrReplicationHandlerTest.doTest-seed#[944A27A1410A307C]) [n:127.0.0.1:48978_afv%2Fg    ] o.a.s.c.c.SolrZkClient makePath: /live_nodes/127.0.0.1:48978_afv%2Fg
   [junit4]   2> 1096796 INFO  (zkCallback-959-thread-2-processing-n:127.0.0.1:50718_afv%2Fg) [n:127.0.0.1:50718_afv%2Fg    ] o.a.s.c.c.ZkStateReader A live node change: WatchedEvent state:SyncConnected type:NodeChildrenChanged path:/live_nodes, has occurred - updating... (live nodes size: 1)
   [junit4]   2> 1096796 INFO  (zkCallback-963-thread-1-processing-n:127.0.0.1:48978_afv%2Fg) [n:127.0.0.1:48978_afv%2Fg    ] o.a.s.c.c.ZkStateReader A live node change: WatchedEvent state:SyncConnected type:NodeChildrenChanged path:/live_nodes, has occurred - updating... (live nodes size: 1)
   [junit4]   2> 1096797 INFO  (TEST-CdcrReplicationHandlerTest.doTest-seed#[944A27A1410A307C]) [n:127.0.0.1:48978_afv%2Fg    ] o.a.s.c.Overseer Overseer (id=null) closing
   [junit4]   2> 1096797 INFO  (TEST-CdcrReplicationHandlerTest.doTest-seed#[944A27A1410A307C]) [n:127.0.0.1:48978_afv%2Fg    ] o.a.s.c.LeaderElector Joined leadership election with path: /overseer_elect/election/94336437902442503-127.0.0.1:48978_afv%2Fg-n_0000000001
   [junit4]   2> 1096798 INFO  (TEST-CdcrReplicationHandlerTest.doTest-seed#[944A27A1410A307C]) [n:127.0.0.1:48978_afv%2Fg    ] o.a.s.c.LeaderElector Watching path /overseer_elect/election/94336437902442500-127.0.0.1:50718_afv%2Fg-n_0000000000 to know if I could be the leader
   [junit4]   2> 1096831 INFO  (TEST-CdcrReplicationHandlerTest.doTest-seed#[944A27A1410A307C]) [n:127.0.0.1:48978_afv%2Fg    ] o.a.s.c.CoreContainer Security conf doesn't exist. Skipping setup for authorization module.
   [junit4]   2> 1096831 INFO  (TEST-CdcrReplicationHandlerTest.doTest-seed#[944A27A1410A307C]) [n:127.0.0.1:48978_afv%2Fg    ] o.a.s.c.CoreContainer No authentication plugin used.
   [junit4]   2> 1096831 INFO  (TEST-CdcrReplicationHandlerTest.doTest-seed#[944A27A1410A307C]) [n:127.0.0.1:48978_afv%2Fg    ] o.a.s.c.CoresLocator Looking for core definitions underneath /home/jenkins/workspace/Lucene-Solr-trunk-Linux/solr/build/solr-core/test/J0/temp/solr.cloud.CdcrReplicationHandlerTest_944A27A1410A307C-001/jetty-002/cores
   [junit4]   2> 1096832 INFO  (TEST-CdcrReplicationHandlerTest.doTest-seed#[944A27A1410A307C]) [n:127.0.0.1:48978_afv%2Fg    ] o.a.s.c.SolrCore Created CoreDescriptor: {name=collection1, config=solrconfig.xml, transient=false, schema=schema.xml, loadOnStartup=true, configSetProperties=configsetprops.json, instanceDir=/home/jenkins/workspace/Lucene-Solr-trunk-Linux/solr/build/solr-core/test/J0/temp/solr.cloud.CdcrReplicationHandlerTest_944A27A1410A307C-001/jetty-002/cores/collection1, collection=tmp_collection, absoluteInstDir=/home/jenkins/workspace/Lucene-Solr-trunk-Linux/solr/build/solr-core/test/J0/temp/solr.cloud.CdcrReplicationHandlerTest_944A27A1410A307C-001/jetty-002/cores/collection1/, coreNodeName=, dataDir=data/, shard=}
   [junit4]   2> 1096832 INFO  (TEST-CdcrReplicationHandlerTest.doTest-seed#[944A27A1410A307C]) [n:127.0.0.1:48978_afv%2Fg    ] o.a.s.c.CoresLocator Found core collection1 in /home/jenkins/workspace/Lucene-Solr-trunk-Linux/solr/build/solr-core/test/J0/temp/solr.cloud.CdcrReplicationHandlerTest_944A27A1410A307C-001/jetty-002/cores/collection1/
   [junit4]   2> 1096832 INFO  (TEST-CdcrReplicationHandlerTest.doTest-seed#[944A27A1410A307C]) [n:127.0.0.1:48978_afv%2Fg    ] o.a.s.c.CoresLocator Found 1 core definitions
   [junit4]   2> 1096833 INFO  (coreLoadExecutor-4802-thread-1-processing-n:127.0.0.1:48978_afv%2Fg) [n:127.0.0.1:48978_afv%2Fg c:tmp_collection   x:collection1] o.a.s.c.ZkController publishing state=down
   [junit4]   2> 1096833 INFO  (TEST-CdcrReplicationHandlerTest.doTest-seed#[944A27A1410A307C]) [n:127.0.0.1:48978_afv%2Fg    ] o.a.s.s.SolrDispatchFilter user.dir=/home/jenkins/workspace/Lucene-Solr-trunk-Linux/solr/build/solr-core/test/J0
   [junit4]   2> 1096833 INFO  (TEST-CdcrReplicationHandlerTest.doTest-seed#[944A27A1410A307C]) [n:127.0.0.1:48978_afv%2Fg    ] o.a.s.s.SolrDispatchFilter SolrDispatchFilter.init() done
   [junit4]   2> 1096833 INFO  (coreLoadExecutor-4802-thread-1-processing-n:127.0.0.1:48978_afv%2Fg) [n:127.0.0.1:48978_afv%2Fg c:tmp_collection   x:collection1] o.a.s.c.ZkController numShards not found on descriptor - reading it from system property
   [junit4]   2> 1096834 INFO  (coreLoadExecutor-4802-thread-1-processing-n:127.0.0.1:48978_afv%2Fg) [n:127.0.0.1:48978_afv%2Fg c:tmp_collection   x:collection1] o.a.s.c.ZkController Registering watch for collection tmp_collection
   [junit4]   2> 1096834 INFO  (zkCallback-959-thread-2-processing-n:127.0.0.1:50718_afv%2Fg) [n:127.0.0.1:50718_afv%2Fg    ] o.a.s.c.DistributedQueue NodeChildrenChanged fired on path /overseer/queue state SyncConnected
   [junit4]   2> 1096834 INFO  (coreLoadExecutor-4802-thread-1-processing-n:127.0.0.1:48978_afv%2Fg) [n:127.0.0.1:48978_afv%2Fg c:tmp_collection   x:collection1] o.a.s.c.c.ZkStateReader addZkWatch tmp_collection
   [junit4]   2> 1096834 INFO  (coreLoadExecutor-4802-thread-1-processing-n:127.0.0.1:48978_afv%2Fg) [n:127.0.0.1:48978_afv%2Fg c:tmp_collection   x:collection1] o.a.s.c.c.ZkStateReader Deleting data for tmp_collection
   [junit4]   2> 1096834 INFO  (OverseerStateUpdate-94336437902442500-127.0.0.1:50718_afv%2Fg-n_0000000000) [n:127.0.0.1:50718_afv%2Fg    ] o.a.s.c.Overseer processMessage: queueSize: 1, message = {
   [junit4]   2>   "core":"collection1",
   [junit4]   2>   "roles":null,
   [junit4]   2>   "base_url":"http://127.0.0.1:48978/afv/g",
   [junit4]   2>   "node_name":"127.0.0.1:48978_afv%2Fg",
   [junit4]   2>   "numShards":"1",
   [junit4]   2>   "state":"down",
   [junit4]   2>   "shard":null,
   [junit4]   2>   "collection":"tmp_collection",
   [junit4]   2>   "operation":"state"} current state version: 3
   [junit4]   2> 1096834 INFO  (coreLoadExecutor-4802-thread-1-processing-n:127.0.0.1:48978_afv%2Fg) [n:127.0.0.1:48978_afv%2Fg c:tmp_collection   x:collection1] o.a.s.c.ZkController look for our core node name
   [junit4]   2> 1096835 INFO  (OverseerStateUpdate-94336437902442500-127.0.0.1:50718_afv%2Fg-n_0000000000) [n:127.0.0.1:50718_afv%2Fg    ] o.a.s.c.o.ReplicaMutator Update state numShards=1 message={
   [junit4]   2>   "core":"collection1",
   [junit4]   2>   "roles":null,
   [junit4]   2>   "base_url":"http://127.0.0.1:48978/afv/g",
   [junit4]   2>   "node_name":"127.0.0.1:48978_afv%2Fg",
   [junit4]   2>   "numShards":"1",
   [junit4]   2>   "state":"down",
   [junit4]   2>   "shard":null,
   [junit4]   2>   "collection":"tmp_collection",
   [junit4]   2>   "operation":"state"}
   [junit4]   2> 1096835 INFO  (OverseerStateUpdate-94336437902442500-127.0.0.1:50718_afv%2Fg-n_0000000000) [n:127.0.0.1:50718_afv%2Fg    ] o.a.s.c.o.ReplicaMutator Collection already exists with numShards=1
   [junit4]   2> 1096835 INFO  (OverseerStateUpdate-94336437902442500-127.0.0.1:50718_afv%2Fg-n_0000000000) [n:127.0.0.1:50718_afv%2Fg    ] o.a.s.c.o.ReplicaMutator Assigning new node to shard shard=shard1
   [junit4]   2> 1096936 INFO  (zkCallback-959-thread-2-processing-n:127.0.0.1:50718_afv%2Fg) [n:127.0.0.1:50718_afv%2Fg    ] o.a.s.c.c.ZkStateReader A cluster state change: WatchedEvent state:SyncConnected type:NodeDataChanged path:/clusterstate.json, has occurred - updating... (live nodes size: 2)
   [junit4]   2> 1096936 INFO  (zkCallback-963-thread-1-processing-n:127.0.0.1:48978_afv%2Fg) [n:127.0.0.1:48978_afv%2Fg    ] o.a.s.c.c.ZkStateReader A cluster state change: WatchedEvent state:SyncConnected type:NodeDataChanged path:/clusterstate.json, has occurred - updating... (live nodes size: 2)
   [junit4]   2> 1097835 INFO  (coreLoadExecutor-4802-thread-1-processing-n:127.0.0.1:48978_afv%2Fg) [n:127.0.0.1:48978_afv%2Fg c:tmp_collection   x:collection1] o.a.s.c.ZkController waiting to find shard id in clusterstate for collection1
   [junit4]   2> 1097835 INFO  (coreLoadExecutor-4802-thread-1-processing-n:127.0.0.1:48978_afv%2Fg) [n:127.0.0.1:48978_afv%2Fg c:tmp_collection   x:collection1] o.a.s.c.ZkController Check for collection zkNode:tmp_collection
   [junit4]   2> 1097835 INFO  (coreLoadExecutor-4802-thread-1-processing-n:127.0.0.1:48978_afv%2Fg) [n:127.0.0.1:48978_afv%2Fg c:tmp_collection   x:collection1] o.a.s.c.ZkController Collection zkNode exists
   [junit4]   2> 1097835 INFO  (coreLoadExecutor-4802-thread-1-processing-n:127.0.0.1:48978_afv%2Fg) [n:127.0.0.1:48978_afv%2Fg c:tmp_collection   x:collection1] o.a.s.c.c.ZkStateReader Load collection config from:/collections/tmp_collection
   [junit4]   2> 1097835 INFO  (coreLoadExecutor-4802-thread-1-processing-n:127.0.0.1:48978_afv%2Fg) [n:127.0.0.1:48978_afv%2Fg c:tmp_collection   x:collection1] o.a.s.c.c.ZkStateReader path=/collections/tmp_collection configName=conf1 specified config exists in ZooKeeper
   [junit4]   2> 1097836 INFO  (coreLoadExecutor-4802-thread-1-processing-n:127.0.0.1:48978_afv%2Fg) [n:127.0.0.1:48978_afv%2Fg c:tmp_collection   x:collection1] o.a.s.c.SolrResourceLoader new SolrResourceLoader for directory: '/home/jenkins/workspace/Lucene-Solr-trunk-Linux/solr/build/solr-core/test/J0/temp/solr.cloud.CdcrReplicationHandlerTest_944A27A1410A307C-001/jetty-002/cores/collection1/'
   [junit4]   2> 1097844 INFO  (coreLoadExecutor-4802-thread-1-processing-n:127.0.0.1:48978_afv%2Fg) [n:127.0.0.1:48978_afv%2Fg c:tmp_collection   x:collection1] o.a.s.c.Config loaded config solrconfig.xml with version 0 
   [junit4]   2> 1097847 INFO  (coreLoadExecutor-4802-thread-1-processing-n:127.0.0.1:48978_afv%2Fg) [n:127.0.0.1:48978_afv%2Fg c:tmp_collection   x:collection1] o.a.s.c.SolrConfig current version of requestparams : -1
   [junit4]   2> 1097849 INFO  (coreLoadExecutor-4802-thread-1-processing-n:127.0.0.1:48978_afv%2Fg) [n:127.0.0.1:48978_afv%2Fg c:tmp_collection   x:collection1] o.a.s.c.SolrConfig Using Lucene MatchVersion: 6.0.0
   [junit4]   2> 1097866 INFO  (coreLoadExecutor-4802-thread-1-processing-n:127.0.0.1:48978_afv%2Fg) [n:127.0.0.1:48978_afv%2Fg c:tmp_collection   x:collection1] o.a.s.c.Config Loaded SolrConfig: solrconfig.xml
   [junit4]   2> 1097867 INFO  (coreLoadExecutor-4802-thread-1-processing-n:127.0.0.1:48978_afv%2Fg) [n:127.0.0.1:48978_afv%2Fg c:tmp_collection   x:collection1] o.a.s.s.IndexSchema Reading Solr Schema from /configs/conf1/schema.xml
   [junit4]   2> 1097870 INFO  (coreLoadExecutor-4802-thread-1-processing-n:127.0.0.1:48978_afv%2Fg) [n:127.0.0.1:48978_afv%2Fg c:tmp_collection   x:collection1] o.a.s.s.IndexSchema [collection1] Schema name=test
   [junit4]   2> 1097936 INFO  (coreLoadExecutor-4802-thread-1-processing-n:127.0.0.1:48978_afv%2Fg) [n:127.0.0.1:48978_afv%2Fg c:tmp_collection   x:collection1] o.a.s.s.IndexSchema default search field in schema is text
   [junit4]   2> 1097937 INFO  (coreLoadExecutor-4802-thread-1-processing-n:127.0.0.1:48978_afv%2Fg) [n:127.0.0.1:48978_afv%2Fg c:tmp_collection   x:collection1] o.a.s.s.IndexSchema unique key field: id
   [junit4]   2> 1097937 INFO  (coreLoadExecutor-4802-thread-1-processing-n:127.0.0.1:48978_afv%2Fg) [n:127.0.0.1:48978_afv%2Fg c:tmp_collection   x:collection1] o.a.s.s.FileExchangeRateProvider Reloading exchange rates from file currency.xml
   [junit4]   2> 1097939 INFO  (coreLoadExecutor-4802-thread-1-processing-n:127.0.0.1:48978_afv%2Fg) [n:127.0.0.1:48978_afv%2Fg c:tmp_collection   x:collection1] o.a.s.s.FileExchangeRateProvider Reloading exchange rates from file currency.xml
   [junit4]   2> 1097945 INFO  (coreLoadExecutor-4802-thread-1-processing-n:127.0.0.1:48978_afv%2Fg) [n:127.0.0.1:48978_afv%2Fg c:tmp_collection   x:collection1] o.a.s.c.ConfigSetProperties Did not find ConfigSet properties, assuming default properties: Can't find resource 'configsetprops.json' in classpath or '/configs/conf1', cwd=/home/jenkins/workspace/Lucene-Solr-trunk-Linux/solr/build/solr-core/test/J0
   [junit4]   2> 1097945 INFO  (coreLoadExecutor-4802-thread-1-processing-n:127.0.0.1:48978_afv%2Fg) [n:127.0.0.1:48978_afv%2Fg c:tmp_collection   x:collection1] o.a.s.c.CoreContainer Creating SolrCore 'collection1' using configuration from collection tmp_collection
   [junit4]   2> 1097945 INFO  (coreLoadExecutor-4802-thread-1-processing-n:127.0.0.1:48978_afv%2Fg) [n:127.0.0.1:48978_afv%2Fg c:tmp_collection s:shard1 r:core_node2 x:collection1] o.a.s.c.SolrCore solr.StandardDirectoryFactory
   [junit4]   2> 1097945 INFO  (coreLoadExecutor-4802-thread-1-processing-n:127.0.0.1:48978_afv%2Fg) [n:127.0.0.1:48978_afv%2Fg c:tmp_collection s:shard1 r:core_node2 x:collection1] o.a.s.c.SolrCore [[collection1] ] Opening new SolrCore at [/home/jenkins/workspace/Lucene-Solr-trunk-Linux/solr/build/solr-core/test/J0/temp/solr.cloud.CdcrReplicationHandlerTest_944A27A1410A307C-001/jetty-002/cores/collection1/], dataDir=[null]
   [junit4]   2> 1097946 INFO  (coreLoadExecutor-4802-thread-1-processing-n:127.0.0.1:48978_afv%2Fg) [n:127.0.0.1:48978_afv%2Fg c:tmp_collection s:shard1 r:core_node2 x:collection1] o.a.s.c.JmxMonitoredMap JMX monitoring is enabled. Adding Solr mbeans to JMX Server: com.sun.jmx.mbeanserver.JmxMBeanServer@b12a1c
   [junit4]   2> 1097946 INFO  (coreLoadExecutor-4802-thread-1-processing-n:127.0.0.1:48978_afv%2Fg) [n:127.0.0.1:48978_afv%2Fg c:tmp_collection s:shard1 r:core_node2 x:collection1] o.a.s.c.CachingDirectoryFactory return new directory for /home/jenkins/workspace/Lucene-Solr-trunk-Linux/solr/build/solr-core/test/J0/temp/solr.cloud.CdcrReplicationHandlerTest_944A27A1410A307C-001/jetty-002/cores/collection1/data
   [junit4]   2> 1097946 INFO  (coreLoadExecutor-4802-thread-1-processing-n:127.0.0.1:48978_afv%2Fg) [n:127.0.0.1:48978_afv%2Fg c:tmp_collection s:shard1 r:core_node2 x:collection1] o.a.s.c.SolrCore New index directory detected: old=null new=/home/jenkins/workspace/Lucene-Solr-trunk-Linux/solr/build/solr-core/test/J0/temp/solr.cloud.CdcrReplicationHandlerTest_944A27A1410A307C-001/jetty-002/cores/collection1/data/index/
   [junit4]   2> 1097946 WARN  (coreLoadExecutor-4802-thread-1-processing-n:127.0.0.1:48978_afv%2Fg) [n:127.0.0.1:48978_afv%2Fg c:tmp_collection s:shard1 r:core_node2 x:collection1] o.a.s.c.SolrCore [collection1] Solr index directory '/home/jenkins/workspace/Lucene-Solr-trunk-Linux/solr/build/solr-core/test/J0/temp/solr.cloud.CdcrReplicationHandlerTest_944A27A1410A307C-001/jetty-002/cores/collection1/data/index' doesn't exist. Creating new index...
   [junit4]   2> 1097947 INFO  (coreLoadExecutor-4802-thread-1-processing-n:127.0.0.1:48978_afv%2Fg) [n:127.0.0.1:48978_afv%2Fg c:tmp_collection s:shard1 r:core_node2 x:collection1] o.a.s.c.CachingDirectoryFactory return new directory for /home/jenkins/workspace/Lucene-Solr-trunk-Linux/solr/build/solr-core/test/J0/temp/solr.cloud.CdcrReplicationHandlerTest_944A27A1410A307C-001/jetty-002/cores/collection1/data/index
   [junit4]   2> 1097947 INFO  (coreLoadExecutor-4802-thread-1-processing-n:127.0.0.1:48978_afv%2Fg) [n:127.0.0.1:48978_afv%2Fg c:tmp_collection s:shard1 r:core_node2 x:collection1] o.a.s.u.RandomMergePolicy RandomMergePolicy wrapping class org.apache.lucene.index.LogByteSizeMergePolicy: [LogByteSizeMergePolicy: minMergeSize=1677721, mergeFactor=26, maxMergeSize=2147483648, maxMergeSizeForForcedMerge=9223372036854775807, calibrateSizeByDeletes=true, maxMergeDocs=2147483647, maxCFSSegmentSizeMB=8.796093022207999E12, noCFSRatio=0.10243047388713143]
   [junit4]   2> 1097979 INFO  (coreLoadExecutor-4802-thread-1-processing-n:127.0.0.1:48978_afv%2Fg) [n:127.0.0.1:48978_afv%2Fg c:tmp_collection s:shard1 r:core_node2 x:collection1] o.a.s.c.SolrCore SolrDeletionPolicy.onCommit: commits: num=1
   [junit4]   2> 	commit{dir=/home/jenkins/workspace/Lucene-Solr-trunk-Linux/solr/build/solr-core/test/J0/temp/solr.cloud.CdcrReplicationHandlerTest_944A27A1410A307C-001/jetty-002/cores/collection1/data/index,segFN=segments_1,generation=1}
   [junit4]   2> 1097980 INFO  (coreLoadExecutor-4802-thread-1-processing-n:127.0.0.1:48978_afv%2Fg) [n:127.0.0.1:48978_afv%2Fg c:tmp_collection s:shard1 r:core_node2 x:collection1] o.a.s.c.SolrCore newest commit generation = 1
   [junit4]   2> 1097980 INFO  (OldIndexDirectoryCleanupThreadForCore-collection1) [n:127.0.0.1:48978_afv%2Fg c:tmp_collection s:shard1 r:core_node2 x:collection1] o.a.s.c.SolrCore Looking for old index directories to cleanup for core collection1 in /home/jenkins/workspace/Lucene-Solr-trunk-Linux/solr/build/solr-core/test/J0/temp/solr.cloud.CdcrReplicationHandlerTest_944A27A1410A307C-001/jetty-002/cores/collection1/data/
   [junit4]   2> 1097982 INFO  (coreLoadExecutor-4802-thread-1-processing-n:127.0.0.1:48978_afv%2Fg) [n:127.0.0.1:48978_afv%2Fg c:tmp_collection s:shard1 r:core_node2 x:collection1] o.a.s.u.p.UpdateRequestProcessorChain creating updateRequestProcessorChain "cdcr-processor-chain"
   [junit4]   2> 1097982 INFO  (coreLoadExecutor-4802-thread-1-processing-n:127.0.0.1:48978_afv%2Fg) [n:127.0.0.1:48978_afv%2Fg c:tmp_collection s:shard1 r:core_node2 x:collection1] o.a.s.c.SolrCore no updateRequestProcessorChain defined as default, creating implicit default
   [junit4]   2> 1097984 INFO  (coreLoadExecutor-4802-thread-1-processing-n:127.0.0.1:48978_afv%2Fg) [n:127.0.0.1:48978_afv%2Fg c:tmp_collection s:shard1 r:core_node2 x:collection1] o.a.s.h.l.XMLLoader xsltCacheLifetimeSeconds=60
   [junit4]   2> 1097984 INFO  (coreLoadExecutor-4802-thread-1-processing-n:127.0.0.1:48978_afv%2Fg) [n:127.0.0.1:48978_afv%2Fg c:tmp_collection s:shard1 r:core_node2 x:collection1] o.a.s.h.l.XMLLoader xsltCacheLifetimeSeconds=60
   [junit4]   2> 1097985 INFO  (coreLoadExecutor-4802-thread-1-processing-n:127.0.0.1:48978_afv%2Fg) [n:127.0.0.1:48978_afv%2Fg c:tmp_collection s:shard1 r:core_node2 x:collection1] o.a.s.h.l.XMLLoader xsltCacheLifetimeSeconds=60
   [junit4]   2> 1097986 INFO  (coreLoadExecutor-4802-thread-1-processing-n:127.0.0.1:48978_afv%2Fg) [n:127.0.0.1:48978_afv%2Fg c:tmp_collection s:shard1 r:core_node2 x:collection1] o.a.s.h.l.XMLLoader xsltCacheLifetimeSeconds=60
   [junit4]   2> 1097989 INFO  (coreLoadExecutor-4802-thread-1-processing-n:127.0.0.1:48978_afv%2Fg) [n:127.0.0.1:48978_afv%2Fg c:tmp_collection s:shard1 r:core_node2 x:collection1] o.a.s.c.RequestHandlers Registered paths: /admin/mbeans,standard,/update/csv,/update/json/docs,/admin/luke,/admin/segments,/get,/admin/system,/replication,/admin/properties,/config,/schema,/admin/plugins,/admin/logging,/update/json,/admin/threads,/admin/ping,/cdcr,/update,/admin/file
   [junit4]   2> 1097989 INFO  (coreLoadExecutor-4802-thread-1-processing-n:127.0.0.1:48978_afv%2Fg) [n:127.0.0.1:48978_afv%2Fg c:tmp_collection s:shard1 r:core_node2 x:collection1] o.a.s.c.SolrCore Using default statsCache cache: org.apache.solr.search.stats.LocalStatsCache
   [junit4]   2> 1097989 INFO  (coreLoadExecutor-4802-thread-1-processing-n:127.0.0.1:48978_afv%2Fg) [n:127.0.0.1:48978_afv%2Fg c:tmp_collection s:shard1 r:core_node2 x:collection1] o.a.s.u.UpdateHandler Using UpdateLog implementation: org.apache.solr.update.CdcrUpdateLog
   [junit4]   2> 1097989 INFO  (coreLoadExecutor-4802-thread-1-processing-n:127.0.0.1:48978_afv%2Fg) [n:127.0.0.1:48978_afv%2Fg c:tmp_collection s:shard1 r:core_node2 x:collection1] o.a.s.u.UpdateLog Initializing UpdateLog: dataDir= defaultSyncLevel=FLUSH numRecordsToKeep=100 maxNumLogsToKeep=10 numVersionBuckets=65536
   [junit4]   2> 1097990 INFO  (coreLoadExecutor-4802-thread-1-processing-n:127.0.0.1:48978_afv%2Fg) [n:127.0.0.1:48978_afv%2Fg c:tmp_collection s:shard1 r:core_node2 x:collection1] o.a.s.c.SolrCore Hard AutoCommit: disabled
   [junit4]   2> 1097990 INFO  (coreLoadExecutor-4802-thread-1-processing-n:127.0.0.1:48978_afv%2Fg) [n:127.0.0.1:48978_afv%2Fg c:tmp_collection s:shard1 r:core_node2 x:collection1] o.a.s.c.SolrCore Soft AutoCommit: disabled
   [junit4]   2> 1097991 INFO  (coreLoadExecutor-4802-thread-1-processing-n:127.0.0.1:48978_afv%2Fg) [n:127.0.0.1:48978_afv%2Fg c:tmp_collection s:shard1 r:core_node2 x:collection1] o.a.s.u.RandomMergePolicy RandomMergePolicy wrapping class org.apache.lucene.index.TieredMergePolicy: [TieredMergePolicy: maxMergeAtOnce=29, maxMergeAtOnceExplicit=33, maxMergedSegmentMB=99.125, floorSegmentMB=1.5224609375, forceMergeDeletesPctAllowed=9.695349370458151, segmentsPerTier=45.0, maxCFSSegmentSizeMB=8.796093022207999E12, noCFSRatio=0.19822055494660829
   [junit4]   2> 1097991 INFO  (coreLoadExecutor-4802-thread-1-processing-n:127.0.0.1:48978_afv%2Fg) [n:127.0.0.1:48978_afv%2Fg c:tmp_collection s:shard1 r:core_node2 x:collection1] o.a.s.c.SolrCore SolrDeletionPolicy.onInit: commits: num=1
   [junit4]   2> 	commit{dir=/home/jenkins/workspace/Lucene-Solr-trunk-Linux/solr/build/solr-core/test/J0/temp/solr.cloud.CdcrReplicationHandlerTest_944A27A1410A307C-001/jetty-002/cores/collection1/data/index,segFN=segments_1,generation=1}
   [junit4]   2> 1097991 INFO  (coreLoadExecutor-4802-thread-1-processing-n:127.0.0.1:48978_afv%2Fg) [n:127.0.0.1:48978_afv%2Fg c:tmp_collection s:shard1 r:core_node2 x:collection1] o.a.s

[...truncated too long message...]

2> 
   [junit4]   2> 1552414 INFO  (qtp1802153-9724) [n:127.0.0.1:48978_afv%2Fg    ] o.a.s.s.SolrDispatchFilter [admin] webapp=null path=/admin/cores params={nodeName=127.0.0.1:50718_afv%252Fg&onlyIfLeaderActive=true&core=source_collection_shard1_replica1&coreNodeName=core_node2&action=PREPRECOVERY&checkLive=true&state=recovering&onlyIfLeader=true&wt=javabin&version=2} status=400 QTime=14003 
   [junit4]   2> 1552415 INFO  (TEST-CdcrReplicationHandlerTest.doTest-seed#[944A27A1410A307C]) [n:127.0.0.1:48978_afv%2Fg c:source_collection s:shard1 r:core_node1 x:source_collection_shard1_replica1] o.a.s.SolrTestCaseJ4 ###Ending doTest
   [junit4]   2> 1552415 INFO  (TEST-CdcrReplicationHandlerTest.doTest-seed#[944A27A1410A307C]) [n:127.0.0.1:48978_afv%2Fg c:source_collection s:shard1 r:core_node1 x:source_collection_shard1_replica1] o.a.s.c.ZkTestServer connecting to 127.0.0.1:32877 32877
   [junit4]   2> 1552448 INFO  (Thread-4362) [    ] o.a.s.c.ZkTestServer connecting to 127.0.0.1:32877 32877
   [junit4]   2> 1552449 WARN  (Thread-4362) [    ] o.a.s.c.ZkTestServer Watch limit violations: 
   [junit4]   2> Maximum concurrent create/delete watches above limit:
   [junit4]   2> 
   [junit4]   2> 	29	/solr/aliases.json
   [junit4]   2> 	9	/solr/configs/conf1
   [junit4]   2> 	3	/solr/security.json
   [junit4]   2> 	3	/solr/collections/source_collection/leaders/shard1
   [junit4]   2> 	2	/solr/collections/tmp_collection/leaders/shard1
   [junit4]   2> 
   [junit4]   2> Maximum concurrent data watches above limit:
   [junit4]   2> 
   [junit4]   2> 	29	/solr/clusterstate.json
   [junit4]   2> 	7	/solr/collections/source_collection/cdcr/state/buffer
   [junit4]   2> 	7	/solr/collections/source_collection/cdcr/state/process
   [junit4]   2> 	5	/solr/collections/source_collection/state.json
   [junit4]   2> 	2	/solr/overseer_elect/election/94336437902442500-127.0.0.1:50718_afv%2Fg-n_0000000000
   [junit4]   2> 	2	/solr/collections/tmp_collection/cdcr/state/buffer
   [junit4]   2> 	2	/solr/collections/tmp_collection/cdcr/state/process
   [junit4]   2> 	2	/solr/collections/source_collection/leader_elect/shard1/election/94336437902442500-core_node2-n_0000000000
   [junit4]   2> 
   [junit4]   2> Maximum concurrent children watches above limit:
   [junit4]   2> 
   [junit4]   2> 	28	/solr/live_nodes
   [junit4]   2> 	2	/solr/overseer/queue
   [junit4]   2> 	2	/solr/overseer/collection-queue-work
   [junit4]   2> 
   [junit4]   2> NOTE: reproduce with: ant test  -Dtestcase=CdcrReplicationHandlerTest -Dtests.method=doTest -Dtests.seed=944A27A1410A307C -Dtests.multiplier=3 -Dtests.slow=true -Dtests.locale=ga -Dtests.timezone=America/Bogota -Dtests.asserts=true -Dtests.file.encoding=US-ASCII
   [junit4] FAILURE  458s J0 | CdcrReplicationHandlerTest.doTest <<<
   [junit4]    > Throwable #1: java.lang.AssertionError: There are still nodes recoverying - waited for 330 seconds
   [junit4]    > 	at __randomizedtesting.SeedInfo.seed([944A27A1410A307C:330E9F052CB123C5]:0)
   [junit4]    > 	at org.apache.solr.cloud.AbstractDistribZkTestBase.waitForRecoveriesToFinish(AbstractDistribZkTestBase.java:172)
   [junit4]    > 	at org.apache.solr.cloud.AbstractDistribZkTestBase.waitForRecoveriesToFinish(AbstractDistribZkTestBase.java:133)
   [junit4]    > 	at org.apache.solr.cloud.AbstractDistribZkTestBase.waitForRecoveriesToFinish(AbstractDistribZkTestBase.java:128)
   [junit4]    > 	at org.apache.solr.cloud.BaseCdcrDistributedZkTest.waitForRecoveriesToFinish(BaseCdcrDistributedZkTest.java:465)
   [junit4]    > 	at org.apache.solr.cloud.BaseCdcrDistributedZkTest.clearSourceCollection(BaseCdcrDistributedZkTest.java:319)
   [junit4]    > 	at org.apache.solr.cloud.CdcrReplicationHandlerTest.doTestPartialReplication(CdcrReplicationHandlerTest.java:86)
   [junit4]    > 	at org.apache.solr.cloud.CdcrReplicationHandlerTest.doTest(CdcrReplicationHandlerTest.java:51)
   [junit4]    > 	at org.apache.solr.BaseDistributedSearchTestCase$ShardsRepeatRule$ShardsFixedStatement.callStatement(BaseDistributedSearchTestCase.java:963)
   [junit4]    > 	at org.apache.solr.BaseDistributedSearchTestCase$ShardsRepeatRule$ShardsStatement.evaluate(BaseDistributedSearchTestCase.java:938)
   [junit4]    > 	at java.lang.Thread.run(Thread.java:745)
   [junit4]   2> 1552454 INFO  (SUITE-CdcrReplicationHandlerTest-seed#[944A27A1410A307C]-worker) [n:127.0.0.1:48978_afv%2Fg c:source_collection s:shard1 r:core_node1 x:source_collection_shard1_replica1] o.a.s.SolrTestCaseJ4 ###deleteCore
   [junit4]   2> NOTE: leaving temporary files on disk at: /home/jenkins/workspace/Lucene-Solr-trunk-Linux/solr/build/solr-core/test/J0/temp/solr.cloud.CdcrReplicationHandlerTest_944A27A1410A307C-001
   [junit4]   2> Aug 13, 2015 10:04:25 AM com.carrotsearch.randomizedtesting.ThreadLeakControl checkThreadLeaks
   [junit4]   2> WARNING: Will linger awaiting termination of 1 leaked thread(s).
   [junit4]   2> NOTE: test params are: codec=Lucene53, sim=RandomSimilarityProvider(queryNorm=false,coord=crazy): {}, locale=ga, timezone=America/Bogota
   [junit4]   2> NOTE: Linux 3.16.0-44-generic i386/Oracle Corporation 1.8.0_51 (32-bit)/cpus=12,threads=1,free=147609352,total=373518336
   [junit4]   2> NOTE: All tests run in this JVM: [LeaderFailoverAfterPartitionTest, MultiTermTest, SimpleMLTQParserTest, TestManagedSchemaFieldResource, TestPhraseSuggestions, TestRandomDVFaceting, TestCodecSupport, TestLRUStatsCache, TermsComponentTest, CdcrUpdateLogTest, IndexSchemaTest, TestRemoteStreaming, HighlighterTest, DistributedSpellCheckComponentTest, TestHashQParserPlugin, TestMergePolicyConfig, BlockCacheTest, IgnoreCommitOptimizeUpdateProcessorFactoryTest, TestClusterStateMutator, TestDistributedSearch, TestWordDelimiterFilterFactory, TestCollationFieldDocValues, AddSchemaFieldsUpdateProcessorFactoryTest, TestSmileRequest, DistributedFacetPivotLongTailTest, RequestHandlersTest, TestMiniSolrCloudCluster, SuggesterFSTTest, TestTrieFacet, TestFieldTypeResource, MergeStrategyTest, HdfsNNFailoverTest, TestFileDictionaryLookup, OverseerStatusTest, TestSweetSpotSimilarityFactory, DistributedFacetPivotLargeTest, QueryElevationComponentTest, TestScoreJoinQPScore, TestJmxIntegration, DateMathParserTest, TestReplicaProperties, TestMinMaxOnMultiValuedField, TestConfig, CollectionReloadTest, BasicDistributedZkTest, StressHdfsTest, TestReplicationHandlerBackup, AddBlockUpdateTest, BJQParserTest, TestExactStatsCache, TestFieldTypeCollectionResource, ExplicitHLLTest, ExternalFileFieldSortTest, SchemaVersionSpecificBehaviorTest, URLClassifyProcessorTest, DeleteLastCustomShardedReplicaTest, DebugComponentTest, PrimitiveFieldTypeTest, TestAuthorizationFramework, PingRequestHandlerTest, DistributedQueryComponentCustomSortTest, HdfsCollectionsAPIDistributedZkTest, TestDocumentBuilder, DocValuesMissingTest, UUIDFieldTest, TriLevelCompositeIdRoutingTest, UpdateRequestProcessorFactoryTest, TestTrackingShardHandlerFactory, BigEndianAscendingWordSerializerTest, TestBadConfig, TestShortCircuitedRequests, TestNamedUpdateProcessors, TestCloudPivotFacet, TestRangeQuery, SolrCoreTest, TestCustomSort, TestClassNameShortening, ZkStateReaderTest, LeaderInitiatedRecoveryOnCommitTest, SignatureUpdateProcessorFactoryTest, TestBinaryField, TestSimpleTrackingShardHandler, CollectionStateFormat2Test, TestDynamicFieldCollectionResource, PeerSyncTest, FastVectorHighlighterTest, TestReplicationHandler, TestRawResponseWriter, TestPostingsSolrHighlighter, FullSolrCloudDistribCmdsTest, TestHashPartitioner, TestStressVersions, TestSolr4Spatial, SpellCheckComponentTest, TestFunctionQuery, BasicFunctionalityTest, TestLazyCores, SimplePostToolTest, AnalysisAfterCoreReloadTest, DocValuesTest, TestStressLucene, TestCSVLoader, NoCacheHeaderTest, TestPseudoReturnFields, DirectUpdateHandlerOptimizeTest, TestSolrDeletionPolicy1, CacheHeaderTest, TestQueryUtils, TestWriterPerf, DocumentBuilderTest, TestIndexingPerformance, TestArbitraryIndexDir, TestCSVResponseWriter, TestAnalyzedSuggestions, TestPHPSerializedResponseWriter, TestBinaryResponseWriter, AlternateDirectoryTest, ResponseLogComponentTest, TestSolrDeletionPolicy2, TestDocSet, OutputWriterTest, TestLuceneMatchVersion, EchoParamsTest, TestIBSimilarityFactory, TestFastWriter, TimeZoneUtilsTest, ScriptEngineTest, PluginInfoTest, PrimUtilsTest, DateFieldTest, DOMUtilTest, RAMDirectoryFactoryTest, ClusterStateTest, TestSolrJ, TestLRUCache, ZkNodePropsTest, SystemInfoHandlerTest, FileUtilsTest, CircularListTest, DistributedMLTComponentTest, CursorPagingTest, DistributedIntervalFacetingTest, TestCursorMarkWithoutUniqueKey, TestDistributedMissingSort, BaseCdcrDistributedZkTest, CdcrReplicationDistributedZkTest, CdcrReplicationHandlerTest]
   [junit4] Completed [454/540] on J0 in 459.26s, 1 test, 1 failure <<< FAILURES!

[...truncated 275 lines...]
BUILD FAILED
/home/jenkins/workspace/Lucene-Solr-trunk-Linux/build.xml:769: The following error occurred while executing this line:
/home/jenkins/workspace/Lucene-Solr-trunk-Linux/build.xml:713: The following error occurred while executing this line:
/home/jenkins/workspace/Lucene-Solr-trunk-Linux/build.xml:59: The following error occurred while executing this line:
/home/jenkins/workspace/Lucene-Solr-trunk-Linux/solr/build.xml:233: The following error occurred while executing this line:
/home/jenkins/workspace/Lucene-Solr-trunk-Linux/solr/common-build.xml:514: The following error occurred while executing this line:
/home/jenkins/workspace/Lucene-Solr-trunk-Linux/lucene/common-build.xml:1429: The following error occurred while executing this line:
/home/jenkins/workspace/Lucene-Solr-trunk-Linux/lucene/common-build.xml:984: There were test failures: 540 suites, 2128 tests, 1 failure, 68 ignored (32 assumptions)

Total time: 49 minutes 10 seconds
Build step 'Invoke Ant' marked build as failure
Archiving artifacts
[WARNINGS] Skipping publisher since build result is FAILURE
Recording test results
Email was triggered for: Failure - Any
Sending email for trigger: Failure - Any



Mime
View raw message