lucene-dev mailing list archives

Site index · List index
Message view « Date » · « Thread »
Top « Date » · « Thread »
From Policeman Jenkins Server <jenk...@thetaphi.de>
Subject [JENKINS] Lucene-Solr-trunk-Linux (32bit/jdk1.8.0_51) - Build # 13828 - Still Failing!
Date Wed, 12 Aug 2015 10:52:39 GMT
Build: http://jenkins.thetaphi.de/job/Lucene-Solr-trunk-Linux/13828/
Java: 32bit/jdk1.8.0_51 -server -XX:+UseParallelGC

1 tests failed.
FAILED:  org.apache.solr.cloud.CollectionsAPIDistributedZkTest.test

Error Message:
Error from server at https://127.0.0.1:54005/oehz/dt: Could not fully remove collection: halfdeletedcollection2

Stack Trace:
org.apache.solr.client.solrj.impl.HttpSolrClient$RemoteSolrException: Error from server at https://127.0.0.1:54005/oehz/dt: Could not fully remove collection: halfdeletedcollection2
	at __randomizedtesting.SeedInfo.seed([19A39875F969E4BB:91F7A7AF57958943]:0)
	at org.apache.solr.client.solrj.impl.HttpSolrClient.executeMethod(HttpSolrClient.java:560)
	at org.apache.solr.client.solrj.impl.HttpSolrClient.request(HttpSolrClient.java:234)
	at org.apache.solr.client.solrj.impl.HttpSolrClient.request(HttpSolrClient.java:226)
	at org.apache.solr.client.solrj.SolrClient.request(SolrClient.java:1220)
	at org.apache.solr.cloud.CollectionsAPIDistributedZkTest.makeRequest(CollectionsAPIDistributedZkTest.java:302)
	at org.apache.solr.cloud.CollectionsAPIDistributedZkTest.deleteCollectionWithDownNodes(CollectionsAPIDistributedZkTest.java:283)
	at org.apache.solr.cloud.CollectionsAPIDistributedZkTest.test(CollectionsAPIDistributedZkTest.java:175)
	at sun.reflect.NativeMethodAccessorImpl.invoke0(Native Method)
	at sun.reflect.NativeMethodAccessorImpl.invoke(NativeMethodAccessorImpl.java:62)
	at sun.reflect.DelegatingMethodAccessorImpl.invoke(DelegatingMethodAccessorImpl.java:43)
	at java.lang.reflect.Method.invoke(Method.java:497)
	at com.carrotsearch.randomizedtesting.RandomizedRunner.invoke(RandomizedRunner.java:1627)
	at com.carrotsearch.randomizedtesting.RandomizedRunner$6.evaluate(RandomizedRunner.java:836)
	at com.carrotsearch.randomizedtesting.RandomizedRunner$7.evaluate(RandomizedRunner.java:872)
	at com.carrotsearch.randomizedtesting.RandomizedRunner$8.evaluate(RandomizedRunner.java:886)
	at org.apache.solr.BaseDistributedSearchTestCase$ShardsRepeatRule$ShardsFixedStatement.callStatement(BaseDistributedSearchTestCase.java:963)
	at org.apache.solr.BaseDistributedSearchTestCase$ShardsRepeatRule$ShardsStatement.evaluate(BaseDistributedSearchTestCase.java:938)
	at com.carrotsearch.randomizedtesting.rules.SystemPropertiesRestoreRule$1.evaluate(SystemPropertiesRestoreRule.java:57)
	at org.apache.lucene.util.TestRuleSetupTeardownChained$1.evaluate(TestRuleSetupTeardownChained.java:50)
	at org.apache.lucene.util.AbstractBeforeAfterRule$1.evaluate(AbstractBeforeAfterRule.java:46)
	at org.apache.lucene.util.TestRuleThreadAndTestName$1.evaluate(TestRuleThreadAndTestName.java:49)
	at org.apache.lucene.util.TestRuleIgnoreAfterMaxFailures$1.evaluate(TestRuleIgnoreAfterMaxFailures.java:65)
	at org.apache.lucene.util.TestRuleMarkFailure$1.evaluate(TestRuleMarkFailure.java:48)
	at com.carrotsearch.randomizedtesting.rules.StatementAdapter.evaluate(StatementAdapter.java:36)
	at com.carrotsearch.randomizedtesting.ThreadLeakControl$StatementRunner.run(ThreadLeakControl.java:365)
	at com.carrotsearch.randomizedtesting.ThreadLeakControl.forkTimeoutingTask(ThreadLeakControl.java:798)
	at com.carrotsearch.randomizedtesting.ThreadLeakControl$3.evaluate(ThreadLeakControl.java:458)
	at com.carrotsearch.randomizedtesting.RandomizedRunner.runSingleTest(RandomizedRunner.java:845)
	at com.carrotsearch.randomizedtesting.RandomizedRunner$3.evaluate(RandomizedRunner.java:747)
	at com.carrotsearch.randomizedtesting.RandomizedRunner$4.evaluate(RandomizedRunner.java:781)
	at com.carrotsearch.randomizedtesting.RandomizedRunner$5.evaluate(RandomizedRunner.java:792)
	at com.carrotsearch.randomizedtesting.rules.StatementAdapter.evaluate(StatementAdapter.java:36)
	at com.carrotsearch.randomizedtesting.rules.SystemPropertiesRestoreRule$1.evaluate(SystemPropertiesRestoreRule.java:57)
	at org.apache.lucene.util.AbstractBeforeAfterRule$1.evaluate(AbstractBeforeAfterRule.java:46)
	at com.carrotsearch.randomizedtesting.rules.StatementAdapter.evaluate(StatementAdapter.java:36)
	at org.apache.lucene.util.TestRuleStoreClassName$1.evaluate(TestRuleStoreClassName.java:42)
	at com.carrotsearch.randomizedtesting.rules.NoShadowingOrOverridesOnMethodsRule$1.evaluate(NoShadowingOrOverridesOnMethodsRule.java:39)
	at com.carrotsearch.randomizedtesting.rules.NoShadowingOrOverridesOnMethodsRule$1.evaluate(NoShadowingOrOverridesOnMethodsRule.java:39)
	at com.carrotsearch.randomizedtesting.rules.StatementAdapter.evaluate(StatementAdapter.java:36)
	at com.carrotsearch.randomizedtesting.rules.StatementAdapter.evaluate(StatementAdapter.java:36)
	at com.carrotsearch.randomizedtesting.rules.StatementAdapter.evaluate(StatementAdapter.java:36)
	at org.apache.lucene.util.TestRuleAssertionsRequired$1.evaluate(TestRuleAssertionsRequired.java:54)
	at org.apache.lucene.util.TestRuleMarkFailure$1.evaluate(TestRuleMarkFailure.java:48)
	at org.apache.lucene.util.TestRuleIgnoreAfterMaxFailures$1.evaluate(TestRuleIgnoreAfterMaxFailures.java:65)
	at org.apache.lucene.util.TestRuleIgnoreTestSuites$1.evaluate(TestRuleIgnoreTestSuites.java:55)
	at com.carrotsearch.randomizedtesting.rules.StatementAdapter.evaluate(StatementAdapter.java:36)
	at com.carrotsearch.randomizedtesting.ThreadLeakControl$StatementRunner.run(ThreadLeakControl.java:365)
	at java.lang.Thread.run(Thread.java:745)




Build Log:
[...truncated 10379 lines...]
   [junit4] Suite: org.apache.solr.cloud.CollectionsAPIDistributedZkTest
   [junit4]   2> Creating dataDir: /home/jenkins/workspace/Lucene-Solr-trunk-Linux/solr/build/solr-core/test/J1/temp/solr.cloud.CollectionsAPIDistributedZkTest_19A39875F969E4BB-001/init-core-data-001
   [junit4]   2> 744843 INFO  (SUITE-CollectionsAPIDistributedZkTest-seed#[19A39875F969E4BB]-worker) [    ] o.a.s.SolrTestCaseJ4 Randomized ssl (true) and clientAuth (false)
   [junit4]   2> 744843 INFO  (SUITE-CollectionsAPIDistributedZkTest-seed#[19A39875F969E4BB]-worker) [    ] o.a.s.BaseDistributedSearchTestCase Setting hostContext system property: /oehz/dt
   [junit4]   2> 744845 INFO  (TEST-CollectionsAPIDistributedZkTest.test-seed#[19A39875F969E4BB]) [    ] o.a.s.c.ZkTestServer STARTING ZK TEST SERVER
   [junit4]   2> 744845 INFO  (Thread-2365) [    ] o.a.s.c.ZkTestServer client port:0.0.0.0/0.0.0.0:0
   [junit4]   2> 744845 INFO  (Thread-2365) [    ] o.a.s.c.ZkTestServer Starting server
   [junit4]   2> 744945 INFO  (TEST-CollectionsAPIDistributedZkTest.test-seed#[19A39875F969E4BB]) [    ] o.a.s.c.ZkTestServer start zk server on port:38510
   [junit4]   2> 744945 INFO  (TEST-CollectionsAPIDistributedZkTest.test-seed#[19A39875F969E4BB]) [    ] o.a.s.c.c.SolrZkClient Using default ZkCredentialsProvider
   [junit4]   2> 744945 INFO  (TEST-CollectionsAPIDistributedZkTest.test-seed#[19A39875F969E4BB]) [    ] o.a.s.c.c.ConnectionManager Waiting for client to connect to ZooKeeper
   [junit4]   2> 744947 INFO  (zkCallback-726-thread-1) [    ] o.a.s.c.c.ConnectionManager Watcher org.apache.solr.common.cloud.ConnectionManager@142cb2a name:ZooKeeperConnection Watcher:127.0.0.1:38510 got event WatchedEvent state:SyncConnected type:None path:null path:null type:None
   [junit4]   2> 744947 INFO  (TEST-CollectionsAPIDistributedZkTest.test-seed#[19A39875F969E4BB]) [    ] o.a.s.c.c.ConnectionManager Client is connected to ZooKeeper
   [junit4]   2> 744947 INFO  (TEST-CollectionsAPIDistributedZkTest.test-seed#[19A39875F969E4BB]) [    ] o.a.s.c.c.SolrZkClient Using default ZkACLProvider
   [junit4]   2> 744948 INFO  (TEST-CollectionsAPIDistributedZkTest.test-seed#[19A39875F969E4BB]) [    ] o.a.s.c.c.SolrZkClient makePath: /solr
   [junit4]   2> 744949 INFO  (TEST-CollectionsAPIDistributedZkTest.test-seed#[19A39875F969E4BB]) [    ] o.a.s.c.c.SolrZkClient Using default ZkCredentialsProvider
   [junit4]   2> 744949 INFO  (TEST-CollectionsAPIDistributedZkTest.test-seed#[19A39875F969E4BB]) [    ] o.a.s.c.c.ConnectionManager Waiting for client to connect to ZooKeeper
   [junit4]   2> 744949 INFO  (zkCallback-727-thread-1) [    ] o.a.s.c.c.ConnectionManager Watcher org.apache.solr.common.cloud.ConnectionManager@8e6b31 name:ZooKeeperConnection Watcher:127.0.0.1:38510/solr got event WatchedEvent state:SyncConnected type:None path:null path:null type:None
   [junit4]   2> 744950 INFO  (TEST-CollectionsAPIDistributedZkTest.test-seed#[19A39875F969E4BB]) [    ] o.a.s.c.c.ConnectionManager Client is connected to ZooKeeper
   [junit4]   2> 744950 INFO  (TEST-CollectionsAPIDistributedZkTest.test-seed#[19A39875F969E4BB]) [    ] o.a.s.c.c.SolrZkClient Using default ZkACLProvider
   [junit4]   2> 744950 INFO  (TEST-CollectionsAPIDistributedZkTest.test-seed#[19A39875F969E4BB]) [    ] o.a.s.c.c.SolrZkClient makePath: /collections/collection1
   [junit4]   2> 744951 INFO  (TEST-CollectionsAPIDistributedZkTest.test-seed#[19A39875F969E4BB]) [    ] o.a.s.c.c.SolrZkClient makePath: /collections/collection1/shards
   [junit4]   2> 744951 INFO  (TEST-CollectionsAPIDistributedZkTest.test-seed#[19A39875F969E4BB]) [    ] o.a.s.c.c.SolrZkClient makePath: /collections/control_collection
   [junit4]   2> 744951 INFO  (TEST-CollectionsAPIDistributedZkTest.test-seed#[19A39875F969E4BB]) [    ] o.a.s.c.c.SolrZkClient makePath: /collections/control_collection/shards
   [junit4]   2> 744952 INFO  (TEST-CollectionsAPIDistributedZkTest.test-seed#[19A39875F969E4BB]) [    ] o.a.s.c.AbstractZkTestCase put /home/jenkins/workspace/Lucene-Solr-trunk-Linux/solr/core/src/test-files/solr/collection1/conf/solrconfig-tlog.xml to /configs/conf1/solrconfig.xml
   [junit4]   2> 744952 INFO  (TEST-CollectionsAPIDistributedZkTest.test-seed#[19A39875F969E4BB]) [    ] o.a.s.c.c.SolrZkClient makePath: /configs/conf1/solrconfig.xml
   [junit4]   2> 744953 INFO  (TEST-CollectionsAPIDistributedZkTest.test-seed#[19A39875F969E4BB]) [    ] o.a.s.c.AbstractZkTestCase put /home/jenkins/workspace/Lucene-Solr-trunk-Linux/solr/core/src/test-files/solr/collection1/conf/schema.xml to /configs/conf1/schema.xml
   [junit4]   2> 744953 INFO  (TEST-CollectionsAPIDistributedZkTest.test-seed#[19A39875F969E4BB]) [    ] o.a.s.c.c.SolrZkClient makePath: /configs/conf1/schema.xml
   [junit4]   2> 744954 INFO  (TEST-CollectionsAPIDistributedZkTest.test-seed#[19A39875F969E4BB]) [    ] o.a.s.c.AbstractZkTestCase put /home/jenkins/workspace/Lucene-Solr-trunk-Linux/solr/core/src/test-files/solr/collection1/conf/solrconfig.snippet.randomindexconfig.xml to /configs/conf1/solrconfig.snippet.randomindexconfig.xml
   [junit4]   2> 744954 INFO  (TEST-CollectionsAPIDistributedZkTest.test-seed#[19A39875F969E4BB]) [    ] o.a.s.c.c.SolrZkClient makePath: /configs/conf1/solrconfig.snippet.randomindexconfig.xml
   [junit4]   2> 744954 INFO  (TEST-CollectionsAPIDistributedZkTest.test-seed#[19A39875F969E4BB]) [    ] o.a.s.c.AbstractZkTestCase put /home/jenkins/workspace/Lucene-Solr-trunk-Linux/solr/core/src/test-files/solr/collection1/conf/stopwords.txt to /configs/conf1/stopwords.txt
   [junit4]   2> 744955 INFO  (TEST-CollectionsAPIDistributedZkTest.test-seed#[19A39875F969E4BB]) [    ] o.a.s.c.c.SolrZkClient makePath: /configs/conf1/stopwords.txt
   [junit4]   2> 744955 INFO  (TEST-CollectionsAPIDistributedZkTest.test-seed#[19A39875F969E4BB]) [    ] o.a.s.c.AbstractZkTestCase put /home/jenkins/workspace/Lucene-Solr-trunk-Linux/solr/core/src/test-files/solr/collection1/conf/protwords.txt to /configs/conf1/protwords.txt
   [junit4]   2> 744955 INFO  (TEST-CollectionsAPIDistributedZkTest.test-seed#[19A39875F969E4BB]) [    ] o.a.s.c.c.SolrZkClient makePath: /configs/conf1/protwords.txt
   [junit4]   2> 744956 INFO  (TEST-CollectionsAPIDistributedZkTest.test-seed#[19A39875F969E4BB]) [    ] o.a.s.c.AbstractZkTestCase put /home/jenkins/workspace/Lucene-Solr-trunk-Linux/solr/core/src/test-files/solr/collection1/conf/currency.xml to /configs/conf1/currency.xml
   [junit4]   2> 744956 INFO  (TEST-CollectionsAPIDistributedZkTest.test-seed#[19A39875F969E4BB]) [    ] o.a.s.c.c.SolrZkClient makePath: /configs/conf1/currency.xml
   [junit4]   2> 744956 INFO  (TEST-CollectionsAPIDistributedZkTest.test-seed#[19A39875F969E4BB]) [    ] o.a.s.c.AbstractZkTestCase put /home/jenkins/workspace/Lucene-Solr-trunk-Linux/solr/core/src/test-files/solr/collection1/conf/enumsConfig.xml to /configs/conf1/enumsConfig.xml
   [junit4]   2> 744956 INFO  (TEST-CollectionsAPIDistributedZkTest.test-seed#[19A39875F969E4BB]) [    ] o.a.s.c.c.SolrZkClient makePath: /configs/conf1/enumsConfig.xml
   [junit4]   2> 744957 INFO  (TEST-CollectionsAPIDistributedZkTest.test-seed#[19A39875F969E4BB]) [    ] o.a.s.c.AbstractZkTestCase put /home/jenkins/workspace/Lucene-Solr-trunk-Linux/solr/core/src/test-files/solr/collection1/conf/open-exchange-rates.json to /configs/conf1/open-exchange-rates.json
   [junit4]   2> 744957 INFO  (TEST-CollectionsAPIDistributedZkTest.test-seed#[19A39875F969E4BB]) [    ] o.a.s.c.c.SolrZkClient makePath: /configs/conf1/open-exchange-rates.json
   [junit4]   2> 744957 INFO  (TEST-CollectionsAPIDistributedZkTest.test-seed#[19A39875F969E4BB]) [    ] o.a.s.c.AbstractZkTestCase put /home/jenkins/workspace/Lucene-Solr-trunk-Linux/solr/core/src/test-files/solr/collection1/conf/mapping-ISOLatin1Accent.txt to /configs/conf1/mapping-ISOLatin1Accent.txt
   [junit4]   2> 744958 INFO  (TEST-CollectionsAPIDistributedZkTest.test-seed#[19A39875F969E4BB]) [    ] o.a.s.c.c.SolrZkClient makePath: /configs/conf1/mapping-ISOLatin1Accent.txt
   [junit4]   2> 744958 INFO  (TEST-CollectionsAPIDistributedZkTest.test-seed#[19A39875F969E4BB]) [    ] o.a.s.c.AbstractZkTestCase put /home/jenkins/workspace/Lucene-Solr-trunk-Linux/solr/core/src/test-files/solr/collection1/conf/old_synonyms.txt to /configs/conf1/old_synonyms.txt
   [junit4]   2> 744958 INFO  (TEST-CollectionsAPIDistributedZkTest.test-seed#[19A39875F969E4BB]) [    ] o.a.s.c.c.SolrZkClient makePath: /configs/conf1/old_synonyms.txt
   [junit4]   2> 744959 INFO  (TEST-CollectionsAPIDistributedZkTest.test-seed#[19A39875F969E4BB]) [    ] o.a.s.c.AbstractZkTestCase put /home/jenkins/workspace/Lucene-Solr-trunk-Linux/solr/core/src/test-files/solr/collection1/conf/synonyms.txt to /configs/conf1/synonyms.txt
   [junit4]   2> 744959 INFO  (TEST-CollectionsAPIDistributedZkTest.test-seed#[19A39875F969E4BB]) [    ] o.a.s.c.c.SolrZkClient makePath: /configs/conf1/synonyms.txt
   [junit4]   2> 744959 INFO  (TEST-CollectionsAPIDistributedZkTest.test-seed#[19A39875F969E4BB]) [    ] o.a.s.c.c.SolrZkClient Using default ZkCredentialsProvider
   [junit4]   2> 744960 INFO  (TEST-CollectionsAPIDistributedZkTest.test-seed#[19A39875F969E4BB]) [    ] o.a.s.c.c.ConnectionManager Waiting for client to connect to ZooKeeper
   [junit4]   2> 744960 INFO  (zkCallback-728-thread-1) [    ] o.a.s.c.c.ConnectionManager Watcher org.apache.solr.common.cloud.ConnectionManager@147f5a2 name:ZooKeeperConnection Watcher:127.0.0.1:38510/solr got event WatchedEvent state:SyncConnected type:None path:null path:null type:None
   [junit4]   2> 744960 INFO  (TEST-CollectionsAPIDistributedZkTest.test-seed#[19A39875F969E4BB]) [    ] o.a.s.c.c.ConnectionManager Client is connected to ZooKeeper
   [junit4]   2> 744960 INFO  (TEST-CollectionsAPIDistributedZkTest.test-seed#[19A39875F969E4BB]) [    ] o.a.s.c.c.SolrZkClient Using default ZkACLProvider
   [junit4]   2> 745007 INFO  (TEST-CollectionsAPIDistributedZkTest.test-seed#[19A39875F969E4BB]) [    ] o.a.s.SolrTestCaseJ4 Writing core.properties file to /home/jenkins/workspace/Lucene-Solr-trunk-Linux/solr/build/solr-core/test/J1/temp/solr.cloud.CollectionsAPIDistributedZkTest_19A39875F969E4BB-001/control-001/cores/collection1
   [junit4]   2> 745008 INFO  (TEST-CollectionsAPIDistributedZkTest.test-seed#[19A39875F969E4BB]) [    ] o.e.j.s.Server jetty-9.2.11.v20150529
   [junit4]   2> 745009 INFO  (TEST-CollectionsAPIDistributedZkTest.test-seed#[19A39875F969E4BB]) [    ] o.e.j.s.h.ContextHandler Started o.e.j.s.ServletContextHandler@1b6b589{/oehz/dt,null,AVAILABLE}
   [junit4]   2> 745013 INFO  (TEST-CollectionsAPIDistributedZkTest.test-seed#[19A39875F969E4BB]) [    ] o.e.j.s.ServerConnector Started ServerConnector@16391ec{SSL-http/1.1}{127.0.0.1:55911}
   [junit4]   2> 745014 INFO  (TEST-CollectionsAPIDistributedZkTest.test-seed#[19A39875F969E4BB]) [    ] o.e.j.s.Server Started @746975ms
   [junit4]   2> 745014 INFO  (TEST-CollectionsAPIDistributedZkTest.test-seed#[19A39875F969E4BB]) [    ] o.a.s.c.s.e.JettySolrRunner Jetty properties: {solr.data.dir=/home/jenkins/workspace/Lucene-Solr-trunk-Linux/solr/build/solr-core/test/J1/temp/solr.cloud.CollectionsAPIDistributedZkTest_19A39875F969E4BB-001/tempDir-001/control/data, hostContext=/oehz/dt, hostPort=55911, coreRootDirectory=/home/jenkins/workspace/Lucene-Solr-trunk-Linux/solr/build/solr-core/test/J1/../../../../../../../../../home/jenkins/workspace/Lucene-Solr-trunk-Linux/solr/build/solr-core/test/J1/temp/solr.cloud.CollectionsAPIDistributedZkTest_19A39875F969E4BB-001/control-001/cores}
   [junit4]   2> 745014 INFO  (TEST-CollectionsAPIDistributedZkTest.test-seed#[19A39875F969E4BB]) [    ] o.a.s.s.SolrDispatchFilter SolrDispatchFilter.init(): sun.misc.Launcher$AppClassLoader@e2f2a
   [junit4]   2> 745014 INFO  (TEST-CollectionsAPIDistributedZkTest.test-seed#[19A39875F969E4BB]) [    ] o.a.s.c.SolrResourceLoader new SolrResourceLoader for directory: '/home/jenkins/workspace/Lucene-Solr-trunk-Linux/solr/build/solr-core/test/J1/../../../../../../../../../home/jenkins/workspace/Lucene-Solr-trunk-Linux/solr/build/solr-core/test/J1/temp/solr.cloud.CollectionsAPIDistributedZkTest_19A39875F969E4BB-001/control-001/'
   [junit4]   2> 745027 INFO  (TEST-CollectionsAPIDistributedZkTest.test-seed#[19A39875F969E4BB]) [    ] o.a.s.c.c.SolrZkClient Using default ZkCredentialsProvider
   [junit4]   2> 745028 INFO  (TEST-CollectionsAPIDistributedZkTest.test-seed#[19A39875F969E4BB]) [    ] o.a.s.c.c.ConnectionManager Waiting for client to connect to ZooKeeper
   [junit4]   2> 745028 INFO  (zkCallback-729-thread-1) [    ] o.a.s.c.c.ConnectionManager Watcher org.apache.solr.common.cloud.ConnectionManager@142150e name:ZooKeeperConnection Watcher:127.0.0.1:38510/solr got event WatchedEvent state:SyncConnected type:None path:null path:null type:None
   [junit4]   2> 745029 INFO  (TEST-CollectionsAPIDistributedZkTest.test-seed#[19A39875F969E4BB]) [    ] o.a.s.c.c.ConnectionManager Client is connected to ZooKeeper
   [junit4]   2> 745029 INFO  (TEST-CollectionsAPIDistributedZkTest.test-seed#[19A39875F969E4BB]) [    ] o.a.s.c.c.SolrZkClient Using default ZkACLProvider
   [junit4]   2> 745029 INFO  (TEST-CollectionsAPIDistributedZkTest.test-seed#[19A39875F969E4BB]) [    ] o.a.s.s.SolrDispatchFilter Loading solr.xml from SolrHome (not found in ZooKeeper)
   [junit4]   2> 745029 INFO  (TEST-CollectionsAPIDistributedZkTest.test-seed#[19A39875F969E4BB]) [    ] o.a.s.c.SolrXmlConfig Loading container configuration from /home/jenkins/workspace/Lucene-Solr-trunk-Linux/solr/build/solr-core/test/J1/../../../../../../../../../home/jenkins/workspace/Lucene-Solr-trunk-Linux/solr/build/solr-core/test/J1/temp/solr.cloud.CollectionsAPIDistributedZkTest_19A39875F969E4BB-001/control-001/solr.xml
   [junit4]   2> 745033 INFO  (TEST-CollectionsAPIDistributedZkTest.test-seed#[19A39875F969E4BB]) [    ] o.a.s.c.CoresLocator Config-defined core root directory: /home/jenkins/workspace/Lucene-Solr-trunk-Linux/solr/build/solr-core/test/J1/../../../../../../../../../home/jenkins/workspace/Lucene-Solr-trunk-Linux/solr/build/solr-core/test/J1/temp/solr.cloud.CollectionsAPIDistributedZkTest_19A39875F969E4BB-001/control-001/cores
   [junit4]   2> 745033 INFO  (TEST-CollectionsAPIDistributedZkTest.test-seed#[19A39875F969E4BB]) [    ] o.a.s.c.CoreContainer New CoreContainer 12220476
   [junit4]   2> 745033 INFO  (TEST-CollectionsAPIDistributedZkTest.test-seed#[19A39875F969E4BB]) [    ] o.a.s.c.CoreContainer Loading cores into CoreContainer [instanceDir=/home/jenkins/workspace/Lucene-Solr-trunk-Linux/solr/build/solr-core/test/J1/../../../../../../../../../home/jenkins/workspace/Lucene-Solr-trunk-Linux/solr/build/solr-core/test/J1/temp/solr.cloud.CollectionsAPIDistributedZkTest_19A39875F969E4BB-001/control-001/]
   [junit4]   2> 745033 INFO  (TEST-CollectionsAPIDistributedZkTest.test-seed#[19A39875F969E4BB]) [    ] o.a.s.c.CoreContainer loading shared library: /home/jenkins/workspace/Lucene-Solr-trunk-Linux/solr/build/solr-core/test/J1/../../../../../../../../../home/jenkins/workspace/Lucene-Solr-trunk-Linux/solr/build/solr-core/test/J1/temp/solr.cloud.CollectionsAPIDistributedZkTest_19A39875F969E4BB-001/control-001/lib
   [junit4]   2> 745033 WARN  (TEST-CollectionsAPIDistributedZkTest.test-seed#[19A39875F969E4BB]) [    ] o.a.s.c.SolrResourceLoader Can't find (or read) directory to add to classloader: lib (resolved as: /home/jenkins/workspace/Lucene-Solr-trunk-Linux/solr/build/solr-core/test/J1/../../../../../../../../../home/jenkins/workspace/Lucene-Solr-trunk-Linux/solr/build/solr-core/test/J1/temp/solr.cloud.CollectionsAPIDistributedZkTest_19A39875F969E4BB-001/control-001/lib).
   [junit4]   2> 745037 INFO  (TEST-CollectionsAPIDistributedZkTest.test-seed#[19A39875F969E4BB]) [    ] o.a.s.h.c.HttpShardHandlerFactory created with socketTimeout : 90000,urlScheme : ,connTimeout : 15000,maxConnectionsPerHost : 20,maxConnections : 10000,corePoolSize : 0,maximumPoolSize : 2147483647,maxThreadIdleTime : 5,sizeOfQueue : -1,fairnessPolicy : false,useRetries : false,
   [junit4]   2> 745039 INFO  (TEST-CollectionsAPIDistributedZkTest.test-seed#[19A39875F969E4BB]) [    ] o.a.s.u.UpdateShardHandler Creating UpdateShardHandler HTTP client with params: socketTimeout=340000&connTimeout=45000&retry=true
   [junit4]   2> 745039 INFO  (TEST-CollectionsAPIDistributedZkTest.test-seed#[19A39875F969E4BB]) [    ] o.a.s.l.LogWatcher SLF4J impl is org.slf4j.impl.Log4jLoggerFactory
   [junit4]   2> 745039 INFO  (TEST-CollectionsAPIDistributedZkTest.test-seed#[19A39875F969E4BB]) [    ] o.a.s.l.LogWatcher Registering Log Listener [Log4j (org.slf4j.impl.Log4jLoggerFactory)]
   [junit4]   2> 745039 INFO  (TEST-CollectionsAPIDistributedZkTest.test-seed#[19A39875F969E4BB]) [    ] o.a.s.c.ZkContainer Zookeeper client=127.0.0.1:38510/solr
   [junit4]   2> 745039 INFO  (TEST-CollectionsAPIDistributedZkTest.test-seed#[19A39875F969E4BB]) [    ] o.a.s.c.ZkController zkHost includes chroot
   [junit4]   2> 745040 INFO  (TEST-CollectionsAPIDistributedZkTest.test-seed#[19A39875F969E4BB]) [    ] o.a.s.c.c.SolrZkClient Using default ZkCredentialsProvider
   [junit4]   2> 745040 INFO  (TEST-CollectionsAPIDistributedZkTest.test-seed#[19A39875F969E4BB]) [    ] o.a.s.c.c.ConnectionManager Waiting for client to connect to ZooKeeper
   [junit4]   2> 745041 INFO  (zkCallback-731-thread-1) [    ] o.a.s.c.c.ConnectionManager Watcher org.apache.solr.common.cloud.ConnectionManager@e9f73f name:ZooKeeperConnection Watcher:127.0.0.1:38510 got event WatchedEvent state:SyncConnected type:None path:null path:null type:None
   [junit4]   2> 745041 INFO  (TEST-CollectionsAPIDistributedZkTest.test-seed#[19A39875F969E4BB]) [    ] o.a.s.c.c.ConnectionManager Client is connected to ZooKeeper
   [junit4]   2> 745041 INFO  (TEST-CollectionsAPIDistributedZkTest.test-seed#[19A39875F969E4BB]) [    ] o.a.s.c.c.SolrZkClient Using default ZkACLProvider
   [junit4]   2> 745042 INFO  (TEST-CollectionsAPIDistributedZkTest.test-seed#[19A39875F969E4BB]) [n:127.0.0.1:55911_oehz%2Fdt    ] o.a.s.c.c.ConnectionManager Waiting for client to connect to ZooKeeper
   [junit4]   2> 745042 INFO  (zkCallback-732-thread-1-processing-n:127.0.0.1:55911_oehz%2Fdt) [n:127.0.0.1:55911_oehz%2Fdt    ] o.a.s.c.c.ConnectionManager Watcher org.apache.solr.common.cloud.ConnectionManager@c62775 name:ZooKeeperConnection Watcher:127.0.0.1:38510/solr got event WatchedEvent state:SyncConnected type:None path:null path:null type:None
   [junit4]   2> 745042 INFO  (TEST-CollectionsAPIDistributedZkTest.test-seed#[19A39875F969E4BB]) [n:127.0.0.1:55911_oehz%2Fdt    ] o.a.s.c.c.ConnectionManager Client is connected to ZooKeeper
   [junit4]   2> 745043 INFO  (TEST-CollectionsAPIDistributedZkTest.test-seed#[19A39875F969E4BB]) [n:127.0.0.1:55911_oehz%2Fdt    ] o.a.s.c.c.SolrZkClient makePath: /overseer/queue
   [junit4]   2> 745043 INFO  (TEST-CollectionsAPIDistributedZkTest.test-seed#[19A39875F969E4BB]) [n:127.0.0.1:55911_oehz%2Fdt    ] o.a.s.c.c.SolrZkClient makePath: /overseer/collection-queue-work
   [junit4]   2> 745044 INFO  (TEST-CollectionsAPIDistributedZkTest.test-seed#[19A39875F969E4BB]) [n:127.0.0.1:55911_oehz%2Fdt    ] o.a.s.c.c.SolrZkClient makePath: /overseer/collection-map-running
   [junit4]   2> 745045 INFO  (TEST-CollectionsAPIDistributedZkTest.test-seed#[19A39875F969E4BB]) [n:127.0.0.1:55911_oehz%2Fdt    ] o.a.s.c.c.SolrZkClient makePath: /overseer/collection-map-completed
   [junit4]   2> 745045 INFO  (TEST-CollectionsAPIDistributedZkTest.test-seed#[19A39875F969E4BB]) [n:127.0.0.1:55911_oehz%2Fdt    ] o.a.s.c.c.SolrZkClient makePath: /overseer/collection-map-failure
   [junit4]   2> 745046 INFO  (TEST-CollectionsAPIDistributedZkTest.test-seed#[19A39875F969E4BB]) [n:127.0.0.1:55911_oehz%2Fdt    ] o.a.s.c.c.SolrZkClient makePath: /live_nodes
   [junit4]   2> 745046 INFO  (TEST-CollectionsAPIDistributedZkTest.test-seed#[19A39875F969E4BB]) [n:127.0.0.1:55911_oehz%2Fdt    ] o.a.s.c.c.SolrZkClient makePath: /aliases.json
   [junit4]   2> 745047 INFO  (TEST-CollectionsAPIDistributedZkTest.test-seed#[19A39875F969E4BB]) [n:127.0.0.1:55911_oehz%2Fdt    ] o.a.s.c.c.SolrZkClient makePath: /clusterstate.json
   [junit4]   2> 745047 INFO  (TEST-CollectionsAPIDistributedZkTest.test-seed#[19A39875F969E4BB]) [n:127.0.0.1:55911_oehz%2Fdt    ] o.a.s.c.c.SolrZkClient makePath: /security.json
   [junit4]   2> 745047 INFO  (TEST-CollectionsAPIDistributedZkTest.test-seed#[19A39875F969E4BB]) [n:127.0.0.1:55911_oehz%2Fdt    ] o.a.s.c.ZkController Register node as live in ZooKeeper:/live_nodes/127.0.0.1:55911_oehz%2Fdt
   [junit4]   2> 745048 INFO  (TEST-CollectionsAPIDistributedZkTest.test-seed#[19A39875F969E4BB]) [n:127.0.0.1:55911_oehz%2Fdt    ] o.a.s.c.c.SolrZkClient makePath: /live_nodes/127.0.0.1:55911_oehz%2Fdt
   [junit4]   2> 745048 INFO  (TEST-CollectionsAPIDistributedZkTest.test-seed#[19A39875F969E4BB]) [n:127.0.0.1:55911_oehz%2Fdt    ] o.a.s.c.c.SolrZkClient makePath: /overseer_elect
   [junit4]   2> 745049 INFO  (TEST-CollectionsAPIDistributedZkTest.test-seed#[19A39875F969E4BB]) [n:127.0.0.1:55911_oehz%2Fdt    ] o.a.s.c.c.SolrZkClient makePath: /overseer_elect/election
   [junit4]   2> 745049 INFO  (TEST-CollectionsAPIDistributedZkTest.test-seed#[19A39875F969E4BB]) [n:127.0.0.1:55911_oehz%2Fdt    ] o.a.s.c.Overseer Overseer (id=null) closing
   [junit4]   2> 745049 INFO  (TEST-CollectionsAPIDistributedZkTest.test-seed#[19A39875F969E4BB]) [n:127.0.0.1:55911_oehz%2Fdt    ] o.a.s.c.LeaderElector Joined leadership election with path: /overseer_elect/election/94330934880239621-127.0.0.1:55911_oehz%2Fdt-n_0000000000
   [junit4]   2> 745050 INFO  (TEST-CollectionsAPIDistributedZkTest.test-seed#[19A39875F969E4BB]) [n:127.0.0.1:55911_oehz%2Fdt    ] o.a.s.c.OverseerElectionContext I am going to be the leader 127.0.0.1:55911_oehz%2Fdt
   [junit4]   2> 745050 INFO  (TEST-CollectionsAPIDistributedZkTest.test-seed#[19A39875F969E4BB]) [n:127.0.0.1:55911_oehz%2Fdt    ] o.a.s.c.c.SolrZkClient makePath: /overseer_elect/leader
   [junit4]   2> 745050 INFO  (TEST-CollectionsAPIDistributedZkTest.test-seed#[19A39875F969E4BB]) [n:127.0.0.1:55911_oehz%2Fdt    ] o.a.s.c.Overseer Overseer (id=94330934880239621-127.0.0.1:55911_oehz%2Fdt-n_0000000000) starting
   [junit4]   2> 745051 INFO  (TEST-CollectionsAPIDistributedZkTest.test-seed#[19A39875F969E4BB]) [n:127.0.0.1:55911_oehz%2Fdt    ] o.a.s.c.c.SolrZkClient makePath: /overseer/queue-work
   [junit4]   2> 745052 INFO  (TEST-CollectionsAPIDistributedZkTest.test-seed#[19A39875F969E4BB]) [n:127.0.0.1:55911_oehz%2Fdt    ] o.a.s.c.OverseerAutoReplicaFailoverThread Starting OverseerAutoReplicaFailoverThread autoReplicaFailoverWorkLoopDelay=10000 autoReplicaFailoverWaitAfterExpiration=10000 autoReplicaFailoverBadNodeExpiration=60000
   [junit4]   2> 745053 INFO  (OverseerCollectionProcessor-94330934880239621-127.0.0.1:55911_oehz%2Fdt-n_0000000000) [n:127.0.0.1:55911_oehz%2Fdt    ] o.a.s.c.OverseerProcessor Process current queue of overseer operations
   [junit4]   2> 745053 INFO  (TEST-CollectionsAPIDistributedZkTest.test-seed#[19A39875F969E4BB]) [n:127.0.0.1:55911_oehz%2Fdt    ] o.a.s.c.c.ZkStateReader Updating cluster state from ZooKeeper... 
   [junit4]   2> 745053 INFO  (OverseerStateUpdate-94330934880239621-127.0.0.1:55911_oehz%2Fdt-n_0000000000) [n:127.0.0.1:55911_oehz%2Fdt    ] o.a.s.c.Overseer Starting to work on the main queue
   [junit4]   2> 745072 INFO  (TEST-CollectionsAPIDistributedZkTest.test-seed#[19A39875F969E4BB]) [n:127.0.0.1:55911_oehz%2Fdt    ] o.a.s.c.CoreContainer Security conf doesn't exist. Skipping setup for authorization module.
   [junit4]   2> 745073 INFO  (TEST-CollectionsAPIDistributedZkTest.test-seed#[19A39875F969E4BB]) [n:127.0.0.1:55911_oehz%2Fdt    ] o.a.s.c.CoreContainer No authentication plugin used.
   [junit4]   2> 745073 INFO  (TEST-CollectionsAPIDistributedZkTest.test-seed#[19A39875F969E4BB]) [n:127.0.0.1:55911_oehz%2Fdt    ] o.a.s.c.CoresLocator Looking for core definitions underneath /home/jenkins/workspace/Lucene-Solr-trunk-Linux/solr/build/solr-core/test/J1/../../../../../../../../../home/jenkins/workspace/Lucene-Solr-trunk-Linux/solr/build/solr-core/test/J1/temp/solr.cloud.CollectionsAPIDistributedZkTest_19A39875F969E4BB-001/control-001/cores
   [junit4]   2> 745074 INFO  (TEST-CollectionsAPIDistributedZkTest.test-seed#[19A39875F969E4BB]) [n:127.0.0.1:55911_oehz%2Fdt    ] o.a.s.c.SolrCore Created CoreDescriptor: {name=collection1, config=solrconfig.xml, transient=false, schema=schema.xml, loadOnStartup=true, configSetProperties=configsetprops.json, instanceDir=/home/jenkins/workspace/Lucene-Solr-trunk-Linux/solr/build/solr-core/test/J1/../../../../../../../../../home/jenkins/workspace/Lucene-Solr-trunk-Linux/solr/build/solr-core/test/J1/temp/solr.cloud.CollectionsAPIDistributedZkTest_19A39875F969E4BB-001/control-001/cores/collection1, collection=control_collection, absoluteInstDir=/home/jenkins/workspace/Lucene-Solr-trunk-Linux/solr/build/solr-core/test/J1/../../../../../../../../../home/jenkins/workspace/Lucene-Solr-trunk-Linux/solr/build/solr-core/test/J1/temp/solr.cloud.CollectionsAPIDistributedZkTest_19A39875F969E4BB-001/control-001/cores/collection1/, coreNodeName=, dataDir=data/, shard=}
   [junit4]   2> 745074 INFO  (TEST-CollectionsAPIDistributedZkTest.test-seed#[19A39875F969E4BB]) [n:127.0.0.1:55911_oehz%2Fdt    ] o.a.s.c.CoresLocator Found core collection1 in /home/jenkins/workspace/Lucene-Solr-trunk-Linux/solr/build/solr-core/test/J1/../../../../../../../../../home/jenkins/workspace/Lucene-Solr-trunk-Linux/solr/build/solr-core/test/J1/temp/solr.cloud.CollectionsAPIDistributedZkTest_19A39875F969E4BB-001/control-001/cores/collection1/
   [junit4]   2> 745074 INFO  (TEST-CollectionsAPIDistributedZkTest.test-seed#[19A39875F969E4BB]) [n:127.0.0.1:55911_oehz%2Fdt    ] o.a.s.c.CoresLocator Found 1 core definitions
   [junit4]   2> 745075 INFO  (TEST-CollectionsAPIDistributedZkTest.test-seed#[19A39875F969E4BB]) [n:127.0.0.1:55911_oehz%2Fdt    ] o.a.s.s.SolrDispatchFilter user.dir=/home/jenkins/workspace/Lucene-Solr-trunk-Linux/solr/build/solr-core/test/J1
   [junit4]   2> 745075 INFO  (coreLoadExecutor-2999-thread-1-processing-n:127.0.0.1:55911_oehz%2Fdt) [n:127.0.0.1:55911_oehz%2Fdt c:control_collection   x:collection1] o.a.s.c.ZkController publishing state=down
   [junit4]   2> 745075 INFO  (coreLoadExecutor-2999-thread-1-processing-n:127.0.0.1:55911_oehz%2Fdt) [n:127.0.0.1:55911_oehz%2Fdt c:control_collection   x:collection1] o.a.s.c.ZkController numShards not found on descriptor - reading it from system property
   [junit4]   2> 745075 INFO  (TEST-CollectionsAPIDistributedZkTest.test-seed#[19A39875F969E4BB]) [n:127.0.0.1:55911_oehz%2Fdt    ] o.a.s.s.SolrDispatchFilter SolrDispatchFilter.init() done
   [junit4]   2> 745075 INFO  (coreLoadExecutor-2999-thread-1-processing-n:127.0.0.1:55911_oehz%2Fdt) [n:127.0.0.1:55911_oehz%2Fdt c:control_collection   x:collection1] o.a.s.c.ZkController look for our core node name
   [junit4]   2> 745075 INFO  (zkCallback-732-thread-1-processing-n:127.0.0.1:55911_oehz%2Fdt) [n:127.0.0.1:55911_oehz%2Fdt    ] o.a.s.c.DistributedQueue NodeChildrenChanged fired on path /overseer/queue state SyncConnected
   [junit4]   2> 745075 INFO  (OverseerStateUpdate-94330934880239621-127.0.0.1:55911_oehz%2Fdt-n_0000000000) [n:127.0.0.1:55911_oehz%2Fdt    ] o.a.s.c.Overseer processMessage: queueSize: 1, message = {
   [junit4]   2>   "core":"collection1",
   [junit4]   2>   "roles":null,
   [junit4]   2>   "base_url":"https://127.0.0.1:55911/oehz/dt",
   [junit4]   2>   "node_name":"127.0.0.1:55911_oehz%2Fdt",
   [junit4]   2>   "numShards":"1",
   [junit4]   2>   "state":"down",
   [junit4]   2>   "shard":null,
   [junit4]   2>   "collection":"control_collection",
   [junit4]   2>   "operation":"state"} current state version: 0
   [junit4]   2> 745076 INFO  (OverseerStateUpdate-94330934880239621-127.0.0.1:55911_oehz%2Fdt-n_0000000000) [n:127.0.0.1:55911_oehz%2Fdt    ] o.a.s.c.o.ReplicaMutator Update state numShards=1 message={
   [junit4]   2>   "core":"collection1",
   [junit4]   2>   "roles":null,
   [junit4]   2>   "base_url":"https://127.0.0.1:55911/oehz/dt",
   [junit4]   2>   "node_name":"127.0.0.1:55911_oehz%2Fdt",
   [junit4]   2>   "numShards":"1",
   [junit4]   2>   "state":"down",
   [junit4]   2>   "shard":null,
   [junit4]   2>   "collection":"control_collection",
   [junit4]   2>   "operation":"state"}
   [junit4]   2> 745076 INFO  (OverseerStateUpdate-94330934880239621-127.0.0.1:55911_oehz%2Fdt-n_0000000000) [n:127.0.0.1:55911_oehz%2Fdt    ] o.a.s.c.o.ClusterStateMutator building a new cName: control_collection
   [junit4]   2> 745076 INFO  (OverseerStateUpdate-94330934880239621-127.0.0.1:55911_oehz%2Fdt-n_0000000000) [n:127.0.0.1:55911_oehz%2Fdt    ] o.a.s.c.o.ReplicaMutator Assigning new node to shard shard=shard1
   [junit4]   2> 745077 INFO  (zkCallback-732-thread-1-processing-n:127.0.0.1:55911_oehz%2Fdt) [n:127.0.0.1:55911_oehz%2Fdt    ] o.a.s.c.c.ZkStateReader A cluster state change: WatchedEvent state:SyncConnected type:NodeDataChanged path:/clusterstate.json, has occurred - updating... (live nodes size: 1)
   [junit4]   2> 746075 INFO  (coreLoadExecutor-2999-thread-1-processing-n:127.0.0.1:55911_oehz%2Fdt) [n:127.0.0.1:55911_oehz%2Fdt c:control_collection   x:collection1] o.a.s.c.ZkController waiting to find shard id in clusterstate for collection1
   [junit4]   2> 746075 INFO  (coreLoadExecutor-2999-thread-1-processing-n:127.0.0.1:55911_oehz%2Fdt) [n:127.0.0.1:55911_oehz%2Fdt c:control_collection   x:collection1] o.a.s.c.ZkController Check for collection zkNode:control_collection
   [junit4]   2> 746076 INFO  (coreLoadExecutor-2999-thread-1-processing-n:127.0.0.1:55911_oehz%2Fdt) [n:127.0.0.1:55911_oehz%2Fdt c:control_collection   x:collection1] o.a.s.c.ZkController Collection zkNode exists
   [junit4]   2> 746076 INFO  (coreLoadExecutor-2999-thread-1-processing-n:127.0.0.1:55911_oehz%2Fdt) [n:127.0.0.1:55911_oehz%2Fdt c:control_collection   x:collection1] o.a.s.c.c.ZkStateReader Load collection config from:/collections/control_collection
   [junit4]   2> 746076 INFO  (coreLoadExecutor-2999-thread-1-processing-n:127.0.0.1:55911_oehz%2Fdt) [n:127.0.0.1:55911_oehz%2Fdt c:control_collection   x:collection1] o.a.s.c.c.ZkStateReader path=/collections/control_collection configName=conf1 specified config exists in ZooKeeper
   [junit4]   2> 746077 INFO  (coreLoadExecutor-2999-thread-1-processing-n:127.0.0.1:55911_oehz%2Fdt) [n:127.0.0.1:55911_oehz%2Fdt c:control_collection   x:collection1] o.a.s.c.SolrResourceLoader new SolrResourceLoader for directory: '/home/jenkins/workspace/Lucene-Solr-trunk-Linux/solr/build/solr-core/test/J1/../../../../../../../../../home/jenkins/workspace/Lucene-Solr-trunk-Linux/solr/build/solr-core/test/J1/temp/solr.cloud.CollectionsAPIDistributedZkTest_19A39875F969E4BB-001/control-001/cores/collection1/'
   [junit4]   2> 746087 INFO  (coreLoadExecutor-2999-thread-1-processing-n:127.0.0.1:55911_oehz%2Fdt) [n:127.0.0.1:55911_oehz%2Fdt c:control_collection   x:collection1] o.a.s.c.Config loaded config solrconfig.xml with version 0 
   [junit4]   2> 746090 INFO  (coreLoadExecutor-2999-thread-1-processing-n:127.0.0.1:55911_oehz%2Fdt) [n:127.0.0.1:55911_oehz%2Fdt c:control_collection   x:collection1] o.a.s.c.SolrConfig current version of requestparams : -1
   [junit4]   2> 746093 INFO  (coreLoadExecutor-2999-thread-1-processing-n:127.0.0.1:55911_oehz%2Fdt) [n:127.0.0.1:55911_oehz%2Fdt c:control_collection   x:collection1] o.a.s.c.SolrConfig Using Lucene MatchVersion: 6.0.0
   [junit4]   2> 746101 INFO  (coreLoadExecutor-2999-thread-1-processing-n:127.0.0.1:55911_oehz%2Fdt) [n:127.0.0.1:55911_oehz%2Fdt c:control_collection   x:collection1] o.a.s.c.Config Loaded SolrConfig: solrconfig.xml
   [junit4]   2> 746102 INFO  (coreLoadExecutor-2999-thread-1-processing-n:127.0.0.1:55911_oehz%2Fdt) [n:127.0.0.1:55911_oehz%2Fdt c:control_collection   x:collection1] o.a.s.s.IndexSchema Reading Solr Schema from /configs/conf1/schema.xml
   [junit4]   2> 746107 INFO  (coreLoadExecutor-2999-thread-1-processing-n:127.0.0.1:55911_oehz%2Fdt) [n:127.0.0.1:55911_oehz%2Fdt c:control_collection   x:collection1] o.a.s.s.IndexSchema [collection1] Schema name=test
   [junit4]   2> 746168 INFO  (coreLoadExecutor-2999-thread-1-processing-n:127.0.0.1:55911_oehz%2Fdt) [n:127.0.0.1:55911_oehz%2Fdt c:control_collection   x:collection1] o.a.s.s.OpenExchangeRatesOrgProvider Initialized with rates=open-exchange-rates.json, refreshInterval=1440.
   [junit4]   2> 746171 INFO  (coreLoadExecutor-2999-thread-1-processing-n:127.0.0.1:55911_oehz%2Fdt) [n:127.0.0.1:55911_oehz%2Fdt c:control_collection   x:collection1] o.a.s.s.IndexSchema default search field in schema is text
   [junit4]   2> 746172 INFO  (coreLoadExecutor-2999-thread-1-processing-n:127.0.0.1:55911_oehz%2Fdt) [n:127.0.0.1:55911_oehz%2Fdt c:control_collection   x:collection1] o.a.s.s.IndexSchema unique key field: id
   [junit4]   2> 746175 INFO  (coreLoadExecutor-2999-thread-1-processing-n:127.0.0.1:55911_oehz%2Fdt) [n:127.0.0.1:55911_oehz%2Fdt c:control_collection   x:collection1] o.a.s.s.FileExchangeRateProvider Reloading exchange rates from file currency.xml
   [junit4]   2> 746176 INFO  (coreLoadExecutor-2999-thread-1-processing-n:127.0.0.1:55911_oehz%2Fdt) [n:127.0.0.1:55911_oehz%2Fdt c:control_collection   x:collection1] o.a.s.s.FileExchangeRateProvider Reloading exchange rates from file currency.xml
   [junit4]   2> 746177 INFO  (coreLoadExecutor-2999-thread-1-processing-n:127.0.0.1:55911_oehz%2Fdt) [n:127.0.0.1:55911_oehz%2Fdt c:control_collection   x:collection1] o.a.s.s.OpenExchangeRatesOrgProvider Reloading exchange rates from open-exchange-rates.json
   [junit4]   2> 746178 WARN  (coreLoadExecutor-2999-thread-1-processing-n:127.0.0.1:55911_oehz%2Fdt) [n:127.0.0.1:55911_oehz%2Fdt c:control_collection   x:collection1] o.a.s.s.OpenExchangeRatesOrgProvider Unknown key IMPORTANT NOTE
   [junit4]   2> 746178 WARN  (coreLoadExecutor-2999-thread-1-processing-n:127.0.0.1:55911_oehz%2Fdt) [n:127.0.0.1:55911_oehz%2Fdt c:control_collection   x:collection1] o.a.s.s.OpenExchangeRatesOrgProvider Expected key, got STRING
   [junit4]   2> 746178 INFO  (coreLoadExecutor-2999-thread-1-processing-n:127.0.0.1:55911_oehz%2Fdt) [n:127.0.0.1:55911_oehz%2Fdt c:control_collection   x:collection1] o.a.s.s.OpenExchangeRatesOrgProvider Reloading exchange rates from open-exchange-rates.json
   [junit4]   2> 746178 WARN  (coreLoadExecutor-2999-thread-1-processing-n:127.0.0.1:55911_oehz%2Fdt) [n:127.0.0.1:55911_oehz%2Fdt c:control_collection   x:collection1] o.a.s.s.OpenExchangeRatesOrgProvider Unknown key IMPORTANT NOTE
   [junit4]   2> 746178 WARN  (coreLoadExecutor-2999-thread-1-processing-n:127.0.0.1:55911_oehz%2Fdt) [n:127.0.0.1:55911_oehz%2Fdt c:control_collection   x:collection1] o.a.s.s.OpenExchangeRatesOrgProvider Expected key, got STRING
   [junit4]   2> 746179 INFO  (coreLoadExecutor-2999-thread-1-processing-n:127.0.0.1:55911_oehz%2Fdt) [n:127.0.0.1:55911_oehz%2Fdt c:control_collection   x:collection1] o.a.s.c.ConfigSetProperties Did not find ConfigSet properties, assuming default properties: Can't find resource 'configsetprops.json' in classpath or '/configs/conf1', cwd=/home/jenkins/workspace/Lucene-Solr-trunk-Linux/solr/build/solr-core/test/J1
   [junit4]   2> 746179 INFO  (coreLoadExecutor-2999-thread-1-processing-n:127.0.0.1:55911_oehz%2Fdt) [n:127.0.0.1:55911_oehz%2Fdt c:control_collection   x:collection1] o.a.s.c.CoreContainer Creating SolrCore 'collection1' using configuration from collection control_collection
   [junit4]   2> 746179 INFO  (coreLoadExecutor-2999-thread-1-processing-n:127.0.0.1:55911_oehz%2Fdt) [n:127.0.0.1:55911_oehz%2Fdt c:control_collection s:shard1 r:core_node1 x:collection1] o.a.s.c.SolrCore org.apache.solr.core.MockDirectoryFactory
   [junit4]   2> 746179 INFO  (coreLoadExecutor-2999-thread-1-processing-n:127.0.0.1:55911_oehz%2Fdt) [n:127.0.0.1:55911_oehz%2Fdt c:control_collection s:shard1 r:core_node1 x:collection1] o.a.s.c.SolrCore [[collection1] ] Opening new SolrCore at [/home/jenkins/workspace/Lucene-Solr-trunk-Linux/solr/build/solr-core/test/J1/../../../../../../../../../home/jenkins/workspace/Lucene-Solr-trunk-Linux/solr/build/solr-core/test/J1/temp/solr.cloud.CollectionsAPIDistributedZkTest_19A39875F969E4BB-001/control-001/cores/collection1/], dataDir=[null]
   [junit4]   2> 746179 INFO  (coreLoadExecutor-2999-thread-1-processing-n:127.0.0.1:55911_oehz%2Fdt) [n:127.0.0.1:55911_oehz%2Fdt c:control_collection s:shard1 r:core_node1 x:collection1] o.a.s.c.JmxMonitoredMap JMX monitoring is enabled. Adding Solr mbeans to JMX Server: com.sun.jmx.mbeanserver.JmxMBeanServer@6edd4c
   [junit4]   2> 746180 INFO  (coreLoadExecutor-2999-thread-1-processing-n:127.0.0.1:55911_oehz%2Fdt) [n:127.0.0.1:55911_oehz%2Fdt c:control_collection s:shard1 r:core_node1 x:collection1] o.a.s.c.CachingDirectoryFactory return new directory for /home/jenkins/workspace/Lucene-Solr-trunk-Linux/solr/build/solr-core/test/J1/../../../../../../../../../home/jenkins/workspace/Lucene-Solr-trunk-Linux/solr/build/solr-core/test/J1/temp/solr.cloud.CollectionsAPIDistributedZkTest_19A39875F969E4BB-001/control-001/cores/collection1/data
   [junit4]   2> 746180 INFO  (coreLoadExecutor-2999-thread-1-processing-n:127.0.0.1:55911_oehz%2Fdt) [n:127.0.0.1:55911_oehz%2Fdt c:control_collection s:shard1 r:core_node1 x:collection1] o.a.s.c.SolrCore New index directory detected: old=null new=/home/jenkins/workspace/Lucene-Solr-trunk-Linux/solr/build/solr-core/test/J1/../../../../../../../../../home/jenkins/workspace/Lucene-Solr-trunk-Linux/solr/build/solr-core/test/J1/temp/solr.cloud.CollectionsAPIDistributedZkTest_19A39875F969E4BB-001/control-001/cores/collection1/data/index/
   [junit4]   2> 746180 WARN  (coreLoadExecutor-2999-thread-1-processing-n:127.0.0.1:55911_oehz%2Fdt) [n:127.0.0.1:55911_oehz%2Fdt c:control_collection s:shard1 r:core_node1 x:collection1] o.a.s.c.SolrCore [collection1] Solr index directory '/home/jenkins/workspace/Lucene-Solr-trunk-Linux/solr/build/solr-core/test/J1/../../../../../../../../../home/jenkins/workspace/Lucene-Solr-trunk-Linux/solr/build/solr-core/test/J1/temp/solr.cloud.CollectionsAPIDistributedZkTest_19A39875F969E4BB-001/control-001/cores/collection1/data/index' doesn't exist. Creating new index...
   [junit4]   2> 746180 INFO  (coreLoadExecutor-2999-thread-1-processing-n:127.0.0.1:55911_oehz%2Fdt) [n:127.0.0.1:55911_oehz%2Fdt c:control_collection s:shard1 r:core_node1 x:collection1] o.a.s.c.CachingDirectoryFactory return new directory for /home/jenkins/workspace/Lucene-Solr-trunk-Linux/solr/build/solr-core/test/J1/../../../../../../../../../home/jenkins/workspace/Lucene-Solr-trunk-Linux/solr/build/solr-core/test/J1/temp/solr.cloud.CollectionsAPIDistributedZkTest_19A39875F969E4BB-001/control-001/cores/collection1/data/index
   [junit4]   2> 746180 INFO  (coreLoadExecutor-2999-thread-1-processing-n:127.0.0.1:55911_oehz%2Fdt) [n:127.0.0.1:55911_oehz%2Fdt c:control_collection s:shard1 r:core_node1 x:collection1] o.a.s.u.RandomMergePolicy RandomMergePolicy wrapping class org.apache.lucene.index.TieredMergePolicy: [TieredMergePolicy: maxMergeAtOnce=37, maxMergeAtOnceExplicit=27, maxMergedSegmentMB=25.943359375, floorSegmentMB=1.244140625, forceMergeDeletesPctAllowed=16.539063573689948, segmentsPerTier=23.0, maxCFSSegmentSizeMB=8.796093022207999E12, noCFSRatio=0.0
   [junit4]   2> 746181 INFO  (coreLoadExecutor-2999-thread-1-processing-n:127.0.0.1:55911_oehz%2Fdt) [n:127.0.0.1:55911_oehz%2Fdt c:control_collection s:shard1 r:core_node1 x:collection1] o.a.s.c.SolrCore SolrDeletionPolicy.onCommit: commits: num=1
   [junit4]   2> 	commit{dir=MockDirectoryWrapper(RAMDirectory@1690e76 lockFactory=org.apache.lucene.store.SingleInstanceLockFactory@1c5465e),segFN=segments_1,generation=1}
   [junit4]   2> 746181 INFO  (coreLoadExecutor-2999-thread-1-processing-n:127.0.0.1:55911_oehz%2Fdt) [n:127.0.0.1:55911_oehz%2Fdt c:control_collection s:shard1 r:core_node1 x:collection1] o.a.s.c.SolrCore newest commit generation = 1
   [junit4]   2> 746181 INFO  (OldIndexDirectoryCleanupThreadForCore-collection1) [n:127.0.0.1:55911_oehz%2Fdt c:control_collection s:shard1 r:core_node1 x:collection1] o.a.s.c.SolrCore Looking for old index directories to cleanup for core collection1 in /home/jenkins/workspace/Lucene-Solr-trunk-Linux/solr/build/solr-core/test/J1/../../../../../../../../../home/jenkins/workspace/Lucene-Solr-trunk-Linux/solr/build/solr-core/test/J1/temp/solr.cloud.CollectionsAPIDistributedZkTest_19A39875F969E4BB-001/control-001/cores/collection1/data/
   [junit4]   2> 746182 WARN  (OldIndexDirectoryCleanupThreadForCore-collection1) [n:127.0.0.1:55911_oehz%2Fdt c:control_collection s:shard1 r:core_node1 x:collection1] o.a.s.c.DirectoryFactory /home/jenkins/workspace/Lucene-Solr-trunk-Linux/solr/build/solr-core/test/J1/../../../../../../../../../home/jenkins/workspace/Lucene-Solr-trunk-Linux/solr/build/solr-core/test/J1/temp/solr.cloud.CollectionsAPIDistributedZkTest_19A39875F969E4BB-001/control-001/cores/collection1/data/ does not point to a valid data directory; skipping clean-up of old index directories.
   [junit4]   2> 746183 INFO  (coreLoadExecutor-2999-thread-1-processing-n:127.0.0.1:55911_oehz%2Fdt) [n:127.0.0.1:55911_oehz%2Fdt c:control_collection s:shard1 r:core_node1 x:collection1] o.a.s.u.p.UpdateRequestProcessorChain creating updateRequestProcessorChain "nodistrib"
   [junit4]   2> 746183 INFO  (coreLoadExecutor-2999-thread-1-processing-n:127.0.0.1:55911_oehz%2Fdt) [n:127.0.0.1:55911_oehz%2Fdt c:control_collection s:shard1 r:core_node1 x:collection1] o.a.s.u.p.UpdateRequestProcessorChain creating updateRequestProcessorChain "dedupe"
   [junit4]   2> 746183 INFO  (coreLoadExecutor-2999-thread-1-processing-n:127.0.0.1:55911_oehz%2Fdt) [n:127.0.0.1:55911_oehz%2Fdt c:control_collection s:shard1 r:core_node1 x:collection1] o.a.s.u.p.UpdateRequestProcessorChain inserting DistributedUpdateProcessorFactory into updateRequestProcessorChain "dedupe"
   [junit4]   2> 746183 INFO  (coreLoadExecutor-2999-thread-1-processing-n:127.0.0.1:55911_oehz%2Fdt) [n:127.0.0.1:55911_oehz%2Fdt c:control_collection s:shard1 r:core_node1 x:collection1] o.a.s.u.p.UpdateRequestProcessorChain creating updateRequestProcessorChain "stored_sig"
   [junit4]   2> 746183 INFO  (coreLoadExecutor-2999-thread-1-processing-n:127.0.0.1:55911_oehz%2Fdt) [n:127.0.0.1:55911_oehz%2Fdt c:control_collection s:shard1 r:core_node1 x:collection1] o.a.s.u.p.UpdateRequestProcessorChain inserting DistributedUpdateProcessorFactory into updateRequestProcessorChain "stored_sig"
   [junit4]   2> 746183 INFO  (coreLoadExecutor-2999-thread-1-processing-n:127.0.0.1:55911_oehz%2Fdt) [n:127.0.0.1:55911_oehz%2Fdt c:control_collection s:shard1 r:core_node1 x:collection1] o.a.s.u.p.UpdateRequestProcessorChain creating updateRequestProcessorChain "distrib-dup-test-chain-explicit"
   [junit4]   2> 746183 INFO  (coreLoadExecutor-2999-thread-1-processing-n:127.0.0.1:55911_oehz%2Fdt) [n:127.0.0.1:55911_oehz%2Fdt c:control_collection s:shard1 r:core_node1 x:collection1] o.a.s.u.p.UpdateRequestProcessorChain creating updateRequestProcessorChain "distrib-dup-test-chain-implicit"
   [junit4]   2> 746183 INFO  (coreLoadExecutor-2999-thread-1-processing-n:127.0.0.1:55911_oehz%2Fdt) [n:127.0.0.1:55911_oehz%2Fdt c:control_collection s:shard1 r:core_node1 x:collection1] o.a.s.u.p.UpdateRequestProcessorChain inserting DistributedUpdateProcessorFactory into updateRequestProcessorChain "distrib-dup-test-chain-implicit"
   [junit4]   2> 746184 INFO  (coreLoadExecutor-2999-thread-1-processing-n:127.0.0.1:55911_oehz%2Fdt) [n:127.0.0.1:55911_oehz%2Fdt c:control_collection s:shard1 r:core_node1 x:collection1] o.a.s.c.SolrCore no updateRequestProcessorChain defined as default, creating implicit default
   [junit4]   2> 746184 INFO  (coreLoadExecutor-2999-thread-1-processing-n:127.0.0.1:55911_oehz%2Fdt) [n:127.0.0.1:55911_oehz%2Fdt c:control_collection s:shard1 r:core_node1 x:collection1] o.a.s.h.l.XMLLoader xsltCacheLifetimeSeconds=60
   [junit4]   2> 746185 INFO  (coreLoadExecutor-2999-thread-1-processing-n:127.0.0.1:55911_oehz%2Fdt) [n:127.0.0.1:55911_oehz%2Fdt c:control_collection s:shard1 r:core_node1 x:collection1] o.a.s.h.l.XMLLoader xsltCacheLifetimeSeconds=60
   [junit4]   2> 746186 INFO  (coreLoadExecutor-2999-thread-1-processing-n:127.0.0.1:55911_oehz%2Fdt) [n:127.0.0.1:55911_oehz%2Fdt c:control_collection s:shard1 r:core_node1 x:collection1] o.a.s.h.l.XMLLoader xsltCacheLifetimeSeconds=60
   [junit4]   2> 746186 INFO  (coreLoadExecutor-2999-thread-1-processing-n:127.0.0.1:55911_oehz%2Fdt) [n:127.0.0.1:55911_oehz%2Fdt c:control_collection s:shard1 r:core_node1 x:collection1] o.a.s.h.l.XMLLoader xsltCacheLifetimeSeconds=60
   [junit4]   2> 746188 INFO  (coreLoadExecutor-2999-thread-1-processing-n:127.0.0.1:55911_oehz%2Fdt) [n:127.0.0.1:55911_oehz%2Fdt c:control_collection s:shard1 r:core_node1 x:collection1] o.a.s.c.RequestHandlers Registered paths: /admin/mbeans,standard,/update/csv,/update/json/docs,/admin/luke,/admin/segments,/get,/admin/system,/replication,/admin/properties,/config,/schema,/admin/plugins,/admin/logging,/update/json,/admin/threads,/admin/ping,/update,/admin/file
   [junit4]   2> 746188 INFO  (coreLoadExecutor-2999-thread-1-processing-n:127.0.0.1:55911_oehz%2Fdt) [n:127.0.0.1:55911_oehz%2Fdt c:control_collection s:shard1 r:core_node1 x:collection1] o.a.s.c.SolrCore Using default statsCache cache: org.apache.solr.search.stats.LocalStatsCache
   [junit4]   2> 746188 INFO  (coreLoadExecutor-2999-thread-1-processing-n:127.0.0.1:55911_oehz%2Fdt) [n:127.0.0.1:55911_oehz%2Fdt c:control_collection s:shard1 r:core_node1 x:collection1] o.a.s.u.UpdateHandler Using UpdateLog implementation: org.apache.solr.update.UpdateLog
   [junit4]   2> 746188 INFO  (coreLoadExecutor-2999-thread-1-processing-n:127.0.0.1:55911_oehz%2Fdt) [n:127.0.0.1:55911_oehz%2Fdt c:control_collection s:shard1 r:core_node1 x:collection1] o.a.s.u.UpdateLog Initializing UpdateLog: dataDir= defaultSyncLevel=FLUSH numRecordsToKeep=100 maxNumLogsToKeep=10 numVersionBuckets=65536
   [junit4]   2> 746189 INFO  (coreLoadExecutor-2999-thread-1-processing-n:127.0.0.1:55911_oehz%2Fdt) [n:127.0.0.1:55911_oehz%2Fdt c:control_collection s:shard1 r:core_node1 x:collection1] o.a.s.c.SolrCore Hard AutoCommit: disabled
   [junit4]   2> 746189 INFO  (coreLoadExecutor-2999-thread-1-processing-n:127.0.0.1:55911_oehz%2Fdt) [n:127.0.0.1:55911_oehz%2Fdt c:control_collection s:shard1 r:core_node1 x:collection1] o.a.s.c.SolrCore Soft AutoCommit: disabled
   [junit4]   2> 746189 INFO  (coreLoadExecutor-2999-thread-1-processing-n:127.0.0.1:55911_oehz%2Fdt) [n:127.0.0.1:55911_oehz%2Fdt c:control_collection s:shard1 r:core_node1 x:collection1] o.a.s.u.RandomMergePolicy RandomMergePolicy wrapping class org.apache.lucene.index.TieredMergePolicy: [TieredMergePolicy: maxMergeAtOnce=27, maxMergeAtOnceExplicit=36, maxMergedSegmentMB=43.9189453125, floorSegmentMB=1.9541015625, forceMergeDeletesPctAllowed=15.664453930684058, segmentsPerTier=44.0, maxCFSSegmentSizeMB=8.796093022207999E12, noCFSRatio=0.0
   [junit4]   2> 746190 INFO  (coreLoadExecutor-2999-thread-1-processing-n:127.0.0.1:55911_oehz%2Fdt) [n:127.0.0.1:55911_oehz%2Fdt c:control_collection s:shard1 r:core_node1 x:collection1] o.a.s.c.SolrCore SolrDeletionPolicy.onInit: commits: num=1
   [junit4]   2> 	commit{dir=MockDirectoryWrapper(RAMDirectory@1690e76 lockFactory=org.apache.lucene.store.SingleInstanceLockFactory@1c5465e),segFN=segments_1,generation=1}
   [junit4]   2> 746190 INFO  (coreLoadExecutor-2999-thread-1-processing-n:127.0.0.1:55911_oehz%2Fdt) [n:127.0.0.1:55911_oehz%2Fdt c:control_collection s:shard1 r:core_node1 x:collection1] o.a.s.c.SolrCore newest commit generation = 1
   [junit4]   2> 746190 INFO  (coreLoadExecutor-2999-thread-1-processing-n:127.0.0.1:55911_oehz%2Fdt) [n:127.0.0.1:55911_oehz%2Fdt c:control_collection s:shard1 r:core_node1 x:collection1] o.a.s.s.SolrIndexSearcher Opening Searcher@1fdc9b4[collection1] main
   [junit4]   2> 746190 INFO  (coreLoadExecutor-2999-thread-1-processing-n:127.0.0.1:55911_oehz%2Fdt) [n:127.0.0.1:55911_oehz%2Fdt c:control_collection s:shard1 r:core_node1 x:collection1] o.a.s.c.c.ZkStateReader Load collection config from:/collections/control_collection
   [junit4]   2> 746191 INFO  (coreLoadExecutor-2999-thread-1-processing-n:127.0.0.1:55911_oehz%2Fdt) [n:127.0.0.1:55911_oehz%2Fdt c:control_collection s:shard1 r:core_node1 x:collection1] o.a.s.c.c.ZkStateReader path=/collections/control_collection configName=conf1 specified config exists in ZooKeeper
   [junit4]   2> 746191 INFO  (coreLoadExecutor-2999-thread-1-processing-n:127.0.0.1:55911_oehz%2Fdt) [n:127.0.0.1:55911_oehz%2Fdt c:control_collection s:shard1 r:core_node1 x:collection1] o.a.s.r.ManagedResourceStorage Setting up ZooKeeper-based storage for the RestManager with znodeBase: /configs/conf1
   [junit4]   2> 746191 INFO  (coreLoadExecutor-2999-thread-1-processing-n:127.0.0.1:55911_oehz%2Fdt) [n:127.0.0.1:55911_oehz%2Fdt c:control_collection s:shard1 r:core_node1 x:collection1] o.a.s.r.ManagedResourceStorage Configured ZooKeeperStorageIO with znodeBase: /configs/conf1
   [junit4]   2> 746191 INFO  (coreLoadExecutor-2999-thread-1-processing-n:127.0.0.1:55911_oehz%2Fdt) [n:127.0.0.1:55911_oehz%2Fdt c:control_collection s:shard1 r:core_node1 x:collection1] o.a.s.r.RestManager Initializing RestManager with initArgs: {}
   [junit4]   2> 746191 INFO  (coreLoadExecutor-2999-thread-1-processing-n:127.0.0.1:55911_oehz%2Fdt) [n:127.0.0.1:55911_oehz%2Fdt c:control_collection s:shard1 r:core_node1 x:collection1] o.a.s.r.ManagedResourceStorage Reading _rest_managed.json using ZooKeeperStorageIO:path=/configs/conf1
   [junit4]   2> 746191 INFO  (coreLoadExecutor-2999-thread-1-processing-n:127.0.0.1:55911_oehz%2Fdt) [n:127.0.0.1:55911_oehz%2Fdt c:control_collection s:shard1 r:core_node1 x:collection1] o.a.s.r.ManagedResourceStorage No data found for znode /configs/conf1/_rest_managed.json
   [junit4]   2> 746191 INFO  (coreLoadExecutor-2999-thread-1-processing-n:127.0.0.1:55911_oehz%2Fdt) [n:127.0.0.1:55911_oehz%2Fdt c:control_collection s:shard1 r:core_node1 x:collection1] o.a.s.r.ManagedResourceStorage Loaded null at path _rest_managed.json using ZooKeeperStorageIO:path=/configs/conf1
   [junit4]   2> 746191 INFO  (coreLoadExecutor-2999-thread-1-processing-n:127.0.0.1:55911_oehz%2Fdt) [n:127.0.0.1:55911_oehz%2Fdt c:control_collection s:shard1 r:core_node1 x:collection1] o.a.s.r.RestManager Initializing 0 registered ManagedResources
   [junit4]   2> 746191 INFO  (coreLoadExecutor-2999-thread-1-processing-n:127.0.0.1:55911_oehz%2Fdt) [n:127.0.0.1:55911_oehz%2Fdt c:control_collection s:shard1 r:core_node1 x:collection1] o.a.s.h.ReplicationHandler Commits will be reserved for  10000
   [junit4]   2> 746192 INFO  (searcherExecutor-3000-thread-1-processing-n:127.0.0.1:55911_oehz%2Fdt x:collection1 s:shard1 c:control_collection r:core_node1) [n:127.0.0.1:55911_oehz%2Fdt c:control_collection s:shard1 r:core_node1 x:collection1] o.a.s.c.SolrCore [collection1] Registered new searcher Searcher@1fdc9b4[collection1] main{ExitableDirectoryReader(UninvertingDirectoryReader())}
   [junit4]   2> 746192 INFO  (coreLoadExecutor-2999-thread-1-processing-n:127.0.0.1:55911_oehz%2Fdt) [n:127.0.0.1:55911_oehz%2Fdt c:control_collection s:shard1 r:core_node1 x:collection1] o.a.s.u.UpdateLog Looking up max value of version field to seed version buckets
   [junit4]   2> 746192 INFO  (coreLoadExecutor-2999-thread-1-processing-n:127.0.0.1:55911_oehz%2Fdt) [n:127.0.0.1:55911_oehz%2Fdt c:control_collection s:shard1 r:core_node1 x:collection1] o.a.s.u.VersionInfo Refreshing highest value of _version_ for 65536 version buckets from index
   [junit4]   2> 746192 INFO  (coreLoadExecutor-2999-thread-1-processing-n:127.0.0.1:55911_oehz%2Fdt) [n:127.0.0.1:55911_oehz%2Fdt c:control_collection s:shard1 r:core_node1 x:collection1] o.a.s.u.VersionInfo No terms found for _version_, cannot seed version bucket highest value from index
   [junit4]   2> 746192 INFO  (coreLoadExecutor-2999-thread-1-processing-n:127.0.0.1:55911_oehz%2Fdt) [n:127.0.0.1:55911_oehz%2Fdt c:control_collection s:shard1 r:core_node1 x:collection1] o.a.s.u.UpdateLog Could not find max version in index or recent updates, using new clock 1509294959495217152
   [junit4]   2> 746194 INFO  (coreLoadExecutor-2999-thread-1-processing-n:127.0.0.1:55911_oehz%2Fdt) [n:127.0.0.1:55911_oehz%2Fdt c:control_collection s:shard1 r:core_node1 x:collection1] o.a.s.u.UpdateLog Took 1.0ms to seed version buckets with highest version 1509294959495217152
   [junit4]   2> 746194 INFO  (coreLoadExecutor-2999-thread-1-processing-n:127.0.0.1:55911_oehz%2Fdt) [n:127.0.0.1:55911_oehz%2Fdt c:control_collection s:shard1 r:core_node1 x:collection1] o.a.s.c.ZkController watch zkdir /configs/conf1
   [junit4]   2> 746194 INFO  (coreLoadExecutor-2999-thread-1-processing-n:127.0.0.1:55911_oehz%2Fdt) [n:127.0.0.1:55911_oehz%2Fdt c:control_collection s:shard1 r:core_node1 x:collection1] o.a.s.c.CoreContainer registering core: collection1
   [junit4]   2> 746194 INFO  (coreZkRegister-2993-thread-1-processing-n:127.0.0.1:55911_oehz%2Fdt x:collection1 s:shard1 c:control_collection r:core_node1) [n:127.0.0.1:55911_oehz%2Fdt c:control_collection s:shard1 r:core_node1 x:collection1] o.a.s.c.ZkController Register replica - core:collection1 address:https://127.0.0.1:55911/oehz/dt collection:control_collection shard:shard1
   [junit4]   2> 746195 INFO  (coreZkRegister-2993-thread-1-processing-n:127.0.0.1:55911_oehz%2Fdt x:collection1 s:shard1 c:control_collection r:core_node1) [n:127.0.0.1:55911_oehz%2Fdt c:control_collection s:shard1 r:core_node1 x:collection1] o.a.s.c.c.SolrZkClient makePath: /collections/control_collection/leader_elect/shard1/election
   [junit4]   2> 746196 INFO  (coreZkRegister-2993-thread-1-processing-n:127.0.0.1:55911_oehz%2Fdt x:collection1 s:shard1 c:control_collection r:core_node1) [n:127.0.0.1:55911_oehz%2Fdt c:control_collection s:shard1 r:core_node1 x:collection1] o.a.s.c.LeaderElector Joined leadership election with path: /collections/control_collection/leader_elect/shard1/election/94330934880239621-core_node1-n_0000000000
   [junit4]   2> 746196 INFO  (coreZkRegister-2993-thread-1-processing-n:127.0.0.1:55911_oehz%2Fdt x:collection1 s:shard1 c:control_collection r:core_node1) [n:127.0.0.1:55911_oehz%2Fdt c:control_collection s:shard1 r:core_node1 x:collection1] o.a.s.c.ShardLeaderElectionContext Running the leader process for shard shard1
   [junit4]   2> 746196 INFO  (zkCallback-732-thread-1-processing-n:127.0.0.1:55911_oehz%2Fdt) [n:127.0.0.1:55911_oehz%2Fdt    ] o.a.s.c.DistributedQueue NodeChildrenChanged fired on path /overseer/queue state SyncConnected
   [junit4]   2> 746196 INFO  (coreZkRegister-2993-thread-1-processing-n:127.0.0.1:55911_oehz%2Fdt x:collection1 s:shard1 c:control_collection r:core_node1) [n:127.0.0.1:55911_oehz%2Fdt c:control_collection s:shard1 r:core_node1 x:collection1] o.a.s.c.ShardLeaderElectionContext Enough replicas found to continue.
   [junit4]   2> 746197 INFO  (coreZkRegister-2993-thread-1-processing-n:127.0.0.1:55911_oehz%2Fdt x:collection1 s:shard1 c:control_collection r:core_node1) [n:127.0.0.1:55911_oehz%2Fdt c:control_collection s:shard1 r:core_node1 x:collection1] o.a.s.c.ShardLeaderElectionContext I may be the new leader - try and sync
   [junit4]   2> 746197 INFO  (coreZkRegister-2993-thread-1-processing-n:127.0.0.1:55911_oehz%2Fdt x:collection1 s:shard1 c:control_collection r:core_node1) [n:127.0.0.1:55911_oehz%2Fdt c:control_collection s:shard1 r:core_node1 x:collection1] o.a.s.c.SyncStrategy Sync replicas to https://127.0.0.1:55911/oehz/dt/collection1/
   [junit4]   2> 746197 INFO  (OverseerStateUpdate-94330934880239621-127.0.0.1:55911_oehz%2Fdt-n_0000000000) [n:127.0.0.1:55911_oehz%2Fdt    ] o.a.s.c.Overseer processMessage: queueSize: 1, message = {
   [junit4]   2>   "operation":"leader",
   [junit4]   2>   "shard":"shard1",
   [junit4]   2>   "collection":"control_collection"} current state version: 1
   [junit4]   2> 746197 INFO  (coreZkRegister-2993-thread-1-processing-n:127.0.0.1:55911_oehz%2Fdt x:collection1 s:shard1 c:control_collection r:core_node1) [n:127.0.0.1:55911_oehz%2Fdt c:control_collection s:shard1 r:core_node1 x:collection1] o.a.s.c.SyncStrategy Sync Success - now sync replicas to me
   [junit4]   2> 746197 INFO  (coreZkRegister-2993-thread-1-processing-n:127.0.0.1:55911_oehz%2Fdt x:collection1 s:shard1 c:control_collection r:core_node1) [n:127.0.0.1:55911_oehz%2Fdt c:control_collection s:shard1 r:core_node1 x:collection1] o.a.s.c.SyncStrategy https://127.0.0.1:55911/oehz/dt/collection1/ has no replicas
   [junit4]   2> 746197 INFO  (coreZkRegister-2993-thread-1-processing-n:127.0.0.1:55911_oehz%2Fdt x:collection1 s:shard1 c:control_collection r:core_node1) [n:127.0.0.1:55911_oehz%2Fdt c:control_collection s:shard1 r:core_node1 x:collection1] o.a.s.c.ShardLeaderElectionContext I am the new leader: https://127.0.0.1:55911/oehz/dt/collection1/ shard1
   [junit4]   2> 746197 INFO  (coreZkRegister-2993-thread-1-processing-n:127.0.0.1:55911_oehz%2Fdt x:collection1 s:shard1 c:control_collection r:core_node1) [n:127.0.0.1:55911_oehz%2Fdt c:control_collection s:shard1 r:core_node1 x:collection1] o.a.s.c.c.SolrZkClient makePath: /collections/control_collection/leaders/shard1
   [junit4]   2> 746198 INFO  (zkCallback-732-thread-1-processing-n:127.0.0.1:55911_oehz%2Fdt) [n:127.0.0.1:55911_oehz%2Fdt    ] o.a.s.c.DistributedQueue NodeChildrenChanged fired on path /overseer/queue state SyncConnected
   [junit4]   2> 746198 INFO  (OverseerStateUpdate-94330934880239621-127.0.0.1:55911_oehz%2Fdt-n_0000000000) [n:127.0.0.1:55911_oehz%2Fdt    ] o.a.s.c.Overseer processMessage: queueSize: 1, message = {
   [junit4]   2>   "operation":"leader",
   [junit4]   2>   "shard":"shard1",
   [junit4]   2>   "collection":"control_collection",
   [junit4]   2>   "base_url":"https://127.0.0.1:55911/oehz/dt",
   [junit4]   2>   "core":"collection1",
   [junit4]   2>   "state":"active"} current state version: 1
   [junit4]   2> 746299 INFO  (zkCallback-732-thread-1-processing-n:127.0.0.1:55911_oehz%2Fdt) [n:127.0.0.1:55911_oehz%2Fdt    ] o.a.s.c.c.ZkStateReader A cluster state change: WatchedEvent state:SyncConnected type:NodeDataChanged path:/clusterstate.json, has occurred - updating... (live nodes size: 1)
   [junit4]   2> 746349 INFO  (coreZkRegister-2993-thread-1-processing-n:127.0.0.1:55911_oehz%2Fdt x:collection1 s:shard1 c:control_collection r:core_node1) [n:127.0.0.1:55911_oehz%2Fdt c:control_collection s:shard1 r:core_node1 x:collection1] o.a.s.c.ZkController We are https://127.0.0.1:55911/oehz/dt/collection1/ and leader is https://127.0.0.1:55911/oehz/dt/collection1/
   [junit4]   2> 746349 INFO  (coreZkRegister-2993-thread-1-processing-n:127.0.0.1:55911_oehz%2Fdt x:collection1 s:shard1 c:control_collection r:core_node1) [n:127.0.0.1:55911_oehz%2Fdt c:control_collection s:shard1 r:core_node1 x:collection1] o.a.s.c.ZkController No LogReplay needed for core=collection1 baseURL=https://127.0.0.1:55911/oehz/dt
   [junit4]   2> 746349 INFO  (coreZkRegister-2993-thread-1-processing-n:127.0.0.1:55911_oehz%2Fdt x:collection1 s:shard1 c:control_collection r:core_node1) [n:127.0.0.1:55911_oehz%2Fdt c:control_collection s:shard1 r:core_node1 x:collection1] o.a.s.c.ZkController I am the leader, no recovery necessary
   [junit4]   2> 746349 INFO  (coreZkRegister-2993-thread-1-processing-n:127.0.0.1:55911_oehz%2Fdt x:collection1 s:shard1 c:control_collection r:core_node1) [n:127.0.0.1:55911_oehz%2Fdt c:control_collection s:shard1 r:core_node1 x:collection1] o.a.s.c.ZkController publishing state=active
   [junit4]   2> 746349 INFO  (coreZkRegister-2993-thread-1-processing-n:127.0.0.1:55911_oehz%2Fdt x:collection1 s:shard1 c:control_collection r:core_node1) [n:127.0.0.1:55911_oehz%2Fdt c:control_collection s:shard1 r:core_node1 x:collection1] o.a.s.c.ZkController numShards not found on descriptor - reading it from system property
   [junit4]   2> 746350 INFO  (zkCallback-732-thread-1-processing-n:127.0.0.1:55911_oehz%2Fdt) [n:127.0.0.1:55911_oehz%2Fdt    ] o.a.s.c.DistributedQueue NodeChildrenChanged fired on path /overseer/queue state SyncConnected
   [junit4]   2> 746350 INFO  (OverseerStateUpdate-94330934880239621-127.0.0.1:55911_oehz%2Fdt-n_0000000000) [n:127.0.0.1:55911_oehz%2Fdt    ] o.a.s.c.Overseer processMessage: queueSize: 1, message = {
   [junit4]   2>   "core":"collection1",
   [junit4]   2>   "core_node_name":"core_node1",
   [junit4]   2>   "roles":null,
   [junit4]   2>   "base_url":"https://127.0.0.1:55911/oehz/dt",
   [junit4]   2>   "node_name":"127.0.0.1:55911_oehz%2Fdt",
   [junit4]   2>   "numShards":"1",
   [junit4]   2>   "state":"active",
   [junit4]   2>   "shard":"shard1",
   [junit4]   2>   "collection":"control_collection",
   [junit4]   2>   "operation":"state"} current state version: 2
   [junit4]   2> 746350 INFO  (OverseerStateUpdate-94330934880239621-127.0.0.1:55911_oehz%2Fdt-n_0000000000) [n:127.0.0.1:55911_oehz%2Fdt    ] o.a.s.c.o.ReplicaMutator Update state numShards=1 message={
   [junit4]   2>   "core":"collection1",
   [junit4]   2>   "core_node_name":"core_node1",
   [junit4]   2>   "roles":null,
   [junit4]   2>   "base_url":"https://127.0.0.1:55911/oehz/dt",
   [junit4]   2>   "node_name":"127.0.0.1:55911_oehz%2Fdt",
   [junit4]   2>   "numShards":"1",
   [junit4]   2>   "state":"active",
   [junit4]   2>   "shard":"shard1",
   [junit4]   2>   "collection":"control_collection",
   [junit4]   2>   "operation":"state"}
   [junit4]   2> 746451 INFO  (zkCallback-732-thread-1-processing-n:127.0.0.1:55911_oehz%2Fdt) [n:127.0.0.1:55911_oehz%2Fdt    ] o.a.s.c.c.ZkStateReader A cluster state change: WatchedEvent state:SyncConnected type:NodeDataChanged path:/clusterstate.json, has occurred - updating... (live nodes size: 1)
   [junit4]   2> 746577 INFO  (TEST-CollectionsAPIDistributedZkTest.test-seed#[19A39875F969E4BB]) [    ] o.a.s.c.c.SolrZkClient Using default ZkCredentialsProvider
   [junit4]   2> 746578 INFO  (TEST-CollectionsAPIDistributedZkTest.test-seed#[19A39875F969E4BB]) [    ] o.a.s.c.c.ConnectionManager Waiting for client to connect to ZooKeeper
   [junit4]   2> 746578 INFO  (zkCallback-734-thread-1) [    ] o.a.s.c.c.ConnectionManager Watcher org.apache.solr.common.cloud.ConnectionManager@91fe76 name:ZooKeeperConnection Watcher:127.0.0.1:38510/solr got event WatchedEvent state:SyncConnected type:None path:null path:null type:None
   [junit4]   2> 746578 INFO  (TEST-CollectionsAPIDistributedZkTest.test-seed#[19A39875F969E4BB]) [    ] o.a.s.c.c.ConnectionManager Client is connected to ZooKeeper
   [junit4]   2> 746579 INFO  (TEST-CollectionsAPIDistributedZkTest.test-seed#[19A39875F969E4BB]) [    ] o.a.s.c.c.SolrZkClient Using default ZkACLProvider
   [junit4]   2> 746579 INFO  (TEST-CollectionsAPIDistributedZkTest.test-seed#[19A39875F969E4BB]) [    ] o.a.s.c.c.ZkStateReader Updating cluster state from ZooKeeper... 
   [junit4]   2> 746580 INFO  (TEST-CollectionsAPIDistributedZkTest.test-seed#[19A39875F969E4BB]) [    ] o.a.s.c.ChaosMonkey monkey: init - expire sessions:false cause connection loss:false
   [junit4]   2> 746580 INFO  (TEST-CollectionsAPIDistributedZkTest.test-seed#[19A39875F969E4BB]) [    ] o.a.s.c.AbstractFullDistribZkTestBase Creating collection1 with stateFormat=2
   [junit4]   2> 746580 INFO  (TEST-CollectionsAPIDistributedZkTest.test-seed#[19A39875F969E4BB]) [    ] o.a.s.c.c.SolrZkClient Using default ZkCredentialsProvider
   [junit4]   2> 746580 INFO  (TEST-CollectionsAPIDistributedZkTest.test-seed#[19A39875F969E4BB]) [    ] o.a.s.c.c.ConnectionManager Waiting for client to connect to ZooKeeper
   [junit4]   2> 746581 INFO  (zkCallback-735-thread-1) [    ] o.a.s.c.c.ConnectionManager Watcher org.apache.solr.common.cloud.ConnectionManager@997bf3 name:ZooKeeperConnection Watcher:127.0.0.1:38510/solr got event WatchedEvent state:SyncConnected type:None path:null path:null type:None
   [junit4]   2> 746581 INFO  (TEST-CollectionsAPIDistributedZkTest.test-seed#[19A39875F969E4BB]) [    ] o.a.s.c.c.ConnectionManager Client is connected to ZooKeeper
   [junit4]   2> 746581 INFO  (TEST-CollectionsAPIDistributedZkTest.test-seed#[19A39875F969E4BB]) [    ] o.a.s.c.c.SolrZkClient Using default ZkACLProvider
   [junit4]   2> 746581 INFO  (zkCallback-732-thread-1-processing-n:127.0.0.1:55911_oehz%2Fdt) [n:127.0.0.1:55911_oehz%2Fdt    ] o.a.s.c.DistributedQueue NodeChildrenChanged fired on path /overseer/queue state SyncConnected
   [junit4]   2> 746582 INFO  (OverseerStateUpdate-94330934880239621-127.0.0.1:55911_oehz%2Fdt-n_0000000000) [n:127.0.0.1:55911_oehz%2Fdt    ] o.a.s.c.Overseer processMessage: queueSize: 1, message = {
   [junit4]   2>   "operation":"create",
   [junit4]   2>   "name":"collection1",
   [junit4]   2>   "numShards":"2",
   [junit4]   2>   "stateFormat":"2"} current state version: 3
   [junit4]   2> 746582 INFO  (OverseerStateUpdate-94330934880239621-127.0.0.1:55911_oehz%2Fdt-n_0000000000) [n:127.0.0.1:55911_oehz%2Fdt    ] o.a.s.c.o.ClusterStateMutator building a new cName: collection1
   [junit4]   2> 746632 INFO  (TEST-CollectionsAPIDistributedZkTest.test-seed#[19A39875F969E4BB]) [    ] o.a.s.SolrTestCaseJ4 Writing core.properties file to /home/jenkins/workspace/Lucene-Solr-trunk-Linux/solr/build/solr-core/test/J1/temp/solr.cloud.CollectionsAPIDistributedZkTest_19A39875F969E4BB-001/shard-1-001/cores/collection1
   [junit4]   2> 746633 INFO  (TEST-CollectionsAPIDistributedZkTest.test-seed#[19A39875F969E4BB]) [    ] o.a.s.c.AbstractFullDistribZkTestBase create jetty 1 in directory /home/jenkins/workspace/Lucene-Solr-trunk-Linux/solr/build/solr-core/test/J1/temp/solr.cloud.CollectionsAPIDistributedZkTest_19A39875F969E4BB-001/shard-1-001
   [junit4]   2> 746633 INFO  (TEST-CollectionsAPIDistributedZkTest.test-seed#[19A39875F969E4BB]) [    ] o.e.j.s.Server jetty-9.2.11.v20150529
   [junit4]   2> 746634 INFO  (TEST-CollectionsAPIDistributedZkTest.test-seed#[19A39875F969E4BB]) [    ] o.e.j.s.h.ContextHandler Started o.e.j.s.ServletContextHandler@1ef2e94{/oehz/dt,null,AVAILABLE}
   [junit4]   2> 746636 INFO  (TEST-CollectionsAPIDistributedZkTest.test-seed#[19A39875F969E4BB]) [    ] o.e.j.s.ServerConnector Started ServerConnector@125855f{SSL-http/1.1}{127.0.0.1:45584}
   [junit4]   2> 746636 INFO  (TEST-CollectionsAPIDistributedZkTest.test-seed#[19A39875F969E4BB]) [    ] o.e.j.s.Server Started @748598ms
   [junit4]   2> 746636 INFO  (TEST-CollectionsAPIDistributedZkTest.test-seed#[19A39875F969E4BB]) [    ] o.a.s.c.s.e.JettySolrRunner Jetty properties: {solr.data.dir=/home/jenkins/workspace/Lucene-Solr-trunk-Linux/solr/build/solr-core/test/J1/temp/solr.cloud.CollectionsAPIDistributedZkTest_19A39875F969E4BB-001/tempDir-001/jetty1, solrconfig=solrconfig.xml, hostContext=/oehz/dt, hostPort=45584, coreRootDirectory=/home/jenkins/workspace/Lucene-Solr-trunk-Linux/solr/build/solr-core/test/J1/../../../../../../../../../home/jenkins/workspace/Lucene-Solr-trunk-Linux/solr/build/solr-core/test/J1/temp/solr.cloud.CollectionsAPIDistributedZkTest_19A39875F969E4BB-001/shard-1-001/cores}
   [junit4]   2> 746637 INFO  (TEST-CollectionsAPIDistributedZkTest.test-seed#[19A39875F969E4BB]) [    ] o.a.s.s.SolrDispatchFilter SolrDispatchFilter.init(): sun.misc.Launcher$AppClassLoader@e2f2a
   [junit4]   2> 746637 INFO  (TEST-CollectionsAPIDistributedZkTest.test-seed#[19A39875F969E4BB]) [    ] o.a.s.c.SolrResourceLoader new SolrResourceLoader for directory: '/home/jenkins/workspace/Lucene-Solr-trunk-Linux/solr/build/solr-core/test/J1/../../../../../../../../../home/jenkins/workspace/Lucene-Solr-trunk-Linux/solr/build/solr-core/test/J1/temp/solr.cloud.CollectionsAPIDistributedZkTest_19A39875F969E4BB-001/shard-1-001/'
   [junit4]   2> 746644 INFO  (TEST-CollectionsAPIDistributedZkTest.test-seed#[19A39875F969E4BB]) [    ] o.a.s.c.c.SolrZkClient Using default ZkCredentialsProvider
   [junit4]   2> 746645 INFO  (TEST-CollectionsAPIDistributedZkTest.test-seed#[19A39875F969E4BB]) [    ] o.a.s.c.c.ConnectionManager Waiting for client to connect to ZooKeeper
   [junit4]   2> 746645 INFO  (zkCallback-736-thread-1) [    ] o.a.s.c.c.ConnectionManager Watcher org.apache.solr.common.cloud.ConnectionManager@1777f84 name:ZooKeeperConnection Watcher:127.0.0.1:38510/solr got event WatchedEvent state:SyncConnected type:None path:null path:null type:None
   [junit4]   2> 746645 INFO  (TEST-CollectionsAPIDistributedZkTest.test-seed#[19A39875F969E4BB]) [    ] o.a.s.c.c.ConnectionManager Client is connected to ZooKeeper
   [junit4]   2> 746646 INFO  (TEST-CollectionsAPIDistributedZkTest.test-seed#[19A39875F969E4BB]) [    ] o.a.s.c.c.SolrZkClient Using default ZkACLProvider
   [junit4]   2> 746646 INFO  (TEST-CollectionsAPIDistributedZkTest.test-seed#[19A39875F969E4BB]) [    ] o.a.s.s.SolrDispatchFilter Loading solr.xml from SolrHome (not found in ZooKeeper)
   [junit4]   2> 746646 INFO  (TEST-CollectionsAPIDistributedZkTest.test-seed#[19A39875F969E4BB]) [    ] o.a.s.c.SolrXmlConfig Loading container configuration from /home/jenkins/workspace/Lucene-Solr-trunk-Linux/solr/build/solr-core/test/J1/../../../../../../../../../home/jenkins/workspace/Lucene-Solr-trunk-Linux/solr/build/solr-core/test/J1/temp/solr.cloud.CollectionsAPIDistributedZkTest_19A39875F969E4BB-001/shard-1-001/solr.xml
   [junit4]   2> 746649 INFO  (TEST-CollectionsAPIDistributedZkTest.test-seed#[19A39875F969E4BB]) [    ] o.a.s.c.CoresLocator Config-defined core root directory: /home/jenkins/workspace/Lucene-Solr-trunk-Linux/solr/build/solr-core/test/J1/../../../../../../../../../home/jenkins/workspace/Lucene-Solr-trunk-Linux/solr/build/solr-core/test/J1/temp/solr.cloud.CollectionsAPIDistributedZkTest_19A39875F969E4BB-001/shard-1-001/cores
   [junit4]   2> 746649 INFO  (TEST-CollectionsAPIDistributedZkTest.test-seed#[19A39875F969E4BB]) [    ] o.a.s.c.CoreContainer New CoreContainer 10708701
   [junit4]   2> 746649 INFO  (TEST-CollectionsAPIDistributedZkTest.test-seed#[19A39875F969E4BB]) [    ] o.a.s.c.CoreContainer Loading cores into CoreContainer [instanceDir=/home/jenkins/workspace/Lucene-Solr-trunk-Linux/solr/build/solr-core/test/J1/../../../../../../../../../home/jenkins/workspace/Lucene-Solr-trunk-Linux/solr/build/solr-core/test/J1/temp/solr.cloud.CollectionsAPIDistributedZkTest_19A39875F969E4BB-001/shard-1-001/]
   [junit4]   2> 746649 INFO  (TEST-CollectionsAPIDistributedZkTest.test-seed#[19A39875F969E4BB]) [    ] o.a.s.c.CoreContainer loading shared library: /home/jenkins/workspace/Lucene-Solr-trunk-Linux/solr/build/solr-core/test/J1/../../../../../../../../../home/jenkins/workspace/Lucene-Solr-trunk-Linux/solr/build/solr-core/test/J1/temp/solr.cloud.CollectionsAPIDistributedZkTest_19A39875F969E4BB-001/shard-1-001/lib
   [junit4]   2> 746649 WARN  (TEST-CollectionsAPIDistributedZkTest.test-seed#[19A39875F969E4BB]) [    ] o.a.s.c.SolrResourceLoader Can't find (or read) directory to add to classloader: lib (resolved as: /home/jenkins/workspace/Lucene-Solr-trunk-Linux/solr/build/solr-core/test/J1/../../../../../../../../../home/jenkins/workspace/Lucene-Solr-trunk-Linux/solr/build/solr-core/test/J1/temp/solr.cloud.CollectionsAPIDistributedZkTest_19A39875F969E4BB-001/shard-1-001/lib).
   [junit4]   2> 746653 INFO  (TEST-CollectionsAPIDistributedZkTest.test-seed#[19A39875F969E4BB]) [    ] o.a.s.h.c.HttpShardHandlerFactory created with socketTimeout : 90000,urlScheme : ,connTimeout : 15000,maxConnectionsPerHost : 20,maxConnections : 10000,corePoolSize : 0,maximumPoolSize : 2147483647,maxThreadIdleTime : 5,sizeOfQueue : -1,fairnessPolicy : false,useRetries : false,
   [junit4]   2> 746654 INFO  (TEST-CollectionsAPIDistributedZkTest.test-seed#[19A39875F969E4BB]) [    ] o.a.s.u.UpdateShardHandler Creating UpdateShardHandler HTTP client with params: socketTimeout=340000&connTimeout=45000&retry=true
   [junit4]   2> 746655 INFO  (TEST-CollectionsAPIDistributedZkTest.test-seed#[19A39875F969E4BB]) [    ] o.a.s.l.LogWatcher SLF4J impl is org.slf4j.impl.Log4jLoggerFactory
   [junit4]   2> 746655 INFO  (TEST-CollectionsAPIDistributedZkTest.test-seed#[19A39875F969E4BB]) [    ] o.a.s.l.LogWatcher Registering Log Listener [Log4j (org.slf4j.impl.Log4jLoggerFactory)]
   [junit4]   2> 746656 INFO  (TEST-CollectionsAPIDistributedZkTest.test-seed#[19A39875F969E4BB]) [    ] o.a.s.c.ZkContainer Zookeeper client=127.0.0.1:38510/solr
   [junit4]   2> 746656 INFO  (TEST-CollectionsAPIDistributedZkTest.test-seed#[19A39875F969E4BB]) [    ] o.a.s.c.ZkController zkHost includes chroot
   [junit4]   2> 746656 INFO  (TEST-CollectionsAPIDistributedZkTest.test-seed#[19A39875F969E4BB]) [    ] o.a.s.c.c.SolrZkClient Using default ZkCredentialsProvider
   [junit4]   2> 746656 INFO  (TEST-CollectionsAPIDistributedZkTest.test-seed#[19A39875F969E4BB]) [    ] o.a.s.c.c.ConnectionManager Waiting for client to connect to ZooKeeper
   [junit4]   2> 746657 INFO  (zkCallback-738-thread-1) [    ] o.a.s.c.c.ConnectionManager Watcher org.apache.solr.common.cloud.ConnectionManager@6574a1 name:ZooKeeperConnection Watcher:127.0.0.1:38510 got event WatchedEvent state:SyncConnected type:None path:null path:null type:None
   [junit4]   2> 746657 INFO  (TEST-CollectionsAPIDistributedZkTest.test-seed#[19A39875F969E4BB]) [    ] o.a.s.c.c.ConnectionManager Client is connected to ZooKeeper
   [junit4]   2> 746657 INFO  (TEST-CollectionsAPIDistributedZkTest.test-seed#[19A39875F969E4BB]) [    ] o.a.s.c.c.SolrZkClient Using default ZkACLProvider
   [junit4]   2> 746658 INFO  (TEST-CollectionsAPIDistributedZkTest.test-seed#[19A39875F969E4BB]) [n:127.0.0.1:45584_oehz%2Fdt    ] o.a.s.c.c.ConnectionManager Waiting for client to connect to ZooKeeper
   [junit4]   2> 746659 INFO  (zkCallback-739-thread-1-processing-n:127.0.0.1:45584_oehz%2Fdt) [n:127.0.0.1:45584_oehz%2Fdt    ] o.a.s.c.c.ConnectionManager Watcher org.apache.solr.common.cloud.ConnectionManager@2f0652 name:ZooKeeperConnection Watcher:127.0.0.1:38510/solr got event WatchedEvent state:SyncConnected type:None path:null path:null type:None
   [junit4]   2> 746659 INFO  (TEST-CollectionsAPIDistributedZkTest.test-seed#[19A39875F969E4BB]) [n:127.0.0.1:45584_oehz%2Fdt    ] o.a.s.c.c.ConnectionManager Client is connected to ZooKeeper
   [junit4]   2> 746660 INFO  (TEST-CollectionsAPIDistributedZkTest.test-seed#[19A39875F969E4BB]) [n:127.0.0.1:45584_oehz%2Fdt    ] o.a.s.c.c.ZkStateReader Updating cluster state from ZooKeeper... 
   [junit4]   2> 746683 INFO  (OverseerStateUpdate-94330934880239621-127.0.0.1:55911_oehz%2Fdt-n_0000000000) [n:127.0.0.1:55911_oehz%2Fdt    ] o.a.s.c.o.ZkStateWriter going to create_collection /collections/collection1/state.json
   [junit4]   2> 746683 INFO  (zkCallback-732-thread-1-processing-n:127.0.0.1:55911_oehz%2Fdt) [n:127.0.0.1:55911_oehz%2Fdt    ] o.a.s.c.c.ZkStateReader A cluster state change: WatchedEvent state:SyncConnected type:NodeDataChanged path:/clusterstate.json, has occurred - updating... (live nodes size: 1)
   [junit4]   2> 746683 INFO  (zkCallback-739-thread-1-processing-n:127.0.0.1:45584_oehz%2Fdt) [n:127.0.0.1:45584_oehz%2Fdt    ] o.a.s.c.c.ZkStateReader A cluster state change: WatchedEvent state:SyncConnected type:NodeDataChanged path:/clusterstate.json, has occurred - updating... (live nodes size: 1)
   [junit4]   2> 746683 INFO  (zkCallback-734-thread-1) [    ] o.a.s.c.c.ZkStateReader A cluster state change: WatchedEvent state:SyncConnected type:NodeDataChanged path:/clusterstate.json, has occurred - updating... (live nodes size: 1)
   [junit4]   2> 747662 INFO  (TEST-CollectionsAPIDistributedZkTest.test-seed#[19A39875F969E4BB]) [n:127.0.0.1:45584_oehz%2Fdt    ] o.a.s.c.ZkController Register node as live in ZooKeeper:/live_nodes/127.0.0.1:45584_oehz%2Fdt
   [junit4]   2> 747662 INFO  (TEST-CollectionsAPIDistributedZkTest.test-seed#[19A39875F969E4BB]) [n:127.0.0.1:45584_oehz%2Fdt    ] o.a.s.c.c.SolrZkClient makePath: /live_nodes/127.0.0.1:45584_oehz%2Fdt
   [junit4]   2> 747663 INFO  (zkCallback-732-thread-1-processing-n:127.0.0.1:55911_oehz%2Fdt) [n:127.0.0.1:55911_oehz%2Fdt    ] o.a.s.c.c.ZkStateReader A live node change: WatchedEvent state:SyncConnected type:NodeChildrenChanged path:/live_nodes, has occurred - updating... (live nodes size: 1)
   [junit4]   2> 747663 INFO  (zkCallback-734-thread-1) [    ] o.a.s.c.c.ZkStateReader A live node change: WatchedEvent state:SyncConnected type:NodeChildrenChanged path:/live_nodes, has occurred - updating... (live nodes size: 1)
   [junit4]   2> 747663 INFO  (zkCallback-739-thread-1-processing-n:127.0.0.1:45584_oehz%2Fdt) [n:127.0.0.1:45584_oehz%2Fdt    ] o.a.s.c.c.ZkStateReader A live node change: WatchedEvent state:SyncConnected type:NodeChildrenChanged path:/live_nodes, has occurred - updating... (live nodes size: 1)
   [junit4]   2> 747663 INFO  (TEST-CollectionsAPIDistributedZkTest.test-seed#[19A39875F969E4BB]) [n:127.0.0.1:45584_oehz%2Fdt    ] o.a.s.c.Overseer Overseer (id=null) closing
   [junit4]   2> 747663 INFO  (TEST-CollectionsAPIDistributedZkTest.test-seed#[19A39875F969E4BB]) [n:127.0.0.1:45584_oehz%2Fdt    ] o.a.s.c.LeaderElector Joined leadership election with path: /overseer_elect/election/94330934880239626-127.0.0.1:45584_oehz%2Fdt-n_0000000001
   [junit4]   2> 747664 INFO  (TEST-CollectionsAPIDistributedZkTest.test-seed#[19A39875F969E4BB]) [n:127.0.0.1:45584_oehz%2Fdt    ] o.a.s.c.LeaderElector Watching path /overseer_elect/election/94330934880239621-127.0.0.1:55911_oehz%2Fdt-n_0000000000 to know if I could be the leader
   [junit4]   2> 747680 INFO  (TEST-CollectionsAPIDistributedZkTest.test-seed#[19A39875F969E4BB]) [n:127.0.0.1:45584_oehz%2Fdt    ] o.a.s.c.CoreContainer Security conf doesn't exist. Skipping setup for authorization module.
   [junit4]   2> 747680 INFO  (TEST-CollectionsAPIDistributedZkTest.test-seed#[19A39875F969E4BB]) [n:127.0.0.1:45584_oehz%2Fdt    ] o.a.s.c.CoreContainer No authentication plugin used.
   [junit4]   2> 747680 INFO  (TEST-CollectionsAPIDistributedZkTest.test-seed#[19A39875F969E4BB]) [n:127.0.0.1:45584_oehz%2Fdt    ] o.a.s.c.CoresLocator Looking for core definitions underneath /home/jenkins/workspace/Lucene-Solr-trunk-Linux/solr/build/solr-core/test/J1/../../../../../../../../../home/jenkins/workspace/Lucene-Solr-trunk-Linux/solr/build/solr-core/test/J1/temp/solr.cloud.CollectionsAPIDistributedZkTest_19A39875F969E4BB-001/shard-1-001/cores
   [junit4]   2> 747683 INFO  (TEST-CollectionsAPIDistributedZkTest.test-seed#[19A39875F969E4BB]) [n:127.0.0.1:45584_oehz%2Fdt    ] o.a.s.c.SolrCore Created CoreDescriptor: {name=collection1, config=solrconfig.xml, transient=false, schema=schema.xml, loadOnStartup=true, configSetProperties=configsetprops.json, instanceDir=/home/jenkins/workspace/Lucene-Solr-trunk-Linux/solr/build/solr-core/test/J1/../../../../../../../../../home/jenkins/workspace/Lucene-Solr-trunk-Linux/solr/build/solr-core/test/J1/temp/solr.cloud.CollectionsAPIDistributedZkTest_19A39875F969E4BB-001/shard-1-001/cores/collection1, collection=collection1, absoluteInstDir=/home/jenkins/workspace/Lucene-Solr-trunk-Linux/solr/build/solr-core/test/J1/../../../../../../../../../home/jenkins/workspace/Lucene-Solr-trunk-Linux/solr/build/solr-core/test/J1/temp/solr.cloud.CollectionsAPIDistributedZkTest_19A39875F969E4BB-001/shard-1-001/cores/collection1/, coreNodeName=, dataDir=data/, shard=}
   [junit4]   2> 747684 INFO  (TEST-CollectionsAPIDistributedZkTest.test-seed#[19A39875F969E4BB]) [n:127.0.0.1:45584_oehz%2Fdt    ] o.a.s.c.CoresLocator Found core collection1 in /home/jenkins/workspace/Lucene-Solr-trunk-Linux/solr/build/solr-core/test/J1/../../../../../../../../../home/jenkins/workspace/Lucene-Solr-trunk-Linux/solr/build/solr-core/test/J1/temp/solr.cloud.CollectionsAPIDistributedZkTest_19A39875F969E4BB-001/shard-1-001/cores/collection1/
   [junit4]   2> 747684 INFO  (TEST-CollectionsAPIDistributedZkTest.test-seed#[19A39875F969E4BB]) [n:127.0.0.1:45584_oehz%2Fdt    ] o.a.s.c.CoresLocator Found 1 core definitions
   [junit4]   2> 747684 INFO  (TEST-CollectionsAPIDistributedZkTest.test-seed#[19A39875F969E4BB]) [n:127.0.0.1:45584_oehz%2Fdt    ] o.a.s.s.SolrDispatchFilter user.dir=/home/jenkins/workspace/Lucene-Solr-trunk-Linux/solr/build/solr-core/test/J1
   [junit4]   2> 747684 INFO  (TEST-CollectionsAPIDistributedZkTest.test-seed#[19A39875F969E4BB]) [n:127.0.0.1:45584_oehz%2Fdt    ] o.a.s.s.SolrDispatchFilter SolrDispatchFilter.init() done
   [junit4]   2> 747685 INFO  (coreLoadExecutor-3010-thread-1-processing-n:127.0.0.1:45584_oehz%2Fdt) [n:127.0.0.1:45584_oehz%2Fdt c:collection1   x:collection1] o.a.s.c.ZkController publishing state=down
   [junit4]   2> 747685 INFO  (coreLoadExecutor-3010-thread-1-processing-n:127.0.0.1:45584_oehz%2Fdt) [n:127.0.0.1:45584_oehz%2Fdt c:collection1   x:collection1] o.a.s.c.ZkController numShards not found on descriptor - reading it from system property
   [junit4]   2> 747685 INFO  (zkCallback-732-thread-1-processing-n:127.0.0.1:55911_oehz%2Fdt) [n:127.0.0.1:55911_oehz%2Fdt    ] o.a.s.c.DistributedQueue NodeChildrenChanged fired on path /overseer/queue state SyncConnected
   [junit4]   2> 747685 INFO  (coreLoadExecutor-3010-thread-1-processing-n:127.0.0.1:45584_oehz%2Fdt) [n:127.0.0.1:45584_oehz%2Fdt c:collection1   x:collection1] o.a.s.c.ZkController Registering watch for collection collection1
   [junit4]   2> 747685 INFO  (coreLoadExecutor-3010-thread-1-processing-n:127.0.0.1:45584_oehz%2Fdt) [n:127.0.0.1:45584_oehz%2Fdt c:collection1   x:collection1] o.a.s.c.c.ZkStateReader addZkWatch collection1
   [junit4]   2> 747685 INFO  (OverseerStateUpdate-94330934880239621-127.0.0.1:55911_oehz%2Fdt-n_0000000000) [n:127.0.0.1:55911_oehz%2Fdt    ] o.a.s.c.Overseer processMessage: queueSize: 1, message = {
   [junit4]   2>   "core":"collection1",
   [junit4]   2>   "roles":null,
   [junit4]   2>   "base_url":"https://127.0.0.1:45584/oehz/dt",
   [junit4]   2>   "node_name":"127.0.0.1:45584_oehz%2Fdt",
   [junit4]   2>   "numShards":"2",
   [junit4]   2>   "state":"down",
   [junit4]   2>   "shard":null,
   [junit4]   2>   "collection":"collection1",
   [junit4]   2>   "operation":"state"} current state version: 4
   [junit4]   2> 747685 INFO  (coreLoadExecutor-3010-thread-1-processing-n:127.0.0.1:45584_oehz%2Fdt) [n:127.0.0.1:45584_oehz%2Fdt c:collection1   x:collection1] o.a.s.c.c.ZkStateReader Updating data for collection1 to ver 0 
   [junit4]   2> 747686 INFO  (coreLoadExecutor-3010-thread-1-processing-n:127.0.0.1:45584_oehz%2Fdt) [n:127.0.0.1:45584_oehz%2Fdt c:collection1   x:collection1] o.a.s.c.ZkController look for our core node name
   [junit4]   2> 747686 INFO  (OverseerStateUpdate-94330934880239621-127.0.0.1:55911_oehz%2Fdt-n_0000000000) [n:127.0.0.1:55911_oehz%2Fdt    ] o.a.s.c.o.ReplicaMutator Update state numShards=2 message={
   [junit4]   2>   "core":"collection1",
   [junit4]   2>   "roles":null,
   [junit4]   2>   "base_url":"https://127.0.0.1:45584/oehz/dt",
   [junit4]   2>   "node_name":"127.0.0.1:45584_oehz%2Fdt",
   [junit4]   2>   "numShards":"2",
   [junit4]   2>   "state":"down",
   [junit4]   2>   "shard":null,
   [junit4]   2>   "collection":"collection1",
   [junit4]   2>   "operation":"state"}
   [junit4]   2> 747686 INFO  (OverseerStateUpdate-94330934880239621-127.0.0.1:55911_oehz%2Fdt-n_0000000000) [n:127.0.0.1:55911_oehz%2Fdt    ] o.a.s.c.o.ReplicaMutator Collection already exists with numShards=2
   [junit4]   2> 747686 INFO  (OverseerStateUpdate-94330934880239621-127.0.0.1:55911_oehz%2Fdt-n_0000000000) [n:127.0.0.1:55911_oehz%2Fdt    ] o.a.s.c.o.ReplicaMutator Assigning new node to shard shard=shard2
   [junit4]   2> 747787 INFO  (OverseerStateUpdate-94330934880239621-127.0.0.1:55911_oehz%2Fdt-n_0000000000) [n:127.0.0.1:55911_oehz%2Fdt    ] o.a.s.c.o.ZkStateWriter going to update_collection /collections/collection1/state.json version: 0
   [junit4]   2> 747787 INFO  (zkCallback-739-thread-1-processing-n:127.0.0.1:45584_oehz%2Fdt) [n:127.0.0.1:45584_oehz%2Fdt    ] o.a.s.c.c.ZkStateReader A cluster state change: WatchedEvent state:SyncConnected type:NodeDataChanged path:/collections/collection1/state.json for collection collection1 has occurred - updating... (live nodes size: 2)
   [junit4]   2> 747787 INFO  (zkCallback-739-thread-1-processing-n:127.0.0.1:45584_oehz%2Fdt) [n:127.0.0.1:45584_oehz%2Fdt    ] o.a.s.c.c.ZkStateReader Updating data for collection1 to ver 1 
   [junit4]   2> 748686 INFO  (coreLoadExecutor-3010-thread-1-proces

[...truncated too long message...]

 871126 WARN  (zkCallback-771-thread-1-processing-n:127.0.0.1:53841_oehz%2Fdt) [n:127.0.0.1:53841_oehz%2Fdt    ] o.a.s.c.c.ZkStateReader ZooKeeper watch triggered, but Solr cannot talk to ZK
   [junit4]   2> 871131 INFO  (TEST-CollectionsAPIDistributedZkTest.test-seed#[19A39875F969E4BB]) [    ] o.e.j.s.ServerConnector Stopped ServerConnector@1a83202{SSL-http/1.1}{127.0.0.1:53841}
   [junit4]   2> 871131 INFO  (TEST-CollectionsAPIDistributedZkTest.test-seed#[19A39875F969E4BB]) [    ] o.e.j.s.h.ContextHandler Stopped o.e.j.s.ServletContextHandler@9eed33{/oehz/dt,null,UNAVAILABLE}
   [junit4]   2> 871132 INFO  (TEST-CollectionsAPIDistributedZkTest.test-seed#[19A39875F969E4BB]) [n:127.0.0.1:53841_oehz%2Fdt c:awholynewcollection_2 s:shard1 r:core_node4 x:awholynewcollection_2_shard1_replica1] o.a.s.c.ZkTestServer connecting to 127.0.0.1:38510 38510
   [junit4]   2> 871138 INFO  (Thread-2517) [n:127.0.0.1:53841_oehz%2Fdt c:awholynewcollection_0 s:shard4 r:core_node10 x:awholynewcollection_0_shard4_replica2] o.a.s.c.ZkTestServer connecting to 127.0.0.1:38510 38510
   [junit4]   2> 871139 WARN  (Thread-2517) [n:127.0.0.1:53841_oehz%2Fdt c:awholynewcollection_0 s:shard4 r:core_node10 x:awholynewcollection_0_shard4_replica2] o.a.s.c.ZkTestServer Watch limit violations: 
   [junit4]   2> Maximum concurrent create/delete watches above limit:
   [junit4]   2> 
   [junit4]   2> 	5	/solr/aliases.json
   [junit4]   2> 
   [junit4]   2> Maximum concurrent data watches above limit:
   [junit4]   2> 
   [junit4]   2> 	6	/solr/collections/collection1/state.json
   [junit4]   2> 	5	/solr/collections/halfdeletedcollection2/state.json
   [junit4]   2> 	5	/solr/collections/awholynewstresscollection_collection0_0/state.json
   [junit4]   2> 	5	/solr/collections/awholynewstresscollection_collection1_0/state.json
   [junit4]   2> 	5	/solr/clusterstate.json
   [junit4]   2> 	2	/solr/overseer_elect/election/94330934880239621-127.0.0.1:55911_oehz%2Fdt-n_0000000000
   [junit4]   2> 	2	/solr/collections/awholynewstresscollection_collection0_0/leader_elect/shard2/election/94330934880239640-core_node10-n_0000000000
   [junit4]   2> 	2	/solr/collections/awholynewstresscollection_collection0_0/leader_elect/shard7/election/94330934880239629-core_node7-n_0000000000
   [junit4]   2> 	2	/solr/collections/halfdeletedcollection/state.json
   [junit4]   2> 	2	/solr/collections/halfdeletedcollection2/leader_elect/shard1/election/94330934880239629-core_node2-n_0000000000
   [junit4]   2> 	2	/solr/collections/acollectionafterbaddelete/state.json
   [junit4]   2> 	2	/solr/collections/awholynewcollection_2/state.json
   [junit4]   2> 	2	/solr/collections/awholynewstresscollection_collection1_0/leader_elect/shard7/election/94330934880239640-core_node4-n_0000000000
   [junit4]   2> 
   [junit4]   2> Maximum concurrent children watches above limit:
   [junit4]   2> 
   [junit4]   2> 	5	/solr/live_nodes
   [junit4]   2> 
   [junit4]   2> NOTE: reproduce with: ant test  -Dtestcase=CollectionsAPIDistributedZkTest -Dtests.method=test -Dtests.seed=19A39875F969E4BB -Dtests.multiplier=3 -Dtests.slow=true -Dtests.locale=cs -Dtests.timezone=Pacific/Noumea -Dtests.asserts=true -Dtests.file.encoding=UTF-8
   [junit4] ERROR    126s J1 | CollectionsAPIDistributedZkTest.test <<<
   [junit4]    > Throwable #1: org.apache.solr.client.solrj.impl.HttpSolrClient$RemoteSolrException: Error from server at https://127.0.0.1:54005/oehz/dt: Could not fully remove collection: halfdeletedcollection2
   [junit4]    > 	at __randomizedtesting.SeedInfo.seed([19A39875F969E4BB:91F7A7AF57958943]:0)
   [junit4]    > 	at org.apache.solr.client.solrj.impl.HttpSolrClient.executeMethod(HttpSolrClient.java:560)
   [junit4]    > 	at org.apache.solr.client.solrj.impl.HttpSolrClient.request(HttpSolrClient.java:234)
   [junit4]    > 	at org.apache.solr.client.solrj.impl.HttpSolrClient.request(HttpSolrClient.java:226)
   [junit4]    > 	at org.apache.solr.client.solrj.SolrClient.request(SolrClient.java:1220)
   [junit4]    > 	at org.apache.solr.cloud.CollectionsAPIDistributedZkTest.makeRequest(CollectionsAPIDistributedZkTest.java:302)
   [junit4]    > 	at org.apache.solr.cloud.CollectionsAPIDistributedZkTest.deleteCollectionWithDownNodes(CollectionsAPIDistributedZkTest.java:283)
   [junit4]    > 	at org.apache.solr.cloud.CollectionsAPIDistributedZkTest.test(CollectionsAPIDistributedZkTest.java:175)
   [junit4]    > 	at org.apache.solr.BaseDistributedSearchTestCase$ShardsRepeatRule$ShardsFixedStatement.callStatement(BaseDistributedSearchTestCase.java:963)
   [junit4]    > 	at org.apache.solr.BaseDistributedSearchTestCase$ShardsRepeatRule$ShardsStatement.evaluate(BaseDistributedSearchTestCase.java:938)
   [junit4]    > 	at java.lang.Thread.run(Thread.java:745)
   [junit4]   2> 871152 INFO  (SUITE-CollectionsAPIDistributedZkTest-seed#[19A39875F969E4BB]-worker) [n:127.0.0.1:53841_oehz%2Fdt c:awholynewcollection_2 s:shard1 r:core_node4 x:awholynewcollection_2_shard1_replica1] o.a.s.SolrTestCaseJ4 ###deleteCore
   [junit4]   2> NOTE: leaving temporary files on disk at: /home/jenkins/workspace/Lucene-Solr-trunk-Linux/solr/build/solr-core/test/J1/temp/solr.cloud.CollectionsAPIDistributedZkTest_19A39875F969E4BB-001
   [junit4]   2> Aug 12, 2015 10:39:23 AM com.carrotsearch.randomizedtesting.ThreadLeakControl checkThreadLeaks
   [junit4]   2> WARNING: Will linger awaiting termination of 2 leaked thread(s).
   [junit4]   2> NOTE: test params are: codec=Asserting(Lucene53): {other_tl1=PostingsFormat(name=LuceneVarGapDocFreqInterval), range_facet_l_dv=PostingsFormat(name=Asserting), _version_=PostingsFormat(name=LuceneVarGapDocFreqInterval), multiDefault=PostingsFormat(name=Direct), a_t=PostingsFormat(name=LuceneVarGapDocFreqInterval), intDefault=PostingsFormat(name=LuceneVarGapDocFreqInterval), a_i1=PostingsFormat(name=LuceneVarGapDocFreqInterval), id=PostingsFormat(name=Asserting), range_facet_i_dv=PostingsFormat(name=LuceneVarGapDocFreqInterval), text=BlockTreeOrds(blocksize=128), range_facet_l=PostingsFormat(name=LuceneVarGapDocFreqInterval), timestamp=PostingsFormat(name=LuceneVarGapDocFreqInterval)}, docValues:{range_facet_l_dv=DocValuesFormat(name=Lucene50), range_facet_i_dv=DocValuesFormat(name=Direct), timestamp=DocValuesFormat(name=Direct)}, sim=RandomSimilarityProvider(queryNorm=false,coord=crazy): {}, locale=cs, timezone=Pacific/Noumea
   [junit4]   2> NOTE: Linux 3.16.0-44-generic i386/Oracle Corporation 1.8.0_51 (32-bit)/cpus=12,threads=1,free=176407072,total=493617152
   [junit4]   2> NOTE: All tests run in this JVM: [FieldAnalysisRequestHandlerTest, TestDistributedGrouping, ShardSplitTest, TestPivotHelperCode, ConvertedLegacyTest, NoCacheHeaderTest, TestWriterPerf, BadComponentTest, TestFastLRUCache, BitVectorTest, FileUtilsTest, TestCopyFieldCollectionResource, ClusterStateUpdateTest, TestDownShardTolerantSearch, TestDefaultStatsCache, TestFastWriter, EchoParamsTest, TestAtomicUpdateErrorCases, TestManagedSynonymFilterFactory, TestRTimerTree, CustomCollectionTest, TestSchemaResource, AsyncMigrateRouteKeyTest, DistanceFunctionTest, JSONWriterTest, HdfsBasicDistributedZk2Test, DeleteShardTest, TestCoreDiscovery, TestHighFrequencyDictionaryFactory, TestOmitPositions, RAMDirectoryFactoryTest, ReplicationFactorTest, TestReloadAndDeleteDocs, JsonLoaderTest, TestSolrXml, SolrPluginUtilsTest, DistributedFacetPivotWhiteBoxTest, CachingDirectoryFactoryTest, SpellPossibilityIteratorTest, TestFiltering, TestImplicitCoreProperties, TestJsonRequest, DistributedFacetPivotSmallTest, ConcurrentDeleteAndCreateCollectionTest, SliceStateTest, SmileWriterTest, OpenCloseCoreStressTest, LukeRequestHandlerTest, CdcrRequestHandlerTest, TestSortByMinMaxFunction, TestSolrCoreProperties, TestCollectionAPI, ShowFileRequestHandlerTest, TestAddFieldRealTimeGet, SolrXmlInZkTest, DistributedTermsComponentTest, TestManagedSchema, TestSuggestSpellingConverter, HLLUtilTest, TestLMDirichletSimilarityFactory, TestSchemaManager, BlockDirectoryTest, FacetPivotSmallTest, TestIntervalFaceting, TestSearchPerf, SegmentsInfoRequestHandlerTest, PreAnalyzedFieldTest, StatelessScriptUpdateProcessorFactoryTest, TestSolrConfigHandlerConcurrent, TestDocBasedVersionConstraints, AssignTest, OutOfBoxZkACLAndCredentialsProvidersTest, TestLMJelinekMercerSimilarityFactory, TestMissingGroups, DocValuesMultiTest, SystemInfoHandlerTest, TestRTGBase, OverseerRolesTest, TestInitQParser, TestAnalyzedSuggestions, MigrateRouteKeyTest, TestSimpleQParserPlugin, TestFieldCollectionResource, SuggesterTSTTest, SolrTestCaseJ4Test, AliasIntegrationTest, TestComponentsName, TestNRTOpen, DocumentAnalysisRequestHandlerTest, TestCharFilters, ChaosMonkeySafeLeaderTest, CollectionsAPIDistributedZkTest]
   [junit4] Completed [275/540] on J1 in 126.83s, 1 test, 1 error <<< FAILURES!

[...truncated 820 lines...]
BUILD FAILED
/home/jenkins/workspace/Lucene-Solr-trunk-Linux/build.xml:759: The following error occurred while executing this line:
/home/jenkins/workspace/Lucene-Solr-trunk-Linux/build.xml:703: The following error occurred while executing this line:
/home/jenkins/workspace/Lucene-Solr-trunk-Linux/build.xml:59: The following error occurred while executing this line:
/home/jenkins/workspace/Lucene-Solr-trunk-Linux/solr/build.xml:233: The following error occurred while executing this line:
/home/jenkins/workspace/Lucene-Solr-trunk-Linux/solr/common-build.xml:514: The following error occurred while executing this line:
/home/jenkins/workspace/Lucene-Solr-trunk-Linux/lucene/common-build.xml:1429: The following error occurred while executing this line:
/home/jenkins/workspace/Lucene-Solr-trunk-Linux/lucene/common-build.xml:984: There were test failures: 540 suites, 2128 tests, 1 error, 68 ignored (32 assumptions)

Total time: 46 minutes 38 seconds
Build step 'Invoke Ant' marked build as failure
Archiving artifacts
[WARNINGS] Skipping publisher since build result is FAILURE
Recording test results
Email was triggered for: Failure - Any
Sending email for trigger: Failure - Any



Mime
View raw message