lucene-dev mailing list archives

Site index · List index
Message view « Date » · « Thread »
Top « Date » · « Thread »
From Policeman Jenkins Server <jenk...@thetaphi.de>
Subject [JENKINS-EA] Lucene-Solr-trunk-Linux (64bit/jdk1.9.0-ea-b60) - Build # 13689 - Failure!
Date Sat, 01 Aug 2015 15:31:20 GMT
Build: http://jenkins.thetaphi.de/job/Lucene-Solr-trunk-Linux/13689/
Java: 64bit/jdk1.9.0-ea-b60 -XX:-UseCompressedOops -XX:+UseConcMarkSweepGC -Djava.locale.providers=JRE,SPI

1 tests failed.
FAILED:  org.apache.solr.cloud.ChaosMonkeySafeLeaderTest.test

Error Message:
expected:<0> but was:<1>

Stack Trace:
java.lang.AssertionError: expected:<0> but was:<1>
	at __randomizedtesting.SeedInfo.seed([20AFDC884E90DA3:8A5EC2122A15605B]:0)
	at org.junit.Assert.fail(Assert.java:93)
	at org.junit.Assert.failNotEquals(Assert.java:647)
	at org.junit.Assert.assertEquals(Assert.java:128)
	at org.junit.Assert.assertEquals(Assert.java:472)
	at org.junit.Assert.assertEquals(Assert.java:456)
	at org.apache.solr.cloud.ChaosMonkeySafeLeaderTest.test(ChaosMonkeySafeLeaderTest.java:156)
	at sun.reflect.NativeMethodAccessorImpl.invoke0(Native Method)
	at sun.reflect.NativeMethodAccessorImpl.invoke(NativeMethodAccessorImpl.java:62)
	at sun.reflect.DelegatingMethodAccessorImpl.invoke(DelegatingMethodAccessorImpl.java:43)
	at java.lang.reflect.Method.invoke(Method.java:502)
	at com.carrotsearch.randomizedtesting.RandomizedRunner.invoke(RandomizedRunner.java:1627)
	at com.carrotsearch.randomizedtesting.RandomizedRunner$6.evaluate(RandomizedRunner.java:836)
	at com.carrotsearch.randomizedtesting.RandomizedRunner$7.evaluate(RandomizedRunner.java:872)
	at com.carrotsearch.randomizedtesting.RandomizedRunner$8.evaluate(RandomizedRunner.java:886)
	at org.apache.solr.BaseDistributedSearchTestCase$ShardsRepeatRule$ShardsFixedStatement.callStatement(BaseDistributedSearchTestCase.java:966)
	at org.apache.solr.BaseDistributedSearchTestCase$ShardsRepeatRule$ShardsStatement.evaluate(BaseDistributedSearchTestCase.java:941)
	at com.carrotsearch.randomizedtesting.rules.SystemPropertiesRestoreRule$1.evaluate(SystemPropertiesRestoreRule.java:57)
	at org.apache.lucene.util.TestRuleSetupTeardownChained$1.evaluate(TestRuleSetupTeardownChained.java:50)
	at org.apache.lucene.util.AbstractBeforeAfterRule$1.evaluate(AbstractBeforeAfterRule.java:46)
	at org.apache.lucene.util.TestRuleThreadAndTestName$1.evaluate(TestRuleThreadAndTestName.java:49)
	at org.apache.lucene.util.TestRuleIgnoreAfterMaxFailures$1.evaluate(TestRuleIgnoreAfterMaxFailures.java:65)
	at org.apache.lucene.util.TestRuleMarkFailure$1.evaluate(TestRuleMarkFailure.java:48)
	at com.carrotsearch.randomizedtesting.rules.StatementAdapter.evaluate(StatementAdapter.java:36)
	at com.carrotsearch.randomizedtesting.ThreadLeakControl$StatementRunner.run(ThreadLeakControl.java:365)
	at com.carrotsearch.randomizedtesting.ThreadLeakControl.forkTimeoutingTask(ThreadLeakControl.java:798)
	at com.carrotsearch.randomizedtesting.ThreadLeakControl$3.evaluate(ThreadLeakControl.java:458)
	at com.carrotsearch.randomizedtesting.RandomizedRunner.runSingleTest(RandomizedRunner.java:845)
	at com.carrotsearch.randomizedtesting.RandomizedRunner$3.evaluate(RandomizedRunner.java:747)
	at com.carrotsearch.randomizedtesting.RandomizedRunner$4.evaluate(RandomizedRunner.java:781)
	at com.carrotsearch.randomizedtesting.RandomizedRunner$5.evaluate(RandomizedRunner.java:792)
	at com.carrotsearch.randomizedtesting.rules.StatementAdapter.evaluate(StatementAdapter.java:36)
	at com.carrotsearch.randomizedtesting.rules.SystemPropertiesRestoreRule$1.evaluate(SystemPropertiesRestoreRule.java:57)
	at org.apache.lucene.util.AbstractBeforeAfterRule$1.evaluate(AbstractBeforeAfterRule.java:46)
	at com.carrotsearch.randomizedtesting.rules.StatementAdapter.evaluate(StatementAdapter.java:36)
	at org.apache.lucene.util.TestRuleStoreClassName$1.evaluate(TestRuleStoreClassName.java:42)
	at com.carrotsearch.randomizedtesting.rules.NoShadowingOrOverridesOnMethodsRule$1.evaluate(NoShadowingOrOverridesOnMethodsRule.java:39)
	at com.carrotsearch.randomizedtesting.rules.NoShadowingOrOverridesOnMethodsRule$1.evaluate(NoShadowingOrOverridesOnMethodsRule.java:39)
	at com.carrotsearch.randomizedtesting.rules.StatementAdapter.evaluate(StatementAdapter.java:36)
	at com.carrotsearch.randomizedtesting.rules.StatementAdapter.evaluate(StatementAdapter.java:36)
	at com.carrotsearch.randomizedtesting.rules.StatementAdapter.evaluate(StatementAdapter.java:36)
	at org.apache.lucene.util.TestRuleAssertionsRequired$1.evaluate(TestRuleAssertionsRequired.java:54)
	at org.apache.lucene.util.TestRuleMarkFailure$1.evaluate(TestRuleMarkFailure.java:48)
	at org.apache.lucene.util.TestRuleIgnoreAfterMaxFailures$1.evaluate(TestRuleIgnoreAfterMaxFailures.java:65)
	at org.apache.lucene.util.TestRuleIgnoreTestSuites$1.evaluate(TestRuleIgnoreTestSuites.java:55)
	at com.carrotsearch.randomizedtesting.rules.StatementAdapter.evaluate(StatementAdapter.java:36)
	at com.carrotsearch.randomizedtesting.ThreadLeakControl$StatementRunner.run(ThreadLeakControl.java:365)
	at java.lang.Thread.run(Thread.java:745)




Build Log:
[...truncated 10271 lines...]
   [junit4] Suite: org.apache.solr.cloud.ChaosMonkeySafeLeaderTest
   [junit4]   2> Creating dataDir: /home/jenkins/workspace/Lucene-Solr-trunk-Linux/solr/build/solr-core/test/J2/temp/solr.cloud.ChaosMonkeySafeLeaderTest_20AFDC884E90DA3-001/init-core-data-001
   [junit4]   2> 564385 INFO  (SUITE-ChaosMonkeySafeLeaderTest-seed#[20AFDC884E90DA3]-worker) [    ] o.a.s.SolrTestCaseJ4 Randomized ssl (false) and clientAuth (false)
   [junit4]   2> 564385 INFO  (SUITE-ChaosMonkeySafeLeaderTest-seed#[20AFDC884E90DA3]-worker) [    ] o.a.s.BaseDistributedSearchTestCase Setting hostContext system property: /_vm/b
   [junit4]   2> 564387 INFO  (TEST-ChaosMonkeySafeLeaderTest.test-seed#[20AFDC884E90DA3]) [    ] o.a.s.c.ZkTestServer STARTING ZK TEST SERVER
   [junit4]   2> 564387 INFO  (Thread-1645) [    ] o.a.s.c.ZkTestServer client port:0.0.0.0/0.0.0.0:0
   [junit4]   2> 564387 INFO  (Thread-1645) [    ] o.a.s.c.ZkTestServer Starting server
   [junit4]   2> 564487 INFO  (TEST-ChaosMonkeySafeLeaderTest.test-seed#[20AFDC884E90DA3]) [    ] o.a.s.c.ZkTestServer start zk server on port:45106
   [junit4]   2> 564488 INFO  (TEST-ChaosMonkeySafeLeaderTest.test-seed#[20AFDC884E90DA3]) [    ] o.a.s.c.c.SolrZkClient Using default ZkCredentialsProvider
   [junit4]   2> 564488 INFO  (TEST-ChaosMonkeySafeLeaderTest.test-seed#[20AFDC884E90DA3]) [    ] o.a.s.c.c.ConnectionManager Waiting for client to connect to ZooKeeper
   [junit4]   2> 564490 INFO  (zkCallback-800-thread-1) [    ] o.a.s.c.c.ConnectionManager Watcher org.apache.solr.common.cloud.ConnectionManager@4b70e669 name:ZooKeeperConnection Watcher:127.0.0.1:45106 got event WatchedEvent state:SyncConnected type:None path:null path:null type:None
   [junit4]   2> 564490 INFO  (TEST-ChaosMonkeySafeLeaderTest.test-seed#[20AFDC884E90DA3]) [    ] o.a.s.c.c.ConnectionManager Client is connected to ZooKeeper
   [junit4]   2> 564490 INFO  (TEST-ChaosMonkeySafeLeaderTest.test-seed#[20AFDC884E90DA3]) [    ] o.a.s.c.c.SolrZkClient Using default ZkACLProvider
   [junit4]   2> 564490 INFO  (TEST-ChaosMonkeySafeLeaderTest.test-seed#[20AFDC884E90DA3]) [    ] o.a.s.c.c.SolrZkClient makePath: /solr
   [junit4]   2> 564491 INFO  (TEST-ChaosMonkeySafeLeaderTest.test-seed#[20AFDC884E90DA3]) [    ] o.a.s.c.c.SolrZkClient Using default ZkCredentialsProvider
   [junit4]   2> 564492 INFO  (TEST-ChaosMonkeySafeLeaderTest.test-seed#[20AFDC884E90DA3]) [    ] o.a.s.c.c.ConnectionManager Waiting for client to connect to ZooKeeper
   [junit4]   2> 564492 INFO  (zkCallback-801-thread-1) [    ] o.a.s.c.c.ConnectionManager Watcher org.apache.solr.common.cloud.ConnectionManager@4dd8bd80 name:ZooKeeperConnection Watcher:127.0.0.1:45106/solr got event WatchedEvent state:SyncConnected type:None path:null path:null type:None
   [junit4]   2> 564492 INFO  (TEST-ChaosMonkeySafeLeaderTest.test-seed#[20AFDC884E90DA3]) [    ] o.a.s.c.c.ConnectionManager Client is connected to ZooKeeper
   [junit4]   2> 564493 INFO  (TEST-ChaosMonkeySafeLeaderTest.test-seed#[20AFDC884E90DA3]) [    ] o.a.s.c.c.SolrZkClient Using default ZkACLProvider
   [junit4]   2> 564493 INFO  (TEST-ChaosMonkeySafeLeaderTest.test-seed#[20AFDC884E90DA3]) [    ] o.a.s.c.c.SolrZkClient makePath: /collections/collection1
   [junit4]   2> 564494 INFO  (TEST-ChaosMonkeySafeLeaderTest.test-seed#[20AFDC884E90DA3]) [    ] o.a.s.c.c.SolrZkClient makePath: /collections/collection1/shards
   [junit4]   2> 564494 INFO  (TEST-ChaosMonkeySafeLeaderTest.test-seed#[20AFDC884E90DA3]) [    ] o.a.s.c.c.SolrZkClient makePath: /collections/control_collection
   [junit4]   2> 564494 INFO  (TEST-ChaosMonkeySafeLeaderTest.test-seed#[20AFDC884E90DA3]) [    ] o.a.s.c.c.SolrZkClient makePath: /collections/control_collection/shards
   [junit4]   2> 564495 INFO  (TEST-ChaosMonkeySafeLeaderTest.test-seed#[20AFDC884E90DA3]) [    ] o.a.s.c.AbstractZkTestCase put /home/jenkins/workspace/Lucene-Solr-trunk-Linux/solr/core/src/test-files/solr/collection1/conf/solrconfig-tlog.xml to /configs/conf1/solrconfig.xml
   [junit4]   2> 564495 INFO  (TEST-ChaosMonkeySafeLeaderTest.test-seed#[20AFDC884E90DA3]) [    ] o.a.s.c.c.SolrZkClient makePath: /configs/conf1/solrconfig.xml
   [junit4]   2> 564496 INFO  (TEST-ChaosMonkeySafeLeaderTest.test-seed#[20AFDC884E90DA3]) [    ] o.a.s.c.AbstractZkTestCase put /home/jenkins/workspace/Lucene-Solr-trunk-Linux/solr/core/src/test-files/solr/collection1/conf/schema15.xml to /configs/conf1/schema.xml
   [junit4]   2> 564496 INFO  (TEST-ChaosMonkeySafeLeaderTest.test-seed#[20AFDC884E90DA3]) [    ] o.a.s.c.c.SolrZkClient makePath: /configs/conf1/schema.xml
   [junit4]   2> 564496 INFO  (TEST-ChaosMonkeySafeLeaderTest.test-seed#[20AFDC884E90DA3]) [    ] o.a.s.c.AbstractZkTestCase put /home/jenkins/workspace/Lucene-Solr-trunk-Linux/solr/core/src/test-files/solr/collection1/conf/solrconfig.snippet.randomindexconfig.xml to /configs/conf1/solrconfig.snippet.randomindexconfig.xml
   [junit4]   2> 564497 INFO  (TEST-ChaosMonkeySafeLeaderTest.test-seed#[20AFDC884E90DA3]) [    ] o.a.s.c.c.SolrZkClient makePath: /configs/conf1/solrconfig.snippet.randomindexconfig.xml
   [junit4]   2> 564497 INFO  (TEST-ChaosMonkeySafeLeaderTest.test-seed#[20AFDC884E90DA3]) [    ] o.a.s.c.AbstractZkTestCase put /home/jenkins/workspace/Lucene-Solr-trunk-Linux/solr/core/src/test-files/solr/collection1/conf/stopwords.txt to /configs/conf1/stopwords.txt
   [junit4]   2> 564497 INFO  (TEST-ChaosMonkeySafeLeaderTest.test-seed#[20AFDC884E90DA3]) [    ] o.a.s.c.c.SolrZkClient makePath: /configs/conf1/stopwords.txt
   [junit4]   2> 564498 INFO  (TEST-ChaosMonkeySafeLeaderTest.test-seed#[20AFDC884E90DA3]) [    ] o.a.s.c.AbstractZkTestCase put /home/jenkins/workspace/Lucene-Solr-trunk-Linux/solr/core/src/test-files/solr/collection1/conf/protwords.txt to /configs/conf1/protwords.txt
   [junit4]   2> 564498 INFO  (TEST-ChaosMonkeySafeLeaderTest.test-seed#[20AFDC884E90DA3]) [    ] o.a.s.c.c.SolrZkClient makePath: /configs/conf1/protwords.txt
   [junit4]   2> 564498 INFO  (TEST-ChaosMonkeySafeLeaderTest.test-seed#[20AFDC884E90DA3]) [    ] o.a.s.c.AbstractZkTestCase put /home/jenkins/workspace/Lucene-Solr-trunk-Linux/solr/core/src/test-files/solr/collection1/conf/currency.xml to /configs/conf1/currency.xml
   [junit4]   2> 564499 INFO  (TEST-ChaosMonkeySafeLeaderTest.test-seed#[20AFDC884E90DA3]) [    ] o.a.s.c.c.SolrZkClient makePath: /configs/conf1/currency.xml
   [junit4]   2> 564499 INFO  (TEST-ChaosMonkeySafeLeaderTest.test-seed#[20AFDC884E90DA3]) [    ] o.a.s.c.AbstractZkTestCase put /home/jenkins/workspace/Lucene-Solr-trunk-Linux/solr/core/src/test-files/solr/collection1/conf/enumsConfig.xml to /configs/conf1/enumsConfig.xml
   [junit4]   2> 564499 INFO  (TEST-ChaosMonkeySafeLeaderTest.test-seed#[20AFDC884E90DA3]) [    ] o.a.s.c.c.SolrZkClient makePath: /configs/conf1/enumsConfig.xml
   [junit4]   2> 564500 INFO  (TEST-ChaosMonkeySafeLeaderTest.test-seed#[20AFDC884E90DA3]) [    ] o.a.s.c.AbstractZkTestCase put /home/jenkins/workspace/Lucene-Solr-trunk-Linux/solr/core/src/test-files/solr/collection1/conf/open-exchange-rates.json to /configs/conf1/open-exchange-rates.json
   [junit4]   2> 564500 INFO  (TEST-ChaosMonkeySafeLeaderTest.test-seed#[20AFDC884E90DA3]) [    ] o.a.s.c.c.SolrZkClient makePath: /configs/conf1/open-exchange-rates.json
   [junit4]   2> 564500 INFO  (TEST-ChaosMonkeySafeLeaderTest.test-seed#[20AFDC884E90DA3]) [    ] o.a.s.c.AbstractZkTestCase put /home/jenkins/workspace/Lucene-Solr-trunk-Linux/solr/core/src/test-files/solr/collection1/conf/mapping-ISOLatin1Accent.txt to /configs/conf1/mapping-ISOLatin1Accent.txt
   [junit4]   2> 564500 INFO  (TEST-ChaosMonkeySafeLeaderTest.test-seed#[20AFDC884E90DA3]) [    ] o.a.s.c.c.SolrZkClient makePath: /configs/conf1/mapping-ISOLatin1Accent.txt
   [junit4]   2> 564501 INFO  (TEST-ChaosMonkeySafeLeaderTest.test-seed#[20AFDC884E90DA3]) [    ] o.a.s.c.AbstractZkTestCase put /home/jenkins/workspace/Lucene-Solr-trunk-Linux/solr/core/src/test-files/solr/collection1/conf/old_synonyms.txt to /configs/conf1/old_synonyms.txt
   [junit4]   2> 564501 INFO  (TEST-ChaosMonkeySafeLeaderTest.test-seed#[20AFDC884E90DA3]) [    ] o.a.s.c.c.SolrZkClient makePath: /configs/conf1/old_synonyms.txt
   [junit4]   2> 564501 INFO  (TEST-ChaosMonkeySafeLeaderTest.test-seed#[20AFDC884E90DA3]) [    ] o.a.s.c.AbstractZkTestCase put /home/jenkins/workspace/Lucene-Solr-trunk-Linux/solr/core/src/test-files/solr/collection1/conf/synonyms.txt to /configs/conf1/synonyms.txt
   [junit4]   2> 564501 INFO  (TEST-ChaosMonkeySafeLeaderTest.test-seed#[20AFDC884E90DA3]) [    ] o.a.s.c.c.SolrZkClient makePath: /configs/conf1/synonyms.txt
   [junit4]   2> 564542 INFO  (TEST-ChaosMonkeySafeLeaderTest.test-seed#[20AFDC884E90DA3]) [    ] o.a.s.SolrTestCaseJ4 Writing core.properties file to /home/jenkins/workspace/Lucene-Solr-trunk-Linux/solr/build/solr-core/test/J2/temp/solr.cloud.ChaosMonkeySafeLeaderTest_20AFDC884E90DA3-001/control-001/cores/collection1
   [junit4]   2> 564543 INFO  (TEST-ChaosMonkeySafeLeaderTest.test-seed#[20AFDC884E90DA3]) [    ] o.e.j.s.Server jetty-9.2.11.v20150529
   [junit4]   2> 564544 INFO  (TEST-ChaosMonkeySafeLeaderTest.test-seed#[20AFDC884E90DA3]) [    ] o.e.j.s.h.ContextHandler Started o.e.j.s.ServletContextHandler@2dfca521{/_vm/b,null,AVAILABLE}
   [junit4]   2> 564546 INFO  (TEST-ChaosMonkeySafeLeaderTest.test-seed#[20AFDC884E90DA3]) [    ] o.e.j.s.ServerConnector Started ServerConnector@28065e9f{HTTP/1.1}{127.0.0.1:58731}
   [junit4]   2> 564546 INFO  (TEST-ChaosMonkeySafeLeaderTest.test-seed#[20AFDC884E90DA3]) [    ] o.e.j.s.Server Started @566513ms
   [junit4]   2> 564546 INFO  (TEST-ChaosMonkeySafeLeaderTest.test-seed#[20AFDC884E90DA3]) [    ] o.a.s.c.s.e.JettySolrRunner Jetty properties: {solr.data.dir=/home/jenkins/workspace/Lucene-Solr-trunk-Linux/solr/build/solr-core/test/J2/temp/solr.cloud.ChaosMonkeySafeLeaderTest_20AFDC884E90DA3-001/tempDir-001/control/data, hostContext=/_vm/b, hostPort=58731, coreRootDirectory=/home/jenkins/workspace/Lucene-Solr-trunk-Linux/solr/build/solr-core/test/J2/../../../../../../../../../home/jenkins/workspace/Lucene-Solr-trunk-Linux/solr/build/solr-core/test/J2/temp/solr.cloud.ChaosMonkeySafeLeaderTest_20AFDC884E90DA3-001/control-001/cores}
   [junit4]   2> 564546 INFO  (TEST-ChaosMonkeySafeLeaderTest.test-seed#[20AFDC884E90DA3]) [    ] o.a.s.s.SolrDispatchFilter SolrDispatchFilter.init(): sun.misc.Launcher$AppClassLoader@45fe3ee3
   [junit4]   2> 564546 INFO  (TEST-ChaosMonkeySafeLeaderTest.test-seed#[20AFDC884E90DA3]) [    ] o.a.s.c.SolrResourceLoader new SolrResourceLoader for directory: '/home/jenkins/workspace/Lucene-Solr-trunk-Linux/solr/build/solr-core/test/J2/../../../../../../../../../home/jenkins/workspace/Lucene-Solr-trunk-Linux/solr/build/solr-core/test/J2/temp/solr.cloud.ChaosMonkeySafeLeaderTest_20AFDC884E90DA3-001/control-001/'
   [junit4]   2> 564554 INFO  (TEST-ChaosMonkeySafeLeaderTest.test-seed#[20AFDC884E90DA3]) [    ] o.a.s.c.c.SolrZkClient Using default ZkCredentialsProvider
   [junit4]   2> 564554 INFO  (TEST-ChaosMonkeySafeLeaderTest.test-seed#[20AFDC884E90DA3]) [    ] o.a.s.c.c.ConnectionManager Waiting for client to connect to ZooKeeper
   [junit4]   2> 564555 INFO  (zkCallback-802-thread-1) [    ] o.a.s.c.c.ConnectionManager Watcher org.apache.solr.common.cloud.ConnectionManager@221c9ea5 name:ZooKeeperConnection Watcher:127.0.0.1:45106/solr got event WatchedEvent state:SyncConnected type:None path:null path:null type:None
   [junit4]   2> 564555 INFO  (TEST-ChaosMonkeySafeLeaderTest.test-seed#[20AFDC884E90DA3]) [    ] o.a.s.c.c.ConnectionManager Client is connected to ZooKeeper
   [junit4]   2> 564555 INFO  (TEST-ChaosMonkeySafeLeaderTest.test-seed#[20AFDC884E90DA3]) [    ] o.a.s.c.c.SolrZkClient Using default ZkACLProvider
   [junit4]   2> 564555 INFO  (TEST-ChaosMonkeySafeLeaderTest.test-seed#[20AFDC884E90DA3]) [    ] o.a.s.s.SolrDispatchFilter Loading solr.xml from SolrHome (not found in ZooKeeper)
   [junit4]   2> 564556 INFO  (TEST-ChaosMonkeySafeLeaderTest.test-seed#[20AFDC884E90DA3]) [    ] o.a.s.c.SolrXmlConfig Loading container configuration from /home/jenkins/workspace/Lucene-Solr-trunk-Linux/solr/build/solr-core/test/J2/../../../../../../../../../home/jenkins/workspace/Lucene-Solr-trunk-Linux/solr/build/solr-core/test/J2/temp/solr.cloud.ChaosMonkeySafeLeaderTest_20AFDC884E90DA3-001/control-001/solr.xml
   [junit4]   2> 564558 INFO  (TEST-ChaosMonkeySafeLeaderTest.test-seed#[20AFDC884E90DA3]) [    ] o.a.s.c.CoresLocator Config-defined core root directory: /home/jenkins/workspace/Lucene-Solr-trunk-Linux/solr/build/solr-core/test/J2/../../../../../../../../../home/jenkins/workspace/Lucene-Solr-trunk-Linux/solr/build/solr-core/test/J2/temp/solr.cloud.ChaosMonkeySafeLeaderTest_20AFDC884E90DA3-001/control-001/cores
   [junit4]   2> 564559 INFO  (TEST-ChaosMonkeySafeLeaderTest.test-seed#[20AFDC884E90DA3]) [    ] o.a.s.c.CoreContainer New CoreContainer 994384621
   [junit4]   2> 564559 INFO  (TEST-ChaosMonkeySafeLeaderTest.test-seed#[20AFDC884E90DA3]) [    ] o.a.s.c.CoreContainer Loading cores into CoreContainer [instanceDir=/home/jenkins/workspace/Lucene-Solr-trunk-Linux/solr/build/solr-core/test/J2/../../../../../../../../../home/jenkins/workspace/Lucene-Solr-trunk-Linux/solr/build/solr-core/test/J2/temp/solr.cloud.ChaosMonkeySafeLeaderTest_20AFDC884E90DA3-001/control-001/]
   [junit4]   2> 564559 INFO  (TEST-ChaosMonkeySafeLeaderTest.test-seed#[20AFDC884E90DA3]) [    ] o.a.s.c.CoreContainer loading shared library: /home/jenkins/workspace/Lucene-Solr-trunk-Linux/solr/build/solr-core/test/J2/../../../../../../../../../home/jenkins/workspace/Lucene-Solr-trunk-Linux/solr/build/solr-core/test/J2/temp/solr.cloud.ChaosMonkeySafeLeaderTest_20AFDC884E90DA3-001/control-001/lib
   [junit4]   2> 564559 WARN  (TEST-ChaosMonkeySafeLeaderTest.test-seed#[20AFDC884E90DA3]) [    ] o.a.s.c.SolrResourceLoader Can't find (or read) directory to add to classloader: lib (resolved as: /home/jenkins/workspace/Lucene-Solr-trunk-Linux/solr/build/solr-core/test/J2/../../../../../../../../../home/jenkins/workspace/Lucene-Solr-trunk-Linux/solr/build/solr-core/test/J2/temp/solr.cloud.ChaosMonkeySafeLeaderTest_20AFDC884E90DA3-001/control-001/lib).
   [junit4]   2> 564562 INFO  (TEST-ChaosMonkeySafeLeaderTest.test-seed#[20AFDC884E90DA3]) [    ] o.a.s.h.c.HttpShardHandlerFactory created with socketTimeout : 90000,urlScheme : ,connTimeout : 15000,maxConnectionsPerHost : 20,maxConnections : 10000,corePoolSize : 0,maximumPoolSize : 2147483647,maxThreadIdleTime : 5,sizeOfQueue : -1,fairnessPolicy : false,useRetries : false,
   [junit4]   2> 564563 INFO  (TEST-ChaosMonkeySafeLeaderTest.test-seed#[20AFDC884E90DA3]) [    ] o.a.s.u.UpdateShardHandler Creating UpdateShardHandler HTTP client with params: socketTimeout=340000&connTimeout=45000&retry=true
   [junit4]   2> 564563 INFO  (TEST-ChaosMonkeySafeLeaderTest.test-seed#[20AFDC884E90DA3]) [    ] o.a.s.l.LogWatcher SLF4J impl is org.slf4j.impl.Log4jLoggerFactory
   [junit4]   2> 564564 INFO  (TEST-ChaosMonkeySafeLeaderTest.test-seed#[20AFDC884E90DA3]) [    ] o.a.s.l.LogWatcher Registering Log Listener [Log4j (org.slf4j.impl.Log4jLoggerFactory)]
   [junit4]   2> 564564 INFO  (TEST-ChaosMonkeySafeLeaderTest.test-seed#[20AFDC884E90DA3]) [    ] o.a.s.c.ZkContainer Zookeeper client=127.0.0.1:45106/solr
   [junit4]   2> 564564 INFO  (TEST-ChaosMonkeySafeLeaderTest.test-seed#[20AFDC884E90DA3]) [    ] o.a.s.c.ZkController zkHost includes chroot
   [junit4]   2> 564564 INFO  (TEST-ChaosMonkeySafeLeaderTest.test-seed#[20AFDC884E90DA3]) [    ] o.a.s.c.c.SolrZkClient Using default ZkCredentialsProvider
   [junit4]   2> 564564 INFO  (TEST-ChaosMonkeySafeLeaderTest.test-seed#[20AFDC884E90DA3]) [    ] o.a.s.c.c.ConnectionManager Waiting for client to connect to ZooKeeper
   [junit4]   2> 564565 INFO  (zkCallback-804-thread-1) [    ] o.a.s.c.c.ConnectionManager Watcher org.apache.solr.common.cloud.ConnectionManager@27773213 name:ZooKeeperConnection Watcher:127.0.0.1:45106 got event WatchedEvent state:SyncConnected type:None path:null path:null type:None
   [junit4]   2> 564565 INFO  (TEST-ChaosMonkeySafeLeaderTest.test-seed#[20AFDC884E90DA3]) [    ] o.a.s.c.c.ConnectionManager Client is connected to ZooKeeper
   [junit4]   2> 564565 INFO  (TEST-ChaosMonkeySafeLeaderTest.test-seed#[20AFDC884E90DA3]) [    ] o.a.s.c.c.SolrZkClient Using default ZkACLProvider
   [junit4]   2> 564566 INFO  (TEST-ChaosMonkeySafeLeaderTest.test-seed#[20AFDC884E90DA3]) [n:127.0.0.1:58731__vm%2Fb    ] o.a.s.c.c.ConnectionManager Waiting for client to connect to ZooKeeper
   [junit4]   2> 564566 INFO  (zkCallback-805-thread-1-processing-n:127.0.0.1:58731__vm%2Fb) [n:127.0.0.1:58731__vm%2Fb    ] o.a.s.c.c.ConnectionManager Watcher org.apache.solr.common.cloud.ConnectionManager@b6d7809 name:ZooKeeperConnection Watcher:127.0.0.1:45106/solr got event WatchedEvent state:SyncConnected type:None path:null path:null type:None
   [junit4]   2> 564566 INFO  (TEST-ChaosMonkeySafeLeaderTest.test-seed#[20AFDC884E90DA3]) [n:127.0.0.1:58731__vm%2Fb    ] o.a.s.c.c.ConnectionManager Client is connected to ZooKeeper
   [junit4]   2> 564567 INFO  (TEST-ChaosMonkeySafeLeaderTest.test-seed#[20AFDC884E90DA3]) [n:127.0.0.1:58731__vm%2Fb    ] o.a.s.c.c.SolrZkClient makePath: /overseer/queue
   [junit4]   2> 564567 INFO  (TEST-ChaosMonkeySafeLeaderTest.test-seed#[20AFDC884E90DA3]) [n:127.0.0.1:58731__vm%2Fb    ] o.a.s.c.c.SolrZkClient makePath: /overseer/collection-queue-work
   [junit4]   2> 564568 INFO  (TEST-ChaosMonkeySafeLeaderTest.test-seed#[20AFDC884E90DA3]) [n:127.0.0.1:58731__vm%2Fb    ] o.a.s.c.c.SolrZkClient makePath: /overseer/collection-map-running
   [junit4]   2> 564568 INFO  (TEST-ChaosMonkeySafeLeaderTest.test-seed#[20AFDC884E90DA3]) [n:127.0.0.1:58731__vm%2Fb    ] o.a.s.c.c.SolrZkClient makePath: /overseer/collection-map-completed
   [junit4]   2> 564569 INFO  (TEST-ChaosMonkeySafeLeaderTest.test-seed#[20AFDC884E90DA3]) [n:127.0.0.1:58731__vm%2Fb    ] o.a.s.c.c.SolrZkClient makePath: /overseer/collection-map-failure
   [junit4]   2> 564570 INFO  (TEST-ChaosMonkeySafeLeaderTest.test-seed#[20AFDC884E90DA3]) [n:127.0.0.1:58731__vm%2Fb    ] o.a.s.c.c.SolrZkClient makePath: /live_nodes
   [junit4]   2> 564570 INFO  (TEST-ChaosMonkeySafeLeaderTest.test-seed#[20AFDC884E90DA3]) [n:127.0.0.1:58731__vm%2Fb    ] o.a.s.c.c.SolrZkClient makePath: /aliases.json
   [junit4]   2> 564570 INFO  (TEST-ChaosMonkeySafeLeaderTest.test-seed#[20AFDC884E90DA3]) [n:127.0.0.1:58731__vm%2Fb    ] o.a.s.c.c.SolrZkClient makePath: /clusterstate.json
   [junit4]   2> 564571 INFO  (TEST-ChaosMonkeySafeLeaderTest.test-seed#[20AFDC884E90DA3]) [n:127.0.0.1:58731__vm%2Fb    ] o.a.s.c.ZkController Register node as live in ZooKeeper:/live_nodes/127.0.0.1:58731__vm%2Fb
   [junit4]   2> 564571 INFO  (TEST-ChaosMonkeySafeLeaderTest.test-seed#[20AFDC884E90DA3]) [n:127.0.0.1:58731__vm%2Fb    ] o.a.s.c.c.SolrZkClient makePath: /live_nodes/127.0.0.1:58731__vm%2Fb
   [junit4]   2> 564571 INFO  (TEST-ChaosMonkeySafeLeaderTest.test-seed#[20AFDC884E90DA3]) [n:127.0.0.1:58731__vm%2Fb    ] o.a.s.c.c.SolrZkClient makePath: /overseer_elect
   [junit4]   2> 564572 INFO  (TEST-ChaosMonkeySafeLeaderTest.test-seed#[20AFDC884E90DA3]) [n:127.0.0.1:58731__vm%2Fb    ] o.a.s.c.c.SolrZkClient makePath: /overseer_elect/election
   [junit4]   2> 564572 INFO  (TEST-ChaosMonkeySafeLeaderTest.test-seed#[20AFDC884E90DA3]) [n:127.0.0.1:58731__vm%2Fb    ] o.a.s.c.Overseer Overseer (id=null) closing
   [junit4]   2> 564572 INFO  (TEST-ChaosMonkeySafeLeaderTest.test-seed#[20AFDC884E90DA3]) [n:127.0.0.1:58731__vm%2Fb    ] o.a.s.c.LeaderElector Joined leadership election with path: /overseer_elect/election/94269729132314628-127.0.0.1:58731__vm%2Fb-n_0000000000
   [junit4]   2> 564573 INFO  (TEST-ChaosMonkeySafeLeaderTest.test-seed#[20AFDC884E90DA3]) [n:127.0.0.1:58731__vm%2Fb    ] o.a.s.c.OverseerElectionContext I am going to be the leader 127.0.0.1:58731__vm%2Fb
   [junit4]   2> 564573 INFO  (TEST-ChaosMonkeySafeLeaderTest.test-seed#[20AFDC884E90DA3]) [n:127.0.0.1:58731__vm%2Fb    ] o.a.s.c.c.SolrZkClient makePath: /overseer_elect/leader
   [junit4]   2> 564573 INFO  (TEST-ChaosMonkeySafeLeaderTest.test-seed#[20AFDC884E90DA3]) [n:127.0.0.1:58731__vm%2Fb    ] o.a.s.c.Overseer Overseer (id=94269729132314628-127.0.0.1:58731__vm%2Fb-n_0000000000) starting
   [junit4]   2> 564574 INFO  (TEST-ChaosMonkeySafeLeaderTest.test-seed#[20AFDC884E90DA3]) [n:127.0.0.1:58731__vm%2Fb    ] o.a.s.c.c.SolrZkClient makePath: /overseer/queue-work
   [junit4]   2> 564575 INFO  (TEST-ChaosMonkeySafeLeaderTest.test-seed#[20AFDC884E90DA3]) [n:127.0.0.1:58731__vm%2Fb    ] o.a.s.c.OverseerAutoReplicaFailoverThread Starting OverseerAutoReplicaFailoverThread autoReplicaFailoverWorkLoopDelay=10000 autoReplicaFailoverWaitAfterExpiration=30000 autoReplicaFailoverBadNodeExpiration=60000
   [junit4]   2> 564575 INFO  (TEST-ChaosMonkeySafeLeaderTest.test-seed#[20AFDC884E90DA3]) [n:127.0.0.1:58731__vm%2Fb    ] o.a.s.c.c.ZkStateReader Updating cluster state from ZooKeeper... 
   [junit4]   2> 564575 INFO  (OverseerCollectionProcessor-94269729132314628-127.0.0.1:58731__vm%2Fb-n_0000000000) [n:127.0.0.1:58731__vm%2Fb    ] o.a.s.c.OverseerCollectionProcessor Process current queue of collection creations
   [junit4]   2> 564576 INFO  (OverseerStateUpdate-94269729132314628-127.0.0.1:58731__vm%2Fb-n_0000000000) [n:127.0.0.1:58731__vm%2Fb    ] o.a.s.c.Overseer Starting to work on the main queue
   [junit4]   2> 564576 INFO  (TEST-ChaosMonkeySafeLeaderTest.test-seed#[20AFDC884E90DA3]) [n:127.0.0.1:58731__vm%2Fb    ] o.a.s.c.CoreContainer No authentication plugin used.
   [junit4]   2> 564576 INFO  (TEST-ChaosMonkeySafeLeaderTest.test-seed#[20AFDC884E90DA3]) [n:127.0.0.1:58731__vm%2Fb    ] o.a.s.c.CoreContainer Security conf doesn't exist. Skipping setup for authorization module.
   [junit4]   2> 564577 INFO  (TEST-ChaosMonkeySafeLeaderTest.test-seed#[20AFDC884E90DA3]) [n:127.0.0.1:58731__vm%2Fb    ] o.a.s.c.CoresLocator Looking for core definitions underneath /home/jenkins/workspace/Lucene-Solr-trunk-Linux/solr/build/solr-core/test/J2/../../../../../../../../../home/jenkins/workspace/Lucene-Solr-trunk-Linux/solr/build/solr-core/test/J2/temp/solr.cloud.ChaosMonkeySafeLeaderTest_20AFDC884E90DA3-001/control-001/cores
   [junit4]   2> 564578 INFO  (TEST-ChaosMonkeySafeLeaderTest.test-seed#[20AFDC884E90DA3]) [n:127.0.0.1:58731__vm%2Fb    ] o.a.s.c.SolrCore Created CoreDescriptor: {name=collection1, config=solrconfig.xml, transient=false, schema=schema.xml, loadOnStartup=true, configSetProperties=configsetprops.json, instanceDir=/home/jenkins/workspace/Lucene-Solr-trunk-Linux/solr/build/solr-core/test/J2/../../../../../../../../../home/jenkins/workspace/Lucene-Solr-trunk-Linux/solr/build/solr-core/test/J2/temp/solr.cloud.ChaosMonkeySafeLeaderTest_20AFDC884E90DA3-001/control-001/cores/collection1, collection=control_collection, absoluteInstDir=/home/jenkins/workspace/Lucene-Solr-trunk-Linux/solr/build/solr-core/test/J2/../../../../../../../../../home/jenkins/workspace/Lucene-Solr-trunk-Linux/solr/build/solr-core/test/J2/temp/solr.cloud.ChaosMonkeySafeLeaderTest_20AFDC884E90DA3-001/control-001/cores/collection1/, coreNodeName=, dataDir=data/, shard=}
   [junit4]   2> 564578 INFO  (TEST-ChaosMonkeySafeLeaderTest.test-seed#[20AFDC884E90DA3]) [n:127.0.0.1:58731__vm%2Fb    ] o.a.s.c.CoresLocator Found core collection1 in /home/jenkins/workspace/Lucene-Solr-trunk-Linux/solr/build/solr-core/test/J2/../../../../../../../../../home/jenkins/workspace/Lucene-Solr-trunk-Linux/solr/build/solr-core/test/J2/temp/solr.cloud.ChaosMonkeySafeLeaderTest_20AFDC884E90DA3-001/control-001/cores/collection1/
   [junit4]   2> 564578 INFO  (TEST-ChaosMonkeySafeLeaderTest.test-seed#[20AFDC884E90DA3]) [n:127.0.0.1:58731__vm%2Fb    ] o.a.s.c.CoresLocator Found 1 core definitions
   [junit4]   2> 564578 INFO  (coreLoadExecutor-2222-thread-1-processing-n:127.0.0.1:58731__vm%2Fb) [n:127.0.0.1:58731__vm%2Fb c:control_collection   x:collection1] o.a.s.c.ZkController publishing state=down
   [junit4]   2> 564578 INFO  (coreLoadExecutor-2222-thread-1-processing-n:127.0.0.1:58731__vm%2Fb) [n:127.0.0.1:58731__vm%2Fb c:control_collection   x:collection1] o.a.s.c.ZkController numShards not found on descriptor - reading it from system property
   [junit4]   2> 564578 INFO  (TEST-ChaosMonkeySafeLeaderTest.test-seed#[20AFDC884E90DA3]) [n:127.0.0.1:58731__vm%2Fb    ] o.a.s.s.SolrDispatchFilter user.dir=/home/jenkins/workspace/Lucene-Solr-trunk-Linux/solr/build/solr-core/test/J2
   [junit4]   2> 564578 INFO  (TEST-ChaosMonkeySafeLeaderTest.test-seed#[20AFDC884E90DA3]) [n:127.0.0.1:58731__vm%2Fb    ] o.a.s.s.SolrDispatchFilter SolrDispatchFilter.init() done
   [junit4]   2> 564578 INFO  (coreLoadExecutor-2222-thread-1-processing-n:127.0.0.1:58731__vm%2Fb) [n:127.0.0.1:58731__vm%2Fb c:control_collection   x:collection1] o.a.s.c.ZkController look for our core node name
   [junit4]   2> 564578 INFO  (zkCallback-805-thread-1-processing-n:127.0.0.1:58731__vm%2Fb) [n:127.0.0.1:58731__vm%2Fb    ] o.a.s.c.DistributedQueue NodeChildrenChanged fired on path /overseer/queue state SyncConnected
   [junit4]   2> 564579 INFO  (OverseerStateUpdate-94269729132314628-127.0.0.1:58731__vm%2Fb-n_0000000000) [n:127.0.0.1:58731__vm%2Fb    ] o.a.s.c.Overseer processMessage: queueSize: 1, message = {
   [junit4]   2>   "core":"collection1",
   [junit4]   2>   "roles":null,
   [junit4]   2>   "base_url":"http://127.0.0.1:58731/_vm/b",
   [junit4]   2>   "node_name":"127.0.0.1:58731__vm%2Fb",
   [junit4]   2>   "numShards":"1",
   [junit4]   2>   "state":"down",
   [junit4]   2>   "shard":null,
   [junit4]   2>   "collection":"control_collection",
   [junit4]   2>   "operation":"state"} current state version: 0
   [junit4]   2> 564579 INFO  (OverseerStateUpdate-94269729132314628-127.0.0.1:58731__vm%2Fb-n_0000000000) [n:127.0.0.1:58731__vm%2Fb    ] o.a.s.c.o.ReplicaMutator Update state numShards=1 message={
   [junit4]   2>   "core":"collection1",
   [junit4]   2>   "roles":null,
   [junit4]   2>   "base_url":"http://127.0.0.1:58731/_vm/b",
   [junit4]   2>   "node_name":"127.0.0.1:58731__vm%2Fb",
   [junit4]   2>   "numShards":"1",
   [junit4]   2>   "state":"down",
   [junit4]   2>   "shard":null,
   [junit4]   2>   "collection":"control_collection",
   [junit4]   2>   "operation":"state"}
   [junit4]   2> 564579 INFO  (OverseerStateUpdate-94269729132314628-127.0.0.1:58731__vm%2Fb-n_0000000000) [n:127.0.0.1:58731__vm%2Fb    ] o.a.s.c.o.ClusterStateMutator building a new cName: control_collection
   [junit4]   2> 564579 INFO  (OverseerStateUpdate-94269729132314628-127.0.0.1:58731__vm%2Fb-n_0000000000) [n:127.0.0.1:58731__vm%2Fb    ] o.a.s.c.o.ReplicaMutator Assigning new node to shard shard=shard1
   [junit4]   2> 564580 INFO  (zkCallback-805-thread-1-processing-n:127.0.0.1:58731__vm%2Fb) [n:127.0.0.1:58731__vm%2Fb    ] o.a.s.c.c.ZkStateReader A cluster state change: WatchedEvent state:SyncConnected type:NodeDataChanged path:/clusterstate.json, has occurred - updating... (live nodes size: 1)
   [junit4]   2> 564580 INFO  (zkCallback-805-thread-1-processing-n:127.0.0.1:58731__vm%2Fb) [n:127.0.0.1:58731__vm%2Fb    ] o.a.s.c.c.ZkStateReader Updated cluster state version to 1
   [junit4]   2> 565579 INFO  (coreLoadExecutor-2222-thread-1-processing-n:127.0.0.1:58731__vm%2Fb) [n:127.0.0.1:58731__vm%2Fb c:control_collection   x:collection1] o.a.s.c.ZkController waiting to find shard id in clusterstate for collection1
   [junit4]   2> 565579 INFO  (coreLoadExecutor-2222-thread-1-processing-n:127.0.0.1:58731__vm%2Fb) [n:127.0.0.1:58731__vm%2Fb c:control_collection   x:collection1] o.a.s.c.ZkController Check for collection zkNode:control_collection
   [junit4]   2> 565579 INFO  (coreLoadExecutor-2222-thread-1-processing-n:127.0.0.1:58731__vm%2Fb) [n:127.0.0.1:58731__vm%2Fb c:control_collection   x:collection1] o.a.s.c.ZkController Collection zkNode exists
   [junit4]   2> 565579 INFO  (coreLoadExecutor-2222-thread-1-processing-n:127.0.0.1:58731__vm%2Fb) [n:127.0.0.1:58731__vm%2Fb c:control_collection   x:collection1] o.a.s.c.c.ZkStateReader Load collection config from:/collections/control_collection
   [junit4]   2> 565579 INFO  (coreLoadExecutor-2222-thread-1-processing-n:127.0.0.1:58731__vm%2Fb) [n:127.0.0.1:58731__vm%2Fb c:control_collection   x:collection1] o.a.s.c.c.ZkStateReader path=/collections/control_collection configName=conf1 specified config exists in ZooKeeper
   [junit4]   2> 565580 INFO  (coreLoadExecutor-2222-thread-1-processing-n:127.0.0.1:58731__vm%2Fb) [n:127.0.0.1:58731__vm%2Fb c:control_collection   x:collection1] o.a.s.c.SolrResourceLoader new SolrResourceLoader for directory: '/home/jenkins/workspace/Lucene-Solr-trunk-Linux/solr/build/solr-core/test/J2/../../../../../../../../../home/jenkins/workspace/Lucene-Solr-trunk-Linux/solr/build/solr-core/test/J2/temp/solr.cloud.ChaosMonkeySafeLeaderTest_20AFDC884E90DA3-001/control-001/cores/collection1/'
   [junit4]   2> 565585 INFO  (coreLoadExecutor-2222-thread-1-processing-n:127.0.0.1:58731__vm%2Fb) [n:127.0.0.1:58731__vm%2Fb c:control_collection   x:collection1] o.a.s.c.Config loaded config solrconfig.xml with version 0 
   [junit4]   2> 565588 INFO  (coreLoadExecutor-2222-thread-1-processing-n:127.0.0.1:58731__vm%2Fb) [n:127.0.0.1:58731__vm%2Fb c:control_collection   x:collection1] o.a.s.c.SolrConfig current version of requestparams : -1
   [junit4]   2> 565595 INFO  (coreLoadExecutor-2222-thread-1-processing-n:127.0.0.1:58731__vm%2Fb) [n:127.0.0.1:58731__vm%2Fb c:control_collection   x:collection1] o.a.s.c.SolrConfig Using Lucene MatchVersion: 6.0.0
   [junit4]   2> 565601 INFO  (coreLoadExecutor-2222-thread-1-processing-n:127.0.0.1:58731__vm%2Fb) [n:127.0.0.1:58731__vm%2Fb c:control_collection   x:collection1] o.a.s.c.Config Loaded SolrConfig: solrconfig.xml
   [junit4]   2> 565601 INFO  (coreLoadExecutor-2222-thread-1-processing-n:127.0.0.1:58731__vm%2Fb) [n:127.0.0.1:58731__vm%2Fb c:control_collection   x:collection1] o.a.s.s.IndexSchema Reading Solr Schema from /configs/conf1/schema.xml
   [junit4]   2> 565604 INFO  (coreLoadExecutor-2222-thread-1-processing-n:127.0.0.1:58731__vm%2Fb) [n:127.0.0.1:58731__vm%2Fb c:control_collection   x:collection1] o.a.s.s.IndexSchema [collection1] Schema name=test
   [junit4]   2> 565659 INFO  (coreLoadExecutor-2222-thread-1-processing-n:127.0.0.1:58731__vm%2Fb) [n:127.0.0.1:58731__vm%2Fb c:control_collection   x:collection1] o.a.s.s.IndexSchema default search field in schema is text
   [junit4]   2> 565660 INFO  (coreLoadExecutor-2222-thread-1-processing-n:127.0.0.1:58731__vm%2Fb) [n:127.0.0.1:58731__vm%2Fb c:control_collection   x:collection1] o.a.s.s.IndexSchema unique key field: id
   [junit4]   2> 565661 INFO  (coreLoadExecutor-2222-thread-1-processing-n:127.0.0.1:58731__vm%2Fb) [n:127.0.0.1:58731__vm%2Fb c:control_collection   x:collection1] o.a.s.s.FileExchangeRateProvider Reloading exchange rates from file currency.xml
   [junit4]   2> 565662 INFO  (coreLoadExecutor-2222-thread-1-processing-n:127.0.0.1:58731__vm%2Fb) [n:127.0.0.1:58731__vm%2Fb c:control_collection   x:collection1] o.a.s.s.FileExchangeRateProvider Reloading exchange rates from file currency.xml
   [junit4]   2> 565668 INFO  (coreLoadExecutor-2222-thread-1-processing-n:127.0.0.1:58731__vm%2Fb) [n:127.0.0.1:58731__vm%2Fb c:control_collection   x:collection1] o.a.s.c.ConfigSetProperties Did not find ConfigSet properties, assuming default properties: Can't find resource 'configsetprops.json' in classpath or '/configs/conf1', cwd=/home/jenkins/workspace/Lucene-Solr-trunk-Linux/solr/build/solr-core/test/J2
   [junit4]   2> 565668 INFO  (coreLoadExecutor-2222-thread-1-processing-n:127.0.0.1:58731__vm%2Fb) [n:127.0.0.1:58731__vm%2Fb c:control_collection   x:collection1] o.a.s.c.CoreContainer Creating SolrCore 'collection1' using configuration from collection control_collection
   [junit4]   2> 565668 INFO  (coreLoadExecutor-2222-thread-1-processing-n:127.0.0.1:58731__vm%2Fb) [n:127.0.0.1:58731__vm%2Fb c:control_collection s:shard1 r:core_node1 x:collection1] o.a.s.c.SolrCore solr.StandardDirectoryFactory
   [junit4]   2> 565668 INFO  (coreLoadExecutor-2222-thread-1-processing-n:127.0.0.1:58731__vm%2Fb) [n:127.0.0.1:58731__vm%2Fb c:control_collection s:shard1 r:core_node1 x:collection1] o.a.s.c.SolrCore [[collection1] ] Opening new SolrCore at [/home/jenkins/workspace/Lucene-Solr-trunk-Linux/solr/build/solr-core/test/J2/../../../../../../../../../home/jenkins/workspace/Lucene-Solr-trunk-Linux/solr/build/solr-core/test/J2/temp/solr.cloud.ChaosMonkeySafeLeaderTest_20AFDC884E90DA3-001/control-001/cores/collection1/], dataDir=[null]
   [junit4]   2> 565668 INFO  (coreLoadExecutor-2222-thread-1-processing-n:127.0.0.1:58731__vm%2Fb) [n:127.0.0.1:58731__vm%2Fb c:control_collection s:shard1 r:core_node1 x:collection1] o.a.s.c.JmxMonitoredMap JMX monitoring is enabled. Adding Solr mbeans to JMX Server: com.sun.jmx.mbeanserver.JmxMBeanServer@1f5b1e68
   [junit4]   2> 565669 INFO  (coreLoadExecutor-2222-thread-1-processing-n:127.0.0.1:58731__vm%2Fb) [n:127.0.0.1:58731__vm%2Fb c:control_collection s:shard1 r:core_node1 x:collection1] o.a.s.c.CachingDirectoryFactory return new directory for /home/jenkins/workspace/Lucene-Solr-trunk-Linux/solr/build/solr-core/test/J2/temp/solr.cloud.ChaosMonkeySafeLeaderTest_20AFDC884E90DA3-001/control-001/cores/collection1/data
   [junit4]   2> 565669 INFO  (coreLoadExecutor-2222-thread-1-processing-n:127.0.0.1:58731__vm%2Fb) [n:127.0.0.1:58731__vm%2Fb c:control_collection s:shard1 r:core_node1 x:collection1] o.a.s.c.SolrCore New index directory detected: old=null new=/home/jenkins/workspace/Lucene-Solr-trunk-Linux/solr/build/solr-core/test/J2/temp/solr.cloud.ChaosMonkeySafeLeaderTest_20AFDC884E90DA3-001/control-001/cores/collection1/data/index/
   [junit4]   2> 565669 WARN  (coreLoadExecutor-2222-thread-1-processing-n:127.0.0.1:58731__vm%2Fb) [n:127.0.0.1:58731__vm%2Fb c:control_collection s:shard1 r:core_node1 x:collection1] o.a.s.c.SolrCore [collection1] Solr index directory '/home/jenkins/workspace/Lucene-Solr-trunk-Linux/solr/build/solr-core/test/J2/temp/solr.cloud.ChaosMonkeySafeLeaderTest_20AFDC884E90DA3-001/control-001/cores/collection1/data/index' doesn't exist. Creating new index...
   [junit4]   2> 565669 INFO  (coreLoadExecutor-2222-thread-1-processing-n:127.0.0.1:58731__vm%2Fb) [n:127.0.0.1:58731__vm%2Fb c:control_collection s:shard1 r:core_node1 x:collection1] o.a.s.c.CachingDirectoryFactory return new directory for /home/jenkins/workspace/Lucene-Solr-trunk-Linux/solr/build/solr-core/test/J2/temp/solr.cloud.ChaosMonkeySafeLeaderTest_20AFDC884E90DA3-001/control-001/cores/collection1/data/index
   [junit4]   2> 565669 INFO  (coreLoadExecutor-2222-thread-1-processing-n:127.0.0.1:58731__vm%2Fb) [n:127.0.0.1:58731__vm%2Fb c:control_collection s:shard1 r:core_node1 x:collection1] o.a.s.u.RandomMergePolicy RandomMergePolicy wrapping class org.apache.lucene.index.LogByteSizeMergePolicy: [LogByteSizeMergePolicy: minMergeSize=1677721, mergeFactor=49, maxMergeSize=2147483648, maxMergeSizeForForcedMerge=9223372036854775807, calibrateSizeByDeletes=false, maxMergeDocs=2147483647, maxCFSSegmentSizeMB=8.796093022207999E12, noCFSRatio=0.12961134836078517]
   [junit4]   2> 565693 INFO  (coreLoadExecutor-2222-thread-1-processing-n:127.0.0.1:58731__vm%2Fb) [n:127.0.0.1:58731__vm%2Fb c:control_collection s:shard1 r:core_node1 x:collection1] o.a.s.c.SolrCore SolrDeletionPolicy.onCommit: commits: num=1
   [junit4]   2> 	commit{dir=/home/jenkins/workspace/Lucene-Solr-trunk-Linux/solr/build/solr-core/test/J2/temp/solr.cloud.ChaosMonkeySafeLeaderTest_20AFDC884E90DA3-001/control-001/cores/collection1/data/index,segFN=segments_1,generation=1}
   [junit4]   2> 565693 INFO  (coreLoadExecutor-2222-thread-1-processing-n:127.0.0.1:58731__vm%2Fb) [n:127.0.0.1:58731__vm%2Fb c:control_collection s:shard1 r:core_node1 x:collection1] o.a.s.c.SolrCore newest commit generation = 1
   [junit4]   2> 565694 INFO  (OldIndexDirectoryCleanupThreadForCore-collection1) [n:127.0.0.1:58731__vm%2Fb c:control_collection s:shard1 r:core_node1 x:collection1] o.a.s.c.SolrCore Looking for old index directories to cleanup for core collection1 in /home/jenkins/workspace/Lucene-Solr-trunk-Linux/solr/build/solr-core/test/J2/temp/solr.cloud.ChaosMonkeySafeLeaderTest_20AFDC884E90DA3-001/control-001/cores/collection1/data/
   [junit4]   2> 565695 INFO  (coreLoadExecutor-2222-thread-1-processing-n:127.0.0.1:58731__vm%2Fb) [n:127.0.0.1:58731__vm%2Fb c:control_collection s:shard1 r:core_node1 x:collection1] o.a.s.u.p.UpdateRequestProcessorChain creating updateRequestProcessorChain "nodistrib"
   [junit4]   2> 565696 INFO  (coreLoadExecutor-2222-thread-1-processing-n:127.0.0.1:58731__vm%2Fb) [n:127.0.0.1:58731__vm%2Fb c:control_collection s:shard1 r:core_node1 x:collection1] o.a.s.u.p.UpdateRequestProcessorChain creating updateRequestProcessorChain "dedupe"
   [junit4]   2> 565696 INFO  (coreLoadExecutor-2222-thread-1-processing-n:127.0.0.1:58731__vm%2Fb) [n:127.0.0.1:58731__vm%2Fb c:control_collection s:shard1 r:core_node1 x:collection1] o.a.s.u.p.UpdateRequestProcessorChain inserting DistributedUpdateProcessorFactory into updateRequestProcessorChain "dedupe"
   [junit4]   2> 565696 INFO  (coreLoadExecutor-2222-thread-1-processing-n:127.0.0.1:58731__vm%2Fb) [n:127.0.0.1:58731__vm%2Fb c:control_collection s:shard1 r:core_node1 x:collection1] o.a.s.u.p.UpdateRequestProcessorChain creating updateRequestProcessorChain "stored_sig"
   [junit4]   2> 565696 INFO  (coreLoadExecutor-2222-thread-1-processing-n:127.0.0.1:58731__vm%2Fb) [n:127.0.0.1:58731__vm%2Fb c:control_collection s:shard1 r:core_node1 x:collection1] o.a.s.u.p.UpdateRequestProcessorChain inserting DistributedUpdateProcessorFactory into updateRequestProcessorChain "stored_sig"
   [junit4]   2> 565696 INFO  (coreLoadExecutor-2222-thread-1-processing-n:127.0.0.1:58731__vm%2Fb) [n:127.0.0.1:58731__vm%2Fb c:control_collection s:shard1 r:core_node1 x:collection1] o.a.s.u.p.UpdateRequestProcessorChain creating updateRequestProcessorChain "distrib-dup-test-chain-explicit"
   [junit4]   2> 565696 INFO  (coreLoadExecutor-2222-thread-1-processing-n:127.0.0.1:58731__vm%2Fb) [n:127.0.0.1:58731__vm%2Fb c:control_collection s:shard1 r:core_node1 x:collection1] o.a.s.u.p.UpdateRequestProcessorChain creating updateRequestProcessorChain "distrib-dup-test-chain-implicit"
   [junit4]   2> 565696 INFO  (coreLoadExecutor-2222-thread-1-processing-n:127.0.0.1:58731__vm%2Fb) [n:127.0.0.1:58731__vm%2Fb c:control_collection s:shard1 r:core_node1 x:collection1] o.a.s.u.p.UpdateRequestProcessorChain inserting DistributedUpdateProcessorFactory into updateRequestProcessorChain "distrib-dup-test-chain-implicit"
   [junit4]   2> 565696 INFO  (coreLoadExecutor-2222-thread-1-processing-n:127.0.0.1:58731__vm%2Fb) [n:127.0.0.1:58731__vm%2Fb c:control_collection s:shard1 r:core_node1 x:collection1] o.a.s.c.SolrCore no updateRequestProcessorChain defined as default, creating implicit default
   [junit4]   2> 565697 INFO  (coreLoadExecutor-2222-thread-1-processing-n:127.0.0.1:58731__vm%2Fb) [n:127.0.0.1:58731__vm%2Fb c:control_collection s:shard1 r:core_node1 x:collection1] o.a.s.h.l.XMLLoader xsltCacheLifetimeSeconds=60
   [junit4]   2> 565698 INFO  (coreLoadExecutor-2222-thread-1-processing-n:127.0.0.1:58731__vm%2Fb) [n:127.0.0.1:58731__vm%2Fb c:control_collection s:shard1 r:core_node1 x:collection1] o.a.s.h.l.XMLLoader xsltCacheLifetimeSeconds=60
   [junit4]   2> 565698 INFO  (coreLoadExecutor-2222-thread-1-processing-n:127.0.0.1:58731__vm%2Fb) [n:127.0.0.1:58731__vm%2Fb c:control_collection s:shard1 r:core_node1 x:collection1] o.a.s.h.l.XMLLoader xsltCacheLifetimeSeconds=60
   [junit4]   2> 565699 INFO  (coreLoadExecutor-2222-thread-1-processing-n:127.0.0.1:58731__vm%2Fb) [n:127.0.0.1:58731__vm%2Fb c:control_collection s:shard1 r:core_node1 x:collection1] o.a.s.h.l.XMLLoader xsltCacheLifetimeSeconds=60
   [junit4]   2> 565700 INFO  (coreLoadExecutor-2222-thread-1-processing-n:127.0.0.1:58731__vm%2Fb) [n:127.0.0.1:58731__vm%2Fb c:control_collection s:shard1 r:core_node1 x:collection1] o.a.s.c.RequestHandlers Registered paths: /admin/mbeans,standard,/update/csv,/update/json/docs,/admin/luke,/admin/segments,/get,/admin/system,/replication,/admin/properties,/config,/schema,/admin/plugins,/admin/logging,/update/json,/admin/threads,/admin/ping,/update,/admin/file
   [junit4]   2> 565700 INFO  (coreLoadExecutor-2222-thread-1-processing-n:127.0.0.1:58731__vm%2Fb) [n:127.0.0.1:58731__vm%2Fb c:control_collection s:shard1 r:core_node1 x:collection1] o.a.s.c.SolrCore Using default statsCache cache: org.apache.solr.search.stats.LocalStatsCache
   [junit4]   2> 565700 INFO  (coreLoadExecutor-2222-thread-1-processing-n:127.0.0.1:58731__vm%2Fb) [n:127.0.0.1:58731__vm%2Fb c:control_collection s:shard1 r:core_node1 x:collection1] o.a.s.u.UpdateHandler Using UpdateLog implementation: org.apache.solr.update.UpdateLog
   [junit4]   2> 565701 INFO  (coreLoadExecutor-2222-thread-1-processing-n:127.0.0.1:58731__vm%2Fb) [n:127.0.0.1:58731__vm%2Fb c:control_collection s:shard1 r:core_node1 x:collection1] o.a.s.u.UpdateLog Initializing UpdateLog: dataDir= defaultSyncLevel=FLUSH numRecordsToKeep=100 maxNumLogsToKeep=10 numVersionBuckets=65536
   [junit4]   2> 565701 INFO  (coreLoadExecutor-2222-thread-1-processing-n:127.0.0.1:58731__vm%2Fb) [n:127.0.0.1:58731__vm%2Fb c:control_collection s:shard1 r:core_node1 x:collection1] o.a.s.c.SolrCore Hard AutoCommit: disabled
   [junit4]   2> 565701 INFO  (coreLoadExecutor-2222-thread-1-processing-n:127.0.0.1:58731__vm%2Fb) [n:127.0.0.1:58731__vm%2Fb c:control_collection s:shard1 r:core_node1 x:collection1] o.a.s.c.SolrCore Soft AutoCommit: disabled
   [junit4]   2> 565701 INFO  (coreLoadExecutor-2222-thread-1-processing-n:127.0.0.1:58731__vm%2Fb) [n:127.0.0.1:58731__vm%2Fb c:control_collection s:shard1 r:core_node1 x:collection1] o.a.s.u.RandomMergePolicy RandomMergePolicy wrapping class org.apache.lucene.index.AlcoholicMergePolicy: [AlcoholicMergePolicy: minMergeSize=0, mergeFactor=10, maxMergeSize=2100694962, maxMergeSizeForForcedMerge=9223372036854775807, calibrateSizeByDeletes=true, maxMergeDocs=2147483647, maxCFSSegmentSizeMB=8.796093022207999E12, noCFSRatio=0.1]
   [junit4]   2> 565702 INFO  (coreLoadExecutor-2222-thread-1-processing-n:127.0.0.1:58731__vm%2Fb) [n:127.0.0.1:58731__vm%2Fb c:control_collection s:shard1 r:core_node1 x:collection1] o.a.s.c.SolrCore SolrDeletionPolicy.onInit: commits: num=1
   [junit4]   2> 	commit{dir=/home/jenkins/workspace/Lucene-Solr-trunk-Linux/solr/build/solr-core/test/J2/temp/solr.cloud.ChaosMonkeySafeLeaderTest_20AFDC884E90DA3-001/control-001/cores/collection1/data/index,segFN=segments_1,generation=1}
   [junit4]   2> 565702 INFO  (coreLoadExecutor-2222-thread-1-processing-n:127.0.0.1:58731__vm%2Fb) [n:127.0.0.1:58731__vm%2Fb c:control_collection s:shard1 r:core_node1 x:collection1] o.a.s.c.SolrCore newest commit generation = 1
   [junit4]   2> 565702 INFO  (coreLoadExecutor-2222-thread-1-processing-n:127.0.0.1:58731__vm%2Fb) [n:127.0.0.1:58731__vm%2Fb c:control_collection s:shard1 r:core_node1 x:collection1] o.a.s.s.SolrIndexSearcher Opening Searcher@48595679[collection1] main
   [junit4]   2> 565702 INFO  (coreLoadExecutor-2222-thread-1-processing-n:127.0.0.1:58731__vm%2Fb) [n:127.0.0.1:58731__vm%2Fb c:control_collection s:shard1 r:core_node1 x:collection1] o.a.s.c.c.ZkStateReader Load collection config from:/collections/control_collection
   [junit4]   2> 565703 INFO  (coreLoadExecutor-2222-thread-1-processing-n:127.0.0.1:58731__vm%2Fb) [n:127.0.0.1:58731__vm%2Fb c:control_collection s:shard1 r:core_node1 x:collection1] o.a.s.c.c.ZkStateReader path=/collections/control_collection configName=conf1 specified config exists in ZooKeeper
   [junit4]   2> 565703 INFO  (coreLoadExecutor-2222-thread-1-processing-n:127.0.0.1:58731__vm%2Fb) [n:127.0.0.1:58731__vm%2Fb c:control_collection s:shard1 r:core_node1 x:collection1] o.a.s.r.ManagedResourceStorage Setting up ZooKeeper-based storage for the RestManager with znodeBase: /configs/conf1
   [junit4]   2> 565703 INFO  (coreLoadExecutor-2222-thread-1-processing-n:127.0.0.1:58731__vm%2Fb) [n:127.0.0.1:58731__vm%2Fb c:control_collection s:shard1 r:core_node1 x:collection1] o.a.s.r.ManagedResourceStorage Configured ZooKeeperStorageIO with znodeBase: /configs/conf1
   [junit4]   2> 565703 INFO  (coreLoadExecutor-2222-thread-1-processing-n:127.0.0.1:58731__vm%2Fb) [n:127.0.0.1:58731__vm%2Fb c:control_collection s:shard1 r:core_node1 x:collection1] o.a.s.r.RestManager Initializing RestManager with initArgs: {}
   [junit4]   2> 565703 INFO  (coreLoadExecutor-2222-thread-1-processing-n:127.0.0.1:58731__vm%2Fb) [n:127.0.0.1:58731__vm%2Fb c:control_collection s:shard1 r:core_node1 x:collection1] o.a.s.r.ManagedResourceStorage Reading _rest_managed.json using ZooKeeperStorageIO:path=/configs/conf1
   [junit4]   2> 565703 INFO  (coreLoadExecutor-2222-thread-1-processing-n:127.0.0.1:58731__vm%2Fb) [n:127.0.0.1:58731__vm%2Fb c:control_collection s:shard1 r:core_node1 x:collection1] o.a.s.r.ManagedResourceStorage No data found for znode /configs/conf1/_rest_managed.json
   [junit4]   2> 565703 INFO  (coreLoadExecutor-2222-thread-1-processing-n:127.0.0.1:58731__vm%2Fb) [n:127.0.0.1:58731__vm%2Fb c:control_collection s:shard1 r:core_node1 x:collection1] o.a.s.r.ManagedResourceStorage Loaded null at path _rest_managed.json using ZooKeeperStorageIO:path=/configs/conf1
   [junit4]   2> 565703 INFO  (coreLoadExecutor-2222-thread-1-processing-n:127.0.0.1:58731__vm%2Fb) [n:127.0.0.1:58731__vm%2Fb c:control_collection s:shard1 r:core_node1 x:collection1] o.a.s.r.RestManager Initializing 0 registered ManagedResources
   [junit4]   2> 565703 INFO  (coreLoadExecutor-2222-thread-1-processing-n:127.0.0.1:58731__vm%2Fb) [n:127.0.0.1:58731__vm%2Fb c:control_collection s:shard1 r:core_node1 x:collection1] o.a.s.h.ReplicationHandler Commits will be reserved for  10000
   [junit4]   2> 565704 INFO  (searcherExecutor-2223-thread-1-processing-n:127.0.0.1:58731__vm%2Fb x:collection1 s:shard1 c:control_collection r:core_node1) [n:127.0.0.1:58731__vm%2Fb c:control_collection s:shard1 r:core_node1 x:collection1] o.a.s.c.SolrCore [collection1] Registered new searcher Searcher@48595679[collection1] main{ExitableDirectoryReader(UninvertingDirectoryReader())}
   [junit4]   2> 565704 INFO  (coreLoadExecutor-2222-thread-1-processing-n:127.0.0.1:58731__vm%2Fb) [n:127.0.0.1:58731__vm%2Fb c:control_collection s:shard1 r:core_node1 x:collection1] o.a.s.u.UpdateLog Looking up max value of version field to seed version buckets
   [junit4]   2> 565704 INFO  (coreLoadExecutor-2222-thread-1-processing-n:127.0.0.1:58731__vm%2Fb) [n:127.0.0.1:58731__vm%2Fb c:control_collection s:shard1 r:core_node1 x:collection1] o.a.s.u.VersionInfo Refreshing highest value of _version_ for 65536 version buckets from index
   [junit4]   2> 565704 INFO  (coreLoadExecutor-2222-thread-1-processing-n:127.0.0.1:58731__vm%2Fb) [n:127.0.0.1:58731__vm%2Fb c:control_collection s:shard1 r:core_node1 x:collection1] o.a.s.u.VersionInfo No terms found for _version_, cannot seed version bucket highest value from index
   [junit4]   2> 565704 INFO  (coreLoadExecutor-2222-thread-1-processing-n:127.0.0.1:58731__vm%2Fb) [n:127.0.0.1:58731__vm%2Fb c:control_collection s:shard1 r:core_node1 x:collection1] o.a.s.u.UpdateLog Could not find max version in index or recent updates, using new clock 1508315667496960000
   [junit4]   2> 565706 INFO  (coreLoadExecutor-2222-thread-1-processing-n:127.0.0.1:58731__vm%2Fb) [n:127.0.0.1:58731__vm%2Fb c:control_collection s:shard1 r:core_node1 x:collection1] o.a.s.u.UpdateLog Took 2 ms to seed version buckets with highest version 1508315667496960000
   [junit4]   2> 565706 INFO  (coreLoadExecutor-2222-thread-1-processing-n:127.0.0.1:58731__vm%2Fb) [n:127.0.0.1:58731__vm%2Fb c:control_collection s:shard1 r:core_node1 x:collection1] o.a.s.c.ZkController watch zkdir /configs/conf1
   [junit4]   2> 565706 INFO  (coreLoadExecutor-2222-thread-1-processing-n:127.0.0.1:58731__vm%2Fb) [n:127.0.0.1:58731__vm%2Fb c:control_collection s:shard1 r:core_node1 x:collection1] o.a.s.c.CoreContainer registering core: collection1
   [junit4]   2> 565706 INFO  (coreZkRegister-2216-thread-1-processing-n:127.0.0.1:58731__vm%2Fb x:collection1 s:shard1 c:control_collection r:core_node1) [n:127.0.0.1:58731__vm%2Fb c:control_collection s:shard1 r:core_node1 x:collection1] o.a.s.c.ZkController Register replica - core:collection1 address:http://127.0.0.1:58731/_vm/b collection:control_collection shard:shard1
   [junit4]   2> 565707 INFO  (coreZkRegister-2216-thread-1-processing-n:127.0.0.1:58731__vm%2Fb x:collection1 s:shard1 c:control_collection r:core_node1) [n:127.0.0.1:58731__vm%2Fb c:control_collection s:shard1 r:core_node1 x:collection1] o.a.s.c.c.SolrZkClient makePath: /collections/control_collection/leader_elect/shard1/election
   [junit4]   2> 565708 INFO  (coreZkRegister-2216-thread-1-processing-n:127.0.0.1:58731__vm%2Fb x:collection1 s:shard1 c:control_collection r:core_node1) [n:127.0.0.1:58731__vm%2Fb c:control_collection s:shard1 r:core_node1 x:collection1] o.a.s.c.LeaderElector Joined leadership election with path: /collections/control_collection/leader_elect/shard1/election/94269729132314628-core_node1-n_0000000000
   [junit4]   2> 565708 INFO  (coreZkRegister-2216-thread-1-processing-n:127.0.0.1:58731__vm%2Fb x:collection1 s:shard1 c:control_collection r:core_node1) [n:127.0.0.1:58731__vm%2Fb c:control_collection s:shard1 r:core_node1 x:collection1] o.a.s.c.ShardLeaderElectionContext Running the leader process for shard shard1
   [junit4]   2> 565708 INFO  (zkCallback-805-thread-1-processing-n:127.0.0.1:58731__vm%2Fb) [n:127.0.0.1:58731__vm%2Fb    ] o.a.s.c.DistributedQueue NodeChildrenChanged fired on path /overseer/queue state SyncConnected
   [junit4]   2> 565708 INFO  (coreZkRegister-2216-thread-1-processing-n:127.0.0.1:58731__vm%2Fb x:collection1 s:shard1 c:control_collection r:core_node1) [n:127.0.0.1:58731__vm%2Fb c:control_collection s:shard1 r:core_node1 x:collection1] o.a.s.c.ShardLeaderElectionContext Enough replicas found to continue.
   [junit4]   2> 565708 INFO  (coreZkRegister-2216-thread-1-processing-n:127.0.0.1:58731__vm%2Fb x:collection1 s:shard1 c:control_collection r:core_node1) [n:127.0.0.1:58731__vm%2Fb c:control_collection s:shard1 r:core_node1 x:collection1] o.a.s.c.ShardLeaderElectionContext I may be the new leader - try and sync
   [junit4]   2> 565709 INFO  (coreZkRegister-2216-thread-1-processing-n:127.0.0.1:58731__vm%2Fb x:collection1 s:shard1 c:control_collection r:core_node1) [n:127.0.0.1:58731__vm%2Fb c:control_collection s:shard1 r:core_node1 x:collection1] o.a.s.c.SyncStrategy Sync replicas to http://127.0.0.1:58731/_vm/b/collection1/
   [junit4]   2> 565709 INFO  (OverseerStateUpdate-94269729132314628-127.0.0.1:58731__vm%2Fb-n_0000000000) [n:127.0.0.1:58731__vm%2Fb    ] o.a.s.c.Overseer processMessage: queueSize: 1, message = {
   [junit4]   2>   "operation":"leader",
   [junit4]   2>   "shard":"shard1",
   [junit4]   2>   "collection":"control_collection"} current state version: 1
   [junit4]   2> 565709 INFO  (coreZkRegister-2216-thread-1-processing-n:127.0.0.1:58731__vm%2Fb x:collection1 s:shard1 c:control_collection r:core_node1) [n:127.0.0.1:58731__vm%2Fb c:control_collection s:shard1 r:core_node1 x:collection1] o.a.s.c.SyncStrategy Sync Success - now sync replicas to me
   [junit4]   2> 565709 INFO  (coreZkRegister-2216-thread-1-processing-n:127.0.0.1:58731__vm%2Fb x:collection1 s:shard1 c:control_collection r:core_node1) [n:127.0.0.1:58731__vm%2Fb c:control_collection s:shard1 r:core_node1 x:collection1] o.a.s.c.SyncStrategy http://127.0.0.1:58731/_vm/b/collection1/ has no replicas
   [junit4]   2> 565709 INFO  (coreZkRegister-2216-thread-1-processing-n:127.0.0.1:58731__vm%2Fb x:collection1 s:shard1 c:control_collection r:core_node1) [n:127.0.0.1:58731__vm%2Fb c:control_collection s:shard1 r:core_node1 x:collection1] o.a.s.c.ShardLeaderElectionContext I am the new leader: http://127.0.0.1:58731/_vm/b/collection1/ shard1
   [junit4]   2> 565709 INFO  (coreZkRegister-2216-thread-1-processing-n:127.0.0.1:58731__vm%2Fb x:collection1 s:shard1 c:control_collection r:core_node1) [n:127.0.0.1:58731__vm%2Fb c:control_collection s:shard1 r:core_node1 x:collection1] o.a.s.c.c.SolrZkClient makePath: /collections/control_collection/leaders/shard1
   [junit4]   2> 565710 INFO  (zkCallback-805-thread-1-processing-n:127.0.0.1:58731__vm%2Fb) [n:127.0.0.1:58731__vm%2Fb    ] o.a.s.c.DistributedQueue NodeChildrenChanged fired on path /overseer/queue state SyncConnected
   [junit4]   2> 565710 INFO  (OverseerStateUpdate-94269729132314628-127.0.0.1:58731__vm%2Fb-n_0000000000) [n:127.0.0.1:58731__vm%2Fb    ] o.a.s.c.Overseer processMessage: queueSize: 1, message = {
   [junit4]   2>   "operation":"leader",
   [junit4]   2>   "shard":"shard1",
   [junit4]   2>   "collection":"control_collection",
   [junit4]   2>   "base_url":"http://127.0.0.1:58731/_vm/b",
   [junit4]   2>   "core":"collection1",
   [junit4]   2>   "state":"active"} current state version: 1
   [junit4]   2> 565811 INFO  (zkCallback-805-thread-1-processing-n:127.0.0.1:58731__vm%2Fb) [n:127.0.0.1:58731__vm%2Fb    ] o.a.s.c.c.ZkStateReader A cluster state change: WatchedEvent state:SyncConnected type:NodeDataChanged path:/clusterstate.json, has occurred - updating... (live nodes size: 1)
   [junit4]   2> 565812 INFO  (zkCallback-805-thread-1-processing-n:127.0.0.1:58731__vm%2Fb) [n:127.0.0.1:58731__vm%2Fb    ] o.a.s.c.c.ZkStateReader Updated cluster state version to 2
   [junit4]   2> 565860 INFO  (coreZkRegister-2216-thread-1-processing-n:127.0.0.1:58731__vm%2Fb x:collection1 s:shard1 c:control_collection r:core_node1) [n:127.0.0.1:58731__vm%2Fb c:control_collection s:shard1 r:core_node1 x:collection1] o.a.s.c.ZkController We are http://127.0.0.1:58731/_vm/b/collection1/ and leader is http://127.0.0.1:58731/_vm/b/collection1/
   [junit4]   2> 565861 INFO  (coreZkRegister-2216-thread-1-processing-n:127.0.0.1:58731__vm%2Fb x:collection1 s:shard1 c:control_collection r:core_node1) [n:127.0.0.1:58731__vm%2Fb c:control_collection s:shard1 r:core_node1 x:collection1] o.a.s.c.ZkController No LogReplay needed for core=collection1 baseURL=http://127.0.0.1:58731/_vm/b
   [junit4]   2> 565861 INFO  (coreZkRegister-2216-thread-1-processing-n:127.0.0.1:58731__vm%2Fb x:collection1 s:shard1 c:control_collection r:core_node1) [n:127.0.0.1:58731__vm%2Fb c:control_collection s:shard1 r:core_node1 x:collection1] o.a.s.c.ZkController I am the leader, no recovery necessary
   [junit4]   2> 565861 INFO  (coreZkRegister-2216-thread-1-processing-n:127.0.0.1:58731__vm%2Fb x:collection1 s:shard1 c:control_collection r:core_node1) [n:127.0.0.1:58731__vm%2Fb c:control_collection s:shard1 r:core_node1 x:collection1] o.a.s.c.ZkController publishing state=active
   [junit4]   2> 565861 INFO  (coreZkRegister-2216-thread-1-processing-n:127.0.0.1:58731__vm%2Fb x:collection1 s:shard1 c:control_collection r:core_node1) [n:127.0.0.1:58731__vm%2Fb c:control_collection s:shard1 r:core_node1 x:collection1] o.a.s.c.ZkController numShards not found on descriptor - reading it from system property
   [junit4]   2> 565862 INFO  (zkCallback-805-thread-1-processing-n:127.0.0.1:58731__vm%2Fb) [n:127.0.0.1:58731__vm%2Fb    ] o.a.s.c.DistributedQueue NodeChildrenChanged fired on path /overseer/queue state SyncConnected
   [junit4]   2> 565862 INFO  (OverseerStateUpdate-94269729132314628-127.0.0.1:58731__vm%2Fb-n_0000000000) [n:127.0.0.1:58731__vm%2Fb    ] o.a.s.c.Overseer processMessage: queueSize: 1, message = {
   [junit4]   2>   "core":"collection1",
   [junit4]   2>   "core_node_name":"core_node1",
   [junit4]   2>   "roles":null,
   [junit4]   2>   "base_url":"http://127.0.0.1:58731/_vm/b",
   [junit4]   2>   "node_name":"127.0.0.1:58731__vm%2Fb",
   [junit4]   2>   "numShards":"1",
   [junit4]   2>   "state":"active",
   [junit4]   2>   "shard":"shard1",
   [junit4]   2>   "collection":"control_collection",
   [junit4]   2>   "operation":"state"} current state version: 2
   [junit4]   2> 565863 INFO  (OverseerStateUpdate-94269729132314628-127.0.0.1:58731__vm%2Fb-n_0000000000) [n:127.0.0.1:58731__vm%2Fb    ] o.a.s.c.o.ReplicaMutator Update state numShards=1 message={
   [junit4]   2>   "core":"collection1",
   [junit4]   2>   "core_node_name":"core_node1",
   [junit4]   2>   "roles":null,
   [junit4]   2>   "base_url":"http://127.0.0.1:58731/_vm/b",
   [junit4]   2>   "node_name":"127.0.0.1:58731__vm%2Fb",
   [junit4]   2>   "numShards":"1",
   [junit4]   2>   "state":"active",
   [junit4]   2>   "shard":"shard1",
   [junit4]   2>   "collection":"control_collection",
   [junit4]   2>   "operation":"state"}
   [junit4]   2> 565964 INFO  (zkCallback-805-thread-1-processing-n:127.0.0.1:58731__vm%2Fb) [n:127.0.0.1:58731__vm%2Fb    ] o.a.s.c.c.ZkStateReader A cluster state change: WatchedEvent state:SyncConnected type:NodeDataChanged path:/clusterstate.json, has occurred - updating... (live nodes size: 1)
   [junit4]   2> 565964 INFO  (zkCallback-805-thread-1-processing-n:127.0.0.1:58731__vm%2Fb) [n:127.0.0.1:58731__vm%2Fb    ] o.a.s.c.c.ZkStateReader Updated cluster state version to 3
   [junit4]   2> 566080 INFO  (TEST-ChaosMonkeySafeLeaderTest.test-seed#[20AFDC884E90DA3]) [    ] o.a.s.c.c.SolrZkClient Using default ZkCredentialsProvider
   [junit4]   2> 566080 INFO  (TEST-ChaosMonkeySafeLeaderTest.test-seed#[20AFDC884E90DA3]) [    ] o.a.s.c.c.ConnectionManager Waiting for client to connect to ZooKeeper
   [junit4]   2> 566081 INFO  (zkCallback-807-thread-1) [    ] o.a.s.c.c.ConnectionManager Watcher org.apache.solr.common.cloud.ConnectionManager@79dd7c21 name:ZooKeeperConnection Watcher:127.0.0.1:45106/solr got event WatchedEvent state:SyncConnected type:None path:null path:null type:None
   [junit4]   2> 566081 INFO  (TEST-ChaosMonkeySafeLeaderTest.test-seed#[20AFDC884E90DA3]) [    ] o.a.s.c.c.ConnectionManager Client is connected to ZooKeeper
   [junit4]   2> 566081 INFO  (TEST-ChaosMonkeySafeLeaderTest.test-seed#[20AFDC884E90DA3]) [    ] o.a.s.c.c.SolrZkClient Using default ZkACLProvider
   [junit4]   2> 566081 INFO  (TEST-ChaosMonkeySafeLeaderTest.test-seed#[20AFDC884E90DA3]) [    ] o.a.s.c.c.ZkStateReader Updating cluster state from ZooKeeper... 
   [junit4]   2> 566082 INFO  (TEST-ChaosMonkeySafeLeaderTest.test-seed#[20AFDC884E90DA3]) [    ] o.a.s.c.ChaosMonkey monkey: init - expire sessions:false cause connection loss:false
   [junit4]   2> 566125 INFO  (TEST-ChaosMonkeySafeLeaderTest.test-seed#[20AFDC884E90DA3]) [    ] o.a.s.SolrTestCaseJ4 Writing core.properties file to /home/jenkins/workspace/Lucene-Solr-trunk-Linux/solr/build/solr-core/test/J2/temp/solr.cloud.ChaosMonkeySafeLeaderTest_20AFDC884E90DA3-001/shard-1-001/cores/collection1
   [junit4]   2> 566126 INFO  (TEST-ChaosMonkeySafeLeaderTest.test-seed#[20AFDC884E90DA3]) [    ] o.a.s.c.AbstractFullDistribZkTestBase create jetty 1 in directory /home/jenkins/workspace/Lucene-Solr-trunk-Linux/solr/build/solr-core/test/J2/temp/solr.cloud.ChaosMonkeySafeLeaderTest_20AFDC884E90DA3-001/shard-1-001
   [junit4]   2> 566126 INFO  (TEST-ChaosMonkeySafeLeaderTest.test-seed#[20AFDC884E90DA3]) [    ] o.e.j.s.Server jetty-9.2.11.v20150529
   [junit4]   2> 566127 INFO  (TEST-ChaosMonkeySafeLeaderTest.test-seed#[20AFDC884E90DA3]) [    ] o.e.j.s.h.ContextHandler Started o.e.j.s.ServletContextHandler@26a0fdbd{/_vm/b,null,AVAILABLE}
   [junit4]   2> 566127 INFO  (TEST-ChaosMonkeySafeLeaderTest.test-seed#[20AFDC884E90DA3]) [    ] o.e.j.s.ServerConnector Started ServerConnector@4020b95f{HTTP/1.1}{127.0.0.1:55077}
   [junit4]   2> 566127 INFO  (TEST-ChaosMonkeySafeLeaderTest.test-seed#[20AFDC884E90DA3]) [    ] o.e.j.s.Server Started @568094ms
   [junit4]   2> 566128 INFO  (TEST-ChaosMonkeySafeLeaderTest.test-seed#[20AFDC884E90DA3]) [    ] o.a.s.c.s.e.JettySolrRunner Jetty properties: {solr.data.dir=/home/jenkins/workspace/Lucene-Solr-trunk-Linux/solr/build/solr-core/test/J2/temp/solr.cloud.ChaosMonkeySafeLeaderTest_20AFDC884E90DA3-001/tempDir-001/jetty1, solrconfig=solrconfig.xml, hostContext=/_vm/b, hostPort=55077, coreRootDirectory=/home/jenkins/workspace/Lucene-Solr-trunk-Linux/solr/build/solr-core/test/J2/temp/solr.cloud.ChaosMonkeySafeLeaderTest_20AFDC884E90DA3-001/shard-1-001/cores}
   [junit4]   2> 566128 INFO  (TEST-ChaosMonkeySafeLeaderTest.test-seed#[20AFDC884E90DA3]) [    ] o.a.s.s.SolrDispatchFilter SolrDispatchFilter.init(): sun.misc.Launcher$AppClassLoader@45fe3ee3
   [junit4]   2> 566128 INFO  (TEST-ChaosMonkeySafeLeaderTest.test-seed#[20AFDC884E90DA3]) [    ] o.a.s.c.SolrResourceLoader new SolrResourceLoader for directory: '/home/jenkins/workspace/Lucene-Solr-trunk-Linux/solr/build/solr-core/test/J2/temp/solr.cloud.ChaosMonkeySafeLeaderTest_20AFDC884E90DA3-001/shard-1-001/'
   [junit4]   2> 566136 INFO  (TEST-ChaosMonkeySafeLeaderTest.test-seed#[20AFDC884E90DA3]) [    ] o.a.s.c.c.SolrZkClient Using default ZkCredentialsProvider
   [junit4]   2> 566136 INFO  (TEST-ChaosMonkeySafeLeaderTest.test-seed#[20AFDC884E90DA3]) [    ] o.a.s.c.c.ConnectionManager Waiting for client to connect to ZooKeeper
   [junit4]   2> 566137 INFO  (zkCallback-808-thread-1) [    ] o.a.s.c.c.ConnectionManager Watcher org.apache.solr.common.cloud.ConnectionManager@5c53f752 name:ZooKeeperConnection Watcher:127.0.0.1:45106/solr got event WatchedEvent state:SyncConnected type:None path:null path:null type:None
   [junit4]   2> 566137 INFO  (TEST-ChaosMonkeySafeLeaderTest.test-seed#[20AFDC884E90DA3]) [    ] o.a.s.c.c.ConnectionManager Client is connected to ZooKeeper
   [junit4]   2> 566137 INFO  (TEST-ChaosMonkeySafeLeaderTest.test-seed#[20AFDC884E90DA3]) [    ] o.a.s.c.c.SolrZkClient Using default ZkACLProvider
   [junit4]   2> 566138 INFO  (TEST-ChaosMonkeySafeLeaderTest.test-seed#[20AFDC884E90DA3]) [    ] o.a.s.s.SolrDispatchFilter Loading solr.xml from SolrHome (not found in ZooKeeper)
   [junit4]   2> 566138 INFO  (TEST-ChaosMonkeySafeLeaderTest.test-seed#[20AFDC884E90DA3]) [    ] o.a.s.c.SolrXmlConfig Loading container configuration from /home/jenkins/workspace/Lucene-Solr-trunk-Linux/solr/build/solr-core/test/J2/temp/solr.cloud.ChaosMonkeySafeLeaderTest_20AFDC884E90DA3-001/shard-1-001/solr.xml
   [junit4]   2> 566141 INFO  (TEST-ChaosMonkeySafeLeaderTest.test-seed#[20AFDC884E90DA3]) [    ] o.a.s.c.CoresLocator Config-defined core root directory: /home/jenkins/workspace/Lucene-Solr-trunk-Linux/solr/build/solr-core/test/J2/temp/solr.cloud.ChaosMonkeySafeLeaderTest_20AFDC884E90DA3-001/shard-1-001/cores
   [junit4]   2> 566141 INFO  (TEST-ChaosMonkeySafeLeaderTest.test-seed#[20AFDC884E90DA3]) [    ] o.a.s.c.CoreContainer New CoreContainer 401007322
   [junit4]   2> 566141 INFO  (TEST-ChaosMonkeySafeLeaderTest.test-seed#[20AFDC884E90DA3]) [    ] o.a.s.c.CoreContainer Loading cores into CoreContainer [instanceDir=/home/jenkins/workspace/Lucene-Solr-trunk-Linux/solr/build/solr-core/test/J2/temp/solr.cloud.ChaosMonkeySafeLeaderTest_20AFDC884E90DA3-001/shard-1-001/]
   [junit4]   2> 566141 INFO  (TEST-ChaosMonkeySafeLeaderTest.test-seed#[20AFDC884E90DA3]) [    ] o.a.s.c.CoreContainer loading shared library: /home/jenkins/workspace/Lucene-Solr-trunk-Linux/solr/build/solr-core/test/J2/temp/solr.cloud.ChaosMonkeySafeLeaderTest_20AFDC884E90DA3-001/shard-1-001/lib
   [junit4]   2> 566141 WARN  (TEST-ChaosMonkeySafeLeaderTest.test-seed#[20AFDC884E90DA3]) [    ] o.a.s.c.SolrResourceLoader Can't find (or read) directory to add to classloader: lib (resolved as: /home/jenkins/workspace/Lucene-Solr-trunk-Linux/solr/build/solr-core/test/J2/temp/solr.cloud.ChaosMonkeySafeLeaderTest_20AFDC884E90DA3-001/shard-1-001/lib).
   [junit4]   2> 566145 INFO  (TEST-ChaosMonkeySafeLeaderTest.test-seed#[20AFDC884E90DA3]) [    ] o.a.s.h.c.HttpShardHandlerFactory created with socketTimeout : 90000,urlScheme : ,connTimeout : 15000,maxConnectionsPerHost : 20,maxConnections : 10000,corePoolSize : 0,maximumPoolSize : 2147483647,maxThreadIdleTime : 5,sizeOfQueue : -1,fairnessPolicy : false,useRetries : false,
   [junit4]   2> 566146 INFO  (TEST-ChaosMonkeySafeLeaderTest.test-seed#[20AFDC884E90DA3]) [    ] o.a.s.u.UpdateShardHandler Creating UpdateShardHandler HTTP client with params: socketTimeout=340000&connTimeout=45000&retry=true
   [junit4]   2> 566146 INFO  (TEST-ChaosMonkeySafeLeaderTest.test-seed#[20AFDC884E90DA3]) [    ] o.a.s.l.LogWatcher SLF4J impl is org.slf4j.impl.Log4jLoggerFactory
   [junit4]   2> 566146 INFO  (TEST-ChaosMonkeySafeLeaderTest.test-seed#[20AFDC884E90DA3]) [    ] o.a.s.l.LogWatcher Registering Log Listener [Log4j (org.slf4j.impl.Log4jLoggerFactory)]
   [junit4]   2> 566146 INFO  (TEST-ChaosMonkeySafeLeaderTest.test-seed#[20AFDC884E90DA3]) [    ] o.a.s.c.ZkContainer Zookeeper client=127.0.0.1:45106/solr
   [junit4]   2> 566146 INFO  (TEST-ChaosMonkeySafeLeaderTest.test-seed#[20AFDC884E90DA3]) [    ] o.a.s.c.ZkController zkHost includes chroot
   [junit4]   2> 566146 INFO  (TEST-ChaosMonkeySafeLeaderTest.test-seed#[20AFDC884E90DA3]) [    ] o.a.s.c.c.SolrZkClient Using default ZkCredentialsProvider
   [junit4]   2> 566147 INFO  (TEST-ChaosMonkeySafeLeaderTest.test-seed#[20AFDC884E90DA3]) [    ] o.a.s.c.c.ConnectionManager Waiting for client to connect to ZooKeeper
   [junit4]   2> 566147 INFO  (zkCallback-810-thread-1) [    ] o.a.s.c.c.ConnectionManager Watcher org.apache.solr.common.cloud.ConnectionManager@3fda24aa name:ZooKeeperConnection Watcher:127.0.0.1:45106 got event WatchedEvent state:SyncConnected type:None path:null path:null type:None
   [junit4]   2> 566147 INFO  (TEST-ChaosMonkeySafeLeaderTest.test-seed#[20AFDC884E90DA3]) [    ] o.a.s.c.c.ConnectionManager Client is connected to ZooKeeper
   [junit4]   2> 566148 INFO  (TEST-ChaosMonkeySafeLeaderTest.test-seed#[20AFDC884E90DA3]) [    ] o.a.s.c.c.SolrZkClient Using default ZkACLProvider
   [junit4]   2> 566148 INFO  (TEST-ChaosMonkeySafeLeaderTest.test-seed#[20AFDC884E90DA3]) [n:127.0.0.1:55077__vm%2Fb    ] o.a.s.c.c.ConnectionManager Waiting for client to connect to ZooKeeper
   [junit4]   2> 566149 INFO  (zkCallback-811-thread-1-processing-n:127.0.0.1:55077__vm%2Fb) [n:127.0.0.1:55077__vm%2Fb    ] o.a.s.c.c.ConnectionManager Watcher org.apache.solr.common.cloud.ConnectionManager@36bfb58a name:ZooKeeperConnection Watcher:127.0.0.1:45106/solr got event WatchedEvent state:SyncConnected type:None path:null path:null type:None
   [junit4]   2> 566149 INFO  (TEST-ChaosMonkeySafeLeaderTest.test-seed#[20AFDC884E90DA3]) [n:127.0.0.1:55077__vm%2Fb    ] o.a.s.c.c.ConnectionManager Client is connected to ZooKeeper
   [junit4]   2> 566150 INFO  (TEST-ChaosMonkeySafeLeaderTest.test-seed#[20AFDC884E90DA3]) [n:127.0.0.1:55077__vm%2Fb    ] o.a.s.c.c.ZkStateReader Updating cluster state from ZooKeeper... 
   [junit4]   2> 567152 INFO  (TEST-ChaosMonkeySafeLeaderTest.test-seed#[20AFDC884E90DA3]) [n:127.0.0.1:55077__vm%2Fb    ] o.a.s.c.ZkController Register node as live in ZooKeeper:/live_nodes/127.0.0.1:55077__vm%2Fb
   [junit4]   2> 567152 INFO  (TEST-ChaosMonkeySafeLeaderTest.test-seed#[20AFDC884E90DA3]) [n:127.0.0.1:55077__vm%2Fb    ] o.a.s.c.c.SolrZkClient makePath: /live_nodes/127.0.0.1:55077__vm%2Fb
   [junit4]   2> 567154 INFO  (TEST-ChaosMonkeySafeLeaderTest.test-seed#[20AFDC884E90DA3]) [n:127.0.0.1:55077__vm%2Fb    ] o.a.s.c.Overseer Overseer (id=null) closing
   [junit4]   2> 567154 INFO  (TEST-ChaosMonkeySafeLeaderTest.test-seed#[20AFDC884E90DA3]) [n:127.0.0.1:55077__vm%2Fb    ] o.a.s.c.LeaderElector Joined leadership election with path: /overseer_elect/election/94269729132314632-127.0.0.1:55077__vm%2Fb-n_0000000001
   [junit4]   2> 567154 INFO  (TEST-ChaosMonkeySafeLeaderTest.test-seed#[20AFDC884E90DA3]) [n:127.0.0.1:55077__vm%2Fb    ] o.a.s.c.LeaderElector Watching path /overseer_elect/election/94269729132314628-127.0.0.1:58731__vm%2Fb-n_0000000000 to know if I could be the leader
   [junit4]   2> 567155 INFO  (TEST-ChaosMonkeySafeLeaderTest.test-seed#[20AFDC884E90DA3]) [n:127.0.0.1:55077__vm%2Fb    ] o.a.s.c.CoreContainer No authentication plugin used.
   [junit4]   2> 567155 INFO  (TEST-ChaosMonkeySafeLeaderTest.test-seed#[20AFDC884E90DA3]) [n:127.0.0.1:55077__vm%2Fb    ] o.a.s.c.CoreContainer Security conf doesn't exist. Skipping setup for authorization module.
   [junit4]   2> 567155 INFO  (TEST-ChaosMonkeySafeLeaderTest.test-seed#[20AFDC884E90DA3]) [n:127.0.0.1:55077__vm%2Fb    ] o.a.s.c.CoresLocator Looking for core definitions underneath /home/jenkins/workspace/Lucene-Solr-trunk-Linux/solr/build/solr-core/test/J2/temp/solr.cloud.ChaosMonkeySafeLeaderTest_20AFDC884E90DA3-001/shard-1-001/cores
   [junit4]   2> 567156 INFO  (TEST-ChaosMonkeySafeLeaderTest.test-seed#[20AFDC884E90DA3]) [n:127.0.0.1:55077__vm%2Fb    ] o.a.s.c.SolrCore Created CoreDescriptor: {name=collection1, config=solrconfig.xml, transient=false, schema=schema.xml, loadOnStartup=true, configSetProperties=configsetprops.json, instanceDir=/home/jenkins/workspace/Lucene-Solr-trunk-Linux/solr/build/solr-core/test/J2/temp/solr.cloud.ChaosMonkeySafeLeaderTest_20AFDC884E90DA3-001/shard-1-001/cores/collection1, collection=collection1, absoluteInstDir=/home/jenkins/workspace/Lucene-Solr-trunk-Linux/solr/build/solr-core/test/J2/temp/solr.cloud.ChaosMonkeySafeLeaderTest_20AFDC884E90DA3-001/shard-1-001/cores/collection1/, coreNodeName=, dataDir=data/, shard=}
   [junit4]   2> 567156 INFO  (TEST-ChaosMonkeySafeLeaderTest.test-seed#[20AFDC884E90DA3]) [n:127.0.0.1:55077__vm%2Fb    ] o.a.s.c.CoresLocator Found core collection1 in /home/jenkins/workspace/Lucene-Solr-trunk-Linux/solr/build/solr-core/test/J2/temp/solr.cloud.ChaosMonkeySafeLeaderTest_20AFDC884E90DA3-001/shard-1-001/cores/collection1/
   [junit4]   2> 567156 INFO  (TEST-ChaosMonkeySafeLeaderTest.test-seed#[20AFDC884E90DA3]) [n:127.0.0.1:55077__vm%2Fb    ] o.a.s.c.CoresLocator Found 1 core definitions
   [junit4]   2> 567157 INFO  (coreLoadExecutor-2233-thread-1-processing-n:127.0.0.1:55077__vm%2Fb) [n:127.0.0.1:55077__vm%2Fb c:collection1   x:collection1] o.a.s.c.ZkController publishing state=down
   [junit4]   2> 567157 INFO  (coreLoadExecutor-2233-thread-1-processing-n:127.0.0.1:55077__vm%2Fb) [n:127.0.0.1:55077__vm%2Fb c:collection1   x:collection1] o.a.s.c.ZkController numShards not found on descriptor - reading it from system property
   [junit4]   2> 567157 INFO  (TEST-ChaosMonkeySafeLeaderTest.test-seed#[20AFDC884E90DA3]) [n:127.0.0.1:55077__vm%2Fb    ] o.a.s.s.SolrDispatchFilter user.dir=/home/jenkins/workspace/Lucene-Solr-trunk-Linux/solr/build/solr-core/test/J2
   [junit4]   2> 567157 INFO  (TEST-ChaosMonkeySafeLeaderTest.test-seed#[20AFDC884E90DA3]) [n:127.0.0.1:55077__vm%2Fb    ] o.a.s.s.SolrDispatchFilter SolrDispatchFilter.init() done
   [junit4]   2> 567158 INFO  (zkCallback-805-thread-1-processing-n:127.0.0.1:58731__vm%2Fb) [n:127.0.0.1:58731__vm%2Fb    ] o.a.s.c.DistributedQueue NodeChildrenChanged fired on path /overseer/queue state SyncConnected
   [junit4]   2> 567158 INFO  (coreLoadExecutor-2233-thread-1-processing-n:127.0.0.1:55077__vm%2Fb) [n:127.0.0.1:55077__vm%2Fb c:collection1   x:collection1] o.a.s.c.ZkController look for our core node name
   [junit4]   2> 567158 INFO  (OverseerStateUpdate-94269729132314628-127.0.0.1:58731__vm%2Fb-n_0000000000) [n:127.0.0.1:58731__vm%2Fb    ] o.a.s.c.Overseer processMessage: queueSize: 1, message = {
   [junit4]   2>   "core":"collection1",
   [junit4]   2>   "roles":null,
   [junit4]   2>   "base_url":"http://127.0.0.1:55077/_vm/b",
   [junit4]   2>   "node_name":"127.0.0.1:55077__vm%2Fb",
   [junit4]   2>   "numShards":"3",
   [junit4]   2>   "state":"down",
   [junit4]   2>   "shard":null,
   [junit4]   2>   "collection":"collection1",
   [junit4]   2>   "operation":"state"} current state version: 3
   [junit4]   2> 567158 INFO  (OverseerStateUpdate-94269729132314628-127.0.0.1:58731__vm%2Fb-n_0000000000) [n:127.0.0.1:58731__vm%2Fb    ] o.a.s.c.o.ReplicaMutator Update state numShards=3 message={
   [junit4]   2>   "core":"collection1",
   [junit4]   2>   "roles":null,
   [junit4]   2>   "base_url":"http://127.0.0.1:55077/_vm/b",
   [junit4]   2>   "node_name":"127.0.0.1:55077__vm%2Fb",
   [junit4]   2>   "numShards":"3",
   [junit4]   2>   "state":"down",
   [junit4]   2>   "shard":null,
   [junit4]   2>   "collection":"collection1",
   [junit4]   2>   "operation":"state"}
   [junit4]   2> 567158 INFO  (OverseerStateUpdate-94269729132314628-127.0.0.1:58731__vm%2Fb-n_0000000000) [n:127.0.0.1:58731__vm%2Fb    ] o.a.s.c.o.ClusterStateMutator building a new cName: collection1
   [junit4]   2> 567159 INFO  (OverseerStateUpdate-94269729132314628-127.0.0.1:58731__vm%2Fb-n_0000000000) [n:127.0.0.1:58731__vm%2Fb    ] o.a.s.c.o.ReplicaMutator Assigning new node to shard shard=shard2
   [junit4]   2> 567260 INFO  (zkCallback-807-thread-1) [    ] o.a.s.c.c.ZkStateReader A cluster state change: WatchedEvent state:SyncConnected type:NodeDataChanged path:/clusterstate.json, has occurred - updating... (live nodes size: 2)
   [junit4]   2> 567260 INFO  (zkCallback-805-thread-1-processing-n:127.0.0.1:58731__vm%2Fb) [n:127.0.0.1:58731__vm%2Fb    ] o.a.s.c.c.ZkStateReader A cluster state change: WatchedEvent state:SyncConnected type:NodeDataChanged path:/clusterstate.json, has occurred - updating... (live nodes size: 2)
   [junit4]   2> 567261 INFO  (zkCallback-811-thread-1-processing-n:127.0.0.1:55077__vm%2Fb) [n:127.0.0.1:55077__vm%2Fb    ] o.a.s.c.c.ZkStateReader A cluster state change: WatchedEvent state:SyncConnected type:NodeDataChanged path:/clusterstate.json, has occurred - updating... (live nodes size: 2)
   [junit4]   2> 567263 INFO  (zkCallback-807-thread-1) [    ] o.a.s.c.c.ZkStateReader Updated cluster state version to 4
   [junit4]   2> 567263 INFO  (zkCallback-805-thread-1-processing-n:127.0.0.1:58731__vm%2Fb) [n:127.0.0.1:58731__vm%2Fb    ] o.a.s.c.c.ZkStateReader Updated cluster state version to 4
   [junit4]   2> 567263 INFO  (zkCallback-811-thread-1-processing-n:127.0.0.1:55077__vm%2Fb) [n:127.0.0.1:55077__vm%2Fb    ] o.a.s.c.c.ZkStateReader Updated cluster state version to 4
   [junit4]   2> 568158 INFO  (coreLoadExecutor-2233-thread-1-processing-n:127.0.0.1:55077__vm%2Fb) [n:127.0.0.1:55077__vm%2Fb c:collection1   x:collection1] o.a.s.c.ZkController waiting to find shard id in clusterstate for collection1
   [junit4]   2> 568158 INFO  (coreLoadExecutor-2233-thread-1-processing-n:127.0.0.1:55077__vm%2Fb) [n:127.0.0.1:55077__vm%2Fb c:collection1   x:collection1] o.a.s.c.ZkController Check for collection zkNode:collection1
   [junit4]   2> 568158 INFO  (coreLoadExecutor-2233-thread-1-processing-n:127.0.0.1:55077__vm%2Fb) [n:127.0.0.1:55077__vm%2Fb c:collection1   x:collection1] o.a.s.c.ZkController Collection zkNode exists
   [junit4]   2> 568159 INFO  (coreLoadExecutor-2233-thread-1-processing-n:127.0.0.1:55077__vm%2Fb) [n:127.0.0.1:55077__vm%2Fb c:collection1   x:collection1] o.a.s.c.c.ZkStateReader Load collection config from:/collections/collection1
   [junit4]   2> 568159 INFO  (coreLoadExecutor-2233-thread-1-processing-n:127.0.0.1:55077__vm%2Fb) [n:127.0.0.1:55077__vm%2Fb c:collection1   x:collection1] o.a.s.c.c.ZkStateReader path=/collections/collection1 configName=conf1 specified config exists in ZooKeeper
   [junit4]   2> 568159 INFO  (coreLoadExecutor-2233-thread-1-processing-n:127.0.0.1:55077__vm%2Fb) [n:127.0.0.1:55077__vm%2Fb c:collection1   x:collection1] o.a.s.c.SolrResourceLoader new SolrResourceLoader for directory: '/home/jenkins/workspace/Lucene-Solr-trunk-Linux/solr/build/solr-core/test/J2/temp/solr.cloud.ChaosMonkeySafeLeaderTest_20AFDC884E90DA3-001/shard-1-001/cores/collection1/'
   [junit4]   2> 568168 INFO  (coreLoadExecutor-2233-thread-1-processing-n:127.0.0.1:55077__vm%2Fb) [n:127.0.0.1:55077__vm%2Fb c:collection1   x:collection1] o.a.s.c.Config loaded config solrconfig.xml with version 0 
   [junit4]   2> 568173 INFO  (coreLoadExecutor-2233-thread-1-processing-n:127.0.0.1:55077__vm%2Fb) [n:127.0.0.1:55077__vm%2Fb c:collection1   x:collection1] o.a.s.c.SolrConfig current version of requestparams : -1
   [junit4]   2> 568193 INFO  (coreLoadExecutor-2233-thread-1-processing-n:127.0.0.1:55077__vm%2Fb) [n:127.0.0.1:55077__vm%2Fb c:collection1   x:collection1] o.a.s.c.SolrConfig Using Lucene MatchVersion: 6.0.0
   [junit4]   2> 568203 INFO  (coreLoadExecutor-2233-thread-1-processing-n:127.0.0.1:55077__vm%2Fb) [n:127.0.0.1:55077__vm%2Fb c:collection1   x:collection1] o.a.s.c.Config Loaded SolrConfig: solrconfig.xml
   [junit4]   2> 568204 INFO  (coreLoadExecutor-2233-thread-1-processing-n:127.0.0.1:55077__vm%2Fb) [n:127.0.0.1:55077__vm%2Fb c:collection1   x:collection1] o.a.s.s.IndexSchema Reading Solr Schema from /configs/conf1/schema.xml
   [junit4]   2> 568208 INFO  (coreLoadExecutor-2233-thread-1-processing-n:127.0.0.1:55077__vm%2Fb) [n:127.0.0.1:55077__vm%2Fb c:collection1   x:collection1] o.a.s.s.IndexSchema [collection1] Schema name=test
   [junit4]   2> 568285 INFO  (coreLoadExecutor-2233-thread-1-processing-n:127.0.0.1:55077__vm%2Fb) [n:127.0.0.1:55077__vm%2Fb c:collection1   x:collection1] o.a.s.s.IndexSchema default search field in schema is text
   [junit4]   2> 568286 INFO  (coreLoadExecutor-2233-thread-1-processing-n:127.0.0.1:55077__vm%2Fb) [n:127.0.0.1:55077__vm%2Fb c:collection1   x:collection1] o.a.s.s.IndexSchema unique key field: id
   [junit4]   2> 568287 INFO  (coreLoadExecutor-2233-thread-1-processing-n:127.0.0.1:55077__vm%2Fb) [n:127.0.0.1:55077__vm%2Fb c:collection1   x:collection1] o.a.s.s.FileExchangeRateProvider Reloading exchange rates from file currency.xml
   [junit4]   2> 568289 INFO  (coreLoadExecutor-2233-thread-1-processing-n:127.0.0.1:55077__vm%2Fb) [n:127.0.0.1:55077__vm%2Fb c:collection1   x:collection1] o.a.s.s.FileExchangeRateProvider Reloading exchange rates from file currency.xml
   [junit4]   2> 568304 INFO  (coreLoadExecutor-2233-thread-1-processing-n:127.0.0.1:55077__vm%2Fb) [n:127.0.0.1:55077__vm%2Fb c:collection1   x:collection1] o.a.s.c.ConfigSetProperties Did not find ConfigSet properties, assuming default properties: Can't find resource 'configsetprops.json' in classpath or '/configs/conf1', cwd=/home/jenkins/workspace/Lucene-Solr-trunk-Linux/solr/build/solr-core/test/J2
   [junit4]   2> 568305 INFO  (coreLoadExecutor-2233-thread-1-processing-n:127.0.0.1:55077__vm%2Fb) [n:127.0.0.1:55077__vm%2Fb c:collection1   x:collection1] o.a.s.c.CoreContainer Creating SolrCore 'collection1' using configuration from collection collection1
   [junit4]   2> 568305 INFO  (coreLoadExecutor-2233-thread-1-processing-n:127.0.0.1:55077__vm%2Fb) [n:127.0.0.1:55077__vm%2Fb c:collection1 s:shard2 r:core_node1 x:collection1] o.a.s.c.SolrCore solr.StandardDirectoryFactory
   [junit4]   2> 568305 INFO  (coreLoadExecutor-2233-thread-1-processing-n:127.0.0.1:55077__vm%2Fb) [n:127.0.0.1:55077__vm%2Fb c:collection1 s:shard2 r:core_node1 x:collection1] o.a.s.c.SolrCore [[collection1] ] Opening new SolrCore at [/home/jenkins/workspace/Lucene-Solr-trunk-Linux/solr/build/solr-core/test/J2/temp/solr.cloud.ChaosMonkeySafeLeaderTest_20AFDC884E90DA3-001/shard-1-001/cores/collection1/], dataDir=[null]
   [junit4]   2> 568305 INFO  (coreLoadExecutor-2233-thread-1-processing-n:127.0.0.1:55077__vm%2Fb) [n:127.0.0.1:55077__vm%2Fb c:collection1 s:shard2 r:core_node1 x:collection1] o.a.s.c.JmxMonitoredMap JMX monitoring is enabled. Adding Solr mbeans to JMX Server: com.sun.jmx.mbeanserver.JmxMBeanServer@1f5b1e68
   [junit4]   2> 568306 INFO  (coreLoadExecutor-2233-thread-1-processing-n:127.0.0.1:55077__vm%2Fb) [n:127.0.0.1:55077__vm%2Fb c:collection1 s:shard2 r:core_node1 x:collection1] o.a.s.c.CachingDirectoryFactory return new directory for /home/jenkins/workspace/Lucene-Solr-trunk-Linux/solr/build/solr-core/test/J2/temp/solr.cloud.ChaosMonkeySafeLeaderTest_20AFDC884E90DA3-001/shard-1-001/cores/collection1/data
   [junit4]   2> 568306 INFO  (coreLoadExecutor-2233-thread-1-processing-n:127.0.0.1:55077__vm%2Fb) [n:127.0.0.1:55077__vm%2Fb c:collection1 s:shard2 r:core_node1 x:collection1] o.a.s.c.SolrCore New index directory detected: old=null new=/home/jenkins/workspace/Lucene-Solr-trunk-Linux/solr/build/solr-core/test/J2/temp/solr.cloud.ChaosMonkeySafeLeaderTest_20AFDC884E90DA3-001/shard-1-001/cores/collection1/data/index/
   [junit4]   2> 568306 WARN  (coreLoadExecutor-2233-thread-1-processing-n:127.0.0.1:55077__vm%2Fb) [n:127.0.0.1:55077__vm%2Fb c:collection1 s:shard2 r:core_node1 x:collection1] o.a.s.c.SolrCore [collection1] Solr index directory '/home/jenkins/workspace/Lucene-Solr-trunk-Linux/solr/build/solr-core/test/J2/temp/solr.cloud.ChaosMonkeySafeLeaderTest_20AFDC884E90DA3-001/shard-1-001/cores/collection1/data/index' doesn't exist. Creating new index...
   [junit4]   2> 568307 INFO  (coreLoadExecutor-2233-thread-1-processing-n:127.0.0.1:55077__vm%2Fb) [n:127.0.0.1:55077__vm%2Fb c:collection1 s:shard2 r:core_node1 x:collection1] o.a.s.c.CachingDirectoryFactory return new directory for /home/jenkins/workspace/Lucene-Solr-trunk-Linux/solr/build/solr-core/test/J2/temp/solr.cloud.ChaosMonkeySafeLeaderTest_20AFDC884E90DA3-001/shard-1-001/cores/collection1/data/index
   [junit4]   2> 568307 INFO  (coreLoadExecutor-2233-thread-1-processing-n:127.0.0.1:55077__vm%2Fb) [n:127.0.0.1:55077__vm%2Fb c:collection1 s:shard2 r:core_node1 x:collection1] o.a.s.u.RandomMergePolicy RandomMergePolicy wrapping class org.apache.lucene.index.LogByteSizeMergePolicy: [LogByteSizeMergePolicy: minMergeSize=1677721, mergeFactor=49, maxMergeSize=2147483648, maxMergeSizeForForcedMerge=9223372036854775807, calibrateSizeByDeletes=false, maxMergeDocs=2147483647, maxCFSSegmentSizeMB=8.796093022207999E12, noCFSRatio=0.12961134836078517]
   [junit4]   2> 568323 INFO  (coreLoadExecutor-2233-thread-1-processing-n:127.0.0.1:55077__vm%2Fb) [n:127.0.0.1:55077__vm%2Fb c:collection1 s:shard2 r:core_node1 x:collection1] o.a.s.c.SolrCore SolrDeletionPolicy.onCommit: commits: num=1
   [junit4]   2> 	commit{dir=/home/jenkins/workspace/Lucene-Solr-trunk-Linux/solr/build/solr-core/test/J2/temp/solr.cloud.ChaosMonkeySafeLeaderTest_20AFDC884E90DA3-001/shard-1-001/cores/collection1/data/index,segFN=segments_1,generation=1}
   [junit4]   2> 568323 INFO  (coreLoadExecutor-2233-thread-1-processing-n:127.0.0.1:55077__vm%2Fb) [n:127.0.0.1:55077__vm%2Fb c:collection1 s:shard2 r:core_node1 x:collection1] o.a.s.c.SolrCore newest commit generation = 1
   [junit4]   2> 568324 INFO  (OldIndexDirectoryCleanupThreadForCore-collection1) [n:127.0.0.1:55077__vm%2Fb c:collection1 s:shard2 r:core_node1 x:collection1] o.a.s.c.SolrCore Looking for old index directories to cleanup for core collection1 in /home/jenkins/workspace/Lucene-Solr-trunk-Linux/solr/build/solr-core/test/J2/temp/solr.cloud.ChaosMonkeySafeLeaderTest_20AFDC884E90DA3-001/shard-1-001/cores/collection1/data/
   [junit4]   2> 568327 INFO  (coreLoadExecutor-2233-thread-1-processing-n:127.0.0.1:55077__vm%2Fb) [n:127.0.0.1:55077__vm%2Fb c:collection1 s:shard2 r:core_node1 x:collection1] o.a.s.u.p.UpdateRequestProcessorChain creating updateRequestProcessorChain "nodistrib"
   [junit4]   2> 568327 INFO  (coreLoadExecutor-2233-thread-1-processing-n:127.0.0.1:55077__vm%2Fb) [n:127.0.0.1:55077__vm%2Fb c:collection1 s:shard2 r:core_node1 x:collection1] o.a.s.u.p.UpdateRequestProcessorChain creating updateRequestProcessorChain "dedupe"
   [junit4]   2> 568327 INFO  (coreLoadExecutor-2233-thread-1-processing-n:127.0.0.1:55077__vm%2Fb) [n:127.0.0.1:55077__vm%2Fb c:collection1 s:shard2 r:core_node1 x:collection1] o.a.s.u.p.UpdateRequestProcessorChain inserting DistributedUpdateProcessorFactory into updateRequestProcessorChain "dedupe"
   [junit4]   2> 568328 INFO  (coreLoadExecutor-2233-thread-1-processing-n:127.0.0.1:55077__vm%2Fb) [n:127.0.0.1:55077__vm%2Fb c:collection1 s:shard2 r:core_node1 x:collection1] o.a.s.u.p.UpdateRequestProcessorChain creating updateRequestProcessorChain "stored_sig"
   [junit4]   2> 568328 INFO  (coreLoadExecutor-2233-thread-1-processing-n:127.0.0.1:55077__vm%2Fb) [n:127.0.0.1:55077__vm%2Fb c:collection1 s:shard2 r:core_node1 x:collection1] o.a.s.u.p.UpdateRequestProcessorChain inserting DistributedUpdateProcessorFactory into updateRequestProcessorChain "stored_sig"
   [junit4]   2> 568328 INFO  (coreLoadExecutor-2233-thread-1-processing-n:127.0.0.1:55077__vm%2Fb) [n:127.0.0.1:55077__vm%2Fb c:collection1 s:shard2 r:core_node1 x:collection1] o.a.s.u.p.UpdateRequestProcessorChain creating updateRequestProcessorChain "distrib-dup-test-chain-explicit"
   [junit4]   2> 568328 INFO  (coreLoadExecutor-2233-thread-1-processing-n:127.0.0.1:55077__vm%2Fb) [n:127.0.0.1:55077__vm%2Fb c:collection1 s:shard2 r:core_node1 x:collection1] o.a.s.u.p.UpdateRequestProcessorChain creating updateRequestProcessorChain "distrib-dup-test-chain-implicit"
   [junit4]   2> 568328 INFO  (coreLoadExecutor-2233-thread-1-processing-n:127.0.0.1:55077__vm%2Fb) [n:127.0.0.1:55077__vm%2Fb c:collection1 s:sh

[...truncated too long message...]

ion1] o.a.s.u.SolrCoreState Closing SolrCoreState
   [junit4]   2> 591174 INFO  (zkCallback-828-thread-1-processing-n:127.0.0.1:32931__vm%2Fb) [n:127.0.0.1:32931__vm%2Fb c:collection1 s:shard3 r:core_node5 x:collection1] o.a.s.u.DefaultSolrCoreState SolrCoreState ref count has reached 0 - closing IndexWriter
   [junit4]   2> 591174 INFO  (zkCallback-828-thread-1-processing-n:127.0.0.1:32931__vm%2Fb) [n:127.0.0.1:32931__vm%2Fb c:collection1 s:shard3 r:core_node5 x:collection1] o.a.s.u.DefaultSolrCoreState closing IndexWriter with IndexWriterCloser
   [junit4]   2> 591175 INFO  (zkCallback-828-thread-1-processing-n:127.0.0.1:32931__vm%2Fb) [n:127.0.0.1:32931__vm%2Fb c:collection1 s:shard3 r:core_node5 x:collection1] o.a.s.c.SolrCore [collection1] Closing main searcher on request.
   [junit4]   2> 591183 INFO  (zkCallback-828-thread-1-processing-n:127.0.0.1:32931__vm%2Fb) [n:127.0.0.1:32931__vm%2Fb c:collection1 s:shard3 r:core_node5 x:collection1] o.a.s.c.CachingDirectoryFactory Closing StandardDirectoryFactory - 2 directories currently being tracked
   [junit4]   2> 591183 INFO  (zkCallback-828-thread-1-processing-n:127.0.0.1:32931__vm%2Fb) [n:127.0.0.1:32931__vm%2Fb c:collection1 s:shard3 r:core_node5 x:collection1] o.a.s.c.CachingDirectoryFactory looking to close /home/jenkins/workspace/Lucene-Solr-trunk-Linux/solr/build/solr-core/test/J2/temp/solr.cloud.ChaosMonkeySafeLeaderTest_20AFDC884E90DA3-001/shard-5-001/cores/collection1/data/index [CachedDir<<refCount=0;path=/home/jenkins/workspace/Lucene-Solr-trunk-Linux/solr/build/solr-core/test/J2/temp/solr.cloud.ChaosMonkeySafeLeaderTest_20AFDC884E90DA3-001/shard-5-001/cores/collection1/data/index;done=false>>]
   [junit4]   2> 591183 INFO  (zkCallback-828-thread-1-processing-n:127.0.0.1:32931__vm%2Fb) [n:127.0.0.1:32931__vm%2Fb c:collection1 s:shard3 r:core_node5 x:collection1] o.a.s.c.CachingDirectoryFactory Closing directory: /home/jenkins/workspace/Lucene-Solr-trunk-Linux/solr/build/solr-core/test/J2/temp/solr.cloud.ChaosMonkeySafeLeaderTest_20AFDC884E90DA3-001/shard-5-001/cores/collection1/data/index
   [junit4]   2> 591183 INFO  (zkCallback-828-thread-1-processing-n:127.0.0.1:32931__vm%2Fb) [n:127.0.0.1:32931__vm%2Fb c:collection1 s:shard3 r:core_node5 x:collection1] o.a.s.c.CachingDirectoryFactory looking to close /home/jenkins/workspace/Lucene-Solr-trunk-Linux/solr/build/solr-core/test/J2/temp/solr.cloud.ChaosMonkeySafeLeaderTest_20AFDC884E90DA3-001/shard-5-001/cores/collection1/data [CachedDir<<refCount=0;path=/home/jenkins/workspace/Lucene-Solr-trunk-Linux/solr/build/solr-core/test/J2/temp/solr.cloud.ChaosMonkeySafeLeaderTest_20AFDC884E90DA3-001/shard-5-001/cores/collection1/data;done=false>>]
   [junit4]   2> 591183 INFO  (zkCallback-828-thread-1-processing-n:127.0.0.1:32931__vm%2Fb) [n:127.0.0.1:32931__vm%2Fb c:collection1 s:shard3 r:core_node5 x:collection1] o.a.s.c.CachingDirectoryFactory Closing directory: /home/jenkins/workspace/Lucene-Solr-trunk-Linux/solr/build/solr-core/test/J2/temp/solr.cloud.ChaosMonkeySafeLeaderTest_20AFDC884E90DA3-001/shard-5-001/cores/collection1/data
   [junit4]   2> 591767 WARN  (zkCallback-828-thread-2-processing-n:127.0.0.1:32931__vm%2Fb) [n:127.0.0.1:32931__vm%2Fb    ] o.a.s.c.c.ZkStateReader ZooKeeper watch triggered, but Solr cannot talk to ZK
   [junit4]   2> 591768 INFO  (TEST-ChaosMonkeySafeLeaderTest.test-seed#[20AFDC884E90DA3]) [    ] o.e.j.s.ServerConnector Stopped ServerConnector@6fa4a633{HTTP/1.1}{127.0.0.1:0}
   [junit4]   2> 591769 INFO  (TEST-ChaosMonkeySafeLeaderTest.test-seed#[20AFDC884E90DA3]) [    ] o.e.j.s.h.ContextHandler Stopped o.e.j.s.ServletContextHandler@7d9e01b0{/_vm/b,null,UNAVAILABLE}
   [junit4]   2> 591769 INFO  (TEST-ChaosMonkeySafeLeaderTest.test-seed#[20AFDC884E90DA3]) [n:127.0.0.1:32931__vm%2Fb c:collection1 s:shard3 r:core_node5 x:collection1] o.a.s.c.ZkTestServer connecting to 127.0.0.1:45106 45106
   [junit4]   2> 591776 INFO  (Thread-1645) [    ] o.a.s.c.ZkTestServer connecting to 127.0.0.1:45106 45106
   [junit4]   2> 591777 WARN  (Thread-1645) [    ] o.a.s.c.ZkTestServer Watch limit violations: 
   [junit4]   2> Maximum concurrent create/delete watches above limit:
   [junit4]   2> 
   [junit4]   2> 	7	/solr/aliases.json
   [junit4]   2> 	7	/solr/clusterstate.json
   [junit4]   2> 	6	/solr/configs/conf1
   [junit4]   2> 
   [junit4]   2> Maximum concurrent data watches above limit:
   [junit4]   2> 
   [junit4]   2> 	2	/solr/overseer_elect/election/94269729132314638-127.0.0.1:59611__vm%2Fb-n_0000000003
   [junit4]   2> 
   [junit4]   2> Maximum concurrent children watches above limit:
   [junit4]   2> 
   [junit4]   2> 	7	/solr/live_nodes
   [junit4]   2> 	4	/solr/overseer/queue
   [junit4]   2> 	4	/solr/overseer/collection-queue-work
   [junit4]   2> 
   [junit4]   2> NOTE: reproduce with: ant test  -Dtestcase=ChaosMonkeySafeLeaderTest -Dtests.method=test -Dtests.seed=20AFDC884E90DA3 -Dtests.multiplier=3 -Dtests.slow=true -Dtests.locale=es_VE -Dtests.timezone=America/Puerto_Rico -Dtests.asserts=true -Dtests.file.encoding=ISO-8859-1
   [junit4] FAILURE 27.4s J2 | ChaosMonkeySafeLeaderTest.test <<<
   [junit4]    > Throwable #1: java.lang.AssertionError: expected:<0> but was:<1>
   [junit4]    > 	at __randomizedtesting.SeedInfo.seed([20AFDC884E90DA3:8A5EC2122A15605B]:0)
   [junit4]    > 	at org.apache.solr.cloud.ChaosMonkeySafeLeaderTest.test(ChaosMonkeySafeLeaderTest.java:156)
   [junit4]    > 	at org.apache.solr.BaseDistributedSearchTestCase$ShardsRepeatRule$ShardsFixedStatement.callStatement(BaseDistributedSearchTestCase.java:966)
   [junit4]    > 	at org.apache.solr.BaseDistributedSearchTestCase$ShardsRepeatRule$ShardsStatement.evaluate(BaseDistributedSearchTestCase.java:941)
   [junit4]    > 	at java.lang.Thread.run(Thread.java:745)
   [junit4]   2> 591780 INFO  (SUITE-ChaosMonkeySafeLeaderTest-seed#[20AFDC884E90DA3]-worker) [n:127.0.0.1:32931__vm%2Fb c:collection1 s:shard3 r:core_node5 x:collection1] o.a.s.SolrTestCaseJ4 ###deleteCore
   [junit4]   2> NOTE: leaving temporary files on disk at: /home/jenkins/workspace/Lucene-Solr-trunk-Linux/solr/build/solr-core/test/J2/temp/solr.cloud.ChaosMonkeySafeLeaderTest_20AFDC884E90DA3-001
   [junit4]   2> Aug 01, 2015 3:12:19 PM com.carrotsearch.randomizedtesting.ThreadLeakControl checkThreadLeaks
   [junit4]   2> WARNING: Will linger awaiting termination of 1 leaked thread(s).
   [junit4]   2> NOTE: test params are: codec=Asserting(Lucene53): {rnd_b=PostingsFormat(name=LuceneVarGapDocFreqInterval), _version_=PostingsFormat(name=Direct), a_t=PostingsFormat(name=Direct), a_i=PostingsFormat(name=LuceneVarGapDocFreqInterval), id=PostingsFormat(name=LuceneVarGapDocFreqInterval)}, docValues:{}, sim=RandomSimilarityProvider(queryNorm=false,coord=crazy): {}, locale=es_VE, timezone=America/Puerto_Rico
   [junit4]   2> NOTE: Linux 3.16.0-44-generic amd64/Oracle Corporation 1.9.0-ea (64-bit)/cpus=12,threads=1,free=182542928,total=515899392
   [junit4]   2> NOTE: All tests run in this JVM: [SoftAutoCommitTest, RollingRestartTest, TestReRankQParserPlugin, TestCSVResponseWriter, TestCollectionAPI, TestFastOutputStream, TestJettySolrRunner, TestSurroundQueryParser, TestSearcherReuse, TestRecovery, PolyFieldTest, PathHierarchyTokenizerFactoryTest, TestTrie, AddSchemaFieldsUpdateProcessorFactoryTest, TestFieldResource, TestStressRecovery, TestReload, LeaderElectionTest, OutputWriterTest, TestUtils, TestScoreJoinQPNoScore, TestRandomMergePolicy, AssignTest, QueryResultKeyTest, TriLevelCompositeIdRoutingTest, TestAuthenticationFramework, NotRequiredUniqueKeyTest, PluginInfoTest, RulesTest, SpellCheckCollatorTest, HighlighterMaxOffsetTest, TestOrdValues, TestConfigSetProperties, DataDrivenBlockJoinTest, SearchHandlerTest, TestCursorMarkWithoutUniqueKey, PrimUtilsTest, TestQueryTypes, TestPerFieldSimilarity, FacetPivotSmallTest, TestCollationField, DistributedQueueTest, TestLuceneMatchVersion, PreAnalyzedUpdateProcessorTest, OverseerTest, BadCopyFieldTest, CdcrUpdateLogTest, TestAnalyzeInfixSuggestions, TestDefaultSearchFieldResource, HdfsLockFactoryTest, FullHLLTest, MoreLikeThisHandlerTest, TestZkChroot, TestSQLHandler, TestCustomDocTransformer, TestPseudoReturnFields, CdcrVersionReplicationTest, TestSolrQueryParser, SSLMigrationTest, TestDefaultSimilarityFactory, RegexBoostProcessorTest, SolrInfoMBeanTest, SOLR749Test, DOMUtilTest, TestCrossCoreJoin, TestSolrQueryParserResource, SortByFunctionTest, DocValuesTest, TestCollationFieldDocValues, TestExactStatsCache, TestBM25SimilarityFactory, RecoveryZkTest, TestOverriddenPrefixQueryForCustomFieldType, TestImplicitCoreProperties, TestQueryUtils, XmlUpdateRequestHandlerTest, AliasIntegrationTest, TestReplicaProperties, HLLUtilTest, SampleTest, CircularListTest, ChaosMonkeySafeLeaderTest]
   [junit4] Completed [193/529] on J2 in 28.41s, 1 test, 1 failure <<< FAILURES!

[...truncated 1073 lines...]
BUILD FAILED
/home/jenkins/workspace/Lucene-Solr-trunk-Linux/build.xml:716: The following error occurred while executing this line:
/home/jenkins/workspace/Lucene-Solr-trunk-Linux/build.xml:660: The following error occurred while executing this line:
/home/jenkins/workspace/Lucene-Solr-trunk-Linux/build.xml:59: The following error occurred while executing this line:
/home/jenkins/workspace/Lucene-Solr-trunk-Linux/solr/build.xml:230: The following error occurred while executing this line:
/home/jenkins/workspace/Lucene-Solr-trunk-Linux/solr/common-build.xml:514: The following error occurred while executing this line:
/home/jenkins/workspace/Lucene-Solr-trunk-Linux/lucene/common-build.xml:1429: The following error occurred while executing this line:
/home/jenkins/workspace/Lucene-Solr-trunk-Linux/lucene/common-build.xml:984: There were test failures: 529 suites, 2092 tests, 1 failure, 65 ignored (30 assumptions)

Total time: 46 minutes 5 seconds
Build step 'Invoke Ant' marked build as failure
Archiving artifacts
Recording test results
Email was triggered for: Failure - Any
Sending email for trigger: Failure - Any



Mime
View raw message