lucene-dev mailing list archives

Site index · List index
Message view « Date » · « Thread »
Top « Date » · « Thread »
From Policeman Jenkins Server <jenk...@thetaphi.de>
Subject [JENKINS] Lucene-Solr-5.x-Linux (64bit/jdk1.7.0_80) - Build # 13722 - Failure!
Date Wed, 26 Aug 2015 01:13:51 GMT
Build: http://jenkins.thetaphi.de/job/Lucene-Solr-5.x-Linux/13722/
Java: 64bit/jdk1.7.0_80 -XX:+UseCompressedOops -XX:+UseParallelGC

1 tests failed.
FAILED:  junit.framework.TestSuite.org.apache.solr.cloud.HttpPartitionTest

Error Message:
ObjectTracker found 1 object(s) that were not released!!! [TransactionLog]

Stack Trace:
java.lang.AssertionError: ObjectTracker found 1 object(s) that were not released!!! [TransactionLog]
	at __randomizedtesting.SeedInfo.seed([54E2F8D778502A82]:0)
	at org.junit.Assert.fail(Assert.java:93)
	at org.junit.Assert.assertTrue(Assert.java:43)
	at org.junit.Assert.assertNull(Assert.java:551)
	at org.apache.solr.SolrTestCaseJ4.afterClass(SolrTestCaseJ4.java:236)
	at sun.reflect.GeneratedMethodAccessor37.invoke(Unknown Source)
	at sun.reflect.DelegatingMethodAccessorImpl.invoke(DelegatingMethodAccessorImpl.java:43)
	at java.lang.reflect.Method.invoke(Method.java:606)
	at com.carrotsearch.randomizedtesting.RandomizedRunner.invoke(RandomizedRunner.java:1627)
	at com.carrotsearch.randomizedtesting.RandomizedRunner$5.evaluate(RandomizedRunner.java:799)
	at com.carrotsearch.randomizedtesting.rules.StatementAdapter.evaluate(StatementAdapter.java:36)
	at com.carrotsearch.randomizedtesting.rules.SystemPropertiesRestoreRule$1.evaluate(SystemPropertiesRestoreRule.java:57)
	at org.apache.lucene.util.AbstractBeforeAfterRule$1.evaluate(AbstractBeforeAfterRule.java:46)
	at com.carrotsearch.randomizedtesting.rules.StatementAdapter.evaluate(StatementAdapter.java:36)
	at org.apache.lucene.util.TestRuleStoreClassName$1.evaluate(TestRuleStoreClassName.java:42)
	at com.carrotsearch.randomizedtesting.rules.NoShadowingOrOverridesOnMethodsRule$1.evaluate(NoShadowingOrOverridesOnMethodsRule.java:39)
	at com.carrotsearch.randomizedtesting.rules.NoShadowingOrOverridesOnMethodsRule$1.evaluate(NoShadowingOrOverridesOnMethodsRule.java:39)
	at com.carrotsearch.randomizedtesting.rules.StatementAdapter.evaluate(StatementAdapter.java:36)
	at com.carrotsearch.randomizedtesting.rules.StatementAdapter.evaluate(StatementAdapter.java:36)
	at com.carrotsearch.randomizedtesting.rules.StatementAdapter.evaluate(StatementAdapter.java:36)
	at org.apache.lucene.util.TestRuleAssertionsRequired$1.evaluate(TestRuleAssertionsRequired.java:54)
	at org.apache.lucene.util.TestRuleMarkFailure$1.evaluate(TestRuleMarkFailure.java:48)
	at org.apache.lucene.util.TestRuleIgnoreAfterMaxFailures$1.evaluate(TestRuleIgnoreAfterMaxFailures.java:65)
	at org.apache.lucene.util.TestRuleIgnoreTestSuites$1.evaluate(TestRuleIgnoreTestSuites.java:55)
	at com.carrotsearch.randomizedtesting.rules.StatementAdapter.evaluate(StatementAdapter.java:36)
	at com.carrotsearch.randomizedtesting.ThreadLeakControl$StatementRunner.run(ThreadLeakControl.java:365)
	at java.lang.Thread.run(Thread.java:745)




Build Log:
[...truncated 10079 lines...]
   [junit4] Suite: org.apache.solr.cloud.HttpPartitionTest
   [junit4]   2> Creating dataDir: /home/jenkins/workspace/Lucene-Solr-5.x-Linux/solr/build/solr-core/test/J2/temp/solr.cloud.HttpPartitionTest_54E2F8D778502A82-001/init-core-data-001
   [junit4]   2> 397480 INFO  (SUITE-HttpPartitionTest-seed#[54E2F8D778502A82]-worker) [    ] o.a.s.BaseDistributedSearchTestCase Setting hostContext system property: /p_cwr/sw
   [junit4]   2> 397482 INFO  (TEST-HttpPartitionTest.test-seed#[54E2F8D778502A82]) [    ] o.a.s.c.ZkTestServer STARTING ZK TEST SERVER
   [junit4]   2> 397483 INFO  (Thread-771) [    ] o.a.s.c.ZkTestServer client port:0.0.0.0/0.0.0.0:0
   [junit4]   2> 397483 INFO  (Thread-771) [    ] o.a.s.c.ZkTestServer Starting server
   [junit4]   2> 397583 INFO  (TEST-HttpPartitionTest.test-seed#[54E2F8D778502A82]) [    ] o.a.s.c.ZkTestServer start zk server on port:35927
   [junit4]   2> 397583 INFO  (TEST-HttpPartitionTest.test-seed#[54E2F8D778502A82]) [    ] o.a.s.c.c.SolrZkClient Using default ZkCredentialsProvider
   [junit4]   2> 397584 INFO  (TEST-HttpPartitionTest.test-seed#[54E2F8D778502A82]) [    ] o.a.s.c.c.ConnectionManager Waiting for client to connect to ZooKeeper
   [junit4]   2> 397586 INFO  (zkCallback-255-thread-1) [    ] o.a.s.c.c.ConnectionManager Watcher org.apache.solr.common.cloud.ConnectionManager@5357231d name:ZooKeeperConnection Watcher:127.0.0.1:35927 got event WatchedEvent state:SyncConnected type:None path:null path:null type:None
   [junit4]   2> 397586 INFO  (TEST-HttpPartitionTest.test-seed#[54E2F8D778502A82]) [    ] o.a.s.c.c.ConnectionManager Client is connected to ZooKeeper
   [junit4]   2> 397586 INFO  (TEST-HttpPartitionTest.test-seed#[54E2F8D778502A82]) [    ] o.a.s.c.c.SolrZkClient Using default ZkACLProvider
   [junit4]   2> 397587 INFO  (TEST-HttpPartitionTest.test-seed#[54E2F8D778502A82]) [    ] o.a.s.c.c.SolrZkClient makePath: /solr
   [junit4]   2> 397588 INFO  (TEST-HttpPartitionTest.test-seed#[54E2F8D778502A82]) [    ] o.a.s.c.c.SolrZkClient Using default ZkCredentialsProvider
   [junit4]   2> 397589 INFO  (TEST-HttpPartitionTest.test-seed#[54E2F8D778502A82]) [    ] o.a.s.c.c.ConnectionManager Waiting for client to connect to ZooKeeper
   [junit4]   2> 397590 INFO  (zkCallback-256-thread-1) [    ] o.a.s.c.c.ConnectionManager Watcher org.apache.solr.common.cloud.ConnectionManager@39e3efd7 name:ZooKeeperConnection Watcher:127.0.0.1:35927/solr got event WatchedEvent state:SyncConnected type:None path:null path:null type:None
   [junit4]   2> 397590 INFO  (TEST-HttpPartitionTest.test-seed#[54E2F8D778502A82]) [    ] o.a.s.c.c.ConnectionManager Client is connected to ZooKeeper
   [junit4]   2> 397590 INFO  (TEST-HttpPartitionTest.test-seed#[54E2F8D778502A82]) [    ] o.a.s.c.c.SolrZkClient Using default ZkACLProvider
   [junit4]   2> 397591 INFO  (TEST-HttpPartitionTest.test-seed#[54E2F8D778502A82]) [    ] o.a.s.c.c.SolrZkClient makePath: /collections/collection1
   [junit4]   2> 397592 INFO  (TEST-HttpPartitionTest.test-seed#[54E2F8D778502A82]) [    ] o.a.s.c.c.SolrZkClient makePath: /collections/collection1/shards
   [junit4]   2> 397592 INFO  (TEST-HttpPartitionTest.test-seed#[54E2F8D778502A82]) [    ] o.a.s.c.c.SolrZkClient makePath: /collections/control_collection
   [junit4]   2> 397593 INFO  (TEST-HttpPartitionTest.test-seed#[54E2F8D778502A82]) [    ] o.a.s.c.c.SolrZkClient makePath: /collections/control_collection/shards
   [junit4]   2> 397593 INFO  (TEST-HttpPartitionTest.test-seed#[54E2F8D778502A82]) [    ] o.a.s.c.AbstractZkTestCase put /home/jenkins/workspace/Lucene-Solr-5.x-Linux/solr/core/src/test-files/solr/collection1/conf/solrconfig-tlog.xml to /configs/conf1/solrconfig.xml
   [junit4]   2> 397593 INFO  (TEST-HttpPartitionTest.test-seed#[54E2F8D778502A82]) [    ] o.a.s.c.c.SolrZkClient makePath: /configs/conf1/solrconfig.xml
   [junit4]   2> 397594 INFO  (TEST-HttpPartitionTest.test-seed#[54E2F8D778502A82]) [    ] o.a.s.c.AbstractZkTestCase put /home/jenkins/workspace/Lucene-Solr-5.x-Linux/solr/core/src/test-files/solr/collection1/conf/schema.xml to /configs/conf1/schema.xml
   [junit4]   2> 397595 INFO  (TEST-HttpPartitionTest.test-seed#[54E2F8D778502A82]) [    ] o.a.s.c.c.SolrZkClient makePath: /configs/conf1/schema.xml
   [junit4]   2> 397595 INFO  (TEST-HttpPartitionTest.test-seed#[54E2F8D778502A82]) [    ] o.a.s.c.AbstractZkTestCase put /home/jenkins/workspace/Lucene-Solr-5.x-Linux/solr/core/src/test-files/solr/collection1/conf/solrconfig.snippet.randomindexconfig.xml to /configs/conf1/solrconfig.snippet.randomindexconfig.xml
   [junit4]   2> 397596 INFO  (TEST-HttpPartitionTest.test-seed#[54E2F8D778502A82]) [    ] o.a.s.c.c.SolrZkClient makePath: /configs/conf1/solrconfig.snippet.randomindexconfig.xml
   [junit4]   2> 397596 INFO  (TEST-HttpPartitionTest.test-seed#[54E2F8D778502A82]) [    ] o.a.s.c.AbstractZkTestCase put /home/jenkins/workspace/Lucene-Solr-5.x-Linux/solr/core/src/test-files/solr/collection1/conf/stopwords.txt to /configs/conf1/stopwords.txt
   [junit4]   2> 397596 INFO  (TEST-HttpPartitionTest.test-seed#[54E2F8D778502A82]) [    ] o.a.s.c.c.SolrZkClient makePath: /configs/conf1/stopwords.txt
   [junit4]   2> 397597 INFO  (TEST-HttpPartitionTest.test-seed#[54E2F8D778502A82]) [    ] o.a.s.c.AbstractZkTestCase put /home/jenkins/workspace/Lucene-Solr-5.x-Linux/solr/core/src/test-files/solr/collection1/conf/protwords.txt to /configs/conf1/protwords.txt
   [junit4]   2> 397597 INFO  (TEST-HttpPartitionTest.test-seed#[54E2F8D778502A82]) [    ] o.a.s.c.c.SolrZkClient makePath: /configs/conf1/protwords.txt
   [junit4]   2> 397598 INFO  (TEST-HttpPartitionTest.test-seed#[54E2F8D778502A82]) [    ] o.a.s.c.AbstractZkTestCase put /home/jenkins/workspace/Lucene-Solr-5.x-Linux/solr/core/src/test-files/solr/collection1/conf/currency.xml to /configs/conf1/currency.xml
   [junit4]   2> 397598 INFO  (TEST-HttpPartitionTest.test-seed#[54E2F8D778502A82]) [    ] o.a.s.c.c.SolrZkClient makePath: /configs/conf1/currency.xml
   [junit4]   2> 397599 INFO  (TEST-HttpPartitionTest.test-seed#[54E2F8D778502A82]) [    ] o.a.s.c.AbstractZkTestCase put /home/jenkins/workspace/Lucene-Solr-5.x-Linux/solr/core/src/test-files/solr/collection1/conf/enumsConfig.xml to /configs/conf1/enumsConfig.xml
   [junit4]   2> 397599 INFO  (TEST-HttpPartitionTest.test-seed#[54E2F8D778502A82]) [    ] o.a.s.c.c.SolrZkClient makePath: /configs/conf1/enumsConfig.xml
   [junit4]   2> 397600 INFO  (TEST-HttpPartitionTest.test-seed#[54E2F8D778502A82]) [    ] o.a.s.c.AbstractZkTestCase put /home/jenkins/workspace/Lucene-Solr-5.x-Linux/solr/core/src/test-files/solr/collection1/conf/open-exchange-rates.json to /configs/conf1/open-exchange-rates.json
   [junit4]   2> 397600 INFO  (TEST-HttpPartitionTest.test-seed#[54E2F8D778502A82]) [    ] o.a.s.c.c.SolrZkClient makePath: /configs/conf1/open-exchange-rates.json
   [junit4]   2> 397601 INFO  (TEST-HttpPartitionTest.test-seed#[54E2F8D778502A82]) [    ] o.a.s.c.AbstractZkTestCase put /home/jenkins/workspace/Lucene-Solr-5.x-Linux/solr/core/src/test-files/solr/collection1/conf/mapping-ISOLatin1Accent.txt to /configs/conf1/mapping-ISOLatin1Accent.txt
   [junit4]   2> 397601 INFO  (TEST-HttpPartitionTest.test-seed#[54E2F8D778502A82]) [    ] o.a.s.c.c.SolrZkClient makePath: /configs/conf1/mapping-ISOLatin1Accent.txt
   [junit4]   2> 397602 INFO  (TEST-HttpPartitionTest.test-seed#[54E2F8D778502A82]) [    ] o.a.s.c.AbstractZkTestCase put /home/jenkins/workspace/Lucene-Solr-5.x-Linux/solr/core/src/test-files/solr/collection1/conf/old_synonyms.txt to /configs/conf1/old_synonyms.txt
   [junit4]   2> 397602 INFO  (TEST-HttpPartitionTest.test-seed#[54E2F8D778502A82]) [    ] o.a.s.c.c.SolrZkClient makePath: /configs/conf1/old_synonyms.txt
   [junit4]   2> 397603 INFO  (TEST-HttpPartitionTest.test-seed#[54E2F8D778502A82]) [    ] o.a.s.c.AbstractZkTestCase put /home/jenkins/workspace/Lucene-Solr-5.x-Linux/solr/core/src/test-files/solr/collection1/conf/synonyms.txt to /configs/conf1/synonyms.txt
   [junit4]   2> 397603 INFO  (TEST-HttpPartitionTest.test-seed#[54E2F8D778502A82]) [    ] o.a.s.c.c.SolrZkClient makePath: /configs/conf1/synonyms.txt
   [junit4]   2> 397659 INFO  (TEST-HttpPartitionTest.test-seed#[54E2F8D778502A82]) [    ] o.a.s.SolrTestCaseJ4 Writing core.properties file to /home/jenkins/workspace/Lucene-Solr-5.x-Linux/solr/build/solr-core/test/J2/temp/solr.cloud.HttpPartitionTest_54E2F8D778502A82-001/control-001/cores/collection1
   [junit4]   2> 397661 INFO  (TEST-HttpPartitionTest.test-seed#[54E2F8D778502A82]) [    ] o.e.j.s.Server jetty-9.2.13.v20150730
   [junit4]   2> 397662 INFO  (TEST-HttpPartitionTest.test-seed#[54E2F8D778502A82]) [    ] o.e.j.s.h.ContextHandler Started o.e.j.s.ServletContextHandler@60e67fd0{/p_cwr/sw,null,AVAILABLE}
   [junit4]   2> 397663 INFO  (TEST-HttpPartitionTest.test-seed#[54E2F8D778502A82]) [    ] o.e.j.s.ServerConnector Started ServerConnector@282a0391{HTTP/1.1}{127.0.0.1:53156}
   [junit4]   2> 397663 INFO  (TEST-HttpPartitionTest.test-seed#[54E2F8D778502A82]) [    ] o.e.j.s.Server Started @399444ms
   [junit4]   2> 397663 INFO  (TEST-HttpPartitionTest.test-seed#[54E2F8D778502A82]) [    ] o.a.s.c.s.e.JettySolrRunner Jetty properties: {hostPort=52317, hostContext=/p_cwr/sw, coreRootDirectory=/home/jenkins/workspace/Lucene-Solr-5.x-Linux/solr/build/solr-core/test/J2/temp/solr.cloud.HttpPartitionTest_54E2F8D778502A82-001/control-001/cores, solr.data.dir=/home/jenkins/workspace/Lucene-Solr-5.x-Linux/solr/build/solr-core/test/J2/temp/solr.cloud.HttpPartitionTest_54E2F8D778502A82-001/tempDir-001/control/data}
   [junit4]   2> 397664 INFO  (TEST-HttpPartitionTest.test-seed#[54E2F8D778502A82]) [    ] o.a.s.s.SolrDispatchFilter SolrDispatchFilter.init(): sun.misc.Launcher$AppClassLoader@373ee92
   [junit4]   2> 397664 INFO  (TEST-HttpPartitionTest.test-seed#[54E2F8D778502A82]) [    ] o.a.s.c.SolrResourceLoader new SolrResourceLoader for directory: '/home/jenkins/workspace/Lucene-Solr-5.x-Linux/solr/build/solr-core/test/J2/temp/solr.cloud.HttpPartitionTest_54E2F8D778502A82-001/control-001/'
   [junit4]   2> 397674 INFO  (TEST-HttpPartitionTest.test-seed#[54E2F8D778502A82]) [    ] o.a.s.c.c.SolrZkClient Using default ZkCredentialsProvider
   [junit4]   2> 397675 INFO  (TEST-HttpPartitionTest.test-seed#[54E2F8D778502A82]) [    ] o.a.s.c.c.ConnectionManager Waiting for client to connect to ZooKeeper
   [junit4]   2> 397677 INFO  (zkCallback-257-thread-1) [    ] o.a.s.c.c.ConnectionManager Watcher org.apache.solr.common.cloud.ConnectionManager@79f11dc8 name:ZooKeeperConnection Watcher:127.0.0.1:35927/solr got event WatchedEvent state:SyncConnected type:None path:null path:null type:None
   [junit4]   2> 397677 INFO  (TEST-HttpPartitionTest.test-seed#[54E2F8D778502A82]) [    ] o.a.s.c.c.ConnectionManager Client is connected to ZooKeeper
   [junit4]   2> 397677 INFO  (TEST-HttpPartitionTest.test-seed#[54E2F8D778502A82]) [    ] o.a.s.c.c.SolrZkClient Using default ZkACLProvider
   [junit4]   2> 397678 INFO  (TEST-HttpPartitionTest.test-seed#[54E2F8D778502A82]) [    ] o.a.s.s.SolrDispatchFilter Loading solr.xml from SolrHome (not found in ZooKeeper)
   [junit4]   2> 397678 INFO  (TEST-HttpPartitionTest.test-seed#[54E2F8D778502A82]) [    ] o.a.s.c.SolrXmlConfig Loading container configuration from /home/jenkins/workspace/Lucene-Solr-5.x-Linux/solr/build/solr-core/test/J2/temp/solr.cloud.HttpPartitionTest_54E2F8D778502A82-001/control-001/solr.xml
   [junit4]   2> 397687 INFO  (TEST-HttpPartitionTest.test-seed#[54E2F8D778502A82]) [    ] o.a.s.c.CoresLocator Config-defined core root directory: /home/jenkins/workspace/Lucene-Solr-5.x-Linux/solr/build/solr-core/test/J2/temp/solr.cloud.HttpPartitionTest_54E2F8D778502A82-001/control-001/cores
   [junit4]   2> 397688 INFO  (TEST-HttpPartitionTest.test-seed#[54E2F8D778502A82]) [    ] o.a.s.c.CoreContainer New CoreContainer 720416997
   [junit4]   2> 397688 INFO  (TEST-HttpPartitionTest.test-seed#[54E2F8D778502A82]) [    ] o.a.s.c.CoreContainer Loading cores into CoreContainer [instanceDir=/home/jenkins/workspace/Lucene-Solr-5.x-Linux/solr/build/solr-core/test/J2/temp/solr.cloud.HttpPartitionTest_54E2F8D778502A82-001/control-001/]
   [junit4]   2> 397688 INFO  (TEST-HttpPartitionTest.test-seed#[54E2F8D778502A82]) [    ] o.a.s.c.CoreContainer loading shared library: /home/jenkins/workspace/Lucene-Solr-5.x-Linux/solr/build/solr-core/test/J2/temp/solr.cloud.HttpPartitionTest_54E2F8D778502A82-001/control-001/lib
   [junit4]   2> 397688 WARN  (TEST-HttpPartitionTest.test-seed#[54E2F8D778502A82]) [    ] o.a.s.c.SolrResourceLoader Can't find (or read) directory to add to classloader: lib (resolved as: /home/jenkins/workspace/Lucene-Solr-5.x-Linux/solr/build/solr-core/test/J2/temp/solr.cloud.HttpPartitionTest_54E2F8D778502A82-001/control-001/lib).
   [junit4]   2> 397695 INFO  (TEST-HttpPartitionTest.test-seed#[54E2F8D778502A82]) [    ] o.a.s.h.c.HttpShardHandlerFactory created with socketTimeout : 90000,urlScheme : ,connTimeout : 15000,maxConnectionsPerHost : 20,maxConnections : 10000,corePoolSize : 0,maximumPoolSize : 2147483647,maxThreadIdleTime : 5,sizeOfQueue : -1,fairnessPolicy : false,useRetries : false,
   [junit4]   2> 397696 INFO  (TEST-HttpPartitionTest.test-seed#[54E2F8D778502A82]) [    ] o.a.s.u.UpdateShardHandler Creating UpdateShardHandler HTTP client with params: socketTimeout=340000&connTimeout=45000&retry=true
   [junit4]   2> 397696 INFO  (TEST-HttpPartitionTest.test-seed#[54E2F8D778502A82]) [    ] o.a.s.l.LogWatcher SLF4J impl is org.slf4j.impl.Log4jLoggerFactory
   [junit4]   2> 397696 INFO  (TEST-HttpPartitionTest.test-seed#[54E2F8D778502A82]) [    ] o.a.s.l.LogWatcher Registering Log Listener [Log4j (org.slf4j.impl.Log4jLoggerFactory)]
   [junit4]   2> 397697 INFO  (TEST-HttpPartitionTest.test-seed#[54E2F8D778502A82]) [    ] o.a.s.c.ZkContainer Zookeeper client=127.0.0.1:35927/solr
   [junit4]   2> 397697 INFO  (TEST-HttpPartitionTest.test-seed#[54E2F8D778502A82]) [    ] o.a.s.c.ZkController zkHost includes chroot
   [junit4]   2> 397697 INFO  (TEST-HttpPartitionTest.test-seed#[54E2F8D778502A82]) [    ] o.a.s.c.c.SolrZkClient Using default ZkCredentialsProvider
   [junit4]   2> 397697 INFO  (TEST-HttpPartitionTest.test-seed#[54E2F8D778502A82]) [    ] o.a.s.c.c.ConnectionManager Waiting for client to connect to ZooKeeper
   [junit4]   2> 397698 INFO  (zkCallback-259-thread-1) [    ] o.a.s.c.c.ConnectionManager Watcher org.apache.solr.common.cloud.ConnectionManager@26ae74a3 name:ZooKeeperConnection Watcher:127.0.0.1:35927 got event WatchedEvent state:SyncConnected type:None path:null path:null type:None
   [junit4]   2> 397699 INFO  (TEST-HttpPartitionTest.test-seed#[54E2F8D778502A82]) [    ] o.a.s.c.c.ConnectionManager Client is connected to ZooKeeper
   [junit4]   2> 397699 INFO  (TEST-HttpPartitionTest.test-seed#[54E2F8D778502A82]) [    ] o.a.s.c.c.SolrZkClient Using default ZkACLProvider
   [junit4]   2> 397700 INFO  (TEST-HttpPartitionTest.test-seed#[54E2F8D778502A82]) [n:127.0.0.1:52317_p_cwr%2Fsw    ] o.a.s.c.c.ConnectionManager Waiting for client to connect to ZooKeeper
   [junit4]   2> 397701 INFO  (zkCallback-260-thread-1-processing-n:127.0.0.1:52317_p_cwr%2Fsw) [n:127.0.0.1:52317_p_cwr%2Fsw    ] o.a.s.c.c.ConnectionManager Watcher org.apache.solr.common.cloud.ConnectionManager@4d88f0bf name:ZooKeeperConnection Watcher:127.0.0.1:35927/solr got event WatchedEvent state:SyncConnected type:None path:null path:null type:None
   [junit4]   2> 397701 INFO  (TEST-HttpPartitionTest.test-seed#[54E2F8D778502A82]) [n:127.0.0.1:52317_p_cwr%2Fsw    ] o.a.s.c.c.ConnectionManager Client is connected to ZooKeeper
   [junit4]   2> 397702 INFO  (TEST-HttpPartitionTest.test-seed#[54E2F8D778502A82]) [n:127.0.0.1:52317_p_cwr%2Fsw    ] o.a.s.c.c.SolrZkClient makePath: /overseer/queue
   [junit4]   2> 397704 INFO  (TEST-HttpPartitionTest.test-seed#[54E2F8D778502A82]) [n:127.0.0.1:52317_p_cwr%2Fsw    ] o.a.s.c.c.SolrZkClient makePath: /overseer/collection-queue-work
   [junit4]   2> 397705 INFO  (TEST-HttpPartitionTest.test-seed#[54E2F8D778502A82]) [n:127.0.0.1:52317_p_cwr%2Fsw    ] o.a.s.c.c.SolrZkClient makePath: /overseer/collection-map-running
   [junit4]   2> 397706 INFO  (TEST-HttpPartitionTest.test-seed#[54E2F8D778502A82]) [n:127.0.0.1:52317_p_cwr%2Fsw    ] o.a.s.c.c.SolrZkClient makePath: /overseer/collection-map-completed
   [junit4]   2> 397713 INFO  (TEST-HttpPartitionTest.test-seed#[54E2F8D778502A82]) [n:127.0.0.1:52317_p_cwr%2Fsw    ] o.a.s.c.c.SolrZkClient makePath: /overseer/collection-map-failure
   [junit4]   2> 397714 INFO  (TEST-HttpPartitionTest.test-seed#[54E2F8D778502A82]) [n:127.0.0.1:52317_p_cwr%2Fsw    ] o.a.s.c.c.SolrZkClient makePath: /live_nodes
   [junit4]   2> 397715 INFO  (TEST-HttpPartitionTest.test-seed#[54E2F8D778502A82]) [n:127.0.0.1:52317_p_cwr%2Fsw    ] o.a.s.c.c.SolrZkClient makePath: /aliases.json
   [junit4]   2> 397715 INFO  (TEST-HttpPartitionTest.test-seed#[54E2F8D778502A82]) [n:127.0.0.1:52317_p_cwr%2Fsw    ] o.a.s.c.c.SolrZkClient makePath: /clusterstate.json
   [junit4]   2> 397716 INFO  (TEST-HttpPartitionTest.test-seed#[54E2F8D778502A82]) [n:127.0.0.1:52317_p_cwr%2Fsw    ] o.a.s.c.c.SolrZkClient makePath: /security.json
   [junit4]   2> 397716 INFO  (TEST-HttpPartitionTest.test-seed#[54E2F8D778502A82]) [n:127.0.0.1:52317_p_cwr%2Fsw    ] o.a.s.c.ZkController Register node as live in ZooKeeper:/live_nodes/127.0.0.1:52317_p_cwr%2Fsw
   [junit4]   2> 397716 INFO  (TEST-HttpPartitionTest.test-seed#[54E2F8D778502A82]) [n:127.0.0.1:52317_p_cwr%2Fsw    ] o.a.s.c.c.SolrZkClient makePath: /live_nodes/127.0.0.1:52317_p_cwr%2Fsw
   [junit4]   2> 397717 INFO  (TEST-HttpPartitionTest.test-seed#[54E2F8D778502A82]) [n:127.0.0.1:52317_p_cwr%2Fsw    ] o.a.s.c.c.SolrZkClient makePath: /overseer_elect
   [junit4]   2> 397717 INFO  (TEST-HttpPartitionTest.test-seed#[54E2F8D778502A82]) [n:127.0.0.1:52317_p_cwr%2Fsw    ] o.a.s.c.c.SolrZkClient makePath: /overseer_elect/election
   [junit4]   2> 397718 INFO  (TEST-HttpPartitionTest.test-seed#[54E2F8D778502A82]) [n:127.0.0.1:52317_p_cwr%2Fsw    ] o.a.s.c.Overseer Overseer (id=null) closing
   [junit4]   2> 397718 INFO  (TEST-HttpPartitionTest.test-seed#[54E2F8D778502A82]) [n:127.0.0.1:52317_p_cwr%2Fsw    ] o.a.s.c.LeaderElector Joined leadership election with path: /overseer_elect/election/94407911463583748-127.0.0.1:52317_p_cwr%2Fsw-n_0000000000
   [junit4]   2> 397719 INFO  (TEST-HttpPartitionTest.test-seed#[54E2F8D778502A82]) [n:127.0.0.1:52317_p_cwr%2Fsw    ] o.a.s.c.OverseerElectionContext I am going to be the leader 127.0.0.1:52317_p_cwr%2Fsw
   [junit4]   2> 397719 INFO  (TEST-HttpPartitionTest.test-seed#[54E2F8D778502A82]) [n:127.0.0.1:52317_p_cwr%2Fsw    ] o.a.s.c.c.SolrZkClient makePath: /overseer_elect/leader
   [junit4]   2> 397719 INFO  (TEST-HttpPartitionTest.test-seed#[54E2F8D778502A82]) [n:127.0.0.1:52317_p_cwr%2Fsw    ] o.a.s.c.Overseer Overseer (id=94407911463583748-127.0.0.1:52317_p_cwr%2Fsw-n_0000000000) starting
   [junit4]   2> 397720 INFO  (TEST-HttpPartitionTest.test-seed#[54E2F8D778502A82]) [n:127.0.0.1:52317_p_cwr%2Fsw    ] o.a.s.c.c.SolrZkClient makePath: /overseer/queue-work
   [junit4]   2> 397722 INFO  (TEST-HttpPartitionTest.test-seed#[54E2F8D778502A82]) [n:127.0.0.1:52317_p_cwr%2Fsw    ] o.a.s.c.OverseerAutoReplicaFailoverThread Starting OverseerAutoReplicaFailoverThread autoReplicaFailoverWorkLoopDelay=10000 autoReplicaFailoverWaitAfterExpiration=30000 autoReplicaFailoverBadNodeExpiration=60000
   [junit4]   2> 397722 INFO  (TEST-HttpPartitionTest.test-seed#[54E2F8D778502A82]) [n:127.0.0.1:52317_p_cwr%2Fsw    ] o.a.s.c.c.ZkStateReader Updating cluster state from ZooKeeper... 
   [junit4]   2> 397722 INFO  (OverseerCollectionProcessor-94407911463583748-127.0.0.1:52317_p_cwr%2Fsw-n_0000000000) [n:127.0.0.1:52317_p_cwr%2Fsw    ] o.a.s.c.OverseerProcessor Process current queue of overseer operations
   [junit4]   2> 397723 INFO  (OverseerStateUpdate-94407911463583748-127.0.0.1:52317_p_cwr%2Fsw-n_0000000000) [n:127.0.0.1:52317_p_cwr%2Fsw    ] o.a.s.c.Overseer Starting to work on the main queue
   [junit4]   2> 397732 INFO  (TEST-HttpPartitionTest.test-seed#[54E2F8D778502A82]) [n:127.0.0.1:52317_p_cwr%2Fsw    ] o.a.s.c.CoreContainer Security conf doesn't exist. Skipping setup for authorization module.
   [junit4]   2> 397732 INFO  (TEST-HttpPartitionTest.test-seed#[54E2F8D778502A82]) [n:127.0.0.1:52317_p_cwr%2Fsw    ] o.a.s.c.CoreContainer No authentication plugin used.
   [junit4]   2> 397732 INFO  (TEST-HttpPartitionTest.test-seed#[54E2F8D778502A82]) [n:127.0.0.1:52317_p_cwr%2Fsw    ] o.a.s.c.CoresLocator Looking for core definitions underneath /home/jenkins/workspace/Lucene-Solr-5.x-Linux/solr/build/solr-core/test/J2/temp/solr.cloud.HttpPartitionTest_54E2F8D778502A82-001/control-001/cores
   [junit4]   2> 397733 INFO  (TEST-HttpPartitionTest.test-seed#[54E2F8D778502A82]) [n:127.0.0.1:52317_p_cwr%2Fsw    ] o.a.s.c.SolrCore Created CoreDescriptor: {loadOnStartup=true, shard=, schema=schema.xml, collection=control_collection, coreNodeName=, name=collection1, transient=false, config=solrconfig.xml, absoluteInstDir=/home/jenkins/workspace/Lucene-Solr-5.x-Linux/solr/build/solr-core/test/J2/temp/solr.cloud.HttpPartitionTest_54E2F8D778502A82-001/control-001/cores/collection1/, instanceDir=/home/jenkins/workspace/Lucene-Solr-5.x-Linux/solr/build/solr-core/test/J2/temp/solr.cloud.HttpPartitionTest_54E2F8D778502A82-001/control-001/cores/collection1, dataDir=data/, configSetProperties=configsetprops.json}
   [junit4]   2> 397733 INFO  (TEST-HttpPartitionTest.test-seed#[54E2F8D778502A82]) [n:127.0.0.1:52317_p_cwr%2Fsw    ] o.a.s.c.CoresLocator Found core collection1 in /home/jenkins/workspace/Lucene-Solr-5.x-Linux/solr/build/solr-core/test/J2/temp/solr.cloud.HttpPartitionTest_54E2F8D778502A82-001/control-001/cores/collection1/
   [junit4]   2> 397733 INFO  (TEST-HttpPartitionTest.test-seed#[54E2F8D778502A82]) [n:127.0.0.1:52317_p_cwr%2Fsw    ] o.a.s.c.CoresLocator Found 1 core definitions
   [junit4]   2> 397734 INFO  (TEST-HttpPartitionTest.test-seed#[54E2F8D778502A82]) [n:127.0.0.1:52317_p_cwr%2Fsw    ] o.a.s.s.SolrDispatchFilter user.dir=/home/jenkins/workspace/Lucene-Solr-5.x-Linux/solr/build/solr-core/test/J2
   [junit4]   2> 397734 INFO  (TEST-HttpPartitionTest.test-seed#[54E2F8D778502A82]) [n:127.0.0.1:52317_p_cwr%2Fsw    ] o.a.s.s.SolrDispatchFilter SolrDispatchFilter.init() done
   [junit4]   2> 397734 INFO  (coreLoadExecutor-838-thread-1-processing-n:127.0.0.1:52317_p_cwr%2Fsw) [n:127.0.0.1:52317_p_cwr%2Fsw c:control_collection   x:collection1] o.a.s.c.ZkController publishing state=down
   [junit4]   2> 397734 INFO  (coreLoadExecutor-838-thread-1-processing-n:127.0.0.1:52317_p_cwr%2Fsw) [n:127.0.0.1:52317_p_cwr%2Fsw c:control_collection   x:collection1] o.a.s.c.ZkController numShards not found on descriptor - reading it from system property
   [junit4]   2> 397743 INFO  (OverseerStateUpdate-94407911463583748-127.0.0.1:52317_p_cwr%2Fsw-n_0000000000) [n:127.0.0.1:52317_p_cwr%2Fsw    ] o.a.s.c.Overseer processMessage: queueSize: 1, message = {
   [junit4]   2>   "base_url":"http://127.0.0.1:52317/p_cwr/sw",
   [junit4]   2>   "node_name":"127.0.0.1:52317_p_cwr%2Fsw",
   [junit4]   2>   "roles":null,
   [junit4]   2>   "operation":"state",
   [junit4]   2>   "numShards":"1",
   [junit4]   2>   "collection":"control_collection",
   [junit4]   2>   "shard":null,
   [junit4]   2>   "core":"collection1",
   [junit4]   2>   "state":"down"} current state version: 0
   [junit4]   2> 397743 INFO  (coreLoadExecutor-838-thread-1-processing-n:127.0.0.1:52317_p_cwr%2Fsw) [n:127.0.0.1:52317_p_cwr%2Fsw c:control_collection   x:collection1] o.a.s.c.ZkController look for our core node name
   [junit4]   2> 397743 INFO  (OverseerStateUpdate-94407911463583748-127.0.0.1:52317_p_cwr%2Fsw-n_0000000000) [n:127.0.0.1:52317_p_cwr%2Fsw    ] o.a.s.c.o.ReplicaMutator Update state numShards=1 message={
   [junit4]   2>   "base_url":"http://127.0.0.1:52317/p_cwr/sw",
   [junit4]   2>   "node_name":"127.0.0.1:52317_p_cwr%2Fsw",
   [junit4]   2>   "roles":null,
   [junit4]   2>   "operation":"state",
   [junit4]   2>   "numShards":"1",
   [junit4]   2>   "collection":"control_collection",
   [junit4]   2>   "shard":null,
   [junit4]   2>   "core":"collection1",
   [junit4]   2>   "state":"down"}
   [junit4]   2> 397743 INFO  (OverseerStateUpdate-94407911463583748-127.0.0.1:52317_p_cwr%2Fsw-n_0000000000) [n:127.0.0.1:52317_p_cwr%2Fsw    ] o.a.s.c.o.ClusterStateMutator building a new cName: control_collection
   [junit4]   2> 397743 INFO  (OverseerStateUpdate-94407911463583748-127.0.0.1:52317_p_cwr%2Fsw-n_0000000000) [n:127.0.0.1:52317_p_cwr%2Fsw    ] o.a.s.c.o.ReplicaMutator Assigning new node to shard shard=shard1
   [junit4]   2> 397746 INFO  (zkCallback-260-thread-1-processing-n:127.0.0.1:52317_p_cwr%2Fsw) [n:127.0.0.1:52317_p_cwr%2Fsw    ] o.a.s.c.c.ZkStateReader A cluster state change: WatchedEvent state:SyncConnected type:NodeDataChanged path:/clusterstate.json, has occurred - updating... (live nodes size: 1)
   [junit4]   2> 398743 INFO  (coreLoadExecutor-838-thread-1-processing-n:127.0.0.1:52317_p_cwr%2Fsw) [n:127.0.0.1:52317_p_cwr%2Fsw c:control_collection   x:collection1] o.a.s.c.ZkController waiting to find shard id in clusterstate for collection1
   [junit4]   2> 398743 INFO  (coreLoadExecutor-838-thread-1-processing-n:127.0.0.1:52317_p_cwr%2Fsw) [n:127.0.0.1:52317_p_cwr%2Fsw c:control_collection   x:collection1] o.a.s.c.ZkController Check for collection zkNode:control_collection
   [junit4]   2> 398744 INFO  (coreLoadExecutor-838-thread-1-processing-n:127.0.0.1:52317_p_cwr%2Fsw) [n:127.0.0.1:52317_p_cwr%2Fsw c:control_collection   x:collection1] o.a.s.c.ZkController Collection zkNode exists
   [junit4]   2> 398744 INFO  (coreLoadExecutor-838-thread-1-processing-n:127.0.0.1:52317_p_cwr%2Fsw) [n:127.0.0.1:52317_p_cwr%2Fsw c:control_collection   x:collection1] o.a.s.c.c.ZkStateReader Load collection config from:/collections/control_collection
   [junit4]   2> 398744 INFO  (coreLoadExecutor-838-thread-1-processing-n:127.0.0.1:52317_p_cwr%2Fsw) [n:127.0.0.1:52317_p_cwr%2Fsw c:control_collection   x:collection1] o.a.s.c.c.ZkStateReader path=/collections/control_collection configName=conf1 specified config exists in ZooKeeper
   [junit4]   2> 398744 INFO  (coreLoadExecutor-838-thread-1-processing-n:127.0.0.1:52317_p_cwr%2Fsw) [n:127.0.0.1:52317_p_cwr%2Fsw c:control_collection   x:collection1] o.a.s.c.SolrResourceLoader new SolrResourceLoader for directory: '/home/jenkins/workspace/Lucene-Solr-5.x-Linux/solr/build/solr-core/test/J2/temp/solr.cloud.HttpPartitionTest_54E2F8D778502A82-001/control-001/cores/collection1/'
   [junit4]   2> 398755 INFO  (coreLoadExecutor-838-thread-1-processing-n:127.0.0.1:52317_p_cwr%2Fsw) [n:127.0.0.1:52317_p_cwr%2Fsw c:control_collection   x:collection1] o.a.s.c.Config loaded config solrconfig.xml with version 0 
   [junit4]   2> 398759 INFO  (coreLoadExecutor-838-thread-1-processing-n:127.0.0.1:52317_p_cwr%2Fsw) [n:127.0.0.1:52317_p_cwr%2Fsw c:control_collection   x:collection1] o.a.s.c.SolrConfig current version of requestparams : -1
   [junit4]   2> 398767 INFO  (coreLoadExecutor-838-thread-1-processing-n:127.0.0.1:52317_p_cwr%2Fsw) [n:127.0.0.1:52317_p_cwr%2Fsw c:control_collection   x:collection1] o.a.s.c.SolrConfig Using Lucene MatchVersion: 5.4.0
   [junit4]   2> 398784 INFO  (coreLoadExecutor-838-thread-1-processing-n:127.0.0.1:52317_p_cwr%2Fsw) [n:127.0.0.1:52317_p_cwr%2Fsw c:control_collection   x:collection1] o.a.s.c.Config Loaded SolrConfig: solrconfig.xml
   [junit4]   2> 398785 INFO  (coreLoadExecutor-838-thread-1-processing-n:127.0.0.1:52317_p_cwr%2Fsw) [n:127.0.0.1:52317_p_cwr%2Fsw c:control_collection   x:collection1] o.a.s.s.IndexSchema Reading Solr Schema from /configs/conf1/schema.xml
   [junit4]   2> 398791 INFO  (coreLoadExecutor-838-thread-1-processing-n:127.0.0.1:52317_p_cwr%2Fsw) [n:127.0.0.1:52317_p_cwr%2Fsw c:control_collection   x:collection1] o.a.s.s.IndexSchema [collection1] Schema name=test
   [junit4]   2> 398950 INFO  (coreLoadExecutor-838-thread-1-processing-n:127.0.0.1:52317_p_cwr%2Fsw) [n:127.0.0.1:52317_p_cwr%2Fsw c:control_collection   x:collection1] o.a.s.s.OpenExchangeRatesOrgProvider Initialized with rates=open-exchange-rates.json, refreshInterval=1440.
   [junit4]   2> 398956 INFO  (coreLoadExecutor-838-thread-1-processing-n:127.0.0.1:52317_p_cwr%2Fsw) [n:127.0.0.1:52317_p_cwr%2Fsw c:control_collection   x:collection1] o.a.s.s.IndexSchema default search field in schema is text
   [junit4]   2> 398957 INFO  (coreLoadExecutor-838-thread-1-processing-n:127.0.0.1:52317_p_cwr%2Fsw) [n:127.0.0.1:52317_p_cwr%2Fsw c:control_collection   x:collection1] o.a.s.s.IndexSchema unique key field: id
   [junit4]   2> 398963 INFO  (coreLoadExecutor-838-thread-1-processing-n:127.0.0.1:52317_p_cwr%2Fsw) [n:127.0.0.1:52317_p_cwr%2Fsw c:control_collection   x:collection1] o.a.s.s.FileExchangeRateProvider Reloading exchange rates from file currency.xml
   [junit4]   2> 398965 INFO  (coreLoadExecutor-838-thread-1-processing-n:127.0.0.1:52317_p_cwr%2Fsw) [n:127.0.0.1:52317_p_cwr%2Fsw c:control_collection   x:collection1] o.a.s.s.FileExchangeRateProvider Reloading exchange rates from file currency.xml
   [junit4]   2> 398967 INFO  (coreLoadExecutor-838-thread-1-processing-n:127.0.0.1:52317_p_cwr%2Fsw) [n:127.0.0.1:52317_p_cwr%2Fsw c:control_collection   x:collection1] o.a.s.s.OpenExchangeRatesOrgProvider Reloading exchange rates from open-exchange-rates.json
   [junit4]   2> 398967 WARN  (coreLoadExecutor-838-thread-1-processing-n:127.0.0.1:52317_p_cwr%2Fsw) [n:127.0.0.1:52317_p_cwr%2Fsw c:control_collection   x:collection1] o.a.s.s.OpenExchangeRatesOrgProvider Unknown key IMPORTANT NOTE
   [junit4]   2> 398967 WARN  (coreLoadExecutor-838-thread-1-processing-n:127.0.0.1:52317_p_cwr%2Fsw) [n:127.0.0.1:52317_p_cwr%2Fsw c:control_collection   x:collection1] o.a.s.s.OpenExchangeRatesOrgProvider Expected key, got STRING
   [junit4]   2> 398967 INFO  (coreLoadExecutor-838-thread-1-processing-n:127.0.0.1:52317_p_cwr%2Fsw) [n:127.0.0.1:52317_p_cwr%2Fsw c:control_collection   x:collection1] o.a.s.s.OpenExchangeRatesOrgProvider Reloading exchange rates from open-exchange-rates.json
   [junit4]   2> 398968 WARN  (coreLoadExecutor-838-thread-1-processing-n:127.0.0.1:52317_p_cwr%2Fsw) [n:127.0.0.1:52317_p_cwr%2Fsw c:control_collection   x:collection1] o.a.s.s.OpenExchangeRatesOrgProvider Unknown key IMPORTANT NOTE
   [junit4]   2> 398968 WARN  (coreLoadExecutor-838-thread-1-processing-n:127.0.0.1:52317_p_cwr%2Fsw) [n:127.0.0.1:52317_p_cwr%2Fsw c:control_collection   x:collection1] o.a.s.s.OpenExchangeRatesOrgProvider Expected key, got STRING
   [junit4]   2> 398969 INFO  (coreLoadExecutor-838-thread-1-processing-n:127.0.0.1:52317_p_cwr%2Fsw) [n:127.0.0.1:52317_p_cwr%2Fsw c:control_collection   x:collection1] o.a.s.c.ConfigSetProperties Did not find ConfigSet properties, assuming default properties: Can't find resource 'configsetprops.json' in classpath or '/configs/conf1', cwd=/home/jenkins/workspace/Lucene-Solr-5.x-Linux/solr/build/solr-core/test/J2
   [junit4]   2> 398969 INFO  (coreLoadExecutor-838-thread-1-processing-n:127.0.0.1:52317_p_cwr%2Fsw) [n:127.0.0.1:52317_p_cwr%2Fsw c:control_collection   x:collection1] o.a.s.c.CoreContainer Creating SolrCore 'collection1' using configuration from collection control_collection
   [junit4]   2> 398970 INFO  (coreLoadExecutor-838-thread-1-processing-n:127.0.0.1:52317_p_cwr%2Fsw) [n:127.0.0.1:52317_p_cwr%2Fsw c:control_collection s:shard1 r:core_node1 x:collection1] o.a.s.c.SolrCore org.apache.solr.core.MockDirectoryFactory
   [junit4]   2> 398970 INFO  (coreLoadExecutor-838-thread-1-processing-n:127.0.0.1:52317_p_cwr%2Fsw) [n:127.0.0.1:52317_p_cwr%2Fsw c:control_collection s:shard1 r:core_node1 x:collection1] o.a.s.c.SolrCore [[collection1] ] Opening new SolrCore at [/home/jenkins/workspace/Lucene-Solr-5.x-Linux/solr/build/solr-core/test/J2/temp/solr.cloud.HttpPartitionTest_54E2F8D778502A82-001/control-001/cores/collection1/], dataDir=[null]
   [junit4]   2> 398970 INFO  (coreLoadExecutor-838-thread-1-processing-n:127.0.0.1:52317_p_cwr%2Fsw) [n:127.0.0.1:52317_p_cwr%2Fsw c:control_collection s:shard1 r:core_node1 x:collection1] o.a.s.c.JmxMonitoredMap JMX monitoring is enabled. Adding Solr mbeans to JMX Server: com.sun.jmx.mbeanserver.JmxMBeanServer@47c105ec
   [junit4]   2> 398971 INFO  (coreLoadExecutor-838-thread-1-processing-n:127.0.0.1:52317_p_cwr%2Fsw) [n:127.0.0.1:52317_p_cwr%2Fsw c:control_collection s:shard1 r:core_node1 x:collection1] o.a.s.c.CachingDirectoryFactory return new directory for /home/jenkins/workspace/Lucene-Solr-5.x-Linux/solr/build/solr-core/test/J2/temp/solr.cloud.HttpPartitionTest_54E2F8D778502A82-001/control-001/cores/collection1/data
   [junit4]   2> 398971 INFO  (coreLoadExecutor-838-thread-1-processing-n:127.0.0.1:52317_p_cwr%2Fsw) [n:127.0.0.1:52317_p_cwr%2Fsw c:control_collection s:shard1 r:core_node1 x:collection1] o.a.s.c.SolrCore New index directory detected: old=null new=/home/jenkins/workspace/Lucene-Solr-5.x-Linux/solr/build/solr-core/test/J2/temp/solr.cloud.HttpPartitionTest_54E2F8D778502A82-001/control-001/cores/collection1/data/index/
   [junit4]   2> 398971 WARN  (coreLoadExecutor-838-thread-1-processing-n:127.0.0.1:52317_p_cwr%2Fsw) [n:127.0.0.1:52317_p_cwr%2Fsw c:control_collection s:shard1 r:core_node1 x:collection1] o.a.s.c.SolrCore [collection1] Solr index directory '/home/jenkins/workspace/Lucene-Solr-5.x-Linux/solr/build/solr-core/test/J2/temp/solr.cloud.HttpPartitionTest_54E2F8D778502A82-001/control-001/cores/collection1/data/index' doesn't exist. Creating new index...
   [junit4]   2> 398972 INFO  (coreLoadExecutor-838-thread-1-processing-n:127.0.0.1:52317_p_cwr%2Fsw) [n:127.0.0.1:52317_p_cwr%2Fsw c:control_collection s:shard1 r:core_node1 x:collection1] o.a.s.c.CachingDirectoryFactory return new directory for /home/jenkins/workspace/Lucene-Solr-5.x-Linux/solr/build/solr-core/test/J2/temp/solr.cloud.HttpPartitionTest_54E2F8D778502A82-001/control-001/cores/collection1/data/index
   [junit4]   2> 398972 INFO  (coreLoadExecutor-838-thread-1-processing-n:127.0.0.1:52317_p_cwr%2Fsw) [n:127.0.0.1:52317_p_cwr%2Fsw c:control_collection s:shard1 r:core_node1 x:collection1] o.a.s.u.RandomMergePolicy RandomMergePolicy wrapping class org.apache.lucene.index.TieredMergePolicy: [TieredMergePolicy: maxMergeAtOnce=35, maxMergeAtOnceExplicit=31, maxMergedSegmentMB=5.5029296875, floorSegmentMB=0.841796875, forceMergeDeletesPctAllowed=26.477759835033407, segmentsPerTier=43.0, maxCFSSegmentSizeMB=8.796093022207999E12, noCFSRatio=0.4438633771398254
   [junit4]   2> 398973 INFO  (coreLoadExecutor-838-thread-1-processing-n:127.0.0.1:52317_p_cwr%2Fsw) [n:127.0.0.1:52317_p_cwr%2Fsw c:control_collection s:shard1 r:core_node1 x:collection1] o.a.s.c.SolrCore SolrDeletionPolicy.onCommit: commits: num=1
   [junit4]   2> 	commit{dir=MockDirectoryWrapper(RAMDirectory@58c022d4 lockFactory=org.apache.lucene.store.SingleInstanceLockFactory@2e2eb9d1),segFN=segments_1,generation=1}
   [junit4]   2> 398973 INFO  (coreLoadExecutor-838-thread-1-processing-n:127.0.0.1:52317_p_cwr%2Fsw) [n:127.0.0.1:52317_p_cwr%2Fsw c:control_collection s:shard1 r:core_node1 x:collection1] o.a.s.c.SolrCore newest commit generation = 1
   [junit4]   2> 398973 INFO  (OldIndexDirectoryCleanupThreadForCore-collection1) [n:127.0.0.1:52317_p_cwr%2Fsw c:control_collection s:shard1 r:core_node1 x:collection1] o.a.s.c.SolrCore Looking for old index directories to cleanup for core collection1 in /home/jenkins/workspace/Lucene-Solr-5.x-Linux/solr/build/solr-core/test/J2/temp/solr.cloud.HttpPartitionTest_54E2F8D778502A82-001/control-001/cores/collection1/data/
   [junit4]   2> 398973 WARN  (OldIndexDirectoryCleanupThreadForCore-collection1) [n:127.0.0.1:52317_p_cwr%2Fsw c:control_collection s:shard1 r:core_node1 x:collection1] o.a.s.c.DirectoryFactory /home/jenkins/workspace/Lucene-Solr-5.x-Linux/solr/build/solr-core/test/J2/temp/solr.cloud.HttpPartitionTest_54E2F8D778502A82-001/control-001/cores/collection1/data/ does not point to a valid data directory; skipping clean-up of old index directories.
   [junit4]   2> 398978 INFO  (coreLoadExecutor-838-thread-1-processing-n:127.0.0.1:52317_p_cwr%2Fsw) [n:127.0.0.1:52317_p_cwr%2Fsw c:control_collection s:shard1 r:core_node1 x:collection1] o.a.s.u.p.UpdateRequestProcessorChain creating updateRequestProcessorChain "nodistrib"
   [junit4]   2> 398978 INFO  (coreLoadExecutor-838-thread-1-processing-n:127.0.0.1:52317_p_cwr%2Fsw) [n:127.0.0.1:52317_p_cwr%2Fsw c:control_collection s:shard1 r:core_node1 x:collection1] o.a.s.u.p.UpdateRequestProcessorChain creating updateRequestProcessorChain "dedupe"
   [junit4]   2> 398978 INFO  (coreLoadExecutor-838-thread-1-processing-n:127.0.0.1:52317_p_cwr%2Fsw) [n:127.0.0.1:52317_p_cwr%2Fsw c:control_collection s:shard1 r:core_node1 x:collection1] o.a.s.u.p.UpdateRequestProcessorChain inserting DistributedUpdateProcessorFactory into updateRequestProcessorChain "dedupe"
   [junit4]   2> 398979 INFO  (coreLoadExecutor-838-thread-1-processing-n:127.0.0.1:52317_p_cwr%2Fsw) [n:127.0.0.1:52317_p_cwr%2Fsw c:control_collection s:shard1 r:core_node1 x:collection1] o.a.s.u.p.UpdateRequestProcessorChain creating updateRequestProcessorChain "stored_sig"
   [junit4]   2> 398979 INFO  (coreLoadExecutor-838-thread-1-processing-n:127.0.0.1:52317_p_cwr%2Fsw) [n:127.0.0.1:52317_p_cwr%2Fsw c:control_collection s:shard1 r:core_node1 x:collection1] o.a.s.u.p.UpdateRequestProcessorChain inserting DistributedUpdateProcessorFactory into updateRequestProcessorChain "stored_sig"
   [junit4]   2> 398979 INFO  (coreLoadExecutor-838-thread-1-processing-n:127.0.0.1:52317_p_cwr%2Fsw) [n:127.0.0.1:52317_p_cwr%2Fsw c:control_collection s:shard1 r:core_node1 x:collection1] o.a.s.u.p.UpdateRequestProcessorChain creating updateRequestProcessorChain "distrib-dup-test-chain-explicit"
   [junit4]   2> 398979 INFO  (coreLoadExecutor-838-thread-1-processing-n:127.0.0.1:52317_p_cwr%2Fsw) [n:127.0.0.1:52317_p_cwr%2Fsw c:control_collection s:shard1 r:core_node1 x:collection1] o.a.s.u.p.UpdateRequestProcessorChain creating updateRequestProcessorChain "distrib-dup-test-chain-implicit"
   [junit4]   2> 398980 INFO  (coreLoadExecutor-838-thread-1-processing-n:127.0.0.1:52317_p_cwr%2Fsw) [n:127.0.0.1:52317_p_cwr%2Fsw c:control_collection s:shard1 r:core_node1 x:collection1] o.a.s.u.p.UpdateRequestProcessorChain inserting DistributedUpdateProcessorFactory into updateRequestProcessorChain "distrib-dup-test-chain-implicit"
   [junit4]   2> 398980 INFO  (coreLoadExecutor-838-thread-1-processing-n:127.0.0.1:52317_p_cwr%2Fsw) [n:127.0.0.1:52317_p_cwr%2Fsw c:control_collection s:shard1 r:core_node1 x:collection1] o.a.s.c.SolrCore no updateRequestProcessorChain defined as default, creating implicit default
   [junit4]   2> 398983 INFO  (coreLoadExecutor-838-thread-1-processing-n:127.0.0.1:52317_p_cwr%2Fsw) [n:127.0.0.1:52317_p_cwr%2Fsw c:control_collection s:shard1 r:core_node1 x:collection1] o.a.s.h.l.XMLLoader xsltCacheLifetimeSeconds=60
   [junit4]   2> 398984 INFO  (coreLoadExecutor-838-thread-1-processing-n:127.0.0.1:52317_p_cwr%2Fsw) [n:127.0.0.1:52317_p_cwr%2Fsw c:control_collection s:shard1 r:core_node1 x:collection1] o.a.s.h.l.XMLLoader xsltCacheLifetimeSeconds=60
   [junit4]   2> 398985 INFO  (coreLoadExecutor-838-thread-1-processing-n:127.0.0.1:52317_p_cwr%2Fsw) [n:127.0.0.1:52317_p_cwr%2Fsw c:control_collection s:shard1 r:core_node1 x:collection1] o.a.s.h.l.XMLLoader xsltCacheLifetimeSeconds=60
   [junit4]   2> 398987 INFO  (coreLoadExecutor-838-thread-1-processing-n:127.0.0.1:52317_p_cwr%2Fsw) [n:127.0.0.1:52317_p_cwr%2Fsw c:control_collection s:shard1 r:core_node1 x:collection1] o.a.s.h.l.XMLLoader xsltCacheLifetimeSeconds=60
   [junit4]   2> 398990 INFO  (coreLoadExecutor-838-thread-1-processing-n:127.0.0.1:52317_p_cwr%2Fsw) [n:127.0.0.1:52317_p_cwr%2Fsw c:control_collection s:shard1 r:core_node1 x:collection1] o.a.s.c.RequestHandlers Registered paths: /admin/plugins,/replication,/admin/system,standard,/update/json,/schema,/config,/update,/admin/luke,/admin/segments,/admin/ping,/get,/update/json/docs,/update/csv,/admin/file,/admin/threads,/admin/properties,/admin/logging,/admin/mbeans
   [junit4]   2> 398991 INFO  (coreLoadExecutor-838-thread-1-processing-n:127.0.0.1:52317_p_cwr%2Fsw) [n:127.0.0.1:52317_p_cwr%2Fsw c:control_collection s:shard1 r:core_node1 x:collection1] o.a.s.c.SolrCore Using default statsCache cache: org.apache.solr.search.stats.LocalStatsCache
   [junit4]   2> 398992 INFO  (coreLoadExecutor-838-thread-1-processing-n:127.0.0.1:52317_p_cwr%2Fsw) [n:127.0.0.1:52317_p_cwr%2Fsw c:control_collection s:shard1 r:core_node1 x:collection1] o.a.s.u.UpdateHandler Using UpdateLog implementation: org.apache.solr.update.UpdateLog
   [junit4]   2> 398992 INFO  (coreLoadExecutor-838-thread-1-processing-n:127.0.0.1:52317_p_cwr%2Fsw) [n:127.0.0.1:52317_p_cwr%2Fsw c:control_collection s:shard1 r:core_node1 x:collection1] o.a.s.u.UpdateLog Initializing UpdateLog: dataDir= defaultSyncLevel=FLUSH numRecordsToKeep=100 maxNumLogsToKeep=10 numVersionBuckets=65536
   [junit4]   2> 398992 INFO  (coreLoadExecutor-838-thread-1-processing-n:127.0.0.1:52317_p_cwr%2Fsw) [n:127.0.0.1:52317_p_cwr%2Fsw c:control_collection s:shard1 r:core_node1 x:collection1] o.a.s.c.SolrCore Hard AutoCommit: disabled
   [junit4]   2> 398992 INFO  (coreLoadExecutor-838-thread-1-processing-n:127.0.0.1:52317_p_cwr%2Fsw) [n:127.0.0.1:52317_p_cwr%2Fsw c:control_collection s:shard1 r:core_node1 x:collection1] o.a.s.c.SolrCore Soft AutoCommit: disabled
   [junit4]   2> 398993 INFO  (coreLoadExecutor-838-thread-1-processing-n:127.0.0.1:52317_p_cwr%2Fsw) [n:127.0.0.1:52317_p_cwr%2Fsw c:control_collection s:shard1 r:core_node1 x:collection1] o.a.s.u.RandomMergePolicy RandomMergePolicy wrapping class org.apache.lucene.index.LogByteSizeMergePolicy: [LogByteSizeMergePolicy: minMergeSize=1677721, mergeFactor=11, maxMergeSize=2147483648, maxMergeSizeForForcedMerge=9223372036854775807, calibrateSizeByDeletes=true, maxMergeDocs=2147483647, maxCFSSegmentSizeMB=8.796093022207999E12, noCFSRatio=0.6070920281354393]
   [junit4]   2> 398993 INFO  (coreLoadExecutor-838-thread-1-processing-n:127.0.0.1:52317_p_cwr%2Fsw) [n:127.0.0.1:52317_p_cwr%2Fsw c:control_collection s:shard1 r:core_node1 x:collection1] o.a.s.c.SolrCore SolrDeletionPolicy.onInit: commits: num=1
   [junit4]   2> 	commit{dir=MockDirectoryWrapper(RAMDirectory@58c022d4 lockFactory=org.apache.lucene.store.SingleInstanceLockFactory@2e2eb9d1),segFN=segments_1,generation=1}
   [junit4]   2> 398993 INFO  (coreLoadExecutor-838-thread-1-processing-n:127.0.0.1:52317_p_cwr%2Fsw) [n:127.0.0.1:52317_p_cwr%2Fsw c:control_collection s:shard1 r:core_node1 x:collection1] o.a.s.c.SolrCore newest commit generation = 1
   [junit4]   2> 398993 INFO  (coreLoadExecutor-838-thread-1-processing-n:127.0.0.1:52317_p_cwr%2Fsw) [n:127.0.0.1:52317_p_cwr%2Fsw c:control_collection s:shard1 r:core_node1 x:collection1] o.a.s.s.SolrIndexSearcher Opening Searcher@766ff867[collection1] main
   [junit4]   2> 398994 INFO  (coreLoadExecutor-838-thread-1-processing-n:127.0.0.1:52317_p_cwr%2Fsw) [n:127.0.0.1:52317_p_cwr%2Fsw c:control_collection s:shard1 r:core_node1 x:collection1] o.a.s.c.c.ZkStateReader Load collection config from:/collections/control_collection
   [junit4]   2> 398994 INFO  (coreLoadExecutor-838-thread-1-processing-n:127.0.0.1:52317_p_cwr%2Fsw) [n:127.0.0.1:52317_p_cwr%2Fsw c:control_collection s:shard1 r:core_node1 x:collection1] o.a.s.c.c.ZkStateReader path=/collections/control_collection configName=conf1 specified config exists in ZooKeeper
   [junit4]   2> 398994 INFO  (coreLoadExecutor-838-thread-1-processing-n:127.0.0.1:52317_p_cwr%2Fsw) [n:127.0.0.1:52317_p_cwr%2Fsw c:control_collection s:shard1 r:core_node1 x:collection1] o.a.s.r.ManagedResourceStorage Setting up ZooKeeper-based storage for the RestManager with znodeBase: /configs/conf1
   [junit4]   2> 398994 INFO  (coreLoadExecutor-838-thread-1-processing-n:127.0.0.1:52317_p_cwr%2Fsw) [n:127.0.0.1:52317_p_cwr%2Fsw c:control_collection s:shard1 r:core_node1 x:collection1] o.a.s.r.ManagedResourceStorage Configured ZooKeeperStorageIO with znodeBase: /configs/conf1
   [junit4]   2> 398994 INFO  (coreLoadExecutor-838-thread-1-processing-n:127.0.0.1:52317_p_cwr%2Fsw) [n:127.0.0.1:52317_p_cwr%2Fsw c:control_collection s:shard1 r:core_node1 x:collection1] o.a.s.r.RestManager Initializing RestManager with initArgs: {}
   [junit4]   2> 398995 INFO  (coreLoadExecutor-838-thread-1-processing-n:127.0.0.1:52317_p_cwr%2Fsw) [n:127.0.0.1:52317_p_cwr%2Fsw c:control_collection s:shard1 r:core_node1 x:collection1] o.a.s.r.ManagedResourceStorage Reading _rest_managed.json using ZooKeeperStorageIO:path=/configs/conf1
   [junit4]   2> 398995 INFO  (coreLoadExecutor-838-thread-1-processing-n:127.0.0.1:52317_p_cwr%2Fsw) [n:127.0.0.1:52317_p_cwr%2Fsw c:control_collection s:shard1 r:core_node1 x:collection1] o.a.s.r.ManagedResourceStorage No data found for znode /configs/conf1/_rest_managed.json
   [junit4]   2> 398995 INFO  (coreLoadExecutor-838-thread-1-processing-n:127.0.0.1:52317_p_cwr%2Fsw) [n:127.0.0.1:52317_p_cwr%2Fsw c:control_collection s:shard1 r:core_node1 x:collection1] o.a.s.r.ManagedResourceStorage Loaded null at path _rest_managed.json using ZooKeeperStorageIO:path=/configs/conf1
   [junit4]   2> 398995 INFO  (coreLoadExecutor-838-thread-1-processing-n:127.0.0.1:52317_p_cwr%2Fsw) [n:127.0.0.1:52317_p_cwr%2Fsw c:control_collection s:shard1 r:core_node1 x:collection1] o.a.s.r.RestManager Initializing 0 registered ManagedResources
   [junit4]   2> 398995 INFO  (coreLoadExecutor-838-thread-1-processing-n:127.0.0.1:52317_p_cwr%2Fsw) [n:127.0.0.1:52317_p_cwr%2Fsw c:control_collection s:shard1 r:core_node1 x:collection1] o.a.s.h.ReplicationHandler Commits will be reserved for  10000
   [junit4]   2> 398996 INFO  (searcherExecutor-839-thread-1-processing-n:127.0.0.1:52317_p_cwr%2Fsw r:core_node1 c:control_collection s:shard1 x:collection1) [n:127.0.0.1:52317_p_cwr%2Fsw c:control_collection s:shard1 r:core_node1 x:collection1] o.a.s.c.SolrCore [collection1] Registered new searcher Searcher@766ff867[collection1] main{ExitableDirectoryReader(UninvertingDirectoryReader())}
   [junit4]   2> 398996 INFO  (coreLoadExecutor-838-thread-1-processing-n:127.0.0.1:52317_p_cwr%2Fsw) [n:127.0.0.1:52317_p_cwr%2Fsw c:control_collection s:shard1 r:core_node1 x:collection1] o.a.s.u.UpdateLog Looking up max value of version field to seed version buckets
   [junit4]   2> 398996 INFO  (coreLoadExecutor-838-thread-1-processing-n:127.0.0.1:52317_p_cwr%2Fsw) [n:127.0.0.1:52317_p_cwr%2Fsw c:control_collection s:shard1 r:core_node1 x:collection1] o.a.s.u.VersionInfo Refreshing highest value of _version_ for 65536 version buckets from index
   [junit4]   2> 398996 INFO  (coreLoadExecutor-838-thread-1-processing-n:127.0.0.1:52317_p_cwr%2Fsw) [n:127.0.0.1:52317_p_cwr%2Fsw c:control_collection s:shard1 r:core_node1 x:collection1] o.a.s.u.VersionInfo No terms found for _version_, cannot seed version bucket highest value from index
   [junit4]   2> 398996 INFO  (coreLoadExecutor-838-thread-1-processing-n:127.0.0.1:52317_p_cwr%2Fsw) [n:127.0.0.1:52317_p_cwr%2Fsw c:control_collection s:shard1 r:core_node1 x:collection1] o.a.s.u.UpdateLog Could not find max version in index or recent updates, using new clock 1510526585002786816
   [junit4]   2> 398998 INFO  (coreLoadExecutor-838-thread-1-processing-n:127.0.0.1:52317_p_cwr%2Fsw) [n:127.0.0.1:52317_p_cwr%2Fsw c:control_collection s:shard1 r:core_node1 x:collection1] o.a.s.u.UpdateLog Took 1.0ms to seed version buckets with highest version 1510526585002786816
   [junit4]   2> 398998 INFO  (coreLoadExecutor-838-thread-1-processing-n:127.0.0.1:52317_p_cwr%2Fsw) [n:127.0.0.1:52317_p_cwr%2Fsw c:control_collection s:shard1 r:core_node1 x:collection1] o.a.s.c.ZkController watch zkdir /configs/conf1
   [junit4]   2> 398998 INFO  (coreLoadExecutor-838-thread-1-processing-n:127.0.0.1:52317_p_cwr%2Fsw) [n:127.0.0.1:52317_p_cwr%2Fsw c:control_collection s:shard1 r:core_node1 x:collection1] o.a.s.c.CoreContainer registering core: collection1
   [junit4]   2> 398998 INFO  (coreZkRegister-832-thread-1-processing-n:127.0.0.1:52317_p_cwr%2Fsw r:core_node1 c:control_collection s:shard1 x:collection1) [n:127.0.0.1:52317_p_cwr%2Fsw c:control_collection s:shard1 r:core_node1 x:collection1] o.a.s.c.ZkController Register replica - core:collection1 address:http://127.0.0.1:52317/p_cwr/sw collection:control_collection shard:shard1
   [junit4]   2> 398999 INFO  (coreZkRegister-832-thread-1-processing-n:127.0.0.1:52317_p_cwr%2Fsw r:core_node1 c:control_collection s:shard1 x:collection1) [n:127.0.0.1:52317_p_cwr%2Fsw c:control_collection s:shard1 r:core_node1 x:collection1] o.a.s.c.c.SolrZkClient makePath: /collections/control_collection/leader_elect/shard1/election
   [junit4]   2> 399000 INFO  (coreZkRegister-832-thread-1-processing-n:127.0.0.1:52317_p_cwr%2Fsw r:core_node1 c:control_collection s:shard1 x:collection1) [n:127.0.0.1:52317_p_cwr%2Fsw c:control_collection s:shard1 r:core_node1 x:collection1] o.a.s.c.LeaderElector Joined leadership election with path: /collections/control_collection/leader_elect/shard1/election/94407911463583748-core_node1-n_0000000000
   [junit4]   2> 399001 INFO  (coreZkRegister-832-thread-1-processing-n:127.0.0.1:52317_p_cwr%2Fsw r:core_node1 c:control_collection s:shard1 x:collection1) [n:127.0.0.1:52317_p_cwr%2Fsw c:control_collection s:shard1 r:core_node1 x:collection1] o.a.s.c.ShardLeaderElectionContext Running the leader process for shard shard1
   [junit4]   2> 399002 INFO  (coreZkRegister-832-thread-1-processing-n:127.0.0.1:52317_p_cwr%2Fsw r:core_node1 c:control_collection s:shard1 x:collection1) [n:127.0.0.1:52317_p_cwr%2Fsw c:control_collection s:shard1 r:core_node1 x:collection1] o.a.s.c.ShardLeaderElectionContext Enough replicas found to continue.
   [junit4]   2> 399002 INFO  (coreZkRegister-832-thread-1-processing-n:127.0.0.1:52317_p_cwr%2Fsw r:core_node1 c:control_collection s:shard1 x:collection1) [n:127.0.0.1:52317_p_cwr%2Fsw c:control_collection s:shard1 r:core_node1 x:collection1] o.a.s.c.ShardLeaderElectionContext I may be the new leader - try and sync
   [junit4]   2> 399002 INFO  (coreZkRegister-832-thread-1-processing-n:127.0.0.1:52317_p_cwr%2Fsw r:core_node1 c:control_collection s:shard1 x:collection1) [n:127.0.0.1:52317_p_cwr%2Fsw c:control_collection s:shard1 r:core_node1 x:collection1] o.a.s.c.SyncStrategy Sync replicas to http://127.0.0.1:52317/p_cwr/sw/collection1/
   [junit4]   2> 399002 INFO  (OverseerStateUpdate-94407911463583748-127.0.0.1:52317_p_cwr%2Fsw-n_0000000000) [n:127.0.0.1:52317_p_cwr%2Fsw    ] o.a.s.c.Overseer processMessage: queueSize: 1, message = {
   [junit4]   2>   "operation":"leader",
   [junit4]   2>   "shard":"shard1",
   [junit4]   2>   "collection":"control_collection"} current state version: 1
   [junit4]   2> 399002 INFO  (coreZkRegister-832-thread-1-processing-n:127.0.0.1:52317_p_cwr%2Fsw r:core_node1 c:control_collection s:shard1 x:collection1) [n:127.0.0.1:52317_p_cwr%2Fsw c:control_collection s:shard1 r:core_node1 x:collection1] o.a.s.c.SyncStrategy Sync Success - now sync replicas to me
   [junit4]   2> 399002 INFO  (coreZkRegister-832-thread-1-processing-n:127.0.0.1:52317_p_cwr%2Fsw r:core_node1 c:control_collection s:shard1 x:collection1) [n:127.0.0.1:52317_p_cwr%2Fsw c:control_collection s:shard1 r:core_node1 x:collection1] o.a.s.c.SyncStrategy http://127.0.0.1:52317/p_cwr/sw/collection1/ has no replicas
   [junit4]   2> 399002 INFO  (coreZkRegister-832-thread-1-processing-n:127.0.0.1:52317_p_cwr%2Fsw r:core_node1 c:control_collection s:shard1 x:collection1) [n:127.0.0.1:52317_p_cwr%2Fsw c:control_collection s:shard1 r:core_node1 x:collection1] o.a.s.c.ShardLeaderElectionContext I am the new leader: http://127.0.0.1:52317/p_cwr/sw/collection1/ shard1
   [junit4]   2> 399002 INFO  (coreZkRegister-832-thread-1-processing-n:127.0.0.1:52317_p_cwr%2Fsw r:core_node1 c:control_collection s:shard1 x:collection1) [n:127.0.0.1:52317_p_cwr%2Fsw c:control_collection s:shard1 r:core_node1 x:collection1] o.a.s.c.c.SolrZkClient makePath: /collections/control_collection/leaders/shard1
   [junit4]   2> 399005 INFO  (OverseerStateUpdate-94407911463583748-127.0.0.1:52317_p_cwr%2Fsw-n_0000000000) [n:127.0.0.1:52317_p_cwr%2Fsw    ] o.a.s.c.Overseer processMessage: queueSize: 1, message = {
   [junit4]   2>   "operation":"leader",
   [junit4]   2>   "shard":"shard1",
   [junit4]   2>   "collection":"control_collection",
   [junit4]   2>   "base_url":"http://127.0.0.1:52317/p_cwr/sw",
   [junit4]   2>   "core":"collection1",
   [junit4]   2>   "state":"active"} current state version: 1
   [junit4]   2> 399106 INFO  (zkCallback-260-thread-2-processing-n:127.0.0.1:52317_p_cwr%2Fsw) [n:127.0.0.1:52317_p_cwr%2Fsw    ] o.a.s.c.c.ZkStateReader A cluster state change: WatchedEvent state:SyncConnected type:NodeDataChanged path:/clusterstate.json, has occurred - updating... (live nodes size: 1)
   [junit4]   2> 399155 INFO  (coreZkRegister-832-thread-1-processing-n:127.0.0.1:52317_p_cwr%2Fsw r:core_node1 c:control_collection s:shard1 x:collection1) [n:127.0.0.1:52317_p_cwr%2Fsw c:control_collection s:shard1 r:core_node1 x:collection1] o.a.s.c.ZkController We are http://127.0.0.1:52317/p_cwr/sw/collection1/ and leader is http://127.0.0.1:52317/p_cwr/sw/collection1/
   [junit4]   2> 399155 INFO  (coreZkRegister-832-thread-1-processing-n:127.0.0.1:52317_p_cwr%2Fsw r:core_node1 c:control_collection s:shard1 x:collection1) [n:127.0.0.1:52317_p_cwr%2Fsw c:control_collection s:shard1 r:core_node1 x:collection1] o.a.s.c.ZkController No LogReplay needed for core=collection1 baseURL=http://127.0.0.1:52317/p_cwr/sw
   [junit4]   2> 399155 INFO  (coreZkRegister-832-thread-1-processing-n:127.0.0.1:52317_p_cwr%2Fsw r:core_node1 c:control_collection s:shard1 x:collection1) [n:127.0.0.1:52317_p_cwr%2Fsw c:control_collection s:shard1 r:core_node1 x:collection1] o.a.s.c.ZkController I am the leader, no recovery necessary
   [junit4]   2> 399155 INFO  (coreZkRegister-832-thread-1-processing-n:127.0.0.1:52317_p_cwr%2Fsw r:core_node1 c:control_collection s:shard1 x:collection1) [n:127.0.0.1:52317_p_cwr%2Fsw c:control_collection s:shard1 r:core_node1 x:collection1] o.a.s.c.ZkController publishing state=active
   [junit4]   2> 399155 INFO  (coreZkRegister-832-thread-1-processing-n:127.0.0.1:52317_p_cwr%2Fsw r:core_node1 c:control_collection s:shard1 x:collection1) [n:127.0.0.1:52317_p_cwr%2Fsw c:control_collection s:shard1 r:core_node1 x:collection1] o.a.s.c.ZkController numShards not found on descriptor - reading it from system property
   [junit4]   2> 399156 INFO  (OverseerStateUpdate-94407911463583748-127.0.0.1:52317_p_cwr%2Fsw-n_0000000000) [n:127.0.0.1:52317_p_cwr%2Fsw    ] o.a.s.c.Overseer processMessage: queueSize: 1, message = {
   [junit4]   2>   "base_url":"http://127.0.0.1:52317/p_cwr/sw",
   [junit4]   2>   "core_node_name":"core_node1",
   [junit4]   2>   "node_name":"127.0.0.1:52317_p_cwr%2Fsw",
   [junit4]   2>   "roles":null,
   [junit4]   2>   "operation":"state",
   [junit4]   2>   "numShards":"1",
   [junit4]   2>   "collection":"control_collection",
   [junit4]   2>   "shard":"shard1",
   [junit4]   2>   "core":"collection1",
   [junit4]   2>   "state":"active"} current state version: 2
   [junit4]   2> 399157 INFO  (OverseerStateUpdate-94407911463583748-127.0.0.1:52317_p_cwr%2Fsw-n_0000000000) [n:127.0.0.1:52317_p_cwr%2Fsw    ] o.a.s.c.o.ReplicaMutator Update state numShards=1 message={
   [junit4]   2>   "base_url":"http://127.0.0.1:52317/p_cwr/sw",
   [junit4]   2>   "core_node_name":"core_node1",
   [junit4]   2>   "node_name":"127.0.0.1:52317_p_cwr%2Fsw",
   [junit4]   2>   "roles":null,
   [junit4]   2>   "operation":"state",
   [junit4]   2>   "numShards":"1",
   [junit4]   2>   "collection":"control_collection",
   [junit4]   2>   "shard":"shard1",
   [junit4]   2>   "core":"collection1",
   [junit4]   2>   "state":"active"}
   [junit4]   2> 399236 INFO  (TEST-HttpPartitionTest.test-seed#[54E2F8D778502A82]) [    ] o.a.s.c.c.SolrZkClient Using default ZkCredentialsProvider
   [junit4]   2> 399236 INFO  (TEST-HttpPartitionTest.test-seed#[54E2F8D778502A82]) [    ] o.a.s.c.c.ConnectionManager Waiting for client to connect to ZooKeeper
   [junit4]   2> 399238 INFO  (zkCallback-262-thread-1) [    ] o.a.s.c.c.ConnectionManager Watcher org.apache.solr.common.cloud.ConnectionManager@652b32ea name:ZooKeeperConnection Watcher:127.0.0.1:35927/solr got event WatchedEvent state:SyncConnected type:None path:null path:null type:None
   [junit4]   2> 399238 INFO  (TEST-HttpPartitionTest.test-seed#[54E2F8D778502A82]) [    ] o.a.s.c.c.ConnectionManager Client is connected to ZooKeeper
   [junit4]   2> 399238 INFO  (TEST-HttpPartitionTest.test-seed#[54E2F8D778502A82]) [    ] o.a.s.c.c.SolrZkClient Using default ZkACLProvider
   [junit4]   2> 399238 INFO  (TEST-HttpPartitionTest.test-seed#[54E2F8D778502A82]) [    ] o.a.s.c.c.ZkStateReader Updating cluster state from ZooKeeper... 
   [junit4]   2> 399240 INFO  (TEST-HttpPartitionTest.test-seed#[54E2F8D778502A82]) [    ] o.a.s.c.ChaosMonkey monkey: init - expire sessions:false cause connection loss:false
   [junit4]   2> 399240 INFO  (TEST-HttpPartitionTest.test-seed#[54E2F8D778502A82]) [    ] o.a.s.c.AbstractFullDistribZkTestBase Creating collection1 with stateFormat=2
   [junit4]   2> 399240 INFO  (TEST-HttpPartitionTest.test-seed#[54E2F8D778502A82]) [    ] o.a.s.c.c.SolrZkClient Using default ZkCredentialsProvider
   [junit4]   2> 399240 INFO  (TEST-HttpPartitionTest.test-seed#[54E2F8D778502A82]) [    ] o.a.s.c.c.ConnectionManager Waiting for client to connect to ZooKeeper
   [junit4]   2> 399241 INFO  (zkCallback-263-thread-1) [    ] o.a.s.c.c.ConnectionManager Watcher org.apache.solr.common.cloud.ConnectionManager@4eeb2c03 name:ZooKeeperConnection Watcher:127.0.0.1:35927/solr got event WatchedEvent state:SyncConnected type:None path:null path:null type:None
   [junit4]   2> 399241 INFO  (TEST-HttpPartitionTest.test-seed#[54E2F8D778502A82]) [    ] o.a.s.c.c.ConnectionManager Client is connected to ZooKeeper
   [junit4]   2> 399241 INFO  (TEST-HttpPartitionTest.test-seed#[54E2F8D778502A82]) [    ] o.a.s.c.c.SolrZkClient Using default ZkACLProvider
   [junit4]   2> 399243 INFO  (OverseerStateUpdate-94407911463583748-127.0.0.1:52317_p_cwr%2Fsw-n_0000000000) [n:127.0.0.1:52317_p_cwr%2Fsw    ] o.a.s.c.Overseer processMessage: queueSize: 1, message = {
   [junit4]   2>   "operation":"create",
   [junit4]   2>   "name":"collection1",
   [junit4]   2>   "numShards":"2",
   [junit4]   2>   "stateFormat":"2"} current state version: 2
   [junit4]   2> 399243 INFO  (OverseerStateUpdate-94407911463583748-127.0.0.1:52317_p_cwr%2Fsw-n_0000000000) [n:127.0.0.1:52317_p_cwr%2Fsw    ] o.a.s.c.o.ClusterStateMutator building a new cName: collection1
   [junit4]   2> 399244 INFO  (zkCallback-260-thread-2-processing-n:127.0.0.1:52317_p_cwr%2Fsw) [n:127.0.0.1:52317_p_cwr%2Fsw    ] o.a.s.c.c.ZkStateReader A cluster state change: WatchedEvent state:SyncConnected type:NodeDataChanged path:/clusterstate.json, has occurred - updating... (live nodes size: 1)
   [junit4]   2> 399244 INFO  (zkCallback-262-thread-1) [    ] o.a.s.c.c.ZkStateReader A cluster state change: WatchedEvent state:SyncConnected type:NodeDataChanged path:/clusterstate.json, has occurred - updating... (live nodes size: 1)
   [junit4]   2> 399293 INFO  (TEST-HttpPartitionTest.test-seed#[54E2F8D778502A82]) [    ] o.a.s.SolrTestCaseJ4 Writing core.properties file to /home/jenkins/workspace/Lucene-Solr-5.x-Linux/solr/build/solr-core/test/J2/temp/solr.cloud.HttpPartitionTest_54E2F8D778502A82-001/shard-1-001/cores/collection1
   [junit4]   2> 399293 INFO  (TEST-HttpPartitionTest.test-seed#[54E2F8D778502A82]) [    ] o.a.s.c.AbstractFullDistribZkTestBase create jetty 1 in directory /home/jenkins/workspace/Lucene-Solr-5.x-Linux/solr/build/solr-core/test/J2/temp/solr.cloud.HttpPartitionTest_54E2F8D778502A82-001/shard-1-001
   [junit4]   2> 399294 INFO  (TEST-HttpPartitionTest.test-seed#[54E2F8D778502A82]) [    ] o.e.j.s.Server jetty-9.2.13.v20150730
   [junit4]   2> 399295 INFO  (TEST-HttpPartitionTest.test-seed#[54E2F8D778502A82]) [    ] o.e.j.s.h.ContextHandler Started o.e.j.s.ServletContextHandler@21add37f{/p_cwr/sw,null,AVAILABLE}
   [junit4]   2> 399296 INFO  (TEST-HttpPartitionTest.test-seed#[54E2F8D778502A82]) [    ] o.e.j.s.ServerConnector Started ServerConnector@5726f91e{HTTP/1.1}{127.0.0.1:53008}
   [junit4]   2> 399296 INFO  (TEST-HttpPartitionTest.test-seed#[54E2F8D778502A82]) [    ] o.e.j.s.Server Started @401077ms
   [junit4]   2> 399296 INFO  (TEST-HttpPartitionTest.test-seed#[54E2F8D778502A82]) [    ] o.a.s.c.s.e.JettySolrRunner Jetty properties: {solr.data.dir=/home/jenkins/workspace/Lucene-Solr-5.x-Linux/solr/build/solr-core/test/J2/temp/solr.cloud.HttpPartitionTest_54E2F8D778502A82-001/tempDir-001/jetty1, coreRootDirectory=/home/jenkins/workspace/Lucene-Solr-5.x-Linux/solr/build/solr-core/test/J2/temp/solr.cloud.HttpPartitionTest_54E2F8D778502A82-001/shard-1-001/cores, hostContext=/p_cwr/sw, hostPort=45127, solrconfig=solrconfig.xml}
   [junit4]   2> 399296 INFO  (TEST-HttpPartitionTest.test-seed#[54E2F8D778502A82]) [    ] o.a.s.s.SolrDispatchFilter SolrDispatchFilter.init(): sun.misc.Launcher$AppClassLoader@373ee92
   [junit4]   2> 399296 INFO  (TEST-HttpPartitionTest.test-seed#[54E2F8D778502A82]) [    ] o.a.s.c.SolrResourceLoader new SolrResourceLoader for directory: '/home/jenkins/workspace/Lucene-Solr-5.x-Linux/solr/build/solr-core/test/J2/temp/solr.cloud.HttpPartitionTest_54E2F8D778502A82-001/shard-1-001/'
   [junit4]   2> 399305 INFO  (TEST-HttpPartitionTest.test-seed#[54E2F8D778502A82]) [    ] o.a.s.c.c.SolrZkClient Using default ZkCredentialsProvider
   [junit4]   2> 399305 INFO  (TEST-HttpPartitionTest.test-seed#[54E2F8D778502A82]) [    ] o.a.s.c.c.ConnectionManager Waiting for client to connect to ZooKeeper
   [junit4]   2> 399307 INFO  (zkCallback-264-thread-1) [    ] o.a.s.c.c.ConnectionManager Watcher org.apache.solr.common.cloud.ConnectionManager@4e2bd979 name:ZooKeeperConnection Watcher:127.0.0.1:35927/solr got event WatchedEvent state:SyncConnected type:None path:null path:null type:None
   [junit4]   2> 399307 INFO  (TEST-HttpPartitionTest.test-seed#[54E2F8D778502A82]) [    ] o.a.s.c.c.ConnectionManager Client is connected to ZooKeeper
   [junit4]   2> 399308 INFO  (TEST-HttpPartitionTest.test-seed#[54E2F8D778502A82]) [    ] o.a.s.c.c.SolrZkClient Using default ZkACLProvider
   [junit4]   2> 399308 INFO  (TEST-HttpPartitionTest.test-seed#[54E2F8D778502A82]) [    ] o.a.s.s.SolrDispatchFilter Loading solr.xml from SolrHome (not found in ZooKeeper)
   [junit4]   2> 399308 INFO  (TEST-HttpPartitionTest.test-seed#[54E2F8D778502A82]) [    ] o.a.s.c.SolrXmlConfig Loading container configuration from /home/jenkins/workspace/Lucene-Solr-5.x-Linux/solr/build/solr-core/test/J2/temp/solr.cloud.HttpPartitionTest_54E2F8D778502A82-001/shard-1-001/solr.xml
   [junit4]   2> 399317 INFO  (TEST-HttpPartitionTest.test-seed#[54E2F8D778502A82]) [    ] o.a.s.c.CoresLocator Config-defined core root directory: /home/jenkins/workspace/Lucene-Solr-5.x-Linux/solr/build/solr-core/test/J2/temp/solr.cloud.HttpPartitionTest_54E2F8D778502A82-001/shard-1-001/cores
   [junit4]   2> 399317 INFO  (TEST-HttpPartitionTest.test-seed#[54E2F8D778502A82]) [    ] o.a.s.c.CoreContainer New CoreContainer 825202548
   [junit4]   2> 399317 INFO  (TEST-HttpPartitionTest.test-seed#[54E2F8D778502A82]) [    ] o.a.s.c.CoreContainer Loading cores into CoreContainer [instanceDir=/home/jenkins/workspace/Lucene-Solr-5.x-Linux/solr/build/solr-core/test/J2/temp/solr.cloud.HttpPartitionTest_54E2F8D778502A82-001/shard-1-001/]
   [junit4]   2> 399317 INFO  (TEST-HttpPartitionTest.test-seed#[54E2F8D778502A82]) [    ] o.a.s.c.CoreContainer loading shared library: /home/jenkins/workspace/Lucene-Solr-5.x-Linux/solr/build/solr-core/test/J2/temp/solr.cloud.HttpPartitionTest_54E2F8D778502A82-001/shard-1-001/lib
   [junit4]   2> 399317 WARN  (TEST-HttpPartitionTest.test-seed#[54E2F8D778502A82]) [    ] o.a.s.c.SolrResourceLoader Can't find (or read) directory to add to classloader: lib (resolved as: /home/jenkins/workspace/Lucene-Solr-5.x-Linux/solr/build/solr-core/test/J2/temp/solr.cloud.HttpPartitionTest_54E2F8D778502A82-001/shard-1-001/lib).
   [junit4]   2> 399322 INFO  (TEST-HttpPartitionTest.test-seed#[54E2F8D778502A82]) [    ] o.a.s.h.c.HttpShardHandlerFactory created with socketTimeout : 90000,urlScheme : ,connTimeout : 15000,maxConnectionsPerHost : 20,maxConnections : 10000,corePoolSize : 0,maximumPoolSize : 2147483647,maxThreadIdleTime : 5,sizeOfQueue : -1,fairnessPolicy : false,useRetries : false,
   [junit4]   2> 399323 INFO  (TEST-HttpPartitionTest.test-seed#[54E2F8D778502A82]) [    ] o.a.s.u.UpdateShardHandler Creating UpdateShardHandler HTTP client with params: socketTimeout=340000&connTimeout=45000&retry=true
   [junit4]   2> 399323 INFO  (TEST-HttpPartitionTest.test-seed#[54E2F8D778502A82]) [    ] o.a.s.l.LogWatcher SLF4J impl is org.slf4j.impl.Log4jLoggerFactory
   [junit4]   2> 399323 INFO  (TEST-HttpPartitionTest.test-seed#[54E2F8D778502A82]) [    ] o.a.s.l.LogWatcher Registering Log Listener [Log4j (org.slf4j.impl.Log4jLoggerFactory)]
   [junit4]   2> 399324 INFO  (TEST-HttpPartitionTest.test-seed#[54E2F8D778502A82]) [    ] o.a.s.c.ZkContainer Zookeeper client=127.0.0.1:35927/solr
   [junit4]   2> 399324 INFO  (TEST-HttpPartitionTest.test-seed#[54E2F8D778502A82]) [    ] o.a.s.c.ZkController zkHost includes chroot
   [junit4]   2> 399324 INFO  (TEST-HttpPartitionTest.test-seed#[54E2F8D778502A82]) [    ] o.a.s.c.c.SolrZkClient Using default ZkCredentialsProvider
   [junit4]   2> 399324 INFO  (TEST-HttpPartitionTest.test-seed#[54E2F8D778502A82]) [    ] o.a.s.c.c.ConnectionManager Waiting for client to connect to ZooKeeper
   [junit4]   2> 399325 INFO  (zkCallback-266-thread-1) [    ] o.a.s.c.c.ConnectionManager Watcher org.apache.solr.common.cloud.ConnectionManager@2a5450d8 name:ZooKeeperConnection Watcher:127.0.0.1:35927 got event WatchedEvent state:SyncConnected type:None path:null path:null type:None
   [junit4]   2> 399326 INFO  (TEST-HttpPartitionTest.test-seed#[54E2F8D778502A82]) [    ] o.a.s.c.c.ConnectionManager Client is connected to ZooKeeper
   [junit4]   2> 399326 INFO  (TEST-HttpPartitionTest.test-seed#[54E2F8D778502A82]) [    ] o.a.s.c.c.SolrZkClient Using default ZkACLProvider
   [junit4]   2> 399327 INFO  (TEST-HttpPartitionTest.test-seed#[54E2F8D778502A82]) [n:127.0.0.1:45127_p_cwr%2Fsw    ] o.a.s.c.c.ConnectionManager Waiting for client to connect to ZooKeeper
   [junit4]   2> 399328 INFO  (zkCallback-267-thread-1-processing-n:127.0.0.1:45127_p_cwr%2Fsw) [n:127.0.0.1:45127_p_cwr%2Fsw    ] o.a.s.c.c.ConnectionManager Watcher org.apache.solr.common.cloud.ConnectionManager@6392bac8 name:ZooKeeperConnection Watcher:127.0.0.1:35927/solr got event WatchedEvent state:SyncConnected type:None path:null path:null type:None
   [junit4]   2> 399328 INFO  (TEST-HttpPartitionTest.test-seed#[54E2F8D778502A82]) [n:127.0.0.1:45127_p_cwr%2Fsw    ] o.a.s.c.c.ConnectionManager Client is connected to ZooKeeper
   [junit4]   2> 399331 INFO  (TEST-HttpPartitionTest.test-seed#[54E2F8D778502A82]) [n:127.0.0.1:45127_p_cwr%2Fsw    ] o.a.s.c.c.ZkStateReader Updating cluster state from ZooKeeper... 
   [junit4]   2> 399346 INFO  (OverseerStateUpdate-94407911463583748-127.0.0.1:52317_p_cwr%2Fsw-n_0000000000) [n:127.0.0.1:52317_p_cwr%2Fsw    ] o.a.s.c.o.ZkStateWriter going to create_collection /collections/collection1/state.json
   [junit4]   2> 400332 INFO  (TEST-HttpPartitionTest.test-seed#[54E2F8D778502A82]) [n:127.0.0.1:45127_p_cwr%2Fsw    ] o.a.s.c.ZkController Register node as live in ZooKeeper:/live_nodes/127.0.0.1:45127_p_cwr%2Fsw
   [junit4]   2> 400333 INFO  (TEST-HttpPartitionTest.test-seed#[54E2F8D778502A82]) [n:127.0.0.1:45127_p_cwr%2Fsw    ] o.a.s.c.c.SolrZkClient makePath: /live_nodes/127.0.0.1:45127_p_cwr%2Fsw
   [junit4]   2> 400333 INFO  (zkCallback-260-thread-2-processing-n:127.0.0.1:52317_p_cwr%2Fsw) [n:127.0.0.1:52317_p_cwr%2Fsw    ] o.a.s.c.c.ZkStateReader A live node change: WatchedEvent state:SyncConnected type:NodeChildrenChanged path:/live_nodes, has occurred - updating... (live nodes size: 1)
   [junit4]   2> 400333 INFO  (zkCallback-262-thread-1) [    ] o.a.s.c.c.ZkStateReader A live node change: WatchedEvent state:SyncConnected type:NodeChildrenChanged path:/live_nodes, has occurred - updating... (live nodes size: 1)
   [junit4]   2> 400333 INFO  (zkCallback-267-thread-1-processing-n:127.0.0.1:45127_p_cwr%2Fsw) [n:127.0.0.1:45127_p_cwr%2Fsw    ] o.a.s.c.c.ZkStateReader A live node change: WatchedEvent state:SyncConnected type:NodeChildrenChanged path:/live_nodes, has occurred - updating... (live nodes size: 1)
   [junit4]   2> 400335 INFO  (TEST-HttpPartitionTest.test-seed#[54E2F8D778502A82]) [n:127.0.0.1:45127_p_cwr%2Fsw    ] o.a.s.c.Overseer Overseer (id=null) closing
   [junit4]   2> 400335 INFO  (TEST-HttpPartitionTest.test-seed#[54E2F8D778502A82]) [n:127.0.0.1:45127_p_cwr%2Fsw    ] o.a.s.c.LeaderElector Joined leadership election with path: /overseer_elect/election/94407911463583753-127.0.0.1:45127_p_cwr%2Fsw-n_0000000001
   [junit4]   2> 400336 INFO  (TEST-HttpPartitionTest.test-seed#[54E2F8D778502A82]) [n:127.0.0.1:45127_p_cwr%2Fsw    ] o.a.s.c.LeaderElector Watching path /overseer_elect/election/94407911463583748-127.0.0.1:52317_p_cwr%2Fsw-n_0000000000 to know if I could be the leader
   [junit4]   2> 400346 INFO  (TEST-HttpPartitionTest.test-seed#[54E2F8D778502A82]) [n:127.0.0.1:45127_p_cwr%2Fsw    ] o.a.s.c.CoreContainer Security conf doesn't exist. Skipping setup for authorization module.
   [junit4]   2> 400346 INFO  (TEST-HttpPartitionTest.test-seed#[54E2F8D778502A82]) [n:127.0.0.1:45127_p_cwr%2Fsw    ] o.a.s.c.CoreContainer No authentication plugin used.
   [junit4]   2> 400346 INFO  (TEST-HttpPartitionTest.test-seed#[54E2F8D778502A82]) [n:127.0.0.1:45127_p_cwr%2Fsw    ] o.a.s.c.CoresLocator Looking for core definitions underneath /home/jenkins/workspace/Lucene-Solr-5.x-Linux/solr/build/solr-core/test/J2/temp/solr.cloud.HttpPartitionTest_54E2F8D778502A82-001/shard-1-001/cores
   [junit4]   2> 400347 INFO  (TEST-HttpPartitionTest.test-seed#[54E2F8D778502A82]) [n:127.0.0.1:45127_p_cwr%2Fsw    ] o.a.s.c.SolrCore Created CoreDescriptor: {config=solrconfig.xml, shard=, name=collection1, schema=schema.xml, collection=collection1, coreNodeName=, instanceDir=/home/jenkins/workspace/Lucene-Solr-5.x-Linux/solr/build/solr-core/test/J2/temp/solr.cloud.HttpPartitionTest_54E2F8D778502A82-001/shard-1-001/cores/collection1, loadOnStartup=true, configSetProperties=configsetprops.json, transient=false, dataDir=data/, absoluteInstDir=/home/jenkins/workspace/Lucene-Solr-5.x-Linux/solr/build/solr-core/test/J2/temp/solr.cloud.HttpPartitionTest_54E2F8D778502A82-001/shard-1-001/cores/collection1/}
   [junit4]   2> 400347 INFO  (TEST-HttpPartitionTest.test-seed#[54E2F8D778502A82]) [n:127.0.0.1:45127_p_cwr%2Fsw    ] o.a.s.c.CoresLocator Found core collection1 in /home/jenkins/workspace/Lucene-Solr-5.x-Linux/solr/build/solr-core/test/J2/temp/solr.cloud.HttpPartitionTest_54E2F8D778502A82-001/shard-1-001/cores/collection1/
   [junit4]   2> 400347 INFO  (TEST-HttpPartitionTest.test-seed#[54E2F8D778502A82]) [n:127.0.0.1:45127_p_cwr%2Fsw    ] o.a.s.c.CoresLocator Found 1 core definitions
   [junit4]   2> 400348 INFO  (TEST-HttpPartitionTest.test-seed#[54E2F8D778502A82]) [n:127.0.0.1:45127_p_cwr%2Fsw    ] o.a.s.s.SolrDispatchFilter user.dir=/home/jenkins/workspace/Lucene-Solr-5.x-Linux/solr/build/solr-core/test/J2
   [junit4]   2> 400348 INFO  (TEST-HttpPartitionTest.test-seed#[54E2F8D778502A82]) [n:127.0.0.1:45127_p_cwr%2Fsw    ] o.a.s.s.SolrDispatchFilter SolrDispatchFilter.init() done
   [junit4]   2> 400348 INFO  (coreLoadExecutor-849-thread-1-processing-n:127.0.0.1:45127_p_cwr%2Fsw) [n:127.0.0.1:45127_p_cwr%2Fsw c:collection1   x:collection1] o.a.s.c.ZkController publishing state=down
   [junit4]   2> 400348 INFO  (coreLoadExecutor-849-thread-1-processing-n:127.0.0.1:45127_p_cwr%2Fsw) [n:127.0.0.1:45127_p_cwr%2Fsw c:collection1   x:collection1] o.a.s.c.ZkController numShards not found on descriptor - reading it from system property
   [junit4]   2> 400349 INFO  (coreLoadExecutor-849-thread-1-processing-n:127.0.0.1:45127_p_cwr%2Fsw) [n:127.0.0.1:45127_p_cwr%2Fsw c:collection1   x:collection1] o.a.s.c.ZkController Registering watch for external collection collection1
   [junit4]   2> 400349 INFO  (coreLoadExecutor-849-thread-1-processing-n:127.0.0.1:45127_p_cwr%2Fsw) [n:127.0.0.1:45127_p_cwr%2Fsw c:collection1   x:collection1] o.a.s.c.c.ZkStateReader addZkWatch collection1
   [junit4]   2> 400349 INFO  (OverseerStateUpdate-94407911463583748-127.0.0.1:52317_p_cwr%2Fsw-n_0000000000) [n:127.0.0.1:52317_p_cwr%2Fsw    ] o.a.s.c.Overseer processMessage: queueSize: 1, message = {
   [junit4]   2>   "base_url":"http://127.0.0.1:45127/p_cwr/sw",
   [junit4]   2>   "node_name":"127.0.0.1:45127_p_cwr%2Fsw",
   [junit4]   2>   "roles":null,
   [junit4]   2>   "operation":"state",
   [junit4]   2>   "numShards":"2",
   [junit4]   2>   "collection":"collection1",
   [junit4]   2>   "shard":null,
   [junit4]   2>   "core":"collection1",
   [junit4]   2>   "state":"down"} current state version: 3
   [junit4]   2> 400349 INFO  (coreLoadExecutor-849-thread-1-processing-n:127.0.0.1:45127_p_cwr%2Fsw) [n:127.0.0.1:45127_p_cwr%2Fsw c:collection1   x:collection1] o.a.s.c.c.ZkStateReader Add data for collection1 ver 0 
   [junit4]   2> 400349 INFO  (coreLoadExecutor-849-thread-1-processing-n:127.0.0.1:45127_p_cwr%2Fsw) [n:127.0.0.1:45127_p_cwr%2Fsw c:collection1   x:collection1] o.a.s.c.ZkController look for our core node name
   [junit4]   2> 400350 INFO  (OverseerStateUpdate-94407911463583748-127.0.0.1:52317_p_cwr%2Fsw-n_0000000000) [n:127.0.0.1:52317_p_cwr%2Fsw    ] o.a.s.c.o.ReplicaMutator Update state numShards=2 message={
   [junit4]   2>   "base_url":"http://127.0.0.1:45127/p_cwr/sw",
   [junit4]   2>   "node_name":"127.0.0.1:45127_p_cwr%2Fsw",
   [junit4]   2>   "roles":null,
   [junit4]   2>   "operation":"state",
   [junit4]   2>   "numShards":"2",
   [junit4]   2>   "collection":"collection1",
   [junit4]   2>   "shard":null,
   [junit4]   2>   "core":"collection1",
   [junit4]   2>   "state":"down"}
   [junit4]   2> 400350 INFO  (OverseerStateUpdate-94407911463583748-127.0.0.1:52317_p_cwr%2Fsw-n_0000000000) [n:127.0.0.1:52317_p_cwr%2Fsw    ] o.a.s.c.o.ReplicaMutator Collection already exists with numShards=2
   [junit4]   2> 400350 INFO  (OverseerStateUpdate-94407911463583748-127.0.0.1:52317_p_cwr%2Fsw-n_0000000000) [n:127.0.0.1:52317_p_cwr%2Fsw    ] o.a.s.c.o.ReplicaMutator Assigning new node to shard shard=shard1
   [junit4]   2> 400451 INFO  (OverseerStateUpdate-94407911463583748-127.0.0.1:52317_p_cwr%2Fsw-n_0000000000) [n:127.0.0.1:52317_p_cwr%2Fsw    ] o.a.s.c.o.ZkStateWriter going to update_collection /collections/collection1/state.json version: 0
   [junit4]   2> 400452 INFO  (zkCallback-267-thread-1-processing-n:127.0.0.1:45127_p_cwr%2Fsw) [n:127.0.0.1:45127_p_cwr%2Fsw    ] o.a.s.c.c.ZkStateReader A cluster state change: WatchedEvent state:SyncConnected type:NodeDataChanged path:/collections/collection1/state.json for collection collection1 has occurred - updating... (live nodes size: 2)
   [junit4]   2> 400452 INFO  (zkCallback-267-thread-1-processing-n:127.0.0.1:45127_p_cwr%2Fsw) [n:127.0.0.1:45127_p_cwr%2Fsw    ] o.a.s.c.c.ZkStateReader Updating data for collection1 from 0 to 1 
   [junit4]   2> 401350 INFO  (coreLoadExecutor-849-thread-1-processing-n:127.0.0.1:45127_p_cwr%2Fsw) [n:127.0.0.1:45127_p_cwr%2Fsw c:collection1   x:collection1] o.a.s.c.ZkController waiting to find shard id in clusterstate for collection1
   [junit4]   2> 401350 INFO  (coreLoadExecutor-849-thread-1-processing-n:127.0.0.1:45127_p_cwr%2Fsw) [n:127.0.0.1:45127_p_cwr%2Fsw c:collection1   x:collection1] o.a.s.c.ZkController Check for collection zkNode:collection1
   [junit4]   2> 401350 INFO  (coreLoadExecutor-849-thread-1-processing-n:127.0.0.1:45127_p_cwr%2Fsw) [n:127.0.0.1:45127_p_cwr%2Fsw c:collection1   x:collection1] o.a.s.c.ZkController Collection zkNode exists
   [junit4]   2> 401350 INFO  (coreLoadExecutor-849-thread-1-processing-n:127.0.0.1:45127_p_cwr%2Fsw) [n:127.0.0.1:45127_p_cwr%2Fsw c:collection1   x:collection1] o.a.s.c.c.ZkStateReader Load collection config from:/collections/collection1
   [junit4]   2> 401350 INFO  (coreLoadExecutor-849-thread-1-processing-n:127.0.0.1:45127_p_cwr%2Fsw) [n:127.0.0.1:45127_p_cwr%2Fsw c:collection1   x:collection1] o.a.s.c.c.ZkStateReader path=/collections/collection1 configName=conf1 specified config exists in ZooKeeper
   [junit4]   2> 401351 INFO  (coreLoadExecutor-849-thread-1-processing-n:127.0.0.1:45127_p_cwr%2Fsw) [n:127.0.0.1:45127_p_cwr%2Fsw c:collection1   x:collection1] o.a.s.c.SolrResourceLoader new SolrResourceLoader for directory: '/home/jenkins/workspace/Lucene-Solr-5.x-Linux/solr/build/solr-core/test/J2/temp/solr.cloud.HttpPartitionTest_54E2F8D778502A82-001/shard-1-001/cores/collection1/'
   [junit4]   2> 401360 INFO  (coreLoadExecutor-849-thread-1-processing-n:127.0.0.1:45127_p_cwr%2Fsw) [n:127.0.0.1:45127_p_cwr%2Fsw c:collection1   x:collection1] o.a.s.c.Config loaded config solrconfig.xml with version 0 
   [junit4]   2> 401364 INFO  (coreLoadExecutor-849-thread-1-processing-n:127.0.0.1:45127_p_cwr%2Fsw) [n:127.0.0.1:45127_p_cwr%2Fsw c:collection1   x:collection1] o.a.s.c.SolrConfig current version of requestparams : -1
   [junit4]   2> 401380 INFO  (coreLoadExecutor-849-thread-1-processing-n:127.0.0.1:45127_p_cwr%2Fsw) [n:127.0.0.1:45127_p_cwr%2Fsw c:collection1   x:collection1] o.a.s.c.SolrConfig Using Lucene MatchVersion: 5.4.0
   [junit4]   2> 401395 INFO  (coreLoadExecutor-849-thread-1-processing-n:127.0.0.1:45127_p_cwr%2Fsw) [n:127.0.0.1:45127_p_cwr%2Fsw c:collection1   x:collection1] o.a.s.c.Config Loaded SolrConfig: solrconfig.xml
   [junit4]   2> 401395 INFO  (coreLoadExecutor-849-thread-1-processing-n:127.0.0.1:45127_p_cwr%2Fsw) [n:127.0.0.1:45127_p_cwr%2Fsw c:collection1   x:collection1] o.a.s.s.IndexSchema Reading Solr Schema from /configs/conf1/schema.xml
   [junit4]   2> 401400 INFO  (coreLoadExecutor-849-thread-1-processing-n:127.0.0.1:45127_p_cwr%2Fsw) [n:127.0.0.1:45127_p_cwr%2Fsw c:collection1   x:collection1] o.a.s.s.IndexSchema [collection1] Schema name=test
   [junit4]   2> 401616 INFO  (coreLoadExecutor-849-thread-1-processing-n:127.0.0.1:45127_p_cwr%2Fsw) [n:127.0.0.1:45127_p_cwr%2Fsw c:collection1   x:collection1] o.a.s.s.OpenExchangeRatesOrgProvider Initialized with rates=open-exchange-rates.json, refreshInterval=1440.
   [junit4]   2> 401623 INFO  (coreLoadExecutor-849-thread-1-processing-n:127.0.0.1:45127_p_cwr%2Fsw) [n:127.0.0.1:45127_p_cwr%2Fsw c:collection1   x:collection1] o.a.s.s.IndexSchema default search field in schema is text
   [junit4]   2> 401624 INFO  (coreLoadExecutor-849-thread-1-processing-n:127.0.0.1:45127_p_cwr%2Fsw) [n:127.0.0.1:45127_p_cwr%2Fsw c:collection1   x:collection1] o.a.s.s.IndexSchema unique key field: id
   [junit4]   2> 401629 INFO  (coreLoadExecutor-849-thread-1-processing-n:127.0.0.1:45127_p_cwr%2Fsw) [n:127.0.0.1:45127_p_cwr%2Fsw c:collection1   x:collection1] o.a.s.s.FileExchangeRateProvider Reloading exchange rates from file currency.xml
   [junit4]   2> 401632 INFO  (coreLoadExecutor-849-thread-1-processing-n:127.0.0.1:45127_p_cwr%2Fsw) [n:127.0.0.1:45127_p_cwr%2Fsw c:collection1   x:collection1] o.a.s.s.FileExchangeRateProvider Reloading exchange rates from file currency.xml
   [junit4]   2> 401633 INFO  (coreLoadExecutor-849-thread-1-processing-n:127.0.0.1:45127_p_cwr%2Fsw) [n:127.0.0.1:45127_p_cwr%2Fsw c:collection1   x:collection1] o.a.s.s.OpenExchangeRatesOrgProvider Reloading exchange rates from open-exchange-rates.json
   [junit4]   2> 401634 WARN  (coreLoadExecutor-849-thread-1-processing-n:127.0.0.1:45127_p_cwr%2Fsw) [n:127.0.0.1:45127_p_cwr%2Fsw c:collection1   x:collection1] o.a.s.s.OpenExchangeRatesOrgProvider Unknown key IMPORTANT NOTE
   [junit4]   2> 401634 WARN  (coreLoadExecutor-849-thread-1-processing-n:127.0.0.1:45127_p_cwr%2Fsw) [n:127.0.0.1:45127_p_cwr%2Fsw c:collection1   x:collection1] o.a.s.s.OpenExchangeRatesOrgProvider Expected key, got STRING
   [junit4]   2> 401634 INFO  (coreLoadExecutor-849-thread-1-processing-n:127.0.0.1:45127_p_cwr%2Fsw) [n:127.0.0.1:45127_p_cwr%2Fsw c:collection1   x:collection1] o.a.s.s.OpenExchangeRatesOrgProvider Reloading exchange rates from open-exchange-rates.json
   [junit4]   2> 401635 WARN  (coreLoadExecutor-849-thread-1-processing-n:127.0.0.1:45127_p_cwr%2Fsw) [n:127.0.0.1:45127_p_cwr%2Fsw c:collection1   x:collection1] o.a.s.s.OpenExchangeRatesOrgProvider Unknown key IMPORTANT NOTE
   [junit4]   2> 401635 WARN  (coreLoadExecutor-849-thread-1-processing-n:127.0.0.1:45127_p_cwr%2Fsw) [n:127.0.0.1:45127_p_cwr%2Fsw c:collection1   x:collection1] o.a.s.s.OpenExchangeRatesOrgProvider Expected key, got STRING
   [junit4]   2> 401635 INFO  (coreLoadExecutor-849-thread-1-processing-n:127.0.0.1:45127_p_cwr%2Fsw) [n:127.0.0.1:45127_p_cwr%2Fsw c:collection1   x:collection1] o.a.s.c.ConfigSetProperties Did not find ConfigSet properties, assuming default properties: Can't find resource 'configsetprops.json' in classpath or '/configs/conf1', cwd=/home/jenkins/workspace/Lucene-Solr-5.x-Linux/solr/build/solr-core/test/J2
   [junit4]   2> 401635 INFO  (coreLoadExecutor-849-thread-1-processing-n:127.0.0.1:45127_p_cwr%2Fsw) [n:127.0.0.1:45127_p_cwr%2Fsw c:collection1   x:collection1] o.a.s.c.CoreContainer Creating SolrCore 'collection1' using configuration from collection collection1
   [junit4]   2> 401635 INFO  (coreLoadExecutor-849-thread-1-processing-n:127.0.0.1:45127_p_cwr%2Fsw) [n:127.0.0.1:45127_p_cwr%2Fsw c:collection1 s:shard1 r:core_node1 x:collection1] o.a.s.c.SolrCore org.apache.solr.core.MockDirectoryFactory
   [junit4]   2> 401636 INFO  (coreLoadExecutor-849-thread-1-processing-n:127.0.0.1:45127_p_cwr%2Fsw) [n:127.0.0.1:45127_p_cwr%2Fsw c:collection1 s:shard1 r:core_node1 x:collection1] o.a.s.c.SolrCore [[collection1] ] Opening new SolrCore at [/home/jenkins/workspace/Lucene-Solr-5.x-Linux/solr/build/solr-core/test/J2/temp/solr.cloud.HttpPartitionTest_54E2F8D778502A82-001/shard-1-001/cores/collection1/], dataDir=[null]
   [junit4]   2> 401636 INFO  (coreLoadExecutor-849-thread-1-processing-n:127.0.0.1:45127_p_cwr%2Fsw) [n:127.0.0.1:45127_p_cwr%2Fsw c:collection1 s:shard1 r:core_node1 x:collection1] o.a.s.c.JmxMonitoredMap JMX monitoring is enabled. Adding Solr mbeans to JMX Server: com.sun.jmx.mbeanserver.JmxMBeanServer@47c105ec
   [junit4]   2> 401636 INFO  (coreLoadExecutor-849-thread-1-processing-n:127.0.0.1:45127_p_cwr%2Fsw) [n:127.0.0.1:45127_p_cwr%2Fsw c:collection1 s:shard1 r:core_node1 x:collection1] o.a.s.c.CachingDirectoryFactory return new directory for /home/jenkins/workspace/Lucene-Solr-5.x-Linux/solr/build/solr-core/test/J2/temp/solr.cloud.HttpPartitionTest_54E2F8D778502A82-001/shard-1-001/cores/collection1/data
   [junit4]   2> 401636 INFO  (coreLoadExecutor-849-thread-1-processing-n:127.0.0.1:45127_p_cwr%2Fsw) [n:127.0.0.1:45127_p_cwr%2Fsw c:collection1 s:shard1 r:core_node1 x:collection1] o.a.s.c.SolrCore New index directory detected: old=null new=/home/jenkins/workspace/Lucene-Solr-5.x-Linux/solr/build/solr-core/test/J2/temp/solr.cloud.HttpPartitionTest_54E2F8D778502A82-001/shard-1-001/cores/collection1/data/index/
   [junit4]   2> 401636 WARN  (coreLoadExecutor-849-thread-1-processing-n:127.0.0.1:45127_p_cwr%2Fsw) [n:127.0.0.1:45127_p_cwr%2Fsw c:collection1 s:shard1 r:core_node1 x:collection1] o.a.s.c.SolrCore [collection1] Solr index directory '/home/jenkins/workspace/Lucene-Solr-5.x-Linux/solr/build/solr-core/test/J2/temp/solr.cloud.HttpPartitionTest_54E2F8D778502A82-001/shard-1-001/cores/collection1/data/index' doesn't exist. Creating new index...
   [junit4]   2> 401636 INFO  (coreLoadExecutor-849-thread-1-processing-n:127.0.0.1:45127_p_cwr%2Fsw) [n:127.0.0.1:45127_p_cwr%2Fsw c:collection1 s:shard1 r:core_node1 x:collection1] o.a.s.c.CachingDirectoryFactory return new directory for /home/jenkins/workspace/Lucene-Solr-5.x-Linux/solr/build/solr-core/test/J2/temp/solr.cloud.HttpPartitionTest_54E2F8D778502A82-001/shard-1-001/cores/collection1/data/index
   [junit4]   2> 401637 INFO  (coreLoadExecutor-849-thread-1-processing-n:127.0.0.1:45127_p_cwr%2Fsw) [n:127.0.0.1:45127_p_cwr%2Fsw c:collection1 s:shard1 r:core_node1 x:collection1] o.a.s.u.RandomMergePolicy RandomMergePolicy wrapping class org.apache.lucene.index.TieredMergePolicy: [TieredMergePolicy: maxMergeAtOnce=35, maxMergeAtOnceExplicit=31, maxMergedSegmentMB=5.5029296875, floorSegmentMB=0.841796875, forceMergeDeletesPctAllowed=26.477759835033407, segmentsPerTier=43.0, maxCFSSegmentSizeMB=8.796093022207999E12, noCFSRatio=0.4438633771398254
   [junit4]   2> 401637 INFO  (coreLoadExecutor-849-thread-1-processing-n:127.0.0.1:45127_p_cwr%2Fsw) [n:127.0.0.1:45127_p_cwr%2Fsw c:collection1 s:shard1 r:core_node1 x:collection1] o.a.s.c.SolrCore SolrDeletionPolicy.onCommit: commits: num=1
   [junit4]   2> 	commit{dir=MockDirectoryWrapper(RAMDirectory@232f3dda lockFactory=org.apache.lucene.store.SingleInstanceLockFactory@7285c541),segFN=segments_1,generation=1}
   [junit4]   2> 401637 INFO  (coreLoadExecutor-849-thread-1-processing-n:127.0.0.1:45127_p_cwr%2Fsw) [n:127.0.0.1:45127_p_cwr%2Fsw c:collection1 s:shard1 r:core_node1 x:collection1] o.a.s.c.SolrCore newest commit generation = 1
   [junit4]   2> 401638 INFO  (OldIndexDirectoryCleanupThreadForCore-collection1) [n:127.0.0.1:45127_p_cwr%2Fsw c:collection1 s:shard1 r:core_node1 x:collection1] o.a.s.c.SolrCore Looking for old index directories to cleanup for core collection1 in /home/jenkins/workspace/Lucene-Solr-5.x-Linux/solr/build/solr-core/test/J2/temp/solr.cloud.HttpPartitionTest_54E2F8D778502A82-001/shard-1-001/cores/collection1/data/
   [junit4]   2> 401638 WARN  (OldIndexDirectoryCleanupThreadForCore-collection1) [n:127.0.0.1:45127_p_cwr%2Fsw c:collection1 s:shard1 r:core_node1 x:collection1] o.a.s.c.DirectoryFactory /home/jenkins/workspace/Lucene-Solr-5.x-Linux/solr/build/solr-core/test/J2/temp/solr.cloud.HttpPartitionTest_54E2F8D778502A82-001/shard-1-001/cores/collection1/data/ does not point to a valid data directory; skipping clean-up of old index directories.
   [junit4]   2> 401641 INFO  (coreLoadExecutor-849-thread-1-processing-n:127.0.0.1:45127_p_cwr%2Fsw) [n:127.0.0.1:45127_p_cwr%2Fsw c:collection1 s:shard1 r:core_node1 x:collection1] o.a.s.u.p.UpdateRequestProcessorChain creating updateRequestProcessorChain "nodistrib"
   [junit4]   2> 401641 INFO  (coreLoadExecutor-849-thread-1-processing-n:127.0.0.1:45127_p_cwr%2Fsw) [n:127.0.0.1:45127_p_cwr

[...truncated too long message...]

D778502A82]) [n:127.0.0.1:34991_p_cwr%2Fsw c:collection1 s:shard1 r:core_node3 x:collection1] o.a.s.c.SocketProxy Closing 4 connections to: http://127.0.0.1:59643/p_cwr/sw, target: http://127.0.0.1:33015/p_cwr/sw
   [junit4]   2> 535210 INFO  (SUITE-HttpPartitionTest-seed#[54E2F8D778502A82]-worker) [n:127.0.0.1:34991_p_cwr%2Fsw c:collection1 s:shard1 r:core_node3 x:collection1] o.a.s.SolrTestCaseJ4 ###deleteCore
   [junit4]   2> ObjectTracker found 1 object(s) that were not released!!! [TransactionLog]
   [junit4]   2> org.apache.solr.common.util.ObjectReleaseTracker$ObjectTrackerException
   [junit4]   2> 	at org.apache.solr.common.util.ObjectReleaseTracker.track(ObjectReleaseTracker.java:34)
   [junit4]   2> 	at org.apache.solr.update.TransactionLog.<init>(TransactionLog.java:183)
   [junit4]   2> 	at org.apache.solr.update.TransactionLog.<init>(TransactionLog.java:141)
   [junit4]   2> 	at org.apache.solr.update.UpdateLog.ensureLog(UpdateLog.java:864)
   [junit4]   2> 	at org.apache.solr.update.UpdateLog.add(UpdateLog.java:425)
   [junit4]   2> 	at org.apache.solr.update.UpdateLog.add(UpdateLog.java:411)
   [junit4]   2> 	at org.apache.solr.update.DirectUpdateHandler2.doNormalUpdate(DirectUpdateHandler2.java:293)
   [junit4]   2> 	at org.apache.solr.update.DirectUpdateHandler2.addDoc0(DirectUpdateHandler2.java:202)
   [junit4]   2> 	at org.apache.solr.update.DirectUpdateHandler2.addDoc(DirectUpdateHandler2.java:164)
   [junit4]   2> 	at org.apache.solr.update.processor.RunUpdateProcessor.processAdd(RunUpdateProcessorFactory.java:69)
   [junit4]   2> 	at org.apache.solr.update.processor.UpdateRequestProcessor.processAdd(UpdateRequestProcessor.java:51)
   [junit4]   2> 	at org.apache.solr.update.processor.DistributedUpdateProcessor.doLocalAdd(DistributedUpdateProcessor.java:954)
   [junit4]   2> 	at org.apache.solr.update.processor.DistributedUpdateProcessor.versionAdd(DistributedUpdateProcessor.java:1109)
   [junit4]   2> 	at org.apache.solr.update.processor.DistributedUpdateProcessor.processAdd(DistributedUpdateProcessor.java:705)
   [junit4]   2> 	at org.apache.solr.update.processor.LogUpdateProcessor.processAdd(LogUpdateProcessorFactory.java:104)
   [junit4]   2> 	at org.apache.solr.handler.loader.JavabinLoader$1.update(JavabinLoader.java:101)
   [junit4]   2> 	at org.apache.solr.client.solrj.request.JavaBinUpdateRequestCodec$1.readOuterMostDocIterator(JavaBinUpdateRequestCodec.java:179)
   [junit4]   2> 	at org.apache.solr.client.solrj.request.JavaBinUpdateRequestCodec$1.readIterator(JavaBinUpdateRequestCodec.java:135)
   [junit4]   2> 	at org.apache.solr.common.util.JavaBinCodec.readVal(JavaBinCodec.java:249)
   [junit4]   2> 	at org.apache.solr.client.solrj.request.JavaBinUpdateRequestCodec$1.readNamedList(JavaBinUpdateRequestCodec.java:121)
   [junit4]   2> 	at org.apache.solr.common.util.JavaBinCodec.readVal(JavaBinCodec.java:214)
   [junit4]   2> 	at org.apache.solr.common.util.JavaBinCodec.unmarshal(JavaBinCodec.java:134)
   [junit4]   2> 	at org.apache.solr.client.solrj.request.JavaBinUpdateRequestCodec.unmarshal(JavaBinUpdateRequestCodec.java:186)
   [junit4]   2> 	at org.apache.solr.handler.loader.JavabinLoader.parseAndLoadDocs(JavabinLoader.java:111)
   [junit4]   2> 	at org.apache.solr.handler.loader.JavabinLoader.load(JavabinLoader.java:58)
   [junit4]   2> 	at org.apache.solr.handler.UpdateRequestHandler$1.load(UpdateRequestHandler.java:98)
   [junit4]   2> 	at org.apache.solr.handler.ContentStreamHandlerBase.handleRequestBody(ContentStreamHandlerBase.java:74)
   [junit4]   2> 	at org.apache.solr.handler.RequestHandlerBase.handleRequest(RequestHandlerBase.java:151)
   [junit4]   2> 	at org.apache.solr.core.SolrCore.execute(SolrCore.java:2079)
   [junit4]   2> 	at org.apache.solr.servlet.HttpSolrCall.execute(HttpSolrCall.java:667)
   [junit4]   2> 	at org.apache.solr.servlet.HttpSolrCall.call(HttpSolrCall.java:460)
   [junit4]   2> 	at org.apache.solr.servlet.SolrDispatchFilter.doFilter(SolrDispatchFilter.java:210)
   [junit4]   2> 	at org.apache.solr.servlet.SolrDispatchFilter.doFilter(SolrDispatchFilter.java:179)
   [junit4]   2> 	at org.eclipse.jetty.servlet.ServletHandler$CachedChain.doFilter(ServletHandler.java:1652)
   [junit4]   2> 	at org.apache.solr.client.solrj.embedded.JettySolrRunner$DebugFilter.doFilter(JettySolrRunner.java:106)
   [junit4]   2> 	at org.eclipse.jetty.servlet.ServletHandler$CachedChain.doFilter(ServletHandler.java:1652)
   [junit4]   2> 	at org.eclipse.jetty.servlets.UserAgentFilter.doFilter(UserAgentFilter.java:83)
   [junit4]   2> 	at org.eclipse.jetty.servlets.GzipFilter.doFilter(GzipFilter.java:300)
   [junit4]   2> 	at org.eclipse.jetty.servlet.ServletHandler$CachedChain.doFilter(ServletHandler.java:1652)
   [junit4]   2> 	at org.eclipse.jetty.servlet.ServletHandler.doHandle(ServletHandler.java:585)
   [junit4]   2> 	at org.eclipse.jetty.server.session.SessionHandler.doHandle(SessionHandler.java:221)
   [junit4]   2> 	at org.eclipse.jetty.server.handler.ContextHandler.doHandle(ContextHandler.java:1127)
   [junit4]   2> 	at org.eclipse.jetty.servlet.ServletHandler.doScope(ServletHandler.java:515)
   [junit4]   2> 	at org.eclipse.jetty.server.session.SessionHandler.doScope(SessionHandler.java:185)
   [junit4]   2> 	at org.eclipse.jetty.server.handler.ContextHandler.doScope(ContextHandler.java:1061)
   [junit4]   2> 	at org.eclipse.jetty.server.handler.ScopedHandler.handle(ScopedHandler.java:141)
   [junit4]   2> 	at org.eclipse.jetty.server.handler.HandlerWrapper.handle(HandlerWrapper.java:97)
   [junit4]   2> 	at org.eclipse.jetty.server.Server.handle(Server.java:499)
   [junit4]   2> 	at org.eclipse.jetty.server.HttpChannel.handle(HttpChannel.java:310)
   [junit4]   2> 	at org.eclipse.jetty.server.HttpConnection.onFillable(HttpConnection.java:257)
   [junit4]   2> 	at org.eclipse.jetty.io.AbstractConnection$2.run(AbstractConnection.java:540)
   [junit4]   2> 	at org.eclipse.jetty.util.thread.QueuedThreadPool.runJob(QueuedThreadPool.java:635)
   [junit4]   2> 	at org.eclipse.jetty.util.thread.QueuedThreadPool$3.run(QueuedThreadPool.java:555)
   [junit4]   2> 	at java.lang.Thread.run(Thread.java:745)
   [junit4]   2> 
   [junit4]   2> Aug 26, 2015 12:55:44 AM com.carrotsearch.randomizedtesting.ThreadLeakControl checkThreadLeaks
   [junit4]   2> WARNING: Will linger awaiting termination of 1 leaked thread(s).
   [junit4]   2> NOTE: test params are: codec=Asserting(Lucene53): {range_facet_l=PostingsFormat(name=Memory doPackFST= false), text=PostingsFormat(name=Memory doPackFST= true), range_facet_i_dv=PostingsFormat(name=Memory doPackFST= false), _version_=PostingsFormat(name=Memory doPackFST= false), intDefault=PostingsFormat(name=Memory doPackFST= false), multiDefault=Lucene50(blocksize=128), a_t=PostingsFormat(name=Memory doPackFST= false), timestamp=PostingsFormat(name=Memory doPackFST= false), range_facet_l_dv=PostingsFormat(name=LuceneVarGapFixedInterval), id=PostingsFormat(name=LuceneVarGapFixedInterval)}, docValues:{range_facet_i_dv=DocValuesFormat(name=Lucene50), timestamp=DocValuesFormat(name=Lucene50), range_facet_l_dv=DocValuesFormat(name=Lucene50)}, sim=RandomSimilarityProvider(queryNorm=true,coord=no): {}, locale=vi, timezone=Indian/Chagos
   [junit4]   2> NOTE: Linux 3.19.0-26-generic amd64/Oracle Corporation 1.7.0_80 (64-bit)/cpus=12,threads=1,free=181022328,total=387448832
   [junit4]   2> NOTE: All tests run in this JVM: [TestConfigSetImmutable, ResponseLogComponentTest, TestAddFieldRealTimeGet, DocExpirationUpdateProcessorFactoryTest, CloudExitableDirectoryReaderTest, TestCollationField, LoggingHandlerTest, TestConfigReload, TestTrie, SimpleFacetsTest, TestTrieFacet, TestSystemIdResolver, UnloadDistributedZkTest, ConnectionManagerTest, FullSolrCloudDistribCmdsTest, TestDistributedStatsComponentCardinality, SortByFunctionTest, SearchHandlerTest, SolrCloudExampleTest, CleanupOldIndexTest, SolrTestCaseJ4Test, OverseerCollectionProcessorTest, TestCopyFieldCollectionResource, SparseHLLTest, SampleTest, HttpPartitionTest]
   [junit4]   2> NOTE: reproduce with: ant test  -Dtestcase=HttpPartitionTest -Dtests.seed=54E2F8D778502A82 -Dtests.multiplier=3 -Dtests.slow=true -Dtests.locale=vi -Dtests.timezone=Indian/Chagos -Dtests.asserts=true -Dtests.file.encoding=US-ASCII
   [junit4] ERROR   0.00s J2 | HttpPartitionTest (suite) <<<
   [junit4]    > Throwable #1: java.lang.AssertionError: ObjectTracker found 1 object(s) that were not released!!! [TransactionLog]
   [junit4]    > 	at __randomizedtesting.SeedInfo.seed([54E2F8D778502A82]:0)
   [junit4]    > 	at org.apache.solr.SolrTestCaseJ4.afterClass(SolrTestCaseJ4.java:236)
   [junit4]    > 	at java.lang.Thread.run(Thread.java:745)
   [junit4] Completed [152/534] on J2 in 138.39s, 1 test, 1 failure <<< FAILURES!

[...truncated 1199 lines...]
BUILD FAILED
/home/jenkins/workspace/Lucene-Solr-5.x-Linux/build.xml:785: The following error occurred while executing this line:
/home/jenkins/workspace/Lucene-Solr-5.x-Linux/build.xml:729: The following error occurred while executing this line:
/home/jenkins/workspace/Lucene-Solr-5.x-Linux/build.xml:59: The following error occurred while executing this line:
/home/jenkins/workspace/Lucene-Solr-5.x-Linux/solr/build.xml:233: The following error occurred while executing this line:
/home/jenkins/workspace/Lucene-Solr-5.x-Linux/solr/common-build.xml:524: The following error occurred while executing this line:
/home/jenkins/workspace/Lucene-Solr-5.x-Linux/lucene/common-build.xml:1452: The following error occurred while executing this line:
/home/jenkins/workspace/Lucene-Solr-5.x-Linux/lucene/common-build.xml:1006: There were test failures: 534 suites, 2119 tests, 1 suite-level error, 67 ignored (31 assumptions)

Total time: 46 minutes 21 seconds
Build step 'Invoke Ant' marked build as failure
Archiving artifacts
[WARNINGS] Skipping publisher since build result is FAILURE
Recording test results
Email was triggered for: Failure - Any
Sending email for trigger: Failure - Any



Mime
View raw message