lucene-dev mailing list archives

Site index · List index
Message view « Date » · « Thread »
Top « Date » · « Thread »
From Apache Jenkins Server <jenk...@builds.apache.org>
Subject [JENKINS] Lucene-Solr-Tests-5.x-Java7 - Build # 3459 - Failure
Date Thu, 27 Aug 2015 13:36:47 GMT
Build: https://builds.apache.org/job/Lucene-Solr-Tests-5.x-Java7/3459/

1 tests failed.
FAILED:  junit.framework.TestSuite.org.apache.solr.cloud.HttpPartitionTest

Error Message:
ObjectTracker found 1 object(s) that were not released!!! [TransactionLog]

Stack Trace:
java.lang.AssertionError: ObjectTracker found 1 object(s) that were not released!!! [TransactionLog]
	at __randomizedtesting.SeedInfo.seed([180EEA8561E0762A]:0)
	at org.junit.Assert.fail(Assert.java:93)
	at org.junit.Assert.assertTrue(Assert.java:43)
	at org.junit.Assert.assertNull(Assert.java:551)
	at org.apache.solr.SolrTestCaseJ4.afterClass(SolrTestCaseJ4.java:236)
	at sun.reflect.GeneratedMethodAccessor38.invoke(Unknown Source)
	at sun.reflect.DelegatingMethodAccessorImpl.invoke(DelegatingMethodAccessorImpl.java:43)
	at java.lang.reflect.Method.invoke(Method.java:606)
	at com.carrotsearch.randomizedtesting.RandomizedRunner.invoke(RandomizedRunner.java:1627)
	at com.carrotsearch.randomizedtesting.RandomizedRunner$5.evaluate(RandomizedRunner.java:799)
	at com.carrotsearch.randomizedtesting.rules.StatementAdapter.evaluate(StatementAdapter.java:36)
	at com.carrotsearch.randomizedtesting.rules.SystemPropertiesRestoreRule$1.evaluate(SystemPropertiesRestoreRule.java:57)
	at org.apache.lucene.util.AbstractBeforeAfterRule$1.evaluate(AbstractBeforeAfterRule.java:46)
	at com.carrotsearch.randomizedtesting.rules.StatementAdapter.evaluate(StatementAdapter.java:36)
	at org.apache.lucene.util.TestRuleStoreClassName$1.evaluate(TestRuleStoreClassName.java:42)
	at com.carrotsearch.randomizedtesting.rules.NoShadowingOrOverridesOnMethodsRule$1.evaluate(NoShadowingOrOverridesOnMethodsRule.java:39)
	at com.carrotsearch.randomizedtesting.rules.NoShadowingOrOverridesOnMethodsRule$1.evaluate(NoShadowingOrOverridesOnMethodsRule.java:39)
	at com.carrotsearch.randomizedtesting.rules.StatementAdapter.evaluate(StatementAdapter.java:36)
	at com.carrotsearch.randomizedtesting.rules.StatementAdapter.evaluate(StatementAdapter.java:36)
	at com.carrotsearch.randomizedtesting.rules.StatementAdapter.evaluate(StatementAdapter.java:36)
	at org.apache.lucene.util.TestRuleAssertionsRequired$1.evaluate(TestRuleAssertionsRequired.java:54)
	at org.apache.lucene.util.TestRuleMarkFailure$1.evaluate(TestRuleMarkFailure.java:48)
	at org.apache.lucene.util.TestRuleIgnoreAfterMaxFailures$1.evaluate(TestRuleIgnoreAfterMaxFailures.java:65)
	at org.apache.lucene.util.TestRuleIgnoreTestSuites$1.evaluate(TestRuleIgnoreTestSuites.java:55)
	at com.carrotsearch.randomizedtesting.rules.StatementAdapter.evaluate(StatementAdapter.java:36)
	at com.carrotsearch.randomizedtesting.ThreadLeakControl$StatementRunner.run(ThreadLeakControl.java:365)
	at java.lang.Thread.run(Thread.java:745)




Build Log:
[...truncated 10836 lines...]
   [junit4] Suite: org.apache.solr.cloud.HttpPartitionTest
   [junit4]   2> Creating dataDir: /x1/jenkins/jenkins-slave/workspace/Lucene-Solr-Tests-5.x-Java7/solr/build/solr-core/test/J0/temp/solr.cloud.HttpPartitionTest_180EEA8561E0762A-001/init-core-data-001
   [junit4]   2> 1401029 INFO  (SUITE-HttpPartitionTest-seed#[180EEA8561E0762A]-worker) [    ] o.a.s.BaseDistributedSearchTestCase Setting hostContext system property: /uj_tt/
   [junit4]   2> 1401033 INFO  (TEST-HttpPartitionTest.test-seed#[180EEA8561E0762A]) [    ] o.a.s.c.ZkTestServer STARTING ZK TEST SERVER
   [junit4]   2> 1401033 INFO  (Thread-3550) [    ] o.a.s.c.ZkTestServer client port:0.0.0.0/0.0.0.0:0
   [junit4]   2> 1401033 INFO  (Thread-3550) [    ] o.a.s.c.ZkTestServer Starting server
   [junit4]   2> 1401133 INFO  (TEST-HttpPartitionTest.test-seed#[180EEA8561E0762A]) [    ] o.a.s.c.ZkTestServer start zk server on port:44752
   [junit4]   2> 1401134 INFO  (TEST-HttpPartitionTest.test-seed#[180EEA8561E0762A]) [    ] o.a.s.c.c.SolrZkClient Using default ZkCredentialsProvider
   [junit4]   2> 1401134 INFO  (TEST-HttpPartitionTest.test-seed#[180EEA8561E0762A]) [    ] o.a.s.c.c.ConnectionManager Waiting for client to connect to ZooKeeper
   [junit4]   2> 1401137 INFO  (zkCallback-1489-thread-1) [    ] o.a.s.c.c.ConnectionManager Watcher org.apache.solr.common.cloud.ConnectionManager@2d98fb0e name:ZooKeeperConnection Watcher:127.0.0.1:44752 got event WatchedEvent state:SyncConnected type:None path:null path:null type:None
   [junit4]   2> 1401137 INFO  (TEST-HttpPartitionTest.test-seed#[180EEA8561E0762A]) [    ] o.a.s.c.c.ConnectionManager Client is connected to ZooKeeper
   [junit4]   2> 1401137 INFO  (TEST-HttpPartitionTest.test-seed#[180EEA8561E0762A]) [    ] o.a.s.c.c.SolrZkClient Using default ZkACLProvider
   [junit4]   2> 1401137 INFO  (TEST-HttpPartitionTest.test-seed#[180EEA8561E0762A]) [    ] o.a.s.c.c.SolrZkClient makePath: /solr
   [junit4]   2> 1401140 INFO  (TEST-HttpPartitionTest.test-seed#[180EEA8561E0762A]) [    ] o.a.s.c.c.SolrZkClient Using default ZkCredentialsProvider
   [junit4]   2> 1401140 INFO  (TEST-HttpPartitionTest.test-seed#[180EEA8561E0762A]) [    ] o.a.s.c.c.ConnectionManager Waiting for client to connect to ZooKeeper
   [junit4]   2> 1401141 INFO  (zkCallback-1490-thread-1) [    ] o.a.s.c.c.ConnectionManager Watcher org.apache.solr.common.cloud.ConnectionManager@4fbad0fe name:ZooKeeperConnection Watcher:127.0.0.1:44752/solr got event WatchedEvent state:SyncConnected type:None path:null path:null type:None
   [junit4]   2> 1401142 INFO  (TEST-HttpPartitionTest.test-seed#[180EEA8561E0762A]) [    ] o.a.s.c.c.ConnectionManager Client is connected to ZooKeeper
   [junit4]   2> 1401142 INFO  (TEST-HttpPartitionTest.test-seed#[180EEA8561E0762A]) [    ] o.a.s.c.c.SolrZkClient Using default ZkACLProvider
   [junit4]   2> 1401142 INFO  (TEST-HttpPartitionTest.test-seed#[180EEA8561E0762A]) [    ] o.a.s.c.c.SolrZkClient makePath: /collections/collection1
   [junit4]   2> 1401144 INFO  (TEST-HttpPartitionTest.test-seed#[180EEA8561E0762A]) [    ] o.a.s.c.c.SolrZkClient makePath: /collections/collection1/shards
   [junit4]   2> 1401145 INFO  (TEST-HttpPartitionTest.test-seed#[180EEA8561E0762A]) [    ] o.a.s.c.c.SolrZkClient makePath: /collections/control_collection
   [junit4]   2> 1401146 INFO  (TEST-HttpPartitionTest.test-seed#[180EEA8561E0762A]) [    ] o.a.s.c.c.SolrZkClient makePath: /collections/control_collection/shards
   [junit4]   2> 1401148 INFO  (TEST-HttpPartitionTest.test-seed#[180EEA8561E0762A]) [    ] o.a.s.c.AbstractZkTestCase put /x1/jenkins/jenkins-slave/workspace/Lucene-Solr-Tests-5.x-Java7/solr/core/src/test-files/solr/collection1/conf/solrconfig-tlog.xml to /configs/conf1/solrconfig.xml
   [junit4]   2> 1401148 INFO  (TEST-HttpPartitionTest.test-seed#[180EEA8561E0762A]) [    ] o.a.s.c.c.SolrZkClient makePath: /configs/conf1/solrconfig.xml
   [junit4]   2> 1401150 INFO  (TEST-HttpPartitionTest.test-seed#[180EEA8561E0762A]) [    ] o.a.s.c.AbstractZkTestCase put /x1/jenkins/jenkins-slave/workspace/Lucene-Solr-Tests-5.x-Java7/solr/core/src/test-files/solr/collection1/conf/schema.xml to /configs/conf1/schema.xml
   [junit4]   2> 1401151 INFO  (TEST-HttpPartitionTest.test-seed#[180EEA8561E0762A]) [    ] o.a.s.c.c.SolrZkClient makePath: /configs/conf1/schema.xml
   [junit4]   2> 1401152 INFO  (TEST-HttpPartitionTest.test-seed#[180EEA8561E0762A]) [    ] o.a.s.c.AbstractZkTestCase put /x1/jenkins/jenkins-slave/workspace/Lucene-Solr-Tests-5.x-Java7/solr/core/src/test-files/solr/collection1/conf/solrconfig.snippet.randomindexconfig.xml to /configs/conf1/solrconfig.snippet.randomindexconfig.xml
   [junit4]   2> 1401153 INFO  (TEST-HttpPartitionTest.test-seed#[180EEA8561E0762A]) [    ] o.a.s.c.c.SolrZkClient makePath: /configs/conf1/solrconfig.snippet.randomindexconfig.xml
   [junit4]   2> 1401154 INFO  (TEST-HttpPartitionTest.test-seed#[180EEA8561E0762A]) [    ] o.a.s.c.AbstractZkTestCase put /x1/jenkins/jenkins-slave/workspace/Lucene-Solr-Tests-5.x-Java7/solr/core/src/test-files/solr/collection1/conf/stopwords.txt to /configs/conf1/stopwords.txt
   [junit4]   2> 1401154 INFO  (TEST-HttpPartitionTest.test-seed#[180EEA8561E0762A]) [    ] o.a.s.c.c.SolrZkClient makePath: /configs/conf1/stopwords.txt
   [junit4]   2> 1401156 INFO  (TEST-HttpPartitionTest.test-seed#[180EEA8561E0762A]) [    ] o.a.s.c.AbstractZkTestCase put /x1/jenkins/jenkins-slave/workspace/Lucene-Solr-Tests-5.x-Java7/solr/core/src/test-files/solr/collection1/conf/protwords.txt to /configs/conf1/protwords.txt
   [junit4]   2> 1401156 INFO  (TEST-HttpPartitionTest.test-seed#[180EEA8561E0762A]) [    ] o.a.s.c.c.SolrZkClient makePath: /configs/conf1/protwords.txt
   [junit4]   2> 1401158 INFO  (TEST-HttpPartitionTest.test-seed#[180EEA8561E0762A]) [    ] o.a.s.c.AbstractZkTestCase put /x1/jenkins/jenkins-slave/workspace/Lucene-Solr-Tests-5.x-Java7/solr/core/src/test-files/solr/collection1/conf/currency.xml to /configs/conf1/currency.xml
   [junit4]   2> 1401158 INFO  (TEST-HttpPartitionTest.test-seed#[180EEA8561E0762A]) [    ] o.a.s.c.c.SolrZkClient makePath: /configs/conf1/currency.xml
   [junit4]   2> 1401159 INFO  (TEST-HttpPartitionTest.test-seed#[180EEA8561E0762A]) [    ] o.a.s.c.AbstractZkTestCase put /x1/jenkins/jenkins-slave/workspace/Lucene-Solr-Tests-5.x-Java7/solr/core/src/test-files/solr/collection1/conf/enumsConfig.xml to /configs/conf1/enumsConfig.xml
   [junit4]   2> 1401160 INFO  (TEST-HttpPartitionTest.test-seed#[180EEA8561E0762A]) [    ] o.a.s.c.c.SolrZkClient makePath: /configs/conf1/enumsConfig.xml
   [junit4]   2> 1401161 INFO  (TEST-HttpPartitionTest.test-seed#[180EEA8561E0762A]) [    ] o.a.s.c.AbstractZkTestCase put /x1/jenkins/jenkins-slave/workspace/Lucene-Solr-Tests-5.x-Java7/solr/core/src/test-files/solr/collection1/conf/open-exchange-rates.json to /configs/conf1/open-exchange-rates.json
   [junit4]   2> 1401161 INFO  (TEST-HttpPartitionTest.test-seed#[180EEA8561E0762A]) [    ] o.a.s.c.c.SolrZkClient makePath: /configs/conf1/open-exchange-rates.json
   [junit4]   2> 1401163 INFO  (TEST-HttpPartitionTest.test-seed#[180EEA8561E0762A]) [    ] o.a.s.c.AbstractZkTestCase put /x1/jenkins/jenkins-slave/workspace/Lucene-Solr-Tests-5.x-Java7/solr/core/src/test-files/solr/collection1/conf/mapping-ISOLatin1Accent.txt to /configs/conf1/mapping-ISOLatin1Accent.txt
   [junit4]   2> 1401163 INFO  (TEST-HttpPartitionTest.test-seed#[180EEA8561E0762A]) [    ] o.a.s.c.c.SolrZkClient makePath: /configs/conf1/mapping-ISOLatin1Accent.txt
   [junit4]   2> 1401167 INFO  (TEST-HttpPartitionTest.test-seed#[180EEA8561E0762A]) [    ] o.a.s.c.AbstractZkTestCase put /x1/jenkins/jenkins-slave/workspace/Lucene-Solr-Tests-5.x-Java7/solr/core/src/test-files/solr/collection1/conf/old_synonyms.txt to /configs/conf1/old_synonyms.txt
   [junit4]   2> 1401168 INFO  (TEST-HttpPartitionTest.test-seed#[180EEA8561E0762A]) [    ] o.a.s.c.c.SolrZkClient makePath: /configs/conf1/old_synonyms.txt
   [junit4]   2> 1401172 INFO  (TEST-HttpPartitionTest.test-seed#[180EEA8561E0762A]) [    ] o.a.s.c.AbstractZkTestCase put /x1/jenkins/jenkins-slave/workspace/Lucene-Solr-Tests-5.x-Java7/solr/core/src/test-files/solr/collection1/conf/synonyms.txt to /configs/conf1/synonyms.txt
   [junit4]   2> 1401172 INFO  (TEST-HttpPartitionTest.test-seed#[180EEA8561E0762A]) [    ] o.a.s.c.c.SolrZkClient makePath: /configs/conf1/synonyms.txt
   [junit4]   2> 1401444 INFO  (TEST-HttpPartitionTest.test-seed#[180EEA8561E0762A]) [    ] o.a.s.SolrTestCaseJ4 Writing core.properties file to /x1/jenkins/jenkins-slave/workspace/Lucene-Solr-Tests-5.x-Java7/solr/build/solr-core/test/J0/temp/solr.cloud.HttpPartitionTest_180EEA8561E0762A-001/control-001/cores/collection1
   [junit4]   2> 1401446 INFO  (TEST-HttpPartitionTest.test-seed#[180EEA8561E0762A]) [    ] o.e.j.s.Server jetty-9.2.13.v20150730
   [junit4]   2> 1401447 INFO  (TEST-HttpPartitionTest.test-seed#[180EEA8561E0762A]) [    ] o.e.j.s.h.ContextHandler Started o.e.j.s.ServletContextHandler@5811fbe0{/uj_tt,null,AVAILABLE}
   [junit4]   2> 1401451 INFO  (TEST-HttpPartitionTest.test-seed#[180EEA8561E0762A]) [    ] o.e.j.s.ServerConnector Started ServerConnector@14d483fb{HTTP/1.1}{127.0.0.1:36918}
   [junit4]   2> 1401451 INFO  (TEST-HttpPartitionTest.test-seed#[180EEA8561E0762A]) [    ] o.e.j.s.Server Started @1404418ms
   [junit4]   2> 1401451 INFO  (TEST-HttpPartitionTest.test-seed#[180EEA8561E0762A]) [    ] o.a.s.c.s.e.JettySolrRunner Jetty properties: {coreRootDirectory=/x1/jenkins/jenkins-slave/workspace/Lucene-Solr-Tests-5.x-Java7/solr/build/solr-core/test/J0/temp/solr.cloud.HttpPartitionTest_180EEA8561E0762A-001/control-001/cores, hostContext=/uj_tt, hostPort=40787, solr.data.dir=/x1/jenkins/jenkins-slave/workspace/Lucene-Solr-Tests-5.x-Java7/solr/build/solr-core/test/J0/temp/solr.cloud.HttpPartitionTest_180EEA8561E0762A-001/tempDir-001/control/data}
   [junit4]   2> 1401452 INFO  (TEST-HttpPartitionTest.test-seed#[180EEA8561E0762A]) [    ] o.a.s.s.SolrDispatchFilter SolrDispatchFilter.init(): sun.misc.Launcher$AppClassLoader@4e0add57
   [junit4]   2> 1401452 INFO  (TEST-HttpPartitionTest.test-seed#[180EEA8561E0762A]) [    ] o.a.s.c.SolrResourceLoader new SolrResourceLoader for directory: '/x1/jenkins/jenkins-slave/workspace/Lucene-Solr-Tests-5.x-Java7/solr/build/solr-core/test/J0/temp/solr.cloud.HttpPartitionTest_180EEA8561E0762A-001/control-001/'
   [junit4]   2> 1401468 INFO  (TEST-HttpPartitionTest.test-seed#[180EEA8561E0762A]) [    ] o.a.s.c.c.SolrZkClient Using default ZkCredentialsProvider
   [junit4]   2> 1401469 INFO  (TEST-HttpPartitionTest.test-seed#[180EEA8561E0762A]) [    ] o.a.s.c.c.ConnectionManager Waiting for client to connect to ZooKeeper
   [junit4]   2> 1401470 INFO  (zkCallback-1491-thread-1) [    ] o.a.s.c.c.ConnectionManager Watcher org.apache.solr.common.cloud.ConnectionManager@2a67c29e name:ZooKeeperConnection Watcher:127.0.0.1:44752/solr got event WatchedEvent state:SyncConnected type:None path:null path:null type:None
   [junit4]   2> 1401470 INFO  (TEST-HttpPartitionTest.test-seed#[180EEA8561E0762A]) [    ] o.a.s.c.c.ConnectionManager Client is connected to ZooKeeper
   [junit4]   2> 1401471 INFO  (TEST-HttpPartitionTest.test-seed#[180EEA8561E0762A]) [    ] o.a.s.c.c.SolrZkClient Using default ZkACLProvider
   [junit4]   2> 1401472 INFO  (TEST-HttpPartitionTest.test-seed#[180EEA8561E0762A]) [    ] o.a.s.s.SolrDispatchFilter Loading solr.xml from SolrHome (not found in ZooKeeper)
   [junit4]   2> 1401472 INFO  (TEST-HttpPartitionTest.test-seed#[180EEA8561E0762A]) [    ] o.a.s.c.SolrXmlConfig Loading container configuration from /x1/jenkins/jenkins-slave/workspace/Lucene-Solr-Tests-5.x-Java7/solr/build/solr-core/test/J0/temp/solr.cloud.HttpPartitionTest_180EEA8561E0762A-001/control-001/solr.xml
   [junit4]   2> 1401486 INFO  (TEST-HttpPartitionTest.test-seed#[180EEA8561E0762A]) [    ] o.a.s.c.CoresLocator Config-defined core root directory: /x1/jenkins/jenkins-slave/workspace/Lucene-Solr-Tests-5.x-Java7/solr/build/solr-core/test/J0/temp/solr.cloud.HttpPartitionTest_180EEA8561E0762A-001/control-001/cores
   [junit4]   2> 1401486 INFO  (TEST-HttpPartitionTest.test-seed#[180EEA8561E0762A]) [    ] o.a.s.c.CoreContainer New CoreContainer 1058032923
   [junit4]   2> 1401486 INFO  (TEST-HttpPartitionTest.test-seed#[180EEA8561E0762A]) [    ] o.a.s.c.CoreContainer Loading cores into CoreContainer [instanceDir=/x1/jenkins/jenkins-slave/workspace/Lucene-Solr-Tests-5.x-Java7/solr/build/solr-core/test/J0/temp/solr.cloud.HttpPartitionTest_180EEA8561E0762A-001/control-001/]
   [junit4]   2> 1401487 INFO  (TEST-HttpPartitionTest.test-seed#[180EEA8561E0762A]) [    ] o.a.s.c.CoreContainer loading shared library: /x1/jenkins/jenkins-slave/workspace/Lucene-Solr-Tests-5.x-Java7/solr/build/solr-core/test/J0/temp/solr.cloud.HttpPartitionTest_180EEA8561E0762A-001/control-001/lib
   [junit4]   2> 1401487 WARN  (TEST-HttpPartitionTest.test-seed#[180EEA8561E0762A]) [    ] o.a.s.c.SolrResourceLoader Can't find (or read) directory to add to classloader: lib (resolved as: /x1/jenkins/jenkins-slave/workspace/Lucene-Solr-Tests-5.x-Java7/solr/build/solr-core/test/J0/temp/solr.cloud.HttpPartitionTest_180EEA8561E0762A-001/control-001/lib).
   [junit4]   2> 1401494 INFO  (TEST-HttpPartitionTest.test-seed#[180EEA8561E0762A]) [    ] o.a.s.h.c.HttpShardHandlerFactory created with socketTimeout : 90000,urlScheme : ,connTimeout : 15000,maxConnectionsPerHost : 20,maxConnections : 10000,corePoolSize : 0,maximumPoolSize : 2147483647,maxThreadIdleTime : 5,sizeOfQueue : -1,fairnessPolicy : false,useRetries : false,
   [junit4]   2> 1401496 INFO  (TEST-HttpPartitionTest.test-seed#[180EEA8561E0762A]) [    ] o.a.s.u.UpdateShardHandler Creating UpdateShardHandler HTTP client with params: socketTimeout=340000&connTimeout=45000&retry=true
   [junit4]   2> 1401496 INFO  (TEST-HttpPartitionTest.test-seed#[180EEA8561E0762A]) [    ] o.a.s.l.LogWatcher SLF4J impl is org.slf4j.impl.Log4jLoggerFactory
   [junit4]   2> 1401496 INFO  (TEST-HttpPartitionTest.test-seed#[180EEA8561E0762A]) [    ] o.a.s.l.LogWatcher Registering Log Listener [Log4j (org.slf4j.impl.Log4jLoggerFactory)]
   [junit4]   2> 1401496 INFO  (TEST-HttpPartitionTest.test-seed#[180EEA8561E0762A]) [    ] o.a.s.c.ZkContainer Zookeeper client=127.0.0.1:44752/solr
   [junit4]   2> 1401497 INFO  (TEST-HttpPartitionTest.test-seed#[180EEA8561E0762A]) [    ] o.a.s.c.ZkController zkHost includes chroot
   [junit4]   2> 1401497 INFO  (TEST-HttpPartitionTest.test-seed#[180EEA8561E0762A]) [    ] o.a.s.c.c.SolrZkClient Using default ZkCredentialsProvider
   [junit4]   2> 1401497 INFO  (TEST-HttpPartitionTest.test-seed#[180EEA8561E0762A]) [    ] o.a.s.c.c.ConnectionManager Waiting for client to connect to ZooKeeper
   [junit4]   2> 1401499 INFO  (zkCallback-1493-thread-1) [    ] o.a.s.c.c.ConnectionManager Watcher org.apache.solr.common.cloud.ConnectionManager@17edc21c name:ZooKeeperConnection Watcher:127.0.0.1:44752 got event WatchedEvent state:SyncConnected type:None path:null path:null type:None
   [junit4]   2> 1401499 INFO  (TEST-HttpPartitionTest.test-seed#[180EEA8561E0762A]) [    ] o.a.s.c.c.ConnectionManager Client is connected to ZooKeeper
   [junit4]   2> 1401500 INFO  (TEST-HttpPartitionTest.test-seed#[180EEA8561E0762A]) [    ] o.a.s.c.c.SolrZkClient Using default ZkACLProvider
   [junit4]   2> 1401502 INFO  (TEST-HttpPartitionTest.test-seed#[180EEA8561E0762A]) [n:127.0.0.1:40787_uj_tt    ] o.a.s.c.c.ConnectionManager Waiting for client to connect to ZooKeeper
   [junit4]   2> 1401503 INFO  (zkCallback-1494-thread-1-processing-n:127.0.0.1:40787_uj_tt) [n:127.0.0.1:40787_uj_tt    ] o.a.s.c.c.ConnectionManager Watcher org.apache.solr.common.cloud.ConnectionManager@4ec967cc name:ZooKeeperConnection Watcher:127.0.0.1:44752/solr got event WatchedEvent state:SyncConnected type:None path:null path:null type:None
   [junit4]   2> 1401503 INFO  (TEST-HttpPartitionTest.test-seed#[180EEA8561E0762A]) [n:127.0.0.1:40787_uj_tt    ] o.a.s.c.c.ConnectionManager Client is connected to ZooKeeper
   [junit4]   2> 1401504 INFO  (TEST-HttpPartitionTest.test-seed#[180EEA8561E0762A]) [n:127.0.0.1:40787_uj_tt    ] o.a.s.c.c.SolrZkClient makePath: /overseer/queue
   [junit4]   2> 1401506 INFO  (TEST-HttpPartitionTest.test-seed#[180EEA8561E0762A]) [n:127.0.0.1:40787_uj_tt    ] o.a.s.c.c.SolrZkClient makePath: /overseer/collection-queue-work
   [junit4]   2> 1401509 INFO  (TEST-HttpPartitionTest.test-seed#[180EEA8561E0762A]) [n:127.0.0.1:40787_uj_tt    ] o.a.s.c.c.SolrZkClient makePath: /overseer/collection-map-running
   [junit4]   2> 1401511 INFO  (TEST-HttpPartitionTest.test-seed#[180EEA8561E0762A]) [n:127.0.0.1:40787_uj_tt    ] o.a.s.c.c.SolrZkClient makePath: /overseer/collection-map-completed
   [junit4]   2> 1401513 INFO  (TEST-HttpPartitionTest.test-seed#[180EEA8561E0762A]) [n:127.0.0.1:40787_uj_tt    ] o.a.s.c.c.SolrZkClient makePath: /overseer/collection-map-failure
   [junit4]   2> 1401515 INFO  (TEST-HttpPartitionTest.test-seed#[180EEA8561E0762A]) [n:127.0.0.1:40787_uj_tt    ] o.a.s.c.c.SolrZkClient makePath: /live_nodes
   [junit4]   2> 1401516 INFO  (TEST-HttpPartitionTest.test-seed#[180EEA8561E0762A]) [n:127.0.0.1:40787_uj_tt    ] o.a.s.c.c.SolrZkClient makePath: /aliases.json
   [junit4]   2> 1401517 INFO  (TEST-HttpPartitionTest.test-seed#[180EEA8561E0762A]) [n:127.0.0.1:40787_uj_tt    ] o.a.s.c.c.SolrZkClient makePath: /clusterstate.json
   [junit4]   2> 1401519 INFO  (TEST-HttpPartitionTest.test-seed#[180EEA8561E0762A]) [n:127.0.0.1:40787_uj_tt    ] o.a.s.c.c.SolrZkClient makePath: /security.json
   [junit4]   2> 1401520 INFO  (TEST-HttpPartitionTest.test-seed#[180EEA8561E0762A]) [n:127.0.0.1:40787_uj_tt    ] o.a.s.c.ZkController Register node as live in ZooKeeper:/live_nodes/127.0.0.1:40787_uj_tt
   [junit4]   2> 1401520 INFO  (TEST-HttpPartitionTest.test-seed#[180EEA8561E0762A]) [n:127.0.0.1:40787_uj_tt    ] o.a.s.c.c.SolrZkClient makePath: /live_nodes/127.0.0.1:40787_uj_tt
   [junit4]   2> 1401522 INFO  (TEST-HttpPartitionTest.test-seed#[180EEA8561E0762A]) [n:127.0.0.1:40787_uj_tt    ] o.a.s.c.c.SolrZkClient makePath: /overseer_elect
   [junit4]   2> 1401523 INFO  (TEST-HttpPartitionTest.test-seed#[180EEA8561E0762A]) [n:127.0.0.1:40787_uj_tt    ] o.a.s.c.c.SolrZkClient makePath: /overseer_elect/election
   [junit4]   2> 1401525 INFO  (TEST-HttpPartitionTest.test-seed#[180EEA8561E0762A]) [n:127.0.0.1:40787_uj_tt    ] o.a.s.c.Overseer Overseer (id=null) closing
   [junit4]   2> 1401525 INFO  (TEST-HttpPartitionTest.test-seed#[180EEA8561E0762A]) [n:127.0.0.1:40787_uj_tt    ] o.a.s.c.LeaderElector Joined leadership election with path: /overseer_elect/election/94416531377356804-127.0.0.1:40787_uj_tt-n_0000000000
   [junit4]   2> 1401526 INFO  (TEST-HttpPartitionTest.test-seed#[180EEA8561E0762A]) [n:127.0.0.1:40787_uj_tt    ] o.a.s.c.OverseerElectionContext I am going to be the leader 127.0.0.1:40787_uj_tt
   [junit4]   2> 1401526 INFO  (TEST-HttpPartitionTest.test-seed#[180EEA8561E0762A]) [n:127.0.0.1:40787_uj_tt    ] o.a.s.c.c.SolrZkClient makePath: /overseer_elect/leader
   [junit4]   2> 1401527 INFO  (TEST-HttpPartitionTest.test-seed#[180EEA8561E0762A]) [n:127.0.0.1:40787_uj_tt    ] o.a.s.c.Overseer Overseer (id=94416531377356804-127.0.0.1:40787_uj_tt-n_0000000000) starting
   [junit4]   2> 1401529 INFO  (TEST-HttpPartitionTest.test-seed#[180EEA8561E0762A]) [n:127.0.0.1:40787_uj_tt    ] o.a.s.c.c.SolrZkClient makePath: /overseer/queue-work
   [junit4]   2> 1401535 INFO  (TEST-HttpPartitionTest.test-seed#[180EEA8561E0762A]) [n:127.0.0.1:40787_uj_tt    ] o.a.s.c.OverseerAutoReplicaFailoverThread Starting OverseerAutoReplicaFailoverThread autoReplicaFailoverWorkLoopDelay=10000 autoReplicaFailoverWaitAfterExpiration=30000 autoReplicaFailoverBadNodeExpiration=60000
   [junit4]   2> 1401535 INFO  (TEST-HttpPartitionTest.test-seed#[180EEA8561E0762A]) [n:127.0.0.1:40787_uj_tt    ] o.a.s.c.c.ZkStateReader Updating cluster state from ZooKeeper... 
   [junit4]   2> 1401535 INFO  (OverseerCollectionConfigSetProcessor-94416531377356804-127.0.0.1:40787_uj_tt-n_0000000000) [n:127.0.0.1:40787_uj_tt    ] o.a.s.c.OverseerTaskProcessor Process current queue of overseer operations
   [junit4]   2> 1401536 INFO  (OverseerStateUpdate-94416531377356804-127.0.0.1:40787_uj_tt-n_0000000000) [n:127.0.0.1:40787_uj_tt    ] o.a.s.c.Overseer Starting to work on the main queue
   [junit4]   2> 1401551 INFO  (TEST-HttpPartitionTest.test-seed#[180EEA8561E0762A]) [n:127.0.0.1:40787_uj_tt    ] o.a.s.c.CoreContainer Security conf doesn't exist. Skipping setup for authorization module.
   [junit4]   2> 1401551 INFO  (TEST-HttpPartitionTest.test-seed#[180EEA8561E0762A]) [n:127.0.0.1:40787_uj_tt    ] o.a.s.c.CoreContainer No authentication plugin used.
   [junit4]   2> 1401552 INFO  (TEST-HttpPartitionTest.test-seed#[180EEA8561E0762A]) [n:127.0.0.1:40787_uj_tt    ] o.a.s.c.CoresLocator Looking for core definitions underneath /x1/jenkins/jenkins-slave/workspace/Lucene-Solr-Tests-5.x-Java7/solr/build/solr-core/test/J0/temp/solr.cloud.HttpPartitionTest_180EEA8561E0762A-001/control-001/cores
   [junit4]   2> 1401553 INFO  (TEST-HttpPartitionTest.test-seed#[180EEA8561E0762A]) [n:127.0.0.1:40787_uj_tt    ] o.a.s.c.SolrCore Created CoreDescriptor: {instanceDir=/x1/jenkins/jenkins-slave/workspace/Lucene-Solr-Tests-5.x-Java7/solr/build/solr-core/test/J0/temp/solr.cloud.HttpPartitionTest_180EEA8561E0762A-001/control-001/cores/collection1, loadOnStartup=true, name=collection1, collection=control_collection, coreNodeName=, schema=schema.xml, configSetProperties=configsetprops.json, transient=false, shard=, dataDir=data/, config=solrconfig.xml, absoluteInstDir=/x1/jenkins/jenkins-slave/workspace/Lucene-Solr-Tests-5.x-Java7/solr/build/solr-core/test/J0/temp/solr.cloud.HttpPartitionTest_180EEA8561E0762A-001/control-001/cores/collection1/}
   [junit4]   2> 1401553 INFO  (TEST-HttpPartitionTest.test-seed#[180EEA8561E0762A]) [n:127.0.0.1:40787_uj_tt    ] o.a.s.c.CoresLocator Found core collection1 in /x1/jenkins/jenkins-slave/workspace/Lucene-Solr-Tests-5.x-Java7/solr/build/solr-core/test/J0/temp/solr.cloud.HttpPartitionTest_180EEA8561E0762A-001/control-001/cores/collection1/
   [junit4]   2> 1401554 INFO  (TEST-HttpPartitionTest.test-seed#[180EEA8561E0762A]) [n:127.0.0.1:40787_uj_tt    ] o.a.s.c.CoresLocator Found 1 core definitions
   [junit4]   2> 1401555 INFO  (TEST-HttpPartitionTest.test-seed#[180EEA8561E0762A]) [n:127.0.0.1:40787_uj_tt    ] o.a.s.s.SolrDispatchFilter user.dir=/x1/jenkins/jenkins-slave/workspace/Lucene-Solr-Tests-5.x-Java7/solr/build/solr-core/test/J0
   [junit4]   2> 1401555 INFO  (TEST-HttpPartitionTest.test-seed#[180EEA8561E0762A]) [n:127.0.0.1:40787_uj_tt    ] o.a.s.s.SolrDispatchFilter SolrDispatchFilter.init() done
   [junit4]   2> 1401555 INFO  (coreLoadExecutor-3575-thread-1-processing-n:127.0.0.1:40787_uj_tt) [n:127.0.0.1:40787_uj_tt c:control_collection   x:collection1] o.a.s.c.ZkController publishing state=down
   [junit4]   2> 1401555 INFO  (coreLoadExecutor-3575-thread-1-processing-n:127.0.0.1:40787_uj_tt) [n:127.0.0.1:40787_uj_tt c:control_collection   x:collection1] o.a.s.c.ZkController numShards not found on descriptor - reading it from system property
   [junit4]   2> 1401557 INFO  (OverseerStateUpdate-94416531377356804-127.0.0.1:40787_uj_tt-n_0000000000) [n:127.0.0.1:40787_uj_tt    ] o.a.s.c.Overseer processMessage: queueSize: 1, message = {
   [junit4]   2>   "numShards":"1",
   [junit4]   2>   "base_url":"http://127.0.0.1:40787/uj_tt",
   [junit4]   2>   "node_name":"127.0.0.1:40787_uj_tt",
   [junit4]   2>   "collection":"control_collection",
   [junit4]   2>   "core":"collection1",
   [junit4]   2>   "shard":null,
   [junit4]   2>   "roles":null,
   [junit4]   2>   "state":"down",
   [junit4]   2>   "operation":"state"} current state version: 0
   [junit4]   2> 1401557 INFO  (coreLoadExecutor-3575-thread-1-processing-n:127.0.0.1:40787_uj_tt) [n:127.0.0.1:40787_uj_tt c:control_collection   x:collection1] o.a.s.c.ZkController look for our core node name
   [junit4]   2> 1401557 INFO  (OverseerStateUpdate-94416531377356804-127.0.0.1:40787_uj_tt-n_0000000000) [n:127.0.0.1:40787_uj_tt    ] o.a.s.c.o.ReplicaMutator Update state numShards=1 message={
   [junit4]   2>   "numShards":"1",
   [junit4]   2>   "base_url":"http://127.0.0.1:40787/uj_tt",
   [junit4]   2>   "node_name":"127.0.0.1:40787_uj_tt",
   [junit4]   2>   "collection":"control_collection",
   [junit4]   2>   "core":"collection1",
   [junit4]   2>   "shard":null,
   [junit4]   2>   "roles":null,
   [junit4]   2>   "state":"down",
   [junit4]   2>   "operation":"state"}
   [junit4]   2> 1401558 INFO  (OverseerStateUpdate-94416531377356804-127.0.0.1:40787_uj_tt-n_0000000000) [n:127.0.0.1:40787_uj_tt    ] o.a.s.c.o.ClusterStateMutator building a new cName: control_collection
   [junit4]   2> 1401558 INFO  (OverseerStateUpdate-94416531377356804-127.0.0.1:40787_uj_tt-n_0000000000) [n:127.0.0.1:40787_uj_tt    ] o.a.s.c.o.ReplicaMutator Assigning new node to shard shard=shard1
   [junit4]   2> 1401560 INFO  (zkCallback-1494-thread-1-processing-n:127.0.0.1:40787_uj_tt) [n:127.0.0.1:40787_uj_tt    ] o.a.s.c.c.ZkStateReader A cluster state change: WatchedEvent state:SyncConnected type:NodeDataChanged path:/clusterstate.json, has occurred - updating... (live nodes size: 1)
   [junit4]   2> 1402557 INFO  (coreLoadExecutor-3575-thread-1-processing-n:127.0.0.1:40787_uj_tt) [n:127.0.0.1:40787_uj_tt c:control_collection   x:collection1] o.a.s.c.ZkController waiting to find shard id in clusterstate for collection1
   [junit4]   2> 1402558 INFO  (coreLoadExecutor-3575-thread-1-processing-n:127.0.0.1:40787_uj_tt) [n:127.0.0.1:40787_uj_tt c:control_collection   x:collection1] o.a.s.c.ZkController Check for collection zkNode:control_collection
   [junit4]   2> 1402558 INFO  (coreLoadExecutor-3575-thread-1-processing-n:127.0.0.1:40787_uj_tt) [n:127.0.0.1:40787_uj_tt c:control_collection   x:collection1] o.a.s.c.ZkController Collection zkNode exists
   [junit4]   2> 1402558 INFO  (coreLoadExecutor-3575-thread-1-processing-n:127.0.0.1:40787_uj_tt) [n:127.0.0.1:40787_uj_tt c:control_collection   x:collection1] o.a.s.c.c.ZkStateReader Load collection config from:/collections/control_collection
   [junit4]   2> 1402559 INFO  (coreLoadExecutor-3575-thread-1-processing-n:127.0.0.1:40787_uj_tt) [n:127.0.0.1:40787_uj_tt c:control_collection   x:collection1] o.a.s.c.c.ZkStateReader path=/collections/control_collection configName=conf1 specified config exists in ZooKeeper
   [junit4]   2> 1402559 INFO  (coreLoadExecutor-3575-thread-1-processing-n:127.0.0.1:40787_uj_tt) [n:127.0.0.1:40787_uj_tt c:control_collection   x:collection1] o.a.s.c.SolrResourceLoader new SolrResourceLoader for directory: '/x1/jenkins/jenkins-slave/workspace/Lucene-Solr-Tests-5.x-Java7/solr/build/solr-core/test/J0/temp/solr.cloud.HttpPartitionTest_180EEA8561E0762A-001/control-001/cores/collection1/'
   [junit4]   2> 1402574 INFO  (coreLoadExecutor-3575-thread-1-processing-n:127.0.0.1:40787_uj_tt) [n:127.0.0.1:40787_uj_tt c:control_collection   x:collection1] o.a.s.c.Config loaded config solrconfig.xml with version 0 
   [junit4]   2> 1402579 INFO  (coreLoadExecutor-3575-thread-1-processing-n:127.0.0.1:40787_uj_tt) [n:127.0.0.1:40787_uj_tt c:control_collection   x:collection1] o.a.s.c.SolrConfig current version of requestparams : -1
   [junit4]   2> 1402592 INFO  (coreLoadExecutor-3575-thread-1-processing-n:127.0.0.1:40787_uj_tt) [n:127.0.0.1:40787_uj_tt c:control_collection   x:collection1] o.a.s.c.SolrConfig Using Lucene MatchVersion: 5.4.0
   [junit4]   2> 1402621 INFO  (coreLoadExecutor-3575-thread-1-processing-n:127.0.0.1:40787_uj_tt) [n:127.0.0.1:40787_uj_tt c:control_collection   x:collection1] o.a.s.c.Config Loaded SolrConfig: solrconfig.xml
   [junit4]   2> 1402622 INFO  (coreLoadExecutor-3575-thread-1-processing-n:127.0.0.1:40787_uj_tt) [n:127.0.0.1:40787_uj_tt c:control_collection   x:collection1] o.a.s.s.IndexSchema Reading Solr Schema from /configs/conf1/schema.xml
   [junit4]   2> 1402628 INFO  (coreLoadExecutor-3575-thread-1-processing-n:127.0.0.1:40787_uj_tt) [n:127.0.0.1:40787_uj_tt c:control_collection   x:collection1] o.a.s.s.IndexSchema [collection1] Schema name=test
   [junit4]   2> 1402891 INFO  (coreLoadExecutor-3575-thread-1-processing-n:127.0.0.1:40787_uj_tt) [n:127.0.0.1:40787_uj_tt c:control_collection   x:collection1] o.a.s.s.OpenExchangeRatesOrgProvider Initialized with rates=open-exchange-rates.json, refreshInterval=1440.
   [junit4]   2> 1402910 INFO  (coreLoadExecutor-3575-thread-1-processing-n:127.0.0.1:40787_uj_tt) [n:127.0.0.1:40787_uj_tt c:control_collection   x:collection1] o.a.s.s.IndexSchema default search field in schema is text
   [junit4]   2> 1402912 INFO  (coreLoadExecutor-3575-thread-1-processing-n:127.0.0.1:40787_uj_tt) [n:127.0.0.1:40787_uj_tt c:control_collection   x:collection1] o.a.s.s.IndexSchema unique key field: id
   [junit4]   2> 1402922 INFO  (coreLoadExecutor-3575-thread-1-processing-n:127.0.0.1:40787_uj_tt) [n:127.0.0.1:40787_uj_tt c:control_collection   x:collection1] o.a.s.s.FileExchangeRateProvider Reloading exchange rates from file currency.xml
   [junit4]   2> 1402925 INFO  (coreLoadExecutor-3575-thread-1-processing-n:127.0.0.1:40787_uj_tt) [n:127.0.0.1:40787_uj_tt c:control_collection   x:collection1] o.a.s.s.FileExchangeRateProvider Reloading exchange rates from file currency.xml
   [junit4]   2> 1402927 INFO  (coreLoadExecutor-3575-thread-1-processing-n:127.0.0.1:40787_uj_tt) [n:127.0.0.1:40787_uj_tt c:control_collection   x:collection1] o.a.s.s.OpenExchangeRatesOrgProvider Reloading exchange rates from open-exchange-rates.json
   [junit4]   2> 1402928 WARN  (coreLoadExecutor-3575-thread-1-processing-n:127.0.0.1:40787_uj_tt) [n:127.0.0.1:40787_uj_tt c:control_collection   x:collection1] o.a.s.s.OpenExchangeRatesOrgProvider Unknown key IMPORTANT NOTE
   [junit4]   2> 1402928 WARN  (coreLoadExecutor-3575-thread-1-processing-n:127.0.0.1:40787_uj_tt) [n:127.0.0.1:40787_uj_tt c:control_collection   x:collection1] o.a.s.s.OpenExchangeRatesOrgProvider Expected key, got STRING
   [junit4]   2> 1402928 INFO  (coreLoadExecutor-3575-thread-1-processing-n:127.0.0.1:40787_uj_tt) [n:127.0.0.1:40787_uj_tt c:control_collection   x:collection1] o.a.s.s.OpenExchangeRatesOrgProvider Reloading exchange rates from open-exchange-rates.json
   [junit4]   2> 1402929 WARN  (coreLoadExecutor-3575-thread-1-processing-n:127.0.0.1:40787_uj_tt) [n:127.0.0.1:40787_uj_tt c:control_collection   x:collection1] o.a.s.s.OpenExchangeRatesOrgProvider Unknown key IMPORTANT NOTE
   [junit4]   2> 1402929 WARN  (coreLoadExecutor-3575-thread-1-processing-n:127.0.0.1:40787_uj_tt) [n:127.0.0.1:40787_uj_tt c:control_collection   x:collection1] o.a.s.s.OpenExchangeRatesOrgProvider Expected key, got STRING
   [junit4]   2> 1402930 INFO  (coreLoadExecutor-3575-thread-1-processing-n:127.0.0.1:40787_uj_tt) [n:127.0.0.1:40787_uj_tt c:control_collection   x:collection1] o.a.s.c.ConfigSetProperties Did not find ConfigSet properties, assuming default properties: Can't find resource 'configsetprops.json' in classpath or '/configs/conf1', cwd=/x1/jenkins/jenkins-slave/workspace/Lucene-Solr-Tests-5.x-Java7/solr/build/solr-core/test/J0
   [junit4]   2> 1402930 INFO  (coreLoadExecutor-3575-thread-1-processing-n:127.0.0.1:40787_uj_tt) [n:127.0.0.1:40787_uj_tt c:control_collection   x:collection1] o.a.s.c.CoreContainer Creating SolrCore 'collection1' using configuration from collection control_collection
   [junit4]   2> 1402931 INFO  (coreLoadExecutor-3575-thread-1-processing-n:127.0.0.1:40787_uj_tt) [n:127.0.0.1:40787_uj_tt c:control_collection s:shard1 r:core_node1 x:collection1] o.a.s.c.SolrCore org.apache.solr.core.MockDirectoryFactory
   [junit4]   2> 1402931 INFO  (coreLoadExecutor-3575-thread-1-processing-n:127.0.0.1:40787_uj_tt) [n:127.0.0.1:40787_uj_tt c:control_collection s:shard1 r:core_node1 x:collection1] o.a.s.c.SolrCore [[collection1] ] Opening new SolrCore at [/x1/jenkins/jenkins-slave/workspace/Lucene-Solr-Tests-5.x-Java7/solr/build/solr-core/test/J0/temp/solr.cloud.HttpPartitionTest_180EEA8561E0762A-001/control-001/cores/collection1/], dataDir=[null]
   [junit4]   2> 1402931 INFO  (coreLoadExecutor-3575-thread-1-processing-n:127.0.0.1:40787_uj_tt) [n:127.0.0.1:40787_uj_tt c:control_collection s:shard1 r:core_node1 x:collection1] o.a.s.c.JmxMonitoredMap JMX monitoring is enabled. Adding Solr mbeans to JMX Server: com.sun.jmx.mbeanserver.JmxMBeanServer@1139529f
   [junit4]   2> 1402932 INFO  (coreLoadExecutor-3575-thread-1-processing-n:127.0.0.1:40787_uj_tt) [n:127.0.0.1:40787_uj_tt c:control_collection s:shard1 r:core_node1 x:collection1] o.a.s.c.CachingDirectoryFactory return new directory for /x1/jenkins/jenkins-slave/workspace/Lucene-Solr-Tests-5.x-Java7/solr/build/solr-core/test/J0/temp/solr.cloud.HttpPartitionTest_180EEA8561E0762A-001/control-001/cores/collection1/data
   [junit4]   2> 1402932 INFO  (coreLoadExecutor-3575-thread-1-processing-n:127.0.0.1:40787_uj_tt) [n:127.0.0.1:40787_uj_tt c:control_collection s:shard1 r:core_node1 x:collection1] o.a.s.c.SolrCore New index directory detected: old=null new=/x1/jenkins/jenkins-slave/workspace/Lucene-Solr-Tests-5.x-Java7/solr/build/solr-core/test/J0/temp/solr.cloud.HttpPartitionTest_180EEA8561E0762A-001/control-001/cores/collection1/data/index/
   [junit4]   2> 1402932 WARN  (coreLoadExecutor-3575-thread-1-processing-n:127.0.0.1:40787_uj_tt) [n:127.0.0.1:40787_uj_tt c:control_collection s:shard1 r:core_node1 x:collection1] o.a.s.c.SolrCore [collection1] Solr index directory '/x1/jenkins/jenkins-slave/workspace/Lucene-Solr-Tests-5.x-Java7/solr/build/solr-core/test/J0/temp/solr.cloud.HttpPartitionTest_180EEA8561E0762A-001/control-001/cores/collection1/data/index' doesn't exist. Creating new index...
   [junit4]   2> 1402932 INFO  (coreLoadExecutor-3575-thread-1-processing-n:127.0.0.1:40787_uj_tt) [n:127.0.0.1:40787_uj_tt c:control_collection s:shard1 r:core_node1 x:collection1] o.a.s.c.CachingDirectoryFactory return new directory for /x1/jenkins/jenkins-slave/workspace/Lucene-Solr-Tests-5.x-Java7/solr/build/solr-core/test/J0/temp/solr.cloud.HttpPartitionTest_180EEA8561E0762A-001/control-001/cores/collection1/data/index
   [junit4]   2> 1402933 INFO  (coreLoadExecutor-3575-thread-1-processing-n:127.0.0.1:40787_uj_tt) [n:127.0.0.1:40787_uj_tt c:control_collection s:shard1 r:core_node1 x:collection1] o.a.s.u.RandomMergePolicy RandomMergePolicy wrapping class org.apache.lucene.index.TieredMergePolicy: [TieredMergePolicy: maxMergeAtOnce=26, maxMergeAtOnceExplicit=40, maxMergedSegmentMB=95.7158203125, floorSegmentMB=1.46484375, forceMergeDeletesPctAllowed=1.0379023364357898, segmentsPerTier=15.0, maxCFSSegmentSizeMB=8.796093022207999E12, noCFSRatio=1.0
   [junit4]   2> 1402933 INFO  (coreLoadExecutor-3575-thread-1-processing-n:127.0.0.1:40787_uj_tt) [n:127.0.0.1:40787_uj_tt c:control_collection s:shard1 r:core_node1 x:collection1] o.a.s.c.SolrCore SolrDeletionPolicy.onCommit: commits: num=1
   [junit4]   2> 	commit{dir=MockDirectoryWrapper(RAMDirectory@6ee62183 lockFactory=org.apache.lucene.store.SingleInstanceLockFactory@46a25856),segFN=segments_1,generation=1}
   [junit4]   2> 1402933 INFO  (coreLoadExecutor-3575-thread-1-processing-n:127.0.0.1:40787_uj_tt) [n:127.0.0.1:40787_uj_tt c:control_collection s:shard1 r:core_node1 x:collection1] o.a.s.c.SolrCore newest commit generation = 1
   [junit4]   2> 1402934 INFO  (OldIndexDirectoryCleanupThreadForCore-collection1) [n:127.0.0.1:40787_uj_tt c:control_collection s:shard1 r:core_node1 x:collection1] o.a.s.c.SolrCore Looking for old index directories to cleanup for core collection1 in /x1/jenkins/jenkins-slave/workspace/Lucene-Solr-Tests-5.x-Java7/solr/build/solr-core/test/J0/temp/solr.cloud.HttpPartitionTest_180EEA8561E0762A-001/control-001/cores/collection1/data/
   [junit4]   2> 1402934 WARN  (OldIndexDirectoryCleanupThreadForCore-collection1) [n:127.0.0.1:40787_uj_tt c:control_collection s:shard1 r:core_node1 x:collection1] o.a.s.c.DirectoryFactory /x1/jenkins/jenkins-slave/workspace/Lucene-Solr-Tests-5.x-Java7/solr/build/solr-core/test/J0/temp/solr.cloud.HttpPartitionTest_180EEA8561E0762A-001/control-001/cores/collection1/data/ does not point to a valid data directory; skipping clean-up of old index directories.
   [junit4]   2> 1402938 INFO  (coreLoadExecutor-3575-thread-1-processing-n:127.0.0.1:40787_uj_tt) [n:127.0.0.1:40787_uj_tt c:control_collection s:shard1 r:core_node1 x:collection1] o.a.s.u.p.UpdateRequestProcessorChain creating updateRequestProcessorChain "nodistrib"
   [junit4]   2> 1402938 INFO  (coreLoadExecutor-3575-thread-1-processing-n:127.0.0.1:40787_uj_tt) [n:127.0.0.1:40787_uj_tt c:control_collection s:shard1 r:core_node1 x:collection1] o.a.s.u.p.UpdateRequestProcessorChain creating updateRequestProcessorChain "dedupe"
   [junit4]   2> 1402938 INFO  (coreLoadExecutor-3575-thread-1-processing-n:127.0.0.1:40787_uj_tt) [n:127.0.0.1:40787_uj_tt c:control_collection s:shard1 r:core_node1 x:collection1] o.a.s.u.p.UpdateRequestProcessorChain inserting DistributedUpdateProcessorFactory into updateRequestProcessorChain "dedupe"
   [junit4]   2> 1402938 INFO  (coreLoadExecutor-3575-thread-1-processing-n:127.0.0.1:40787_uj_tt) [n:127.0.0.1:40787_uj_tt c:control_collection s:shard1 r:core_node1 x:collection1] o.a.s.u.p.UpdateRequestProcessorChain creating updateRequestProcessorChain "stored_sig"
   [junit4]   2> 1402939 INFO  (coreLoadExecutor-3575-thread-1-processing-n:127.0.0.1:40787_uj_tt) [n:127.0.0.1:40787_uj_tt c:control_collection s:shard1 r:core_node1 x:collection1] o.a.s.u.p.UpdateRequestProcessorChain inserting DistributedUpdateProcessorFactory into updateRequestProcessorChain "stored_sig"
   [junit4]   2> 1402939 INFO  (coreLoadExecutor-3575-thread-1-processing-n:127.0.0.1:40787_uj_tt) [n:127.0.0.1:40787_uj_tt c:control_collection s:shard1 r:core_node1 x:collection1] o.a.s.u.p.UpdateRequestProcessorChain creating updateRequestProcessorChain "distrib-dup-test-chain-explicit"
   [junit4]   2> 1402939 INFO  (coreLoadExecutor-3575-thread-1-processing-n:127.0.0.1:40787_uj_tt) [n:127.0.0.1:40787_uj_tt c:control_collection s:shard1 r:core_node1 x:collection1] o.a.s.u.p.UpdateRequestProcessorChain creating updateRequestProcessorChain "distrib-dup-test-chain-implicit"
   [junit4]   2> 1402939 INFO  (coreLoadExecutor-3575-thread-1-processing-n:127.0.0.1:40787_uj_tt) [n:127.0.0.1:40787_uj_tt c:control_collection s:shard1 r:core_node1 x:collection1] o.a.s.u.p.UpdateRequestProcessorChain inserting DistributedUpdateProcessorFactory into updateRequestProcessorChain "distrib-dup-test-chain-implicit"
   [junit4]   2> 1402939 INFO  (coreLoadExecutor-3575-thread-1-processing-n:127.0.0.1:40787_uj_tt) [n:127.0.0.1:40787_uj_tt c:control_collection s:shard1 r:core_node1 x:collection1] o.a.s.c.SolrCore no updateRequestProcessorChain defined as default, creating implicit default
   [junit4]   2> 1402942 INFO  (coreLoadExecutor-3575-thread-1-processing-n:127.0.0.1:40787_uj_tt) [n:127.0.0.1:40787_uj_tt c:control_collection s:shard1 r:core_node1 x:collection1] o.a.s.h.l.XMLLoader xsltCacheLifetimeSeconds=60
   [junit4]   2> 1402944 INFO  (coreLoadExecutor-3575-thread-1-processing-n:127.0.0.1:40787_uj_tt) [n:127.0.0.1:40787_uj_tt c:control_collection s:shard1 r:core_node1 x:collection1] o.a.s.h.l.XMLLoader xsltCacheLifetimeSeconds=60
   [junit4]   2> 1402945 INFO  (coreLoadExecutor-3575-thread-1-processing-n:127.0.0.1:40787_uj_tt) [n:127.0.0.1:40787_uj_tt c:control_collection s:shard1 r:core_node1 x:collection1] o.a.s.h.l.XMLLoader xsltCacheLifetimeSeconds=60
   [junit4]   2> 1402946 INFO  (coreLoadExecutor-3575-thread-1-processing-n:127.0.0.1:40787_uj_tt) [n:127.0.0.1:40787_uj_tt c:control_collection s:shard1 r:core_node1 x:collection1] o.a.s.h.l.XMLLoader xsltCacheLifetimeSeconds=60
   [junit4]   2> 1402950 INFO  (coreLoadExecutor-3575-thread-1-processing-n:127.0.0.1:40787_uj_tt) [n:127.0.0.1:40787_uj_tt c:control_collection s:shard1 r:core_node1 x:collection1] o.a.s.c.RequestHandlers Registered paths: /admin/plugins,standard,/admin/mbeans,/update/json,/admin/segments,/update/json/docs,/admin/ping,/get,/update/csv,/config,/admin/system,/replication,/admin/file,/admin/threads,/admin/luke,/admin/logging,/schema,/update,/admin/properties
   [junit4]   2> 1402951 INFO  (coreLoadExecutor-3575-thread-1-processing-n:127.0.0.1:40787_uj_tt) [n:127.0.0.1:40787_uj_tt c:control_collection s:shard1 r:core_node1 x:collection1] o.a.s.c.SolrCore Using default statsCache cache: org.apache.solr.search.stats.LocalStatsCache
   [junit4]   2> 1402952 INFO  (coreLoadExecutor-3575-thread-1-processing-n:127.0.0.1:40787_uj_tt) [n:127.0.0.1:40787_uj_tt c:control_collection s:shard1 r:core_node1 x:collection1] o.a.s.u.UpdateHandler Using UpdateLog implementation: org.apache.solr.update.UpdateLog
   [junit4]   2> 1402952 INFO  (coreLoadExecutor-3575-thread-1-processing-n:127.0.0.1:40787_uj_tt) [n:127.0.0.1:40787_uj_tt c:control_collection s:shard1 r:core_node1 x:collection1] o.a.s.u.UpdateLog Initializing UpdateLog: dataDir= defaultSyncLevel=FLUSH numRecordsToKeep=100 maxNumLogsToKeep=10 numVersionBuckets=65536
   [junit4]   2> 1402953 INFO  (coreLoadExecutor-3575-thread-1-processing-n:127.0.0.1:40787_uj_tt) [n:127.0.0.1:40787_uj_tt c:control_collection s:shard1 r:core_node1 x:collection1] o.a.s.c.SolrCore Hard AutoCommit: disabled
   [junit4]   2> 1402953 INFO  (coreLoadExecutor-3575-thread-1-processing-n:127.0.0.1:40787_uj_tt) [n:127.0.0.1:40787_uj_tt c:control_collection s:shard1 r:core_node1 x:collection1] o.a.s.c.SolrCore Soft AutoCommit: disabled
   [junit4]   2> 1402953 INFO  (coreLoadExecutor-3575-thread-1-processing-n:127.0.0.1:40787_uj_tt) [n:127.0.0.1:40787_uj_tt c:control_collection s:shard1 r:core_node1 x:collection1] o.a.s.u.RandomMergePolicy RandomMergePolicy wrapping class org.apache.lucene.index.TieredMergePolicy: [TieredMergePolicy: maxMergeAtOnce=21, maxMergeAtOnceExplicit=31, maxMergedSegmentMB=60.455078125, floorSegmentMB=1.44921875, forceMergeDeletesPctAllowed=3.184163093132338, segmentsPerTier=16.0, maxCFSSegmentSizeMB=8.796093022207999E12, noCFSRatio=1.0
   [junit4]   2> 1402954 INFO  (coreLoadExecutor-3575-thread-1-processing-n:127.0.0.1:40787_uj_tt) [n:127.0.0.1:40787_uj_tt c:control_collection s:shard1 r:core_node1 x:collection1] o.a.s.c.SolrCore SolrDeletionPolicy.onInit: commits: num=1
   [junit4]   2> 	commit{dir=MockDirectoryWrapper(RAMDirectory@6ee62183 lockFactory=org.apache.lucene.store.SingleInstanceLockFactory@46a25856),segFN=segments_1,generation=1}
   [junit4]   2> 1402954 INFO  (coreLoadExecutor-3575-thread-1-processing-n:127.0.0.1:40787_uj_tt) [n:127.0.0.1:40787_uj_tt c:control_collection s:shard1 r:core_node1 x:collection1] o.a.s.c.SolrCore newest commit generation = 1
   [junit4]   2> 1402954 INFO  (coreLoadExecutor-3575-thread-1-processing-n:127.0.0.1:40787_uj_tt) [n:127.0.0.1:40787_uj_tt c:control_collection s:shard1 r:core_node1 x:collection1] o.a.s.s.SolrIndexSearcher Opening Searcher@2ce22c4e[collection1] main
   [junit4]   2> 1402954 INFO  (coreLoadExecutor-3575-thread-1-processing-n:127.0.0.1:40787_uj_tt) [n:127.0.0.1:40787_uj_tt c:control_collection s:shard1 r:core_node1 x:collection1] o.a.s.c.c.ZkStateReader Load collection config from:/collections/control_collection
   [junit4]   2> 1402955 INFO  (coreLoadExecutor-3575-thread-1-processing-n:127.0.0.1:40787_uj_tt) [n:127.0.0.1:40787_uj_tt c:control_collection s:shard1 r:core_node1 x:collection1] o.a.s.c.c.ZkStateReader path=/collections/control_collection configName=conf1 specified config exists in ZooKeeper
   [junit4]   2> 1402955 INFO  (coreLoadExecutor-3575-thread-1-processing-n:127.0.0.1:40787_uj_tt) [n:127.0.0.1:40787_uj_tt c:control_collection s:shard1 r:core_node1 x:collection1] o.a.s.r.ManagedResourceStorage Setting up ZooKeeper-based storage for the RestManager with znodeBase: /configs/conf1
   [junit4]   2> 1402956 INFO  (coreLoadExecutor-3575-thread-1-processing-n:127.0.0.1:40787_uj_tt) [n:127.0.0.1:40787_uj_tt c:control_collection s:shard1 r:core_node1 x:collection1] o.a.s.r.ManagedResourceStorage Configured ZooKeeperStorageIO with znodeBase: /configs/conf1
   [junit4]   2> 1402956 INFO  (coreLoadExecutor-3575-thread-1-processing-n:127.0.0.1:40787_uj_tt) [n:127.0.0.1:40787_uj_tt c:control_collection s:shard1 r:core_node1 x:collection1] o.a.s.r.RestManager Initializing RestManager with initArgs: {}
   [junit4]   2> 1402956 INFO  (coreLoadExecutor-3575-thread-1-processing-n:127.0.0.1:40787_uj_tt) [n:127.0.0.1:40787_uj_tt c:control_collection s:shard1 r:core_node1 x:collection1] o.a.s.r.ManagedResourceStorage Reading _rest_managed.json using ZooKeeperStorageIO:path=/configs/conf1
   [junit4]   2> 1402957 INFO  (coreLoadExecutor-3575-thread-1-processing-n:127.0.0.1:40787_uj_tt) [n:127.0.0.1:40787_uj_tt c:control_collection s:shard1 r:core_node1 x:collection1] o.a.s.r.ManagedResourceStorage No data found for znode /configs/conf1/_rest_managed.json
   [junit4]   2> 1402957 INFO  (coreLoadExecutor-3575-thread-1-processing-n:127.0.0.1:40787_uj_tt) [n:127.0.0.1:40787_uj_tt c:control_collection s:shard1 r:core_node1 x:collection1] o.a.s.r.ManagedResourceStorage Loaded null at path _rest_managed.json using ZooKeeperStorageIO:path=/configs/conf1
   [junit4]   2> 1402957 INFO  (coreLoadExecutor-3575-thread-1-processing-n:127.0.0.1:40787_uj_tt) [n:127.0.0.1:40787_uj_tt c:control_collection s:shard1 r:core_node1 x:collection1] o.a.s.r.RestManager Initializing 0 registered ManagedResources
   [junit4]   2> 1402957 INFO  (coreLoadExecutor-3575-thread-1-processing-n:127.0.0.1:40787_uj_tt) [n:127.0.0.1:40787_uj_tt c:control_collection s:shard1 r:core_node1 x:collection1] o.a.s.h.ReplicationHandler Commits will be reserved for  10000
   [junit4]   2> 1402958 INFO  (searcherExecutor-3576-thread-1-processing-n:127.0.0.1:40787_uj_tt c:control_collection x:collection1 r:core_node1 s:shard1) [n:127.0.0.1:40787_uj_tt c:control_collection s:shard1 r:core_node1 x:collection1] o.a.s.c.SolrCore [collection1] Registered new searcher Searcher@2ce22c4e[collection1] main{ExitableDirectoryReader(UninvertingDirectoryReader())}
   [junit4]   2> 1402958 INFO  (coreLoadExecutor-3575-thread-1-processing-n:127.0.0.1:40787_uj_tt) [n:127.0.0.1:40787_uj_tt c:control_collection s:shard1 r:core_node1 x:collection1] o.a.s.u.UpdateLog Looking up max value of version field to seed version buckets
   [junit4]   2> 1402958 INFO  (coreLoadExecutor-3575-thread-1-processing-n:127.0.0.1:40787_uj_tt) [n:127.0.0.1:40787_uj_tt c:control_collection s:shard1 r:core_node1 x:collection1] o.a.s.u.VersionInfo Refreshing highest value of _version_ for 65536 version buckets from index
   [junit4]   2> 1402958 INFO  (coreLoadExecutor-3575-thread-1-processing-n:127.0.0.1:40787_uj_tt) [n:127.0.0.1:40787_uj_tt c:control_collection s:shard1 r:core_node1 x:collection1] o.a.s.u.VersionInfo No terms found for _version_, cannot seed version bucket highest value from index
   [junit4]   2> 1402958 INFO  (coreLoadExecutor-3575-thread-1-processing-n:127.0.0.1:40787_uj_tt) [n:127.0.0.1:40787_uj_tt c:control_collection s:shard1 r:core_node1 x:collection1] o.a.s.u.UpdateLog Could not find max version in index or recent updates, using new clock 1510664504054120448
   [junit4]   2> 1402960 INFO  (coreLoadExecutor-3575-thread-1-processing-n:127.0.0.1:40787_uj_tt) [n:127.0.0.1:40787_uj_tt c:control_collection s:shard1 r:core_node1 x:collection1] o.a.s.u.UpdateLog Took 2.0ms to seed version buckets with highest version 1510664504054120448
   [junit4]   2> 1402961 INFO  (coreLoadExecutor-3575-thread-1-processing-n:127.0.0.1:40787_uj_tt) [n:127.0.0.1:40787_uj_tt c:control_collection s:shard1 r:core_node1 x:collection1] o.a.s.c.ZkController watch zkdir /configs/conf1
   [junit4]   2> 1402961 INFO  (coreLoadExecutor-3575-thread-1-processing-n:127.0.0.1:40787_uj_tt) [n:127.0.0.1:40787_uj_tt c:control_collection s:shard1 r:core_node1 x:collection1] o.a.s.c.CoreContainer registering core: collection1
   [junit4]   2> 1402962 INFO  (coreZkRegister-3569-thread-1-processing-n:127.0.0.1:40787_uj_tt c:control_collection x:collection1 r:core_node1 s:shard1) [n:127.0.0.1:40787_uj_tt c:control_collection s:shard1 r:core_node1 x:collection1] o.a.s.c.ZkController Register replica - core:collection1 address:http://127.0.0.1:40787/uj_tt collection:control_collection shard:shard1
   [junit4]   2> 1402962 INFO  (coreZkRegister-3569-thread-1-processing-n:127.0.0.1:40787_uj_tt c:control_collection x:collection1 r:core_node1 s:shard1) [n:127.0.0.1:40787_uj_tt c:control_collection s:shard1 r:core_node1 x:collection1] o.a.s.c.c.SolrZkClient makePath: /collections/control_collection/leader_elect/shard1/election
   [junit4]   2> 1402966 INFO  (coreZkRegister-3569-thread-1-processing-n:127.0.0.1:40787_uj_tt c:control_collection x:collection1 r:core_node1 s:shard1) [n:127.0.0.1:40787_uj_tt c:control_collection s:shard1 r:core_node1 x:collection1] o.a.s.c.LeaderElector Joined leadership election with path: /collections/control_collection/leader_elect/shard1/election/94416531377356804-core_node1-n_0000000000
   [junit4]   2> 1402967 INFO  (coreZkRegister-3569-thread-1-processing-n:127.0.0.1:40787_uj_tt c:control_collection x:collection1 r:core_node1 s:shard1) [n:127.0.0.1:40787_uj_tt c:control_collection s:shard1 r:core_node1 x:collection1] o.a.s.c.ShardLeaderElectionContext Running the leader process for shard shard1
   [junit4]   2> 1402969 INFO  (coreZkRegister-3569-thread-1-processing-n:127.0.0.1:40787_uj_tt c:control_collection x:collection1 r:core_node1 s:shard1) [n:127.0.0.1:40787_uj_tt c:control_collection s:shard1 r:core_node1 x:collection1] o.a.s.c.ShardLeaderElectionContext Enough replicas found to continue.
   [junit4]   2> 1402969 INFO  (OverseerStateUpdate-94416531377356804-127.0.0.1:40787_uj_tt-n_0000000000) [n:127.0.0.1:40787_uj_tt    ] o.a.s.c.Overseer processMessage: queueSize: 1, message = {
   [junit4]   2>   "operation":"leader",
   [junit4]   2>   "shard":"shard1",
   [junit4]   2>   "collection":"control_collection"} current state version: 1
   [junit4]   2> 1402969 INFO  (coreZkRegister-3569-thread-1-processing-n:127.0.0.1:40787_uj_tt c:control_collection x:collection1 r:core_node1 s:shard1) [n:127.0.0.1:40787_uj_tt c:control_collection s:shard1 r:core_node1 x:collection1] o.a.s.c.ShardLeaderElectionContext I may be the new leader - try and sync
   [junit4]   2> 1402969 INFO  (coreZkRegister-3569-thread-1-processing-n:127.0.0.1:40787_uj_tt c:control_collection x:collection1 r:core_node1 s:shard1) [n:127.0.0.1:40787_uj_tt c:control_collection s:shard1 r:core_node1 x:collection1] o.a.s.c.SyncStrategy Sync replicas to http://127.0.0.1:40787/uj_tt/collection1/
   [junit4]   2> 1402970 INFO  (coreZkRegister-3569-thread-1-processing-n:127.0.0.1:40787_uj_tt c:control_collection x:collection1 r:core_node1 s:shard1) [n:127.0.0.1:40787_uj_tt c:control_collection s:shard1 r:core_node1 x:collection1] o.a.s.c.SyncStrategy Sync Success - now sync replicas to me
   [junit4]   2> 1402970 INFO  (coreZkRegister-3569-thread-1-processing-n:127.0.0.1:40787_uj_tt c:control_collection x:collection1 r:core_node1 s:shard1) [n:127.0.0.1:40787_uj_tt c:control_collection s:shard1 r:core_node1 x:collection1] o.a.s.c.SyncStrategy http://127.0.0.1:40787/uj_tt/collection1/ has no replicas
   [junit4]   2> 1402970 INFO  (coreZkRegister-3569-thread-1-processing-n:127.0.0.1:40787_uj_tt c:control_collection x:collection1 r:core_node1 s:shard1) [n:127.0.0.1:40787_uj_tt c:control_collection s:shard1 r:core_node1 x:collection1] o.a.s.c.ShardLeaderElectionContext I am the new leader: http://127.0.0.1:40787/uj_tt/collection1/ shard1
   [junit4]   2> 1402970 INFO  (coreZkRegister-3569-thread-1-processing-n:127.0.0.1:40787_uj_tt c:control_collection x:collection1 r:core_node1 s:shard1) [n:127.0.0.1:40787_uj_tt c:control_collection s:shard1 r:core_node1 x:collection1] o.a.s.c.c.SolrZkClient makePath: /collections/control_collection/leaders/shard1
   [junit4]   2> 1402974 INFO  (OverseerStateUpdate-94416531377356804-127.0.0.1:40787_uj_tt-n_0000000000) [n:127.0.0.1:40787_uj_tt    ] o.a.s.c.Overseer processMessage: queueSize: 1, message = {
   [junit4]   2>   "operation":"leader",
   [junit4]   2>   "shard":"shard1",
   [junit4]   2>   "collection":"control_collection",
   [junit4]   2>   "base_url":"http://127.0.0.1:40787/uj_tt",
   [junit4]   2>   "core":"collection1",
   [junit4]   2>   "state":"active"} current state version: 1
   [junit4]   2> 1403057 INFO  (TEST-HttpPartitionTest.test-seed#[180EEA8561E0762A]) [    ] o.a.s.c.c.SolrZkClient Using default ZkCredentialsProvider
   [junit4]   2> 1403058 INFO  (TEST-HttpPartitionTest.test-seed#[180EEA8561E0762A]) [    ] o.a.s.c.c.ConnectionManager Waiting for client to connect to ZooKeeper
   [junit4]   2> 1403059 INFO  (zkCallback-1496-thread-1) [    ] o.a.s.c.c.ConnectionManager Watcher org.apache.solr.common.cloud.ConnectionManager@418c17de name:ZooKeeperConnection Watcher:127.0.0.1:44752/solr got event WatchedEvent state:SyncConnected type:None path:null path:null type:None
   [junit4]   2> 1403059 INFO  (TEST-HttpPartitionTest.test-seed#[180EEA8561E0762A]) [    ] o.a.s.c.c.ConnectionManager Client is connected to ZooKeeper
   [junit4]   2> 1403059 INFO  (TEST-HttpPartitionTest.test-seed#[180EEA8561E0762A]) [    ] o.a.s.c.c.SolrZkClient Using default ZkACLProvider
   [junit4]   2> 1403059 INFO  (TEST-HttpPartitionTest.test-seed#[180EEA8561E0762A]) [    ] o.a.s.c.c.ZkStateReader Updating cluster state from ZooKeeper... 
   [junit4]   2> 1403062 INFO  (TEST-HttpPartitionTest.test-seed#[180EEA8561E0762A]) [    ] o.a.s.c.ChaosMonkey monkey: init - expire sessions:false cause connection loss:false
   [junit4]   2> 1403076 INFO  (zkCallback-1494-thread-1-processing-n:127.0.0.1:40787_uj_tt) [n:127.0.0.1:40787_uj_tt    ] o.a.s.c.c.ZkStateReader A cluster state change: WatchedEvent state:SyncConnected type:NodeDataChanged path:/clusterstate.json, has occurred - updating... (live nodes size: 1)
   [junit4]   2> 1403076 INFO  (zkCallback-1496-thread-1) [    ] o.a.s.c.c.ZkStateReader A cluster state change: WatchedEvent state:SyncConnected type:NodeDataChanged path:/clusterstate.json, has occurred - updating... (live nodes size: 1)
   [junit4]   2> 1403125 INFO  (coreZkRegister-3569-thread-1-processing-n:127.0.0.1:40787_uj_tt c:control_collection x:collection1 r:core_node1 s:shard1) [n:127.0.0.1:40787_uj_tt c:control_collection s:shard1 r:core_node1 x:collection1] o.a.s.c.ZkController We are http://127.0.0.1:40787/uj_tt/collection1/ and leader is http://127.0.0.1:40787/uj_tt/collection1/
   [junit4]   2> 1403125 INFO  (coreZkRegister-3569-thread-1-processing-n:127.0.0.1:40787_uj_tt c:control_collection x:collection1 r:core_node1 s:shard1) [n:127.0.0.1:40787_uj_tt c:control_collection s:shard1 r:core_node1 x:collection1] o.a.s.c.ZkController No LogReplay needed for core=collection1 baseURL=http://127.0.0.1:40787/uj_tt
   [junit4]   2> 1403125 INFO  (coreZkRegister-3569-thread-1-processing-n:127.0.0.1:40787_uj_tt c:control_collection x:collection1 r:core_node1 s:shard1) [n:127.0.0.1:40787_uj_tt c:control_collection s:shard1 r:core_node1 x:collection1] o.a.s.c.ZkController I am the leader, no recovery necessary
   [junit4]   2> 1403126 INFO  (coreZkRegister-3569-thread-1-processing-n:127.0.0.1:40787_uj_tt c:control_collection x:collection1 r:core_node1 s:shard1) [n:127.0.0.1:40787_uj_tt c:control_collection s:shard1 r:core_node1 x:collection1] o.a.s.c.ZkController publishing state=active
   [junit4]   2> 1403126 INFO  (coreZkRegister-3569-thread-1-processing-n:127.0.0.1:40787_uj_tt c:control_collection x:collection1 r:core_node1 s:shard1) [n:127.0.0.1:40787_uj_tt c:control_collection s:shard1 r:core_node1 x:collection1] o.a.s.c.ZkController numShards not found on descriptor - reading it from system property
   [junit4]   2> 1403128 INFO  (OverseerStateUpdate-94416531377356804-127.0.0.1:40787_uj_tt-n_0000000000) [n:127.0.0.1:40787_uj_tt    ] o.a.s.c.Overseer processMessage: queueSize: 1, message = {
   [junit4]   2>   "numShards":"2",
   [junit4]   2>   "base_url":"http://127.0.0.1:40787/uj_tt",
   [junit4]   2>   "node_name":"127.0.0.1:40787_uj_tt",
   [junit4]   2>   "collection":"control_collection",
   [junit4]   2>   "core":"collection1",
   [junit4]   2>   "shard":"shard1",
   [junit4]   2>   "roles":null,
   [junit4]   2>   "state":"active",
   [junit4]   2>   "operation":"state",
   [junit4]   2>   "core_node_name":"core_node1"} current state version: 2
   [junit4]   2> 1403128 INFO  (OverseerStateUpdate-94416531377356804-127.0.0.1:40787_uj_tt-n_0000000000) [n:127.0.0.1:40787_uj_tt    ] o.a.s.c.o.ReplicaMutator Update state numShards=2 message={
   [junit4]   2>   "numShards":"2",
   [junit4]   2>   "base_url":"http://127.0.0.1:40787/uj_tt",
   [junit4]   2>   "node_name":"127.0.0.1:40787_uj_tt",
   [junit4]   2>   "collection":"control_collection",
   [junit4]   2>   "core":"collection1",
   [junit4]   2>   "shard":"shard1",
   [junit4]   2>   "roles":null,
   [junit4]   2>   "state":"active",
   [junit4]   2>   "operation":"state",
   [junit4]   2>   "core_node_name":"core_node1"}
   [junit4]   2> 1403231 INFO  (zkCallback-1496-thread-1) [    ] o.a.s.c.c.ZkStateReader A cluster state change: WatchedEvent state:SyncConnected type:NodeDataChanged path:/clusterstate.json, has occurred - updating... (live nodes size: 1)
   [junit4]   2> 1403231 INFO  (zkCallback-1494-thread-1-processing-n:127.0.0.1:40787_uj_tt) [n:127.0.0.1:40787_uj_tt    ] o.a.s.c.c.ZkStateReader A cluster state change: WatchedEvent state:SyncConnected type:NodeDataChanged path:/clusterstate.json, has occurred - updating... (live nodes size: 1)
   [junit4]   2> 1403331 INFO  (TEST-HttpPartitionTest.test-seed#[180EEA8561E0762A]) [    ] o.a.s.SolrTestCaseJ4 Writing core.properties file to /x1/jenkins/jenkins-slave/workspace/Lucene-Solr-Tests-5.x-Java7/solr/build/solr-core/test/J0/temp/solr.cloud.HttpPartitionTest_180EEA8561E0762A-001/shard-1-001/cores/collection1
   [junit4]   2> 1403332 INFO  (TEST-HttpPartitionTest.test-seed#[180EEA8561E0762A]) [    ] o.a.s.c.AbstractFullDistribZkTestBase create jetty 1 in directory /x1/jenkins/jenkins-slave/workspace/Lucene-Solr-Tests-5.x-Java7/solr/build/solr-core/test/J0/temp/solr.cloud.HttpPartitionTest_180EEA8561E0762A-001/shard-1-001
   [junit4]   2> 1403332 INFO  (TEST-HttpPartitionTest.test-seed#[180EEA8561E0762A]) [    ] o.e.j.s.Server jetty-9.2.13.v20150730
   [junit4]   2> 1403337 INFO  (TEST-HttpPartitionTest.test-seed#[180EEA8561E0762A]) [    ] o.e.j.s.h.ContextHandler Started o.e.j.s.ServletContextHandler@37514147{/uj_tt,null,AVAILABLE}
   [junit4]   2> 1403337 INFO  (TEST-HttpPartitionTest.test-seed#[180EEA8561E0762A]) [    ] o.e.j.s.ServerConnector Started ServerConnector@4e94752{HTTP/1.1}{127.0.0.1:43869}
   [junit4]   2> 1403337 INFO  (TEST-HttpPartitionTest.test-seed#[180EEA8561E0762A]) [    ] o.e.j.s.Server Started @1406304ms
   [junit4]   2> 1403338 INFO  (TEST-HttpPartitionTest.test-seed#[180EEA8561E0762A]) [    ] o.a.s.c.s.e.JettySolrRunner Jetty properties: {hostContext=/uj_tt, solrconfig=solrconfig.xml, hostPort=39825, solr.data.dir=/x1/jenkins/jenkins-slave/workspace/Lucene-Solr-Tests-5.x-Java7/solr/build/solr-core/test/J0/temp/solr.cloud.HttpPartitionTest_180EEA8561E0762A-001/tempDir-001/jetty1, coreRootDirectory=/x1/jenkins/jenkins-slave/workspace/Lucene-Solr-Tests-5.x-Java7/solr/build/solr-core/test/J0/temp/solr.cloud.HttpPartitionTest_180EEA8561E0762A-001/shard-1-001/cores}
   [junit4]   2> 1403338 INFO  (TEST-HttpPartitionTest.test-seed#[180EEA8561E0762A]) [    ] o.a.s.s.SolrDispatchFilter SolrDispatchFilter.init(): sun.misc.Launcher$AppClassLoader@4e0add57
   [junit4]   2> 1403338 INFO  (TEST-HttpPartitionTest.test-seed#[180EEA8561E0762A]) [    ] o.a.s.c.SolrResourceLoader new SolrResourceLoader for directory: '/x1/jenkins/jenkins-slave/workspace/Lucene-Solr-Tests-5.x-Java7/solr/build/solr-core/test/J0/temp/solr.cloud.HttpPartitionTest_180EEA8561E0762A-001/shard-1-001/'
   [junit4]   2> 1403356 INFO  (TEST-HttpPartitionTest.test-seed#[180EEA8561E0762A]) [    ] o.a.s.c.c.SolrZkClient Using default ZkCredentialsProvider
   [junit4]   2> 1403356 INFO  (TEST-HttpPartitionTest.test-seed#[180EEA8561E0762A]) [    ] o.a.s.c.c.ConnectionManager Waiting for client to connect to ZooKeeper
   [junit4]   2> 1403358 INFO  (zkCallback-1497-thread-1) [    ] o.a.s.c.c.ConnectionManager Watcher org.apache.solr.common.cloud.ConnectionManager@bd89ea0 name:ZooKeeperConnection Watcher:127.0.0.1:44752/solr got event WatchedEvent state:SyncConnected type:None path:null path:null type:None
   [junit4]   2> 1403358 INFO  (TEST-HttpPartitionTest.test-seed#[180EEA8561E0762A]) [    ] o.a.s.c.c.ConnectionManager Client is connected to ZooKeeper
   [junit4]   2> 1403358 INFO  (TEST-HttpPartitionTest.test-seed#[180EEA8561E0762A]) [    ] o.a.s.c.c.SolrZkClient Using default ZkACLProvider
   [junit4]   2> 1403360 INFO  (TEST-HttpPartitionTest.test-seed#[180EEA8561E0762A]) [    ] o.a.s.s.SolrDispatchFilter Loading solr.xml from SolrHome (not found in ZooKeeper)
   [junit4]   2> 1403360 INFO  (TEST-HttpPartitionTest.test-seed#[180EEA8561E0762A]) [    ] o.a.s.c.SolrXmlConfig Loading container configuration from /x1/jenkins/jenkins-slave/workspace/Lucene-Solr-Tests-5.x-Java7/solr/build/solr-core/test/J0/temp/solr.cloud.HttpPartitionTest_180EEA8561E0762A-001/shard-1-001/solr.xml
   [junit4]   2> 1403374 INFO  (TEST-HttpPartitionTest.test-seed#[180EEA8561E0762A]) [    ] o.a.s.c.CoresLocator Config-defined core root directory: /x1/jenkins/jenkins-slave/workspace/Lucene-Solr-Tests-5.x-Java7/solr/build/solr-core/test/J0/temp/solr.cloud.HttpPartitionTest_180EEA8561E0762A-001/shard-1-001/cores
   [junit4]   2> 1403374 INFO  (TEST-HttpPartitionTest.test-seed#[180EEA8561E0762A]) [    ] o.a.s.c.CoreContainer New CoreContainer 529924087
   [junit4]   2> 1403374 INFO  (TEST-HttpPartitionTest.test-seed#[180EEA8561E0762A]) [    ] o.a.s.c.CoreContainer Loading cores into CoreContainer [instanceDir=/x1/jenkins/jenkins-slave/workspace/Lucene-Solr-Tests-5.x-Java7/solr/build/solr-core/test/J0/temp/solr.cloud.HttpPartitionTest_180EEA8561E0762A-001/shard-1-001/]
   [junit4]   2> 1403375 INFO  (TEST-HttpPartitionTest.test-seed#[180EEA8561E0762A]) [    ] o.a.s.c.CoreContainer loading shared library: /x1/jenkins/jenkins-slave/workspace/Lucene-Solr-Tests-5.x-Java7/solr/build/solr-core/test/J0/temp/solr.cloud.HttpPartitionTest_180EEA8561E0762A-001/shard-1-001/lib
   [junit4]   2> 1403375 WARN  (TEST-HttpPartitionTest.test-seed#[180EEA8561E0762A]) [    ] o.a.s.c.SolrResourceLoader Can't find (or read) directory to add to classloader: lib (resolved as: /x1/jenkins/jenkins-slave/workspace/Lucene-Solr-Tests-5.x-Java7/solr/build/solr-core/test/J0/temp/solr.cloud.HttpPartitionTest_180EEA8561E0762A-001/shard-1-001/lib).
   [junit4]   2> 1403383 INFO  (TEST-HttpPartitionTest.test-seed#[180EEA8561E0762A]) [    ] o.a.s.h.c.HttpShardHandlerFactory created with socketTimeout : 90000,urlScheme : ,connTimeout : 15000,maxConnectionsPerHost : 20,maxConnections : 10000,corePoolSize : 0,maximumPoolSize : 2147483647,maxThreadIdleTime : 5,sizeOfQueue : -1,fairnessPolicy : false,useRetries : false,
   [junit4]   2> 1403384 INFO  (TEST-HttpPartitionTest.test-seed#[180EEA8561E0762A]) [    ] o.a.s.u.UpdateShardHandler Creating UpdateShardHandler HTTP client with params: socketTimeout=340000&connTimeout=45000&retry=true
   [junit4]   2> 1403384 INFO  (TEST-HttpPartitionTest.test-seed#[180EEA8561E0762A]) [    ] o.a.s.l.LogWatcher SLF4J impl is org.slf4j.impl.Log4jLoggerFactory
   [junit4]   2> 1403384 INFO  (TEST-HttpPartitionTest.test-seed#[180EEA8561E0762A]) [    ] o.a.s.l.LogWatcher Registering Log Listener [Log4j (org.slf4j.impl.Log4jLoggerFactory)]
   [junit4]   2> 1403385 INFO  (TEST-HttpPartitionTest.test-seed#[180EEA8561E0762A]) [    ] o.a.s.c.ZkContainer Zookeeper client=127.0.0.1:44752/solr
   [junit4]   2> 1403385 INFO  (TEST-HttpPartitionTest.test-seed#[180EEA8561E0762A]) [    ] o.a.s.c.ZkController zkHost includes chroot
   [junit4]   2> 1403385 INFO  (TEST-HttpPartitionTest.test-seed#[180EEA8561E0762A]) [    ] o.a.s.c.c.SolrZkClient Using default ZkCredentialsProvider
   [junit4]   2> 1403385 INFO  (TEST-HttpPartitionTest.test-seed#[180EEA8561E0762A]) [    ] o.a.s.c.c.ConnectionManager Waiting for client to connect to ZooKeeper
   [junit4]   2> 1403387 INFO  (zkCallback-1499-thread-1) [    ] o.a.s.c.c.ConnectionManager Watcher org.apache.solr.common.cloud.ConnectionManager@1331768a name:ZooKeeperConnection Watcher:127.0.0.1:44752 got event WatchedEvent state:SyncConnected type:None path:null path:null type:None
   [junit4]   2> 1403388 INFO  (TEST-HttpPartitionTest.test-seed#[180EEA8561E0762A]) [    ] o.a.s.c.c.ConnectionManager Client is connected to ZooKeeper
   [junit4]   2> 1403388 INFO  (TEST-HttpPartitionTest.test-seed#[180EEA8561E0762A]) [    ] o.a.s.c.c.SolrZkClient Using default ZkACLProvider
   [junit4]   2> 1403390 INFO  (TEST-HttpPartitionTest.test-seed#[180EEA8561E0762A]) [n:127.0.0.1:39825_uj_tt    ] o.a.s.c.c.ConnectionManager Waiting for client to connect to ZooKeeper
   [junit4]   2> 1403391 INFO  (zkCallback-1500-thread-1-processing-n:127.0.0.1:39825_uj_tt) [n:127.0.0.1:39825_uj_tt    ] o.a.s.c.c.ConnectionManager Watcher org.apache.solr.common.cloud.ConnectionManager@2cacd906 name:ZooKeeperConnection Watcher:127.0.0.1:44752/solr got event WatchedEvent state:SyncConnected type:None path:null path:null type:None
   [junit4]   2> 1403391 INFO  (TEST-HttpPartitionTest.test-seed#[180EEA8561E0762A]) [n:127.0.0.1:39825_uj_tt    ] o.a.s.c.c.ConnectionManager Client is connected to ZooKeeper
   [junit4]   2> 1403396 INFO  (TEST-HttpPartitionTest.test-seed#[180EEA8561E0762A]) [n:127.0.0.1:39825_uj_tt    ] o.a.s.c.c.ZkStateReader Updating cluster state from ZooKeeper... 
   [junit4]   2> 1404402 INFO  (TEST-HttpPartitionTest.test-seed#[180EEA8561E0762A]) [n:127.0.0.1:39825_uj_tt    ] o.a.s.c.ZkController Register node as live in ZooKeeper:/live_nodes/127.0.0.1:39825_uj_tt
   [junit4]   2> 1404403 INFO  (TEST-HttpPartitionTest.test-seed#[180EEA8561E0762A]) [n:127.0.0.1:39825_uj_tt    ] o.a.s.c.c.SolrZkClient makePath: /live_nodes/127.0.0.1:39825_uj_tt
   [junit4]   2> 1404404 INFO  (zkCallback-1496-thread-1) [    ] o.a.s.c.c.ZkStateReader A live node change: WatchedEvent state:SyncConnected type:NodeChildrenChanged path:/live_nodes, has occurred - updating... (live nodes size: 1)
   [junit4]   2> 1404404 INFO  (zkCallback-1494-thread-1-processing-n:127.0.0.1:40787_uj_tt) [n:127.0.0.1:40787_uj_tt    ] o.a.s.c.c.ZkStateReader A live node change: WatchedEvent state:SyncConnected type:NodeChildrenChanged path:/live_nodes, has occurred - updating... (live nodes size: 1)
   [junit4]   2> 1404405 INFO  (zkCallback-1500-thread-1-processing-n:127.0.0.1:39825_uj_tt) [n:127.0.0.1:39825_uj_tt    ] o.a.s.c.c.ZkStateReader A live node change: WatchedEvent state:SyncConnected type:NodeChildrenChanged path:/live_nodes, has occurred - updating... (live nodes size: 1)
   [junit4]   2> 1404406 INFO  (TEST-HttpPartitionTest.test-seed#[180EEA8561E0762A]) [n:127.0.0.1:39825_uj_tt    ] o.a.s.c.Overseer Overseer (id=null) closing
   [junit4]   2> 1404407 INFO  (TEST-HttpPartitionTest.test-seed#[180EEA8561E0762A]) [n:127.0.0.1:39825_uj_tt    ] o.a.s.c.LeaderElector Joined leadership election with path: /overseer_elect/election/94416531377356808-127.0.0.1:39825_uj_tt-n_0000000001
   [junit4]   2> 1404408 INFO  (TEST-HttpPartitionTest.test-seed#[180EEA8561E0762A]) [n:127.0.0.1:39825_uj_tt    ] o.a.s.c.LeaderElector Watching path /overseer_elect/election/94416531377356804-127.0.0.1:40787_uj_tt-n_0000000000 to know if I could be the leader
   [junit4]   2> 1404422 INFO  (TEST-HttpPartitionTest.test-seed#[180EEA8561E0762A]) [n:127.0.0.1:39825_uj_tt    ] o.a.s.c.CoreContainer Security conf doesn't exist. Skipping setup for authorization module.
   [junit4]   2> 1404422 INFO  (TEST-HttpPartitionTest.test-seed#[180EEA8561E0762A]) [n:127.0.0.1:39825_uj_tt    ] o.a.s.c.CoreContainer No authentication plugin used.
   [junit4]   2> 1404423 INFO  (TEST-HttpPartitionTest.test-seed#[180EEA8561E0762A]) [n:127.0.0.1:39825_uj_tt    ] o.a.s.c.CoresLocator Looking for core definitions underneath /x1/jenkins/jenkins-slave/workspace/Lucene-Solr-Tests-5.x-Java7/solr/build/solr-core/test/J0/temp/solr.cloud.HttpPartitionTest_180EEA8561E0762A-001/shard-1-001/cores
   [junit4]   2> 1404424 INFO  (TEST-HttpPartitionTest.test-seed#[180EEA8561E0762A]) [n:127.0.0.1:39825_uj_tt    ] o.a.s.c.SolrCore Created CoreDescriptor: {shard=, name=collection1, absoluteInstDir=/x1/jenkins/jenkins-slave/workspace/Lucene-Solr-Tests-5.x-Java7/solr/build/solr-core/test/J0/temp/solr.cloud.HttpPartitionTest_180EEA8561E0762A-001/shard-1-001/cores/collection1/, configSetProperties=configsetprops.json, coreNodeName=, schema=schema.xml, loadOnStartup=true, dataDir=data/, config=solrconfig.xml, collection=collection1, instanceDir=/x1/jenkins/jenkins-slave/workspace/Lucene-Solr-Tests-5.x-Java7/solr/build/solr-core/test/J0/temp/solr.cloud.HttpPartitionTest_180EEA8561E0762A-001/shard-1-001/cores/collection1, transient=false}
   [junit4]   2> 1404424 INFO  (TEST-HttpPartitionTest.test-seed#[180EEA8561E0762A]) [n:127.0.0.1:39825_uj_tt    ] o.a.s.c.CoresLocator Found core collection1 in /x1/jenkins/jenkins-slave/workspace/Lucene-Solr-Tests-5.x-Java7/solr/build/solr-core/test/J0/temp/solr.cloud.HttpPartitionTest_180EEA8561E0762A-001/shard-1-001/cores/collection1/
   [junit4]   2> 1404424 INFO  (TEST-HttpPartitionTest.test-seed#[180EEA8561E0762A]) [n:127.0.0.1:39825_uj_tt    ] o.a.s.c.CoresLocator Found 1 core definitions
   [junit4]   2> 1404425 INFO  (TEST-HttpPartitionTest.test-seed#[180EEA8561E0762A]) [n:127.0.0.1:39825_uj_tt    ] o.a.s.s.SolrDispatchFilter user.dir=/x1/jenkins/jenkins-slave/workspace/Lucene-Solr-Tests-5.x-Java7/solr/build/solr-core/test/J0
   [junit4]   2> 1404425 INFO  (TEST-HttpPartitionTest.test-seed#[180EEA8561E0762A]) [n:127.0.0.1:39825_uj_tt    ] o.a.s.s.SolrDispatchFilter SolrDispatchFilter.init() done
   [junit4]   2> 1404425 INFO  (coreLoadExecutor-3586-thread-1-processing-n:127.0.0.1:39825_uj_tt) [n:127.0.0.1:39825_uj_tt c:collection1   x:collection1] o.a.s.c.ZkController publishing state=down
   [junit4]   2> 1404426 INFO  (coreLoadExecutor-3586-thread-1-processing-n:127.0.0.1:39825_uj_tt) [n:127.0.0.1:39825_uj_tt c:collection1   x:collection1] o.a.s.c.ZkController numShards not found on descriptor - reading it from system property
   [junit4]   2> 1404427 INFO  (coreLoadExecutor-3586-thread-1-processing-n:127.0.0.1:39825_uj_tt) [n:127.0.0.1:39825_uj_tt c:collection1   x:collection1] o.a.s.c.ZkController look for our core node name
   [junit4]   2> 1404427 INFO  (OverseerStateUpdate-94416531377356804-127.0.0.1:40787_uj_tt-n_0000000000) [n:127.0.0.1:40787_uj_tt    ] o.a.s.c.Overseer processMessage: queueSize: 1, message = {
   [junit4]   2>   "numShards":"2",
   [junit4]   2>   "base_url":"http://127.0.0.1:39825/uj_tt",
   [junit4]   2>   "node_name":"127.0.0.1:39825_uj_tt",
   [junit4]   2>   "collection":"collection1",
   [junit4]   2>   "core":"collection1",
   [junit4]   2>   "shard":null,
   [junit4]   2>   "roles":null,
   [junit4]   2>   "state":"down",
   [junit4]   2>   "operation":"state"} current state version: 3
   [junit4]   2> 1404428 INFO  (OverseerStateUpdate-94416531377356804-127.0.0.1:40787_uj_tt-n_0000000000) [n:127.0.0.1:40787_uj_tt    ] o.a.s.c.o.ReplicaMutator Update state numShards=2 message={
   [junit4]   2>   "numShards":"2",
   [junit4]   2>   "base_url":"http://127.0.0.1:39825/uj_tt",
   [junit4]   2>   "node_name":"127.0.0.1:39825_uj_tt",
   [junit4]   2>   "collection":"collection1",
   [junit4]   2>   "core":"collection1",
   [junit4]   2>   "shard":null,
   [junit4]   2>   "roles":null,
   [junit4]   2>   "state":"down",
   [junit4]   2>   "operation":"state"}
   [junit4]   2> 1404428 INFO  (OverseerStateUpdate-94416531377356804-127.0.0.1:40787_uj_tt-n_0000000000) [n:127.0.0.1:40787_uj_tt    ] o.a.s.c.o.ClusterStateMutator building a new cName: collection1
   [junit4]   2> 1404428 INFO  (OverseerStateUpdate-94416531377356804-127.0.0.1:40787_uj_tt-n_0000000000) [n:127.0.0.1:40787_uj_tt    ] o.a.s.c.o.ReplicaMutator Assigning new node to shard shard=shard1
   [junit4]   2> 1404531 INFO  (zkCallback-1494-thread-1-processing-n:127.0.0.1:40787_uj_tt) [n:127.0.0.1:40787_uj_tt    ] o.a.s.c.c.ZkStateReader A cluster state change: WatchedEvent state:SyncConnected type:NodeDataChanged path:/clusterstate.json, has occurred - updating... (live nodes size: 2)
   [junit4]   2> 1404531 INFO  (zkCallback-1500-thread-1-processing-n:127.0.0.1:39825_uj_tt) [n:127.0.0.1:39825_uj_tt    ] o.a.s.c.c.ZkStateReader A cluster state change: WatchedEvent state:SyncConnected type:NodeDataChanged path:/clusterstate.json, has occurred - updating... (live nodes size: 2)
   [junit4]   2> 1404531 INFO  (zkCallback-1496-thread-1) [    ] o.a.s.c.c.ZkStateReader A cluster state change: WatchedEvent state:SyncConnected type:NodeDataChanged path:/clusterstate.json, has occurred - updating... (live nodes size: 2)
   [junit4]   2> 1405428 INFO  (coreLoadExecutor-3586-thread-1-processing-n:127.0.0.1:39825_uj_tt) [n:127.0.0.1:39825_uj_tt c:collection1   x:collection1] o.a.s.c.ZkController waiting to find shard id in clusterstate for collection1
   [junit4]   2> 1405428 INFO  (coreLoadExecutor-3586-thread-1-processing-n:127.0.0.1:39825_uj_tt) [n:127.0.0.1:39825_uj_tt c:collection1   x:collection1] o.a.s.c.ZkController Check for collection zkNode:collection1
   [junit4]   2> 1405429 INFO  (coreLoadExecutor-3586-thread-1-processing-n:127.0.0.1:39825_uj_tt) [n:127.0.0.1:39825_uj_tt c:collection1   x:collection1] o.a.s.c.ZkController Collection zkNode exists
   [junit4]   2> 1405429 INFO  (coreLoadExecutor-3586-thread-1-processing-n:127.0.0.1:39825_uj_tt) [n:127.0.0.1:39825_uj_tt c:collection1   x:collection1] o.a.s.c.c.ZkStateReader Load collection config from:/collections/collection1
   [junit4]   2> 1405430 INFO  (coreLoadExecutor-3586-thread-1-processing-n:127.0.0.1:39825_uj_tt) [n:127.0.0.1:39825_uj_tt c:collection1   x:collection1] o.a.s.c.c.ZkStateReader path=/collections/collection1 configName=conf1 specified config exists in ZooKeeper
   [junit4]   2> 1405430 INFO  (coreLoadExecutor-3586-thread-1-processing-n:127.0.0.1:39825_uj_tt) [n:127.0.0.1:39825_uj_tt c:collection1   x:collection1] o.a.s.c.SolrResourceLoader new SolrResourceLoader for directory: '/x1/jenkins/jenkins-slave/workspace/Lucene-Solr-Tests-5.x-Java7/solr/build/solr-core/test/J0/temp/solr.cloud.HttpPartitionTest_180EEA8561E0762A-001/shard-1-001/cores/collection1/'
   [junit4]   2> 1405451 INFO  (coreLoadExecutor-3586-thread-1-processing-n:127.0.0.1:39825_uj_tt) [n:127.0.0.1:39825_uj_tt c:collection1   x:collection1] o.a.s.c.Config loaded config solrconfig.xml with version 0 
   [junit4]   2> 1405458 INFO  (coreLoadExecutor-3586-thread-1-processing-n:127.0.0.1:39825_uj_tt) [n:127.0.0.1:39825_uj_tt c:collection1   x:collection1] o.a.s.c.SolrConfig current version of requestparams : -1
   [junit4]   2> 1405472 INFO  (coreLoadExecutor-3586-thread-1-processing-n:127.0.0.1:39825_uj_tt) [n:127.0.0.1:39825_uj_tt c:collection1   x:collection1] o.a.s.c.SolrConfig Using Lucene MatchVersion: 5.4.0
   [junit4]   2> 1405504 INFO  (coreLoadExecutor-3586-thread-1-processing-n:127.0.0.1:39825_uj_tt) [n:127.0.0.1:39825_uj_tt c:collection1   x:collection1] o.a.s.c.Config Loaded SolrConfig: solrconfig.xml
   [junit4]   2> 1405508 INFO  (coreLoadExecutor-3586-thread-1-processing-n:127.0.0.1:39825_uj_tt) [n:127.0.0.1:39825_uj_tt c:collection1   x:collection1] o.a.s.s.IndexSchema Reading Solr Schema from /configs/conf1/schema.xml
   [junit4]   2> 1405515 INFO  (coreLoadExecutor-3586-thread-1-processing-n:127.0.0.1:39825_uj_tt) [n:127.0.0.1:39825_uj_tt c:collection1   x:collection1] o.a.s.s.IndexSchema [collection1] Schema name=test
   [junit4]   2> 1405815 INFO  (coreLoadExecutor-3586-thread-1-processing-n:127.0.0.1:39825_uj_tt) [n:127.0.0.1:39825_uj_tt c:collection1   x:collection1] o.a.s.s.OpenExchangeRatesOrgProvider Initialized with rates=open-exchange-rates.json, refreshInterval=1440.
   [junit4]   2> 1405824 INFO  (coreLoadExecutor-3586-thread-1-processing-n:127.0.0.1:39825_uj_tt) [n:127.0.0.1:39825_uj_tt c:collection1   x:collection1] o.a.s.s.IndexSchema default search field in schema is text
   [junit4]   2> 1405826 INFO  (coreLoadExecutor-3586-thread-1-processing-n:127.0.0.1:39825_uj_tt) [n:127.0.0.1:39825_uj_tt c:collection1   x:collection1] o.a.s.s.IndexSchema unique key field: id
   [junit4]   2> 1405837 INFO  (coreLoadExecutor-3586-thread-1-processing-n:127.0.0.1:39825_uj_tt) [n:127.0.0.1:39825_uj_tt c:collection1   x:collection1] o.a.s.s.FileExchangeRateProvider Reloading exchange rates from file currency.xml
   [junit4]   2> 1405840 INFO  (coreLoadExecutor-3586-thread-1-processing-n:127.0.0.1:39825_uj_tt) [n:127.0.0.1:39825_uj_tt c:collection1   x:collection1] o.a.s.s.FileExchangeRateProvider Reloading exchange rates from file currency.xml
   [junit4]   2> 1405843 INFO  (coreLoadExecutor-3586-thread-1-processing-n:127.0.0.1:39825_uj_tt) [n:127.0.0.1:39825_uj_tt c:collection1   x:collection1] o.a.s.s.OpenExchangeRatesOrgProvider Reloading exchange rates from open-exchange-rates.json
   [junit4]   2> 1405844 WARN  (coreLoadExecutor-3586-thread-1-processing-n:127.0.0.1:39825_uj_tt) [n:127.0.0.1:39825_uj_tt c:collection1   x:collection1] o.a.s.s.OpenExchangeRatesOrgProvider Unknown key IMPORTANT NOTE
   [junit4]   2> 1405844 WARN  (coreLoadExecutor-3586-thread-1-processing-n:127.0.0.1:39825_uj_tt) [n:127.0.0.1:39825_uj_tt c:collection1   x:collection1] o.a.s.s.OpenExchangeRatesOrgProvider Expected key, got STRING
   [junit4]   2> 1405845 INFO  (coreLoadExecutor-3586-thread-1-processing-n:127.0.0.1:39825_uj_tt) [n:127.0.0.1:39825_uj_tt c:collection1   x:collection1] o.a.s.s.OpenExchangeRatesOrgProvider Reloading exchange rates from open-exchange-rates.json
   [junit4]   2> 1405845 WARN  (coreLoadExecutor-3586-thread-1-processing-n:127.0.0.1:39825_uj_tt) [n:127.0.0.1:39825_uj_tt c:collection1   x:collection1] o.a.s.s.OpenExchangeRatesOrgProvider Unknown key IMPORTANT NOTE
   [junit4]   2> 1405846 WARN  (coreLoadExecutor-3586-thread-1-processing-n:127.0.0.1:39825_uj_tt) [n:127.0.0.1:39825_uj_tt c:collection1   x:collection1] o.a.s.s.OpenExchangeRatesOrgProvider Expected key, got STRING
   [junit4]   2> 1405847 INFO  (coreLoadExecutor-3586-thread-1-processing-n:127.0.0.1:39825_uj_tt) [n:127.0.0.1:39825_uj_tt c:collection1   x:collection1] o.a.s.c.ConfigSetProperties Did not find ConfigSet properties, assuming default properties: Can't find resource 'configsetprops.json' in classpath or '/configs/conf1', cwd=/x1/jenkins/jenkins-slave/workspace/Lucene-Solr-Tests-5.x-Java7/solr/build/solr-core/test/J0
   [junit4]   2> 1405847 INFO  (coreLoadExecutor-3586-thread-1-processing-n:127.0.0.1:39825_uj_tt) [n:127.0.0.1:39825_uj_tt c:collection1   x:collection1] o.a.s.c.CoreContainer Creating SolrCore 'collection1' using configuration from collection collection1
   [junit4]   2> 1405847 INFO  (coreLoadExecutor-3586-thread-1-processing-n:127.0.0.1:39825_uj_tt) [n:127.0.0.1:39825_uj_tt c:collection1 s:shard1 r:core_node1 x:collection1] o.a.s.c.SolrCore org.apache.solr.core.MockDirectoryFactory
   [junit4]   2> 1405847 INFO  (coreLoadExecutor-3586-thread-1-processing-n:127.0.0.1:39825_uj_tt) [n:127.0.0.1:39825_uj_tt c:collection1 s:shard1 r:core_node1 x:collection1] o.a.s.c.SolrCore [[collection1] ] Opening new SolrCore at [/x1/jenkins/jenkins-slave/workspace/Lucene-Solr-Tests-5.x-Java7/solr/build/solr-core/test/J0/temp/solr.cloud.HttpPartitionTest_180EEA8561E0762A-001/shard-1-001/cores/collection1/], dataDir=[null]
   [junit4]   2> 1405848 INFO  (coreLoadExecutor-3586-thread-1-processing-n:127.0.0.1:39825_uj_tt) [n:127.0.0.1:39825_uj_tt c:collection1 s:shard1 r:core_node1 x:collection1] o.a.s.c.JmxMonitoredMap JMX monitoring is enabled. Adding Solr mbeans to JMX Server: com.sun.jmx.mbeanserver.JmxMBeanServer@1139529f
   [junit4]   2> 1405848 INFO  (coreLoadExecutor-3586-thread-1-processing-n:127.0.0.1:39825_uj_tt) [n:127.0.0.1:39825_uj_tt c:collection1 s:shard1 r:core_node1 x:collection1] o.a.s.c.CachingDirectoryFactory return new directory for /x1/jenkins/jenkins-slave/workspace/Lucene-Solr-Tests-5.x-Java7/solr/build/solr-core/test/J0/temp/solr.cloud.HttpPartitionTest_180EEA8561E0762A-001/shard-1-001/cores/collection1/data
   [junit4]   2> 1405848 INFO  (coreLoadExecutor-3586-thread-1-processing-n:127.0.0.1:39825_uj_tt) [n:127.0.0.1:39825_uj_tt c:collection1 s:shard1 r:core_node1 x:collection1] o.a.s.c.SolrCore New index directory detected: old=null new=/x1/jenkins/jenkins-slave/workspace/Lucene-Solr-Tests-5.x-Java7/solr/build/solr-core/test/J0/temp/solr.cloud.HttpPartitionTest_180EEA8561E0762A-001/shard-1-001/cores/collection1/data/index/
   [junit4]   2> 1405849 WARN  (coreLoadExecutor-3586-thread-1-processing-n:127.0.0.1:39825_uj_tt) [n:127.0.0.1:39825_uj_tt c:collection1 s:shard1 r:core_node1 x:collection1] o.a.s.c.SolrCore [collection1] Solr index directory '/x1/jenkins/jenkins-slave/workspace/Lucene-Solr-Tests-5.x-Java7/solr/build/solr-core/test/J0/temp/solr.cloud.HttpPartitionTest_180EEA8561E0762A-001/shard-1-001/cores/collection1/data/index' doesn't exist. Creating new index...
   [junit4]   2> 1405849 INFO  (coreLoadExecutor-3586-thread-1-processing-n:127.0.0.1:39825_uj_tt) [n:127.0.0.1:39825_uj_tt c:collection1 s:shard1 r:core_node1 x:collection1] o.a.s.c.CachingDirectoryFactory return new directory for /x1/jenkins/jenkins-slave/workspace/Lucene-Solr-Tests-5.x-Java7/solr/build/solr-core/test/J0/temp/solr.cloud.HttpPartitionTest_180EEA8561E0762A-001/shard-1-001/cores/collection1/data/index
   [junit4]   2> 1405849 INFO  (coreLoadExecutor-3586-thread-1-processing-n:127.0.0.1:39825_uj_tt) [n:127.0.0.1:39825_uj_tt c:collection1 s:shard1 r:core_node1 x:collection1] o.a.s.u.RandomMergePolicy RandomMergePolicy wrapping class org.apache.lucene.index.TieredMergePolicy: [TieredMergePolicy: maxMergeAtOnce=26, maxMergeAtOnceExplicit=40, maxMergedSegmentMB=95.7158203125, floorSegmentMB=1.46484375, forceMergeDeletesPctAllowed=1.0379023364357898, segmentsPerTier=15.0, maxCFSSegmentSizeMB=8.796093022207999E12, noCFSRatio=1.0
   [junit4]   2> 1405850 INFO  (coreLoadExecutor-3586-thread-1-processing-n:127.0.0.1:39825_uj_tt) [n:127.0.0.1:39825_uj_tt c:collection1 s:shard1 r:core_node1 x:collection1] o.a.s.c.SolrCore SolrDeletionPolicy.onCommit: commits: num=1
   [junit4]   2> 	commit{dir=MockDirectoryWrapper(RAMDirectory@736a66f8 lockFactory=org.apache.lucene.store.SingleInstanceLockFactory@4e8e5efa),segFN=segments_1,generation=1}
   [junit4]   2> 1405850 INFO  (coreLoadExecutor-3586-thread-1-processing-n:127.0.0.1:39825_uj_tt) [n:127.0.0.1:39825_uj_tt c:collection1 s:shard1 r:core_node1 x:collection1] o.a.s.c.SolrCore newest commit generation = 1
   [junit4]   2> 1405851 INFO  (OldIndexDirectoryCleanupThreadForCore-collection1) [n:127.0.0.1:39825_uj_tt c:collection1 s:shard1 r:core_node1 x:collection1] o.a.s.c.SolrCore Looking for old index directories to cleanup for core collection1 in /x1/jenkins/jenkins-slave/workspace/Lucene-Solr-Tests-5.x-Java7/solr/build/solr-core/test/J0/temp/solr.cloud.HttpPartitionTest_180EEA8561E0762A-001/shard-1-001/cores/collection1/data/
   [junit4]   2> 1405851 WARN  (OldIndexDirectoryCleanupThreadForCore-collection1) [n:127.0.0.1:39825_uj_tt c:collection1 s:shard1 r:core_node1 x:collection1] o.a.s.c.DirectoryFactory /x1/jenkins/jenkins-slave/workspace/Lucene-Solr-Tests-5.x-Java7/solr/build/solr-core/test/J0/temp/solr.cloud.HttpPartitionTest_180EEA8561E0762A-001/shard-1-001/cores/collection1/data/ does not point to a valid data directory; skipping clean-up of old index directories.
   [junit4]   2> 1405856 INFO  (coreLoadExecutor-3586-thread-1-processing-n:127.0.0.1:39825_uj_tt) [n:127.0.0.1:39825_uj_tt c:collection1 s:shard1 r:core_node1 x:collection1] o.a.s.u.p.UpdateRequestProcessorChain creating updateRequestProcessorChain "nodistrib"
   [junit4]   2> 1405856 INFO  (coreLoadExecutor-3586-thread-1-processing-n:127.0.0.1:39825_uj_tt) [n:127.0.0.1:39825_uj_tt c:collection1 s:shard1 r:core_node1 x:collection1] o.a.s.u.p.UpdateRequestProcessorChain creating updateRequestProcessorChain "dedupe"
   [junit4]   2> 1405857 INFO  (coreLoadExecutor-3586-thread-1-processing-n:127.0.0.1:39825_uj_tt) [n:127.0.0.1:39825_uj_tt c:collection1 s:shard1 r:core_node1 x:collection1] o.a.s.u.p.UpdateRequestProcessorChain inserting DistributedUpdateProcessorFactory into updateRequestProcessorChain "dedupe"
   [junit4]   2> 1405857 INFO  (coreLoadExecutor-3586-thread-1-processing-n:127.0.0.1:39825_uj_tt) [n:127.0.0.1:39825_uj_tt c:collection1 s:shard1 r:core_node1 x:collection1] o.a.s.u.p.UpdateRequestProcessorChain creating updateRequestProcessorChain "stored_sig"
   [junit4]   2> 1405857 INFO  (coreLoadExecutor-3586-thread-1-processing-n:127.0.0.1:39825_uj_tt) [n:127.0.0.1:39825_uj_tt c:collection1 s:shard1 r:core_node1 x:collection1] o.a.s.u.p.UpdateRequestProcessorChain inserting DistributedUpdateProcessorFactory into updateRequestProcessorChain "stored_sig"
   [junit4]   2> 1405857 INFO  (coreLoadExecutor-3586-thread-1-processing-n:127.0.0.1:39825_uj_tt) [n:127.0.0.1:39825_uj_tt c:collection1 s:shard1 r:core_node1 x:collection1] o.a.s.u.p.UpdateRequestProcessorChain creating updateRequestProcessorChain "distrib-dup-test-chain-explicit"
   [junit4]   2> 1405858 INFO  (coreLoadExecutor-3586-thread-1-processing-n:127.0.0.1:39825_uj_tt) [n:127.0.0.1:39825_uj_tt c:collection1 s:shard1 r:core_node1 x:collection1] o.a.s.u.p.UpdateRequestProcessorChain creating updateRequestProcessorChain "distrib-dup-test-chain-implicit"
   [junit4]   2> 1405858 INFO  (coreLoadExecutor-3586-thread-1-processing-n:127.0.0.1:39825_uj_tt) [n:127.0.0.1:39825_uj_tt c:collection1 s:shard1 r:core_node1 x:collection1] o.a.s.u.p.UpdateRequestProcessorChain inserting DistributedUpdateProcessorFactory into updateRequestProcessorChain "distrib-dup-test-chain-implicit"
   [junit4]   2> 1405858 INFO  (coreLoadExecutor-3586-thread-1-processing-n:127.0.0.1:39825_uj_tt) [n:127.0.0.1:39825_uj_tt c:collection1 s:shard1 r:core_node1 x:collection1] o.a.s.c.SolrCore no updateRequestProcessorChain defined as default, creating implicit default
   [junit4]   2> 1405861 INFO  (coreLoadExecutor-3586-thread-1-processing-n:127.0.0.1:39825_uj_tt) [n:127.0.0.1:39825_uj_tt c:collection1 s:shard1 r:core_node1 x:collection1] o.a.s.h.l.XMLLoader xsltCacheLifetimeSeconds=60
   [junit4]   2> 1405863 INFO  (coreLoadExecutor-3586-thread-1-processing-n:127.0.0.1:39825_uj_tt) [n:127.0.0.1:39825_uj_tt c:collection1 s:shard1 r:core_node1 x:collection1] o.a.s.h.l.XMLLoader xsltCacheLifetimeSeconds=60
   [junit4]   2> 1405864 INFO  (coreLoadExecutor-3586-thread-1-processing-n:127.0.0.1:39825_uj_tt) [n:127.0.0.1:39825_uj_tt c:collection1 s:shard1 r:core_node1 x:collection1

[...truncated too long message...]

rocessor.java:51)
   [junit4]   2> 	at org.apache.solr.update.processor.DistributedUpdateProcessor.doLocalAdd(DistributedUpdateProcessor.java:954)
   [junit4]   2> 	at org.apache.solr.update.processor.DistributedUpdateProcessor.versionAdd(DistributedUpdateProcessor.java:1109)
   [junit4]   2> 	at org.apache.solr.update.processor.DistributedUpdateProcessor.processAdd(DistributedUpdateProcessor.java:705)
   [junit4]   2> 	at org.apache.solr.update.processor.LogUpdateProcessor.processAdd(LogUpdateProcessorFactory.java:104)
   [junit4]   2> 	at org.apache.solr.handler.loader.JavabinLoader$1.update(JavabinLoader.java:101)
   [junit4]   2> 	at org.apache.solr.client.solrj.request.JavaBinUpdateRequestCodec$1.readOuterMostDocIterator(JavaBinUpdateRequestCodec.java:179)
   [junit4]   2> 	at org.apache.solr.client.solrj.request.JavaBinUpdateRequestCodec$1.readIterator(JavaBinUpdateRequestCodec.java:135)
   [junit4]   2> 	at org.apache.solr.common.util.JavaBinCodec.readVal(JavaBinCodec.java:249)
   [junit4]   2> 	at org.apache.solr.client.solrj.request.JavaBinUpdateRequestCodec$1.readNamedList(JavaBinUpdateRequestCodec.java:121)
   [junit4]   2> 	at org.apache.solr.common.util.JavaBinCodec.readVal(JavaBinCodec.java:214)
   [junit4]   2> 	at org.apache.solr.common.util.JavaBinCodec.unmarshal(JavaBinCodec.java:134)
   [junit4]   2> 	at org.apache.solr.client.solrj.request.JavaBinUpdateRequestCodec.unmarshal(JavaBinUpdateRequestCodec.java:186)
   [junit4]   2> 	at org.apache.solr.handler.loader.JavabinLoader.parseAndLoadDocs(JavabinLoader.java:111)
   [junit4]   2> 	at org.apache.solr.handler.loader.JavabinLoader.load(JavabinLoader.java:58)
   [junit4]   2> 	at org.apache.solr.handler.UpdateRequestHandler$1.load(UpdateRequestHandler.java:98)
   [junit4]   2> 	at org.apache.solr.handler.ContentStreamHandlerBase.handleRequestBody(ContentStreamHandlerBase.java:74)
   [junit4]   2> 	at org.apache.solr.handler.RequestHandlerBase.handleRequest(RequestHandlerBase.java:151)
   [junit4]   2> 	at org.apache.solr.core.SolrCore.execute(SolrCore.java:2079)
   [junit4]   2> 	at org.apache.solr.servlet.HttpSolrCall.execute(HttpSolrCall.java:667)
   [junit4]   2> 	at org.apache.solr.servlet.HttpSolrCall.call(HttpSolrCall.java:460)
   [junit4]   2> 	at org.apache.solr.servlet.SolrDispatchFilter.doFilter(SolrDispatchFilter.java:210)
   [junit4]   2> 	at org.apache.solr.servlet.SolrDispatchFilter.doFilter(SolrDispatchFilter.java:179)
   [junit4]   2> 	at org.eclipse.jetty.servlet.ServletHandler$CachedChain.doFilter(ServletHandler.java:1652)
   [junit4]   2> 	at org.apache.solr.client.solrj.embedded.JettySolrRunner$DebugFilter.doFilter(JettySolrRunner.java:106)
   [junit4]   2> 	at org.eclipse.jetty.servlet.ServletHandler$CachedChain.doFilter(ServletHandler.java:1652)
   [junit4]   2> 	at org.eclipse.jetty.servlets.UserAgentFilter.doFilter(UserAgentFilter.java:83)
   [junit4]   2> 	at org.eclipse.jetty.servlets.GzipFilter.doFilter(GzipFilter.java:300)
   [junit4]   2> 	at org.eclipse.jetty.servlet.ServletHandler$CachedChain.doFilter(ServletHandler.java:1652)
   [junit4]   2> 	at org.eclipse.jetty.servlet.ServletHandler.doHandle(ServletHandler.java:585)
   [junit4]   2> 	at org.eclipse.jetty.server.session.SessionHandler.doHandle(SessionHandler.java:221)
   [junit4]   2> 	at org.eclipse.jetty.server.handler.ContextHandler.doHandle(ContextHandler.java:1127)
   [junit4]   2> 	at org.eclipse.jetty.servlet.ServletHandler.doScope(ServletHandler.java:515)
   [junit4]   2> 	at org.eclipse.jetty.server.session.SessionHandler.doScope(SessionHandler.java:185)
   [junit4]   2> 	at org.eclipse.jetty.server.handler.ContextHandler.doScope(ContextHandler.java:1061)
   [junit4]   2> 	at org.eclipse.jetty.server.handler.ScopedHandler.handle(ScopedHandler.java:141)
   [junit4]   2> 	at org.eclipse.jetty.server.handler.HandlerWrapper.handle(HandlerWrapper.java:97)
   [junit4]   2> 	at org.eclipse.jetty.server.Server.handle(Server.java:499)
   [junit4]   2> 	at org.eclipse.jetty.server.HttpChannel.handle(HttpChannel.java:310)
   [junit4]   2> 	at org.eclipse.jetty.server.HttpConnection.onFillable(HttpConnection.java:257)
   [junit4]   2> 	at org.eclipse.jetty.io.AbstractConnection$2.run(AbstractConnection.java:540)
   [junit4]   2> 	at org.eclipse.jetty.util.thread.QueuedThreadPool.runJob(QueuedThreadPool.java:635)
   [junit4]   2> 	at org.eclipse.jetty.util.thread.QueuedThreadPool$3.run(QueuedThreadPool.java:555)
   [junit4]   2> 	at java.lang.Thread.run(Thread.java:745)
   [junit4]   2> 
   [junit4]   2> NOTE: test params are: codec=DummyCompressingStoredFields(storedFieldsFormat=CompressingStoredFieldsFormat(compressionMode=DUMMY, chunkSize=6, maxDocsPerChunk=753, blockSize=2), termVectorsFormat=CompressingTermVectorsFormat(compressionMode=DUMMY, chunkSize=6, blockSize=2)), sim=DefaultSimilarity, locale=sr_ME_#Latn, timezone=SystemV/YST9
   [junit4]   2> NOTE: Linux 3.13.0-52-generic amd64/Oracle Corporation 1.7.0_72 (64-bit)/cpus=4,threads=1,free=77210080,total=527433728
   [junit4]   2> NOTE: All tests run in this JVM: [AlternateDirectoryTest, DistribCursorPagingTest, TestManagedStopFilterFactory, XsltUpdateRequestHandlerTest, MigrateRouteKeyTest, BJQParserTest, SmileWriterTest, TestFieldSortValues, ConcurrentDeleteAndCreateCollectionTest, TestPseudoReturnFields, OverseerTaskQueueTest, SOLR749Test, TestDistributedSearch, TimeZoneUtilsTest, TestRealTimeGet, TestConfig, AnalysisErrorHandlingTest, JavabinLoaderTest, LeaderInitiatedRecoveryOnCommitTest, TestDocumentBuilder, DeleteLastCustomShardedReplicaTest, SolrRequestParserTest, BigEndianAscendingWordSerializerTest, TestExactStatsCache, DisMaxRequestHandlerTest, CurrencyFieldOpenExchangeTest, TestMergePolicyConfig, VMParamsZkACLAndCredentialsProvidersTest, SecurityConfHandlerTest, SignatureUpdateProcessorFactoryTest, DocValuesMissingTest, TestSolr4Spatial, TestRandomFaceting, AddBlockUpdateTest, TestSolrDynamicMBean, ReturnFieldsTest, VersionInfoTest, RequiredFieldsTest, DefaultValueUpdateProcessorTest, CopyFieldTest, TestReloadAndDeleteDocs, TestFieldTypeCollectionResource, TestSolrCloudWithKerberosAlt, TestCloudManagedSchemaConcurrent, TestHdfsUpdateLog, TestRawResponseWriter, TestFreeTextSuggestions, TestRequestStatusCollectionAPI, DistributedSpellCheckComponentTest, AnalyticsMergeStrategyTest, LeaderElectionIntegrationTest, SuggestComponentTest, DocumentAnalysisRequestHandlerTest, SpatialRPTFieldTypeTest, SolrCoreTest, TestMaxScoreQueryParser, CollectionsAPIAsyncDistributedZkTest, OutputWriterTest, TestPhraseSuggestions, ShardSplitTest, BasicZkTest, TestDocSet, TestBinaryField, DistributedDebugComponentTest, RequestLoggingTest, TestRemoteStreaming, QueryEqualityTest, TestFunctionQuery, PathHierarchyTokenizerFactoryTest, TestCSVLoader, DateMathParserTest, PeerSyncTest, TestHighlightDedupGrouping, TestConfigSets, TestSolrCLIRunExample, StandardRequestHandlerTest, TestFaceting, SimpleCollectionCreateDeleteTest, TestLazyCores, TestCollectionAPI, TestConfigReload, FileBasedSpellCheckerTest, TestIntervalFaceting, FullHLLTest, ResponseHeaderTest, TestLuceneMatchVersion, SpellCheckComponentTest, BadIndexSchemaTest, BasicFunctionalityTest, TestBadConfig, ShowFileRequestHandlerTest, CurrencyFieldXmlFileTest, SimplePostToolTest, AnalysisAfterCoreReloadTest, CoreAdminHandlerTest, TestStressLucene, FieldMutatingUpdateProcessorTest, TestAtomicUpdateErrorCases, DistanceFunctionTest, LukeRequestHandlerTest, TestOmitPositions, RequestHandlersTest, TestValueSourceCache, IndexSchemaRuntimeFieldTest, SolrPluginUtilsTest, JSONWriterTest, TestAnalyzedSuggestions, TestPHPSerializedResponseWriter, TestComponentsName, TestLFUCache, TestSimpleTrackingShardHandler, TestJettySolrRunner, AliasIntegrationTest, DeleteReplicaTest, DeleteShardTest, HttpPartitionTest]
   [junit4]   2> NOTE: reproduce with: ant test  -Dtestcase=HttpPartitionTest -Dtests.seed=180EEA8561E0762A -Dtests.multiplier=2 -Dtests.slow=true -Dtests.locale=sr_ME_#Latn -Dtests.timezone=SystemV/YST9 -Dtests.asserts=true -Dtests.file.encoding=US-ASCII
   [junit4] ERROR   0.00s J0 | HttpPartitionTest (suite) <<<
   [junit4]    > Throwable #1: java.lang.AssertionError: ObjectTracker found 1 object(s) that were not released!!! [TransactionLog]
   [junit4]    > 	at __randomizedtesting.SeedInfo.seed([180EEA8561E0762A]:0)
   [junit4]    > 	at org.apache.solr.SolrTestCaseJ4.afterClass(SolrTestCaseJ4.java:236)
   [junit4]    > 	at java.lang.Thread.run(Thread.java:745)
   [junit4] Completed [404/536] on J0 in 139.34s, 1 test, 1 failure <<< FAILURES!

[...truncated 429 lines...]
BUILD FAILED
/x1/jenkins/jenkins-slave/workspace/Lucene-Solr-Tests-5.x-Java7/build.xml:785: The following error occurred while executing this line:
/x1/jenkins/jenkins-slave/workspace/Lucene-Solr-Tests-5.x-Java7/build.xml:729: The following error occurred while executing this line:
/x1/jenkins/jenkins-slave/workspace/Lucene-Solr-Tests-5.x-Java7/build.xml:59: The following error occurred while executing this line:
/x1/jenkins/jenkins-slave/workspace/Lucene-Solr-Tests-5.x-Java7/solr/build.xml:233: The following error occurred while executing this line:
/x1/jenkins/jenkins-slave/workspace/Lucene-Solr-Tests-5.x-Java7/solr/common-build.xml:524: The following error occurred while executing this line:
/x1/jenkins/jenkins-slave/workspace/Lucene-Solr-Tests-5.x-Java7/lucene/common-build.xml:1452: The following error occurred while executing this line:
/x1/jenkins/jenkins-slave/workspace/Lucene-Solr-Tests-5.x-Java7/lucene/common-build.xml:1006: There were test failures: 536 suites, 2128 tests, 1 suite-level error, 47 ignored (35 assumptions)

Total time: 57 minutes 3 seconds
Build step 'Invoke Ant' marked build as failure
Archiving artifacts
Sending artifact delta relative to Lucene-Solr-Tests-5.x-Java7 #3458
Archived 4 artifacts
Archive block size is 32768
Received 0 blocks and 303044123 bytes
Compression is 0.0%
Took 52 sec
Recording test results
Email was triggered for: Failure
Sending email for trigger: Failure



Mime
View raw message