lucene-dev mailing list archives

Site index · List index
Message view « Date » · « Thread »
Top « Date » · « Thread »
From Policeman Jenkins Server <jenk...@thetaphi.de>
Subject [JENKINS] Lucene-Solr-5.x-Linux (64bit/jdk1.8.0_51) - Build # 13646 - Failure!
Date Tue, 18 Aug 2015 08:16:04 GMT
Build: http://jenkins.thetaphi.de/job/Lucene-Solr-5.x-Linux/13646/
Java: 64bit/jdk1.8.0_51 -XX:+UseCompressedOops -XX:+UseSerialGC

1 tests failed.
FAILED:  junit.framework.TestSuite.org.apache.solr.cloud.HttpPartitionTest

Error Message:
ObjectTracker found 1 object(s) that were not released!!! [TransactionLog]

Stack Trace:
java.lang.AssertionError: ObjectTracker found 1 object(s) that were not released!!! [TransactionLog]
	at __randomizedtesting.SeedInfo.seed([48AAE2F144024F8]:0)
	at org.junit.Assert.fail(Assert.java:93)
	at org.junit.Assert.assertTrue(Assert.java:43)
	at org.junit.Assert.assertNull(Assert.java:551)
	at org.apache.solr.SolrTestCaseJ4.afterClass(SolrTestCaseJ4.java:236)
	at sun.reflect.GeneratedMethodAccessor34.invoke(Unknown Source)
	at sun.reflect.DelegatingMethodAccessorImpl.invoke(DelegatingMethodAccessorImpl.java:43)
	at java.lang.reflect.Method.invoke(Method.java:497)
	at com.carrotsearch.randomizedtesting.RandomizedRunner.invoke(RandomizedRunner.java:1627)
	at com.carrotsearch.randomizedtesting.RandomizedRunner$5.evaluate(RandomizedRunner.java:799)
	at com.carrotsearch.randomizedtesting.rules.StatementAdapter.evaluate(StatementAdapter.java:36)
	at com.carrotsearch.randomizedtesting.rules.SystemPropertiesRestoreRule$1.evaluate(SystemPropertiesRestoreRule.java:57)
	at org.apache.lucene.util.AbstractBeforeAfterRule$1.evaluate(AbstractBeforeAfterRule.java:46)
	at com.carrotsearch.randomizedtesting.rules.StatementAdapter.evaluate(StatementAdapter.java:36)
	at org.apache.lucene.util.TestRuleStoreClassName$1.evaluate(TestRuleStoreClassName.java:42)
	at com.carrotsearch.randomizedtesting.rules.NoShadowingOrOverridesOnMethodsRule$1.evaluate(NoShadowingOrOverridesOnMethodsRule.java:39)
	at com.carrotsearch.randomizedtesting.rules.NoShadowingOrOverridesOnMethodsRule$1.evaluate(NoShadowingOrOverridesOnMethodsRule.java:39)
	at com.carrotsearch.randomizedtesting.rules.StatementAdapter.evaluate(StatementAdapter.java:36)
	at com.carrotsearch.randomizedtesting.rules.StatementAdapter.evaluate(StatementAdapter.java:36)
	at com.carrotsearch.randomizedtesting.rules.StatementAdapter.evaluate(StatementAdapter.java:36)
	at org.apache.lucene.util.TestRuleAssertionsRequired$1.evaluate(TestRuleAssertionsRequired.java:54)
	at org.apache.lucene.util.TestRuleMarkFailure$1.evaluate(TestRuleMarkFailure.java:48)
	at org.apache.lucene.util.TestRuleIgnoreAfterMaxFailures$1.evaluate(TestRuleIgnoreAfterMaxFailures.java:65)
	at org.apache.lucene.util.TestRuleIgnoreTestSuites$1.evaluate(TestRuleIgnoreTestSuites.java:55)
	at com.carrotsearch.randomizedtesting.rules.StatementAdapter.evaluate(StatementAdapter.java:36)
	at com.carrotsearch.randomizedtesting.ThreadLeakControl$StatementRunner.run(ThreadLeakControl.java:365)
	at java.lang.Thread.run(Thread.java:745)




Build Log:
[...truncated 10438 lines...]
   [junit4] Suite: org.apache.solr.cloud.HttpPartitionTest
   [junit4]   2> Creating dataDir: /home/jenkins/workspace/Lucene-Solr-5.x-Linux/solr/build/solr-core/test/J1/temp/solr.cloud.HttpPartitionTest_48AAE2F144024F8-001/init-core-data-001
   [junit4]   2> 748343 INFO  (SUITE-HttpPartitionTest-seed#[48AAE2F144024F8]-worker) [    ] o.a.s.BaseDistributedSearchTestCase Setting hostContext system property: /
   [junit4]   2> 748345 INFO  (TEST-HttpPartitionTest.test-seed#[48AAE2F144024F8]) [    ] o.a.s.c.ZkTestServer STARTING ZK TEST SERVER
   [junit4]   2> 748345 INFO  (Thread-2478) [    ] o.a.s.c.ZkTestServer client port:0.0.0.0/0.0.0.0:0
   [junit4]   2> 748345 INFO  (Thread-2478) [    ] o.a.s.c.ZkTestServer Starting server
   [junit4]   2> 748445 INFO  (TEST-HttpPartitionTest.test-seed#[48AAE2F144024F8]) [    ] o.a.s.c.ZkTestServer start zk server on port:52110
   [junit4]   2> 748446 INFO  (TEST-HttpPartitionTest.test-seed#[48AAE2F144024F8]) [    ] o.a.s.c.c.SolrZkClient Using default ZkCredentialsProvider
   [junit4]   2> 748446 INFO  (TEST-HttpPartitionTest.test-seed#[48AAE2F144024F8]) [    ] o.a.s.c.c.ConnectionManager Waiting for client to connect to ZooKeeper
   [junit4]   2> 748448 INFO  (zkCallback-1700-thread-1) [    ] o.a.s.c.c.ConnectionManager Watcher org.apache.solr.common.cloud.ConnectionManager@ab28106 name:ZooKeeperConnection Watcher:127.0.0.1:52110 got event WatchedEvent state:SyncConnected type:None path:null path:null type:None
   [junit4]   2> 748448 INFO  (TEST-HttpPartitionTest.test-seed#[48AAE2F144024F8]) [    ] o.a.s.c.c.ConnectionManager Client is connected to ZooKeeper
   [junit4]   2> 748448 INFO  (TEST-HttpPartitionTest.test-seed#[48AAE2F144024F8]) [    ] o.a.s.c.c.SolrZkClient Using default ZkACLProvider
   [junit4]   2> 748448 INFO  (TEST-HttpPartitionTest.test-seed#[48AAE2F144024F8]) [    ] o.a.s.c.c.SolrZkClient makePath: /solr
   [junit4]   2> 748450 INFO  (TEST-HttpPartitionTest.test-seed#[48AAE2F144024F8]) [    ] o.a.s.c.c.SolrZkClient Using default ZkCredentialsProvider
   [junit4]   2> 748450 INFO  (TEST-HttpPartitionTest.test-seed#[48AAE2F144024F8]) [    ] o.a.s.c.c.ConnectionManager Waiting for client to connect to ZooKeeper
   [junit4]   2> 748452 INFO  (zkCallback-1701-thread-1) [    ] o.a.s.c.c.ConnectionManager Watcher org.apache.solr.common.cloud.ConnectionManager@4355da00 name:ZooKeeperConnection Watcher:127.0.0.1:52110/solr got event WatchedEvent state:SyncConnected type:None path:null path:null type:None
   [junit4]   2> 748452 INFO  (TEST-HttpPartitionTest.test-seed#[48AAE2F144024F8]) [    ] o.a.s.c.c.ConnectionManager Client is connected to ZooKeeper
   [junit4]   2> 748452 INFO  (TEST-HttpPartitionTest.test-seed#[48AAE2F144024F8]) [    ] o.a.s.c.c.SolrZkClient Using default ZkACLProvider
   [junit4]   2> 748452 INFO  (TEST-HttpPartitionTest.test-seed#[48AAE2F144024F8]) [    ] o.a.s.c.c.SolrZkClient makePath: /collections/collection1
   [junit4]   2> 748453 INFO  (TEST-HttpPartitionTest.test-seed#[48AAE2F144024F8]) [    ] o.a.s.c.c.SolrZkClient makePath: /collections/collection1/shards
   [junit4]   2> 748454 INFO  (TEST-HttpPartitionTest.test-seed#[48AAE2F144024F8]) [    ] o.a.s.c.c.SolrZkClient makePath: /collections/control_collection
   [junit4]   2> 748454 INFO  (TEST-HttpPartitionTest.test-seed#[48AAE2F144024F8]) [    ] o.a.s.c.c.SolrZkClient makePath: /collections/control_collection/shards
   [junit4]   2> 748455 INFO  (TEST-HttpPartitionTest.test-seed#[48AAE2F144024F8]) [    ] o.a.s.c.AbstractZkTestCase put /home/jenkins/workspace/Lucene-Solr-5.x-Linux/solr/core/src/test-files/solr/collection1/conf/solrconfig-tlog.xml to /configs/conf1/solrconfig.xml
   [junit4]   2> 748455 INFO  (TEST-HttpPartitionTest.test-seed#[48AAE2F144024F8]) [    ] o.a.s.c.c.SolrZkClient makePath: /configs/conf1/solrconfig.xml
   [junit4]   2> 748457 INFO  (TEST-HttpPartitionTest.test-seed#[48AAE2F144024F8]) [    ] o.a.s.c.AbstractZkTestCase put /home/jenkins/workspace/Lucene-Solr-5.x-Linux/solr/core/src/test-files/solr/collection1/conf/schema.xml to /configs/conf1/schema.xml
   [junit4]   2> 748457 INFO  (TEST-HttpPartitionTest.test-seed#[48AAE2F144024F8]) [    ] o.a.s.c.c.SolrZkClient makePath: /configs/conf1/schema.xml
   [junit4]   2> 748458 INFO  (TEST-HttpPartitionTest.test-seed#[48AAE2F144024F8]) [    ] o.a.s.c.AbstractZkTestCase put /home/jenkins/workspace/Lucene-Solr-5.x-Linux/solr/core/src/test-files/solr/collection1/conf/solrconfig.snippet.randomindexconfig.xml to /configs/conf1/solrconfig.snippet.randomindexconfig.xml
   [junit4]   2> 748458 INFO  (TEST-HttpPartitionTest.test-seed#[48AAE2F144024F8]) [    ] o.a.s.c.c.SolrZkClient makePath: /configs/conf1/solrconfig.snippet.randomindexconfig.xml
   [junit4]   2> 748459 INFO  (TEST-HttpPartitionTest.test-seed#[48AAE2F144024F8]) [    ] o.a.s.c.AbstractZkTestCase put /home/jenkins/workspace/Lucene-Solr-5.x-Linux/solr/core/src/test-files/solr/collection1/conf/stopwords.txt to /configs/conf1/stopwords.txt
   [junit4]   2> 748459 INFO  (TEST-HttpPartitionTest.test-seed#[48AAE2F144024F8]) [    ] o.a.s.c.c.SolrZkClient makePath: /configs/conf1/stopwords.txt
   [junit4]   2> 748460 INFO  (TEST-HttpPartitionTest.test-seed#[48AAE2F144024F8]) [    ] o.a.s.c.AbstractZkTestCase put /home/jenkins/workspace/Lucene-Solr-5.x-Linux/solr/core/src/test-files/solr/collection1/conf/protwords.txt to /configs/conf1/protwords.txt
   [junit4]   2> 748460 INFO  (TEST-HttpPartitionTest.test-seed#[48AAE2F144024F8]) [    ] o.a.s.c.c.SolrZkClient makePath: /configs/conf1/protwords.txt
   [junit4]   2> 748461 INFO  (TEST-HttpPartitionTest.test-seed#[48AAE2F144024F8]) [    ] o.a.s.c.AbstractZkTestCase put /home/jenkins/workspace/Lucene-Solr-5.x-Linux/solr/core/src/test-files/solr/collection1/conf/currency.xml to /configs/conf1/currency.xml
   [junit4]   2> 748461 INFO  (TEST-HttpPartitionTest.test-seed#[48AAE2F144024F8]) [    ] o.a.s.c.c.SolrZkClient makePath: /configs/conf1/currency.xml
   [junit4]   2> 748462 INFO  (TEST-HttpPartitionTest.test-seed#[48AAE2F144024F8]) [    ] o.a.s.c.AbstractZkTestCase put /home/jenkins/workspace/Lucene-Solr-5.x-Linux/solr/core/src/test-files/solr/collection1/conf/enumsConfig.xml to /configs/conf1/enumsConfig.xml
   [junit4]   2> 748462 INFO  (TEST-HttpPartitionTest.test-seed#[48AAE2F144024F8]) [    ] o.a.s.c.c.SolrZkClient makePath: /configs/conf1/enumsConfig.xml
   [junit4]   2> 748463 INFO  (TEST-HttpPartitionTest.test-seed#[48AAE2F144024F8]) [    ] o.a.s.c.AbstractZkTestCase put /home/jenkins/workspace/Lucene-Solr-5.x-Linux/solr/core/src/test-files/solr/collection1/conf/open-exchange-rates.json to /configs/conf1/open-exchange-rates.json
   [junit4]   2> 748463 INFO  (TEST-HttpPartitionTest.test-seed#[48AAE2F144024F8]) [    ] o.a.s.c.c.SolrZkClient makePath: /configs/conf1/open-exchange-rates.json
   [junit4]   2> 748463 INFO  (TEST-HttpPartitionTest.test-seed#[48AAE2F144024F8]) [    ] o.a.s.c.AbstractZkTestCase put /home/jenkins/workspace/Lucene-Solr-5.x-Linux/solr/core/src/test-files/solr/collection1/conf/mapping-ISOLatin1Accent.txt to /configs/conf1/mapping-ISOLatin1Accent.txt
   [junit4]   2> 748464 INFO  (TEST-HttpPartitionTest.test-seed#[48AAE2F144024F8]) [    ] o.a.s.c.c.SolrZkClient makePath: /configs/conf1/mapping-ISOLatin1Accent.txt
   [junit4]   2> 748464 INFO  (TEST-HttpPartitionTest.test-seed#[48AAE2F144024F8]) [    ] o.a.s.c.AbstractZkTestCase put /home/jenkins/workspace/Lucene-Solr-5.x-Linux/solr/core/src/test-files/solr/collection1/conf/old_synonyms.txt to /configs/conf1/old_synonyms.txt
   [junit4]   2> 748465 INFO  (TEST-HttpPartitionTest.test-seed#[48AAE2F144024F8]) [    ] o.a.s.c.c.SolrZkClient makePath: /configs/conf1/old_synonyms.txt
   [junit4]   2> 748465 INFO  (TEST-HttpPartitionTest.test-seed#[48AAE2F144024F8]) [    ] o.a.s.c.AbstractZkTestCase put /home/jenkins/workspace/Lucene-Solr-5.x-Linux/solr/core/src/test-files/solr/collection1/conf/synonyms.txt to /configs/conf1/synonyms.txt
   [junit4]   2> 748465 INFO  (TEST-HttpPartitionTest.test-seed#[48AAE2F144024F8]) [    ] o.a.s.c.c.SolrZkClient makePath: /configs/conf1/synonyms.txt
   [junit4]   2> 748517 INFO  (TEST-HttpPartitionTest.test-seed#[48AAE2F144024F8]) [    ] o.a.s.SolrTestCaseJ4 Writing core.properties file to /home/jenkins/workspace/Lucene-Solr-5.x-Linux/solr/build/solr-core/test/J1/temp/solr.cloud.HttpPartitionTest_48AAE2F144024F8-001/control-001/cores/collection1
   [junit4]   2> 748519 INFO  (TEST-HttpPartitionTest.test-seed#[48AAE2F144024F8]) [    ] o.e.j.s.Server jetty-9.2.11.v20150529
   [junit4]   2> 748519 INFO  (TEST-HttpPartitionTest.test-seed#[48AAE2F144024F8]) [    ] o.e.j.s.h.ContextHandler Started o.e.j.s.ServletContextHandler@4633b8bb{/,null,AVAILABLE}
   [junit4]   2> 748523 INFO  (TEST-HttpPartitionTest.test-seed#[48AAE2F144024F8]) [    ] o.e.j.s.ServerConnector Started ServerConnector@a44b8b5{HTTP/1.1}{127.0.0.1:46959}
   [junit4]   2> 748523 INFO  (TEST-HttpPartitionTest.test-seed#[48AAE2F144024F8]) [    ] o.e.j.s.Server Started @749986ms
   [junit4]   2> 748523 INFO  (TEST-HttpPartitionTest.test-seed#[48AAE2F144024F8]) [    ] o.a.s.c.s.e.JettySolrRunner Jetty properties: {solr.data.dir=/home/jenkins/workspace/Lucene-Solr-5.x-Linux/solr/build/solr-core/test/J1/temp/solr.cloud.HttpPartitionTest_48AAE2F144024F8-001/tempDir-001/control/data, hostContext=/, hostPort=32811, coreRootDirectory=/home/jenkins/workspace/Lucene-Solr-5.x-Linux/solr/build/solr-core/test/J1/temp/solr.cloud.HttpPartitionTest_48AAE2F144024F8-001/control-001/cores}
   [junit4]   2> 748524 INFO  (TEST-HttpPartitionTest.test-seed#[48AAE2F144024F8]) [    ] o.a.s.s.SolrDispatchFilter SolrDispatchFilter.init(): sun.misc.Launcher$AppClassLoader@4e0e2f2a
   [junit4]   2> 748524 INFO  (TEST-HttpPartitionTest.test-seed#[48AAE2F144024F8]) [    ] o.a.s.c.SolrResourceLoader new SolrResourceLoader for directory: '/home/jenkins/workspace/Lucene-Solr-5.x-Linux/solr/build/solr-core/test/J1/temp/solr.cloud.HttpPartitionTest_48AAE2F144024F8-001/control-001/'
   [junit4]   2> 748537 INFO  (TEST-HttpPartitionTest.test-seed#[48AAE2F144024F8]) [    ] o.a.s.c.c.SolrZkClient Using default ZkCredentialsProvider
   [junit4]   2> 748537 INFO  (TEST-HttpPartitionTest.test-seed#[48AAE2F144024F8]) [    ] o.a.s.c.c.ConnectionManager Waiting for client to connect to ZooKeeper
   [junit4]   2> 748538 INFO  (zkCallback-1702-thread-1) [    ] o.a.s.c.c.ConnectionManager Watcher org.apache.solr.common.cloud.ConnectionManager@3ce6e280 name:ZooKeeperConnection Watcher:127.0.0.1:52110/solr got event WatchedEvent state:SyncConnected type:None path:null path:null type:None
   [junit4]   2> 748538 INFO  (TEST-HttpPartitionTest.test-seed#[48AAE2F144024F8]) [    ] o.a.s.c.c.ConnectionManager Client is connected to ZooKeeper
   [junit4]   2> 748538 INFO  (TEST-HttpPartitionTest.test-seed#[48AAE2F144024F8]) [    ] o.a.s.c.c.SolrZkClient Using default ZkACLProvider
   [junit4]   2> 748539 INFO  (TEST-HttpPartitionTest.test-seed#[48AAE2F144024F8]) [    ] o.a.s.s.SolrDispatchFilter Loading solr.xml from SolrHome (not found in ZooKeeper)
   [junit4]   2> 748539 INFO  (TEST-HttpPartitionTest.test-seed#[48AAE2F144024F8]) [    ] o.a.s.c.SolrXmlConfig Loading container configuration from /home/jenkins/workspace/Lucene-Solr-5.x-Linux/solr/build/solr-core/test/J1/temp/solr.cloud.HttpPartitionTest_48AAE2F144024F8-001/control-001/solr.xml
   [junit4]   2> 748543 INFO  (TEST-HttpPartitionTest.test-seed#[48AAE2F144024F8]) [    ] o.a.s.c.CoresLocator Config-defined core root directory: /home/jenkins/workspace/Lucene-Solr-5.x-Linux/solr/build/solr-core/test/J1/temp/solr.cloud.HttpPartitionTest_48AAE2F144024F8-001/control-001/cores
   [junit4]   2> 748543 INFO  (TEST-HttpPartitionTest.test-seed#[48AAE2F144024F8]) [    ] o.a.s.c.CoreContainer New CoreContainer 966438649
   [junit4]   2> 748543 INFO  (TEST-HttpPartitionTest.test-seed#[48AAE2F144024F8]) [    ] o.a.s.c.CoreContainer Loading cores into CoreContainer [instanceDir=/home/jenkins/workspace/Lucene-Solr-5.x-Linux/solr/build/solr-core/test/J1/temp/solr.cloud.HttpPartitionTest_48AAE2F144024F8-001/control-001/]
   [junit4]   2> 748544 INFO  (TEST-HttpPartitionTest.test-seed#[48AAE2F144024F8]) [    ] o.a.s.c.CoreContainer loading shared library: /home/jenkins/workspace/Lucene-Solr-5.x-Linux/solr/build/solr-core/test/J1/temp/solr.cloud.HttpPartitionTest_48AAE2F144024F8-001/control-001/lib
   [junit4]   2> 748544 WARN  (TEST-HttpPartitionTest.test-seed#[48AAE2F144024F8]) [    ] o.a.s.c.SolrResourceLoader Can't find (or read) directory to add to classloader: lib (resolved as: /home/jenkins/workspace/Lucene-Solr-5.x-Linux/solr/build/solr-core/test/J1/temp/solr.cloud.HttpPartitionTest_48AAE2F144024F8-001/control-001/lib).
   [junit4]   2> 748550 INFO  (TEST-HttpPartitionTest.test-seed#[48AAE2F144024F8]) [    ] o.a.s.h.c.HttpShardHandlerFactory created with socketTimeout : 90000,urlScheme : ,connTimeout : 15000,maxConnectionsPerHost : 20,maxConnections : 10000,corePoolSize : 0,maximumPoolSize : 2147483647,maxThreadIdleTime : 5,sizeOfQueue : -1,fairnessPolicy : false,useRetries : false,
   [junit4]   2> 748551 INFO  (TEST-HttpPartitionTest.test-seed#[48AAE2F144024F8]) [    ] o.a.s.u.UpdateShardHandler Creating UpdateShardHandler HTTP client with params: socketTimeout=340000&connTimeout=45000&retry=true
   [junit4]   2> 748552 INFO  (TEST-HttpPartitionTest.test-seed#[48AAE2F144024F8]) [    ] o.a.s.l.LogWatcher SLF4J impl is org.slf4j.impl.Log4jLoggerFactory
   [junit4]   2> 748552 INFO  (TEST-HttpPartitionTest.test-seed#[48AAE2F144024F8]) [    ] o.a.s.l.LogWatcher Registering Log Listener [Log4j (org.slf4j.impl.Log4jLoggerFactory)]
   [junit4]   2> 748552 INFO  (TEST-HttpPartitionTest.test-seed#[48AAE2F144024F8]) [    ] o.a.s.c.ZkContainer Zookeeper client=127.0.0.1:52110/solr
   [junit4]   2> 748553 INFO  (TEST-HttpPartitionTest.test-seed#[48AAE2F144024F8]) [    ] o.a.s.c.ZkController zkHost includes chroot
   [junit4]   2> 748553 INFO  (TEST-HttpPartitionTest.test-seed#[48AAE2F144024F8]) [    ] o.a.s.c.c.SolrZkClient Using default ZkCredentialsProvider
   [junit4]   2> 748553 INFO  (TEST-HttpPartitionTest.test-seed#[48AAE2F144024F8]) [    ] o.a.s.c.c.ConnectionManager Waiting for client to connect to ZooKeeper
   [junit4]   2> 748554 INFO  (zkCallback-1704-thread-1) [    ] o.a.s.c.c.ConnectionManager Watcher org.apache.solr.common.cloud.ConnectionManager@4cebb4b9 name:ZooKeeperConnection Watcher:127.0.0.1:52110 got event WatchedEvent state:SyncConnected type:None path:null path:null type:None
   [junit4]   2> 748554 INFO  (TEST-HttpPartitionTest.test-seed#[48AAE2F144024F8]) [    ] o.a.s.c.c.ConnectionManager Client is connected to ZooKeeper
   [junit4]   2> 748554 INFO  (TEST-HttpPartitionTest.test-seed#[48AAE2F144024F8]) [    ] o.a.s.c.c.SolrZkClient Using default ZkACLProvider
   [junit4]   2> 748555 INFO  (TEST-HttpPartitionTest.test-seed#[48AAE2F144024F8]) [n:127.0.0.1:32811_    ] o.a.s.c.c.ConnectionManager Waiting for client to connect to ZooKeeper
   [junit4]   2> 748556 INFO  (zkCallback-1705-thread-1-processing-n:127.0.0.1:32811_) [n:127.0.0.1:32811_    ] o.a.s.c.c.ConnectionManager Watcher org.apache.solr.common.cloud.ConnectionManager@2c0d7d93 name:ZooKeeperConnection Watcher:127.0.0.1:52110/solr got event WatchedEvent state:SyncConnected type:None path:null path:null type:None
   [junit4]   2> 748556 INFO  (TEST-HttpPartitionTest.test-seed#[48AAE2F144024F8]) [n:127.0.0.1:32811_    ] o.a.s.c.c.ConnectionManager Client is connected to ZooKeeper
   [junit4]   2> 748556 INFO  (TEST-HttpPartitionTest.test-seed#[48AAE2F144024F8]) [n:127.0.0.1:32811_    ] o.a.s.c.c.SolrZkClient makePath: /overseer/queue
   [junit4]   2> 748557 INFO  (TEST-HttpPartitionTest.test-seed#[48AAE2F144024F8]) [n:127.0.0.1:32811_    ] o.a.s.c.c.SolrZkClient makePath: /overseer/collection-queue-work
   [junit4]   2> 748558 INFO  (TEST-HttpPartitionTest.test-seed#[48AAE2F144024F8]) [n:127.0.0.1:32811_    ] o.a.s.c.c.SolrZkClient makePath: /overseer/collection-map-running
   [junit4]   2> 748559 INFO  (TEST-HttpPartitionTest.test-seed#[48AAE2F144024F8]) [n:127.0.0.1:32811_    ] o.a.s.c.c.SolrZkClient makePath: /overseer/collection-map-completed
   [junit4]   2> 748559 INFO  (TEST-HttpPartitionTest.test-seed#[48AAE2F144024F8]) [n:127.0.0.1:32811_    ] o.a.s.c.c.SolrZkClient makePath: /overseer/collection-map-failure
   [junit4]   2> 748560 INFO  (TEST-HttpPartitionTest.test-seed#[48AAE2F144024F8]) [n:127.0.0.1:32811_    ] o.a.s.c.c.SolrZkClient makePath: /live_nodes
   [junit4]   2> 748561 INFO  (TEST-HttpPartitionTest.test-seed#[48AAE2F144024F8]) [n:127.0.0.1:32811_    ] o.a.s.c.c.SolrZkClient makePath: /aliases.json
   [junit4]   2> 748561 INFO  (TEST-HttpPartitionTest.test-seed#[48AAE2F144024F8]) [n:127.0.0.1:32811_    ] o.a.s.c.c.SolrZkClient makePath: /clusterstate.json
   [junit4]   2> 748562 INFO  (TEST-HttpPartitionTest.test-seed#[48AAE2F144024F8]) [n:127.0.0.1:32811_    ] o.a.s.c.c.SolrZkClient makePath: /security.json
   [junit4]   2> 748562 INFO  (TEST-HttpPartitionTest.test-seed#[48AAE2F144024F8]) [n:127.0.0.1:32811_    ] o.a.s.c.ZkController Register node as live in ZooKeeper:/live_nodes/127.0.0.1:32811_
   [junit4]   2> 748562 INFO  (TEST-HttpPartitionTest.test-seed#[48AAE2F144024F8]) [n:127.0.0.1:32811_    ] o.a.s.c.c.SolrZkClient makePath: /live_nodes/127.0.0.1:32811_
   [junit4]   2> 748563 INFO  (TEST-HttpPartitionTest.test-seed#[48AAE2F144024F8]) [n:127.0.0.1:32811_    ] o.a.s.c.c.SolrZkClient makePath: /overseer_elect
   [junit4]   2> 748563 INFO  (TEST-HttpPartitionTest.test-seed#[48AAE2F144024F8]) [n:127.0.0.1:32811_    ] o.a.s.c.c.SolrZkClient makePath: /overseer_elect/election
   [junit4]   2> 748564 INFO  (TEST-HttpPartitionTest.test-seed#[48AAE2F144024F8]) [n:127.0.0.1:32811_    ] o.a.s.c.Overseer Overseer (id=null) closing
   [junit4]   2> 748565 INFO  (TEST-HttpPartitionTest.test-seed#[48AAE2F144024F8]) [n:127.0.0.1:32811_    ] o.a.s.c.LeaderElector Joined leadership election with path: /overseer_elect/election/94364308486291460-127.0.0.1:32811_-n_0000000000
   [junit4]   2> 748565 INFO  (TEST-HttpPartitionTest.test-seed#[48AAE2F144024F8]) [n:127.0.0.1:32811_    ] o.a.s.c.OverseerElectionContext I am going to be the leader 127.0.0.1:32811_
   [junit4]   2> 748565 INFO  (TEST-HttpPartitionTest.test-seed#[48AAE2F144024F8]) [n:127.0.0.1:32811_    ] o.a.s.c.c.SolrZkClient makePath: /overseer_elect/leader
   [junit4]   2> 748566 INFO  (TEST-HttpPartitionTest.test-seed#[48AAE2F144024F8]) [n:127.0.0.1:32811_    ] o.a.s.c.Overseer Overseer (id=94364308486291460-127.0.0.1:32811_-n_0000000000) starting
   [junit4]   2> 748566 INFO  (TEST-HttpPartitionTest.test-seed#[48AAE2F144024F8]) [n:127.0.0.1:32811_    ] o.a.s.c.c.SolrZkClient makePath: /overseer/queue-work
   [junit4]   2> 748569 INFO  (TEST-HttpPartitionTest.test-seed#[48AAE2F144024F8]) [n:127.0.0.1:32811_    ] o.a.s.c.OverseerAutoReplicaFailoverThread Starting OverseerAutoReplicaFailoverThread autoReplicaFailoverWorkLoopDelay=10000 autoReplicaFailoverWaitAfterExpiration=30000 autoReplicaFailoverBadNodeExpiration=60000
   [junit4]   2> 748569 INFO  (OverseerCollectionProcessor-94364308486291460-127.0.0.1:32811_-n_0000000000) [n:127.0.0.1:32811_    ] o.a.s.c.OverseerProcessor Process current queue of overseer operations
   [junit4]   2> 748569 INFO  (TEST-HttpPartitionTest.test-seed#[48AAE2F144024F8]) [n:127.0.0.1:32811_    ] o.a.s.c.c.ZkStateReader Updating cluster state from ZooKeeper... 
   [junit4]   2> 748569 INFO  (OverseerStateUpdate-94364308486291460-127.0.0.1:32811_-n_0000000000) [n:127.0.0.1:32811_    ] o.a.s.c.Overseer Starting to work on the main queue
   [junit4]   2> 748592 INFO  (TEST-HttpPartitionTest.test-seed#[48AAE2F144024F8]) [n:127.0.0.1:32811_    ] o.a.s.c.CoreContainer Security conf doesn't exist. Skipping setup for authorization module.
   [junit4]   2> 748592 INFO  (TEST-HttpPartitionTest.test-seed#[48AAE2F144024F8]) [n:127.0.0.1:32811_    ] o.a.s.c.CoreContainer No authentication plugin used.
   [junit4]   2> 748592 INFO  (TEST-HttpPartitionTest.test-seed#[48AAE2F144024F8]) [n:127.0.0.1:32811_    ] o.a.s.c.CoresLocator Looking for core definitions underneath /home/jenkins/workspace/Lucene-Solr-5.x-Linux/solr/build/solr-core/test/J1/temp/solr.cloud.HttpPartitionTest_48AAE2F144024F8-001/control-001/cores
   [junit4]   2> 748593 INFO  (TEST-HttpPartitionTest.test-seed#[48AAE2F144024F8]) [n:127.0.0.1:32811_    ] o.a.s.c.SolrCore Created CoreDescriptor: {name=collection1, config=solrconfig.xml, transient=false, schema=schema.xml, loadOnStartup=true, configSetProperties=configsetprops.json, instanceDir=/home/jenkins/workspace/Lucene-Solr-5.x-Linux/solr/build/solr-core/test/J1/temp/solr.cloud.HttpPartitionTest_48AAE2F144024F8-001/control-001/cores/collection1, collection=control_collection, absoluteInstDir=/home/jenkins/workspace/Lucene-Solr-5.x-Linux/solr/build/solr-core/test/J1/temp/solr.cloud.HttpPartitionTest_48AAE2F144024F8-001/control-001/cores/collection1/, coreNodeName=, dataDir=data/, shard=}
   [junit4]   2> 748593 INFO  (TEST-HttpPartitionTest.test-seed#[48AAE2F144024F8]) [n:127.0.0.1:32811_    ] o.a.s.c.CoresLocator Found core collection1 in /home/jenkins/workspace/Lucene-Solr-5.x-Linux/solr/build/solr-core/test/J1/temp/solr.cloud.HttpPartitionTest_48AAE2F144024F8-001/control-001/cores/collection1/
   [junit4]   2> 748593 INFO  (TEST-HttpPartitionTest.test-seed#[48AAE2F144024F8]) [n:127.0.0.1:32811_    ] o.a.s.c.CoresLocator Found 1 core definitions
   [junit4]   2> 748594 INFO  (coreLoadExecutor-3013-thread-1-processing-n:127.0.0.1:32811_) [n:127.0.0.1:32811_ c:control_collection   x:collection1] o.a.s.c.ZkController publishing state=down
   [junit4]   2> 748594 INFO  (coreLoadExecutor-3013-thread-1-processing-n:127.0.0.1:32811_) [n:127.0.0.1:32811_ c:control_collection   x:collection1] o.a.s.c.ZkController numShards not found on descriptor - reading it from system property
   [junit4]   2> 748594 INFO  (TEST-HttpPartitionTest.test-seed#[48AAE2F144024F8]) [n:127.0.0.1:32811_    ] o.a.s.s.SolrDispatchFilter user.dir=/home/jenkins/workspace/Lucene-Solr-5.x-Linux/solr/build/solr-core/test/J1
   [junit4]   2> 748594 INFO  (TEST-HttpPartitionTest.test-seed#[48AAE2F144024F8]) [n:127.0.0.1:32811_    ] o.a.s.s.SolrDispatchFilter SolrDispatchFilter.init() done
   [junit4]   2> 748594 INFO  (zkCallback-1705-thread-1-processing-n:127.0.0.1:32811_) [n:127.0.0.1:32811_    ] o.a.s.c.DistributedQueue NodeChildrenChanged fired on path /overseer/queue state SyncConnected
   [junit4]   2> 748594 INFO  (coreLoadExecutor-3013-thread-1-processing-n:127.0.0.1:32811_) [n:127.0.0.1:32811_ c:control_collection   x:collection1] o.a.s.c.ZkController look for our core node name
   [junit4]   2> 748595 INFO  (OverseerStateUpdate-94364308486291460-127.0.0.1:32811_-n_0000000000) [n:127.0.0.1:32811_    ] o.a.s.c.Overseer processMessage: queueSize: 1, message = {
   [junit4]   2>   "core":"collection1",
   [junit4]   2>   "roles":null,
   [junit4]   2>   "base_url":"http://127.0.0.1:32811",
   [junit4]   2>   "node_name":"127.0.0.1:32811_",
   [junit4]   2>   "numShards":"1",
   [junit4]   2>   "state":"down",
   [junit4]   2>   "shard":null,
   [junit4]   2>   "collection":"control_collection",
   [junit4]   2>   "operation":"state"} current state version: 0
   [junit4]   2> 748595 INFO  (OverseerStateUpdate-94364308486291460-127.0.0.1:32811_-n_0000000000) [n:127.0.0.1:32811_    ] o.a.s.c.o.ReplicaMutator Update state numShards=1 message={
   [junit4]   2>   "core":"collection1",
   [junit4]   2>   "roles":null,
   [junit4]   2>   "base_url":"http://127.0.0.1:32811",
   [junit4]   2>   "node_name":"127.0.0.1:32811_",
   [junit4]   2>   "numShards":"1",
   [junit4]   2>   "state":"down",
   [junit4]   2>   "shard":null,
   [junit4]   2>   "collection":"control_collection",
   [junit4]   2>   "operation":"state"}
   [junit4]   2> 748595 INFO  (OverseerStateUpdate-94364308486291460-127.0.0.1:32811_-n_0000000000) [n:127.0.0.1:32811_    ] o.a.s.c.o.ClusterStateMutator building a new cName: control_collection
   [junit4]   2> 748595 INFO  (OverseerStateUpdate-94364308486291460-127.0.0.1:32811_-n_0000000000) [n:127.0.0.1:32811_    ] o.a.s.c.o.ReplicaMutator Assigning new node to shard shard=shard1
   [junit4]   2> 748595 INFO  (zkCallback-1705-thread-1-processing-n:127.0.0.1:32811_) [n:127.0.0.1:32811_    ] o.a.s.c.c.ZkStateReader A cluster state change: WatchedEvent state:SyncConnected type:NodeDataChanged path:/clusterstate.json, has occurred - updating... (live nodes size: 1)
   [junit4]   2> 749594 INFO  (coreLoadExecutor-3013-thread-1-processing-n:127.0.0.1:32811_) [n:127.0.0.1:32811_ c:control_collection   x:collection1] o.a.s.c.ZkController waiting to find shard id in clusterstate for collection1
   [junit4]   2> 749595 INFO  (coreLoadExecutor-3013-thread-1-processing-n:127.0.0.1:32811_) [n:127.0.0.1:32811_ c:control_collection   x:collection1] o.a.s.c.ZkController Check for collection zkNode:control_collection
   [junit4]   2> 749595 INFO  (coreLoadExecutor-3013-thread-1-processing-n:127.0.0.1:32811_) [n:127.0.0.1:32811_ c:control_collection   x:collection1] o.a.s.c.ZkController Collection zkNode exists
   [junit4]   2> 749595 INFO  (coreLoadExecutor-3013-thread-1-processing-n:127.0.0.1:32811_) [n:127.0.0.1:32811_ c:control_collection   x:collection1] o.a.s.c.c.ZkStateReader Load collection config from:/collections/control_collection
   [junit4]   2> 749595 INFO  (coreLoadExecutor-3013-thread-1-processing-n:127.0.0.1:32811_) [n:127.0.0.1:32811_ c:control_collection   x:collection1] o.a.s.c.c.ZkStateReader path=/collections/control_collection configName=conf1 specified config exists in ZooKeeper
   [junit4]   2> 749595 INFO  (coreLoadExecutor-3013-thread-1-processing-n:127.0.0.1:32811_) [n:127.0.0.1:32811_ c:control_collection   x:collection1] o.a.s.c.SolrResourceLoader new SolrResourceLoader for directory: '/home/jenkins/workspace/Lucene-Solr-5.x-Linux/solr/build/solr-core/test/J1/temp/solr.cloud.HttpPartitionTest_48AAE2F144024F8-001/control-001/cores/collection1/'
   [junit4]   2> 749603 INFO  (coreLoadExecutor-3013-thread-1-processing-n:127.0.0.1:32811_) [n:127.0.0.1:32811_ c:control_collection   x:collection1] o.a.s.c.Config loaded config solrconfig.xml with version 0 
   [junit4]   2> 749606 INFO  (coreLoadExecutor-3013-thread-1-processing-n:127.0.0.1:32811_) [n:127.0.0.1:32811_ c:control_collection   x:collection1] o.a.s.c.SolrConfig current version of requestparams : -1
   [junit4]   2> 749608 INFO  (coreLoadExecutor-3013-thread-1-processing-n:127.0.0.1:32811_) [n:127.0.0.1:32811_ c:control_collection   x:collection1] o.a.s.c.SolrConfig Using Lucene MatchVersion: 5.4.0
   [junit4]   2> 749627 INFO  (coreLoadExecutor-3013-thread-1-processing-n:127.0.0.1:32811_) [n:127.0.0.1:32811_ c:control_collection   x:collection1] o.a.s.c.Config Loaded SolrConfig: solrconfig.xml
   [junit4]   2> 749628 INFO  (coreLoadExecutor-3013-thread-1-processing-n:127.0.0.1:32811_) [n:127.0.0.1:32811_ c:control_collection   x:collection1] o.a.s.s.IndexSchema Reading Solr Schema from /configs/conf1/schema.xml
   [junit4]   2> 749631 INFO  (coreLoadExecutor-3013-thread-1-processing-n:127.0.0.1:32811_) [n:127.0.0.1:32811_ c:control_collection   x:collection1] o.a.s.s.IndexSchema [collection1] Schema name=test
   [junit4]   2> 749678 INFO  (coreLoadExecutor-3013-thread-1-processing-n:127.0.0.1:32811_) [n:127.0.0.1:32811_ c:control_collection   x:collection1] o.a.s.s.OpenExchangeRatesOrgProvider Initialized with rates=open-exchange-rates.json, refreshInterval=1440.
   [junit4]   2> 749682 INFO  (coreLoadExecutor-3013-thread-1-processing-n:127.0.0.1:32811_) [n:127.0.0.1:32811_ c:control_collection   x:collection1] o.a.s.s.IndexSchema default search field in schema is text
   [junit4]   2> 749683 INFO  (coreLoadExecutor-3013-thread-1-processing-n:127.0.0.1:32811_) [n:127.0.0.1:32811_ c:control_collection   x:collection1] o.a.s.s.IndexSchema unique key field: id
   [junit4]   2> 749687 INFO  (coreLoadExecutor-3013-thread-1-processing-n:127.0.0.1:32811_) [n:127.0.0.1:32811_ c:control_collection   x:collection1] o.a.s.s.FileExchangeRateProvider Reloading exchange rates from file currency.xml
   [junit4]   2> 749700 INFO  (coreLoadExecutor-3013-thread-1-processing-n:127.0.0.1:32811_) [n:127.0.0.1:32811_ c:control_collection   x:collection1] o.a.s.s.FileExchangeRateProvider Reloading exchange rates from file currency.xml
   [junit4]   2> 749701 INFO  (coreLoadExecutor-3013-thread-1-processing-n:127.0.0.1:32811_) [n:127.0.0.1:32811_ c:control_collection   x:collection1] o.a.s.s.OpenExchangeRatesOrgProvider Reloading exchange rates from open-exchange-rates.json
   [junit4]   2> 749702 WARN  (coreLoadExecutor-3013-thread-1-processing-n:127.0.0.1:32811_) [n:127.0.0.1:32811_ c:control_collection   x:collection1] o.a.s.s.OpenExchangeRatesOrgProvider Unknown key IMPORTANT NOTE
   [junit4]   2> 749702 WARN  (coreLoadExecutor-3013-thread-1-processing-n:127.0.0.1:32811_) [n:127.0.0.1:32811_ c:control_collection   x:collection1] o.a.s.s.OpenExchangeRatesOrgProvider Expected key, got STRING
   [junit4]   2> 749702 INFO  (coreLoadExecutor-3013-thread-1-processing-n:127.0.0.1:32811_) [n:127.0.0.1:32811_ c:control_collection   x:collection1] o.a.s.s.OpenExchangeRatesOrgProvider Reloading exchange rates from open-exchange-rates.json
   [junit4]   2> 749702 WARN  (coreLoadExecutor-3013-thread-1-processing-n:127.0.0.1:32811_) [n:127.0.0.1:32811_ c:control_collection   x:collection1] o.a.s.s.OpenExchangeRatesOrgProvider Unknown key IMPORTANT NOTE
   [junit4]   2> 749702 WARN  (coreLoadExecutor-3013-thread-1-processing-n:127.0.0.1:32811_) [n:127.0.0.1:32811_ c:control_collection   x:collection1] o.a.s.s.OpenExchangeRatesOrgProvider Expected key, got STRING
   [junit4]   2> 749703 INFO  (coreLoadExecutor-3013-thread-1-processing-n:127.0.0.1:32811_) [n:127.0.0.1:32811_ c:control_collection   x:collection1] o.a.s.c.ConfigSetProperties Did not find ConfigSet properties, assuming default properties: Can't find resource 'configsetprops.json' in classpath or '/configs/conf1', cwd=/home/jenkins/workspace/Lucene-Solr-5.x-Linux/solr/build/solr-core/test/J1
   [junit4]   2> 749703 INFO  (coreLoadExecutor-3013-thread-1-processing-n:127.0.0.1:32811_) [n:127.0.0.1:32811_ c:control_collection   x:collection1] o.a.s.c.CoreContainer Creating SolrCore 'collection1' using configuration from collection control_collection
   [junit4]   2> 749703 INFO  (coreLoadExecutor-3013-thread-1-processing-n:127.0.0.1:32811_) [n:127.0.0.1:32811_ c:control_collection s:shard1 r:core_node1 x:collection1] o.a.s.c.SolrCore org.apache.solr.core.MockDirectoryFactory
   [junit4]   2> 749703 INFO  (coreLoadExecutor-3013-thread-1-processing-n:127.0.0.1:32811_) [n:127.0.0.1:32811_ c:control_collection s:shard1 r:core_node1 x:collection1] o.a.s.c.SolrCore [[collection1] ] Opening new SolrCore at [/home/jenkins/workspace/Lucene-Solr-5.x-Linux/solr/build/solr-core/test/J1/temp/solr.cloud.HttpPartitionTest_48AAE2F144024F8-001/control-001/cores/collection1/], dataDir=[null]
   [junit4]   2> 749704 INFO  (coreLoadExecutor-3013-thread-1-processing-n:127.0.0.1:32811_) [n:127.0.0.1:32811_ c:control_collection s:shard1 r:core_node1 x:collection1] o.a.s.c.JmxMonitoredMap JMX monitoring is enabled. Adding Solr mbeans to JMX Server: com.sun.jmx.mbeanserver.JmxMBeanServer@78f55071
   [junit4]   2> 749704 INFO  (coreLoadExecutor-3013-thread-1-processing-n:127.0.0.1:32811_) [n:127.0.0.1:32811_ c:control_collection s:shard1 r:core_node1 x:collection1] o.a.s.c.CachingDirectoryFactory return new directory for /home/jenkins/workspace/Lucene-Solr-5.x-Linux/solr/build/solr-core/test/J1/temp/solr.cloud.HttpPartitionTest_48AAE2F144024F8-001/control-001/cores/collection1/data
   [junit4]   2> 749705 INFO  (coreLoadExecutor-3013-thread-1-processing-n:127.0.0.1:32811_) [n:127.0.0.1:32811_ c:control_collection s:shard1 r:core_node1 x:collection1] o.a.s.c.SolrCore New index directory detected: old=null new=/home/jenkins/workspace/Lucene-Solr-5.x-Linux/solr/build/solr-core/test/J1/temp/solr.cloud.HttpPartitionTest_48AAE2F144024F8-001/control-001/cores/collection1/data/index/
   [junit4]   2> 749705 WARN  (coreLoadExecutor-3013-thread-1-processing-n:127.0.0.1:32811_) [n:127.0.0.1:32811_ c:control_collection s:shard1 r:core_node1 x:collection1] o.a.s.c.SolrCore [collection1] Solr index directory '/home/jenkins/workspace/Lucene-Solr-5.x-Linux/solr/build/solr-core/test/J1/temp/solr.cloud.HttpPartitionTest_48AAE2F144024F8-001/control-001/cores/collection1/data/index' doesn't exist. Creating new index...
   [junit4]   2> 749705 INFO  (coreLoadExecutor-3013-thread-1-processing-n:127.0.0.1:32811_) [n:127.0.0.1:32811_ c:control_collection s:shard1 r:core_node1 x:collection1] o.a.s.c.CachingDirectoryFactory return new directory for /home/jenkins/workspace/Lucene-Solr-5.x-Linux/solr/build/solr-core/test/J1/temp/solr.cloud.HttpPartitionTest_48AAE2F144024F8-001/control-001/cores/collection1/data/index
   [junit4]   2> 749705 INFO  (coreLoadExecutor-3013-thread-1-processing-n:127.0.0.1:32811_) [n:127.0.0.1:32811_ c:control_collection s:shard1 r:core_node1 x:collection1] o.a.s.u.RandomMergePolicy RandomMergePolicy wrapping class org.apache.lucene.index.TieredMergePolicy: [TieredMergePolicy: maxMergeAtOnce=46, maxMergeAtOnceExplicit=17, maxMergedSegmentMB=74.01953125, floorSegmentMB=1.091796875, forceMergeDeletesPctAllowed=22.731458214570743, segmentsPerTier=47.0, maxCFSSegmentSizeMB=8.796093022207999E12, noCFSRatio=1.0
   [junit4]   2> 749705 INFO  (coreLoadExecutor-3013-thread-1-processing-n:127.0.0.1:32811_) [n:127.0.0.1:32811_ c:control_collection s:shard1 r:core_node1 x:collection1] o.a.s.c.SolrCore SolrDeletionPolicy.onCommit: commits: num=1
   [junit4]   2> 	commit{dir=MockDirectoryWrapper(RAMDirectory@3b752647 lockFactory=org.apache.lucene.store.SingleInstanceLockFactory@3d00d500),segFN=segments_1,generation=1}
   [junit4]   2> 749705 INFO  (coreLoadExecutor-3013-thread-1-processing-n:127.0.0.1:32811_) [n:127.0.0.1:32811_ c:control_collection s:shard1 r:core_node1 x:collection1] o.a.s.c.SolrCore newest commit generation = 1
   [junit4]   2> 749706 INFO  (OldIndexDirectoryCleanupThreadForCore-collection1) [n:127.0.0.1:32811_ c:control_collection s:shard1 r:core_node1 x:collection1] o.a.s.c.SolrCore Looking for old index directories to cleanup for core collection1 in /home/jenkins/workspace/Lucene-Solr-5.x-Linux/solr/build/solr-core/test/J1/temp/solr.cloud.HttpPartitionTest_48AAE2F144024F8-001/control-001/cores/collection1/data/
   [junit4]   2> 749706 WARN  (OldIndexDirectoryCleanupThreadForCore-collection1) [n:127.0.0.1:32811_ c:control_collection s:shard1 r:core_node1 x:collection1] o.a.s.c.DirectoryFactory /home/jenkins/workspace/Lucene-Solr-5.x-Linux/solr/build/solr-core/test/J1/temp/solr.cloud.HttpPartitionTest_48AAE2F144024F8-001/control-001/cores/collection1/data/ does not point to a valid data directory; skipping clean-up of old index directories.
   [junit4]   2> 749707 INFO  (coreLoadExecutor-3013-thread-1-processing-n:127.0.0.1:32811_) [n:127.0.0.1:32811_ c:control_collection s:shard1 r:core_node1 x:collection1] o.a.s.u.p.UpdateRequestProcessorChain creating updateRequestProcessorChain "nodistrib"
   [junit4]   2> 749707 INFO  (coreLoadExecutor-3013-thread-1-processing-n:127.0.0.1:32811_) [n:127.0.0.1:32811_ c:control_collection s:shard1 r:core_node1 x:collection1] o.a.s.u.p.UpdateRequestProcessorChain creating updateRequestProcessorChain "dedupe"
   [junit4]   2> 749707 INFO  (coreLoadExecutor-3013-thread-1-processing-n:127.0.0.1:32811_) [n:127.0.0.1:32811_ c:control_collection s:shard1 r:core_node1 x:collection1] o.a.s.u.p.UpdateRequestProcessorChain inserting DistributedUpdateProcessorFactory into updateRequestProcessorChain "dedupe"
   [junit4]   2> 749707 INFO  (coreLoadExecutor-3013-thread-1-processing-n:127.0.0.1:32811_) [n:127.0.0.1:32811_ c:control_collection s:shard1 r:core_node1 x:collection1] o.a.s.u.p.UpdateRequestProcessorChain creating updateRequestProcessorChain "stored_sig"
   [junit4]   2> 749707 INFO  (coreLoadExecutor-3013-thread-1-processing-n:127.0.0.1:32811_) [n:127.0.0.1:32811_ c:control_collection s:shard1 r:core_node1 x:collection1] o.a.s.u.p.UpdateRequestProcessorChain inserting DistributedUpdateProcessorFactory into updateRequestProcessorChain "stored_sig"
   [junit4]   2> 749707 INFO  (coreLoadExecutor-3013-thread-1-processing-n:127.0.0.1:32811_) [n:127.0.0.1:32811_ c:control_collection s:shard1 r:core_node1 x:collection1] o.a.s.u.p.UpdateRequestProcessorChain creating updateRequestProcessorChain "distrib-dup-test-chain-explicit"
   [junit4]   2> 749708 INFO  (coreLoadExecutor-3013-thread-1-processing-n:127.0.0.1:32811_) [n:127.0.0.1:32811_ c:control_collection s:shard1 r:core_node1 x:collection1] o.a.s.u.p.UpdateRequestProcessorChain creating updateRequestProcessorChain "distrib-dup-test-chain-implicit"
   [junit4]   2> 749708 INFO  (coreLoadExecutor-3013-thread-1-processing-n:127.0.0.1:32811_) [n:127.0.0.1:32811_ c:control_collection s:shard1 r:core_node1 x:collection1] o.a.s.u.p.UpdateRequestProcessorChain inserting DistributedUpdateProcessorFactory into updateRequestProcessorChain "distrib-dup-test-chain-implicit"
   [junit4]   2> 749708 INFO  (coreLoadExecutor-3013-thread-1-processing-n:127.0.0.1:32811_) [n:127.0.0.1:32811_ c:control_collection s:shard1 r:core_node1 x:collection1] o.a.s.c.SolrCore no updateRequestProcessorChain defined as default, creating implicit default
   [junit4]   2> 749709 INFO  (coreLoadExecutor-3013-thread-1-processing-n:127.0.0.1:32811_) [n:127.0.0.1:32811_ c:control_collection s:shard1 r:core_node1 x:collection1] o.a.s.h.l.XMLLoader xsltCacheLifetimeSeconds=60
   [junit4]   2> 749709 INFO  (coreLoadExecutor-3013-thread-1-processing-n:127.0.0.1:32811_) [n:127.0.0.1:32811_ c:control_collection s:shard1 r:core_node1 x:collection1] o.a.s.h.l.XMLLoader xsltCacheLifetimeSeconds=60
   [junit4]   2> 749710 INFO  (coreLoadExecutor-3013-thread-1-processing-n:127.0.0.1:32811_) [n:127.0.0.1:32811_ c:control_collection s:shard1 r:core_node1 x:collection1] o.a.s.h.l.XMLLoader xsltCacheLifetimeSeconds=60
   [junit4]   2> 749710 INFO  (coreLoadExecutor-3013-thread-1-processing-n:127.0.0.1:32811_) [n:127.0.0.1:32811_ c:control_collection s:shard1 r:core_node1 x:collection1] o.a.s.h.l.XMLLoader xsltCacheLifetimeSeconds=60
   [junit4]   2> 749712 INFO  (coreLoadExecutor-3013-thread-1-processing-n:127.0.0.1:32811_) [n:127.0.0.1:32811_ c:control_collection s:shard1 r:core_node1 x:collection1] o.a.s.c.RequestHandlers Registered paths: /admin/mbeans,standard,/update/csv,/update/json/docs,/admin/luke,/admin/segments,/get,/admin/system,/replication,/admin/properties,/config,/schema,/admin/plugins,/admin/logging,/update/json,/admin/threads,/admin/ping,/update,/admin/file
   [junit4]   2> 749712 INFO  (coreLoadExecutor-3013-thread-1-processing-n:127.0.0.1:32811_) [n:127.0.0.1:32811_ c:control_collection s:shard1 r:core_node1 x:collection1] o.a.s.c.SolrCore Using default statsCache cache: org.apache.solr.search.stats.LocalStatsCache
   [junit4]   2> 749712 INFO  (coreLoadExecutor-3013-thread-1-processing-n:127.0.0.1:32811_) [n:127.0.0.1:32811_ c:control_collection s:shard1 r:core_node1 x:collection1] o.a.s.u.UpdateHandler Using UpdateLog implementation: org.apache.solr.update.UpdateLog
   [junit4]   2> 749713 INFO  (coreLoadExecutor-3013-thread-1-processing-n:127.0.0.1:32811_) [n:127.0.0.1:32811_ c:control_collection s:shard1 r:core_node1 x:collection1] o.a.s.u.UpdateLog Initializing UpdateLog: dataDir= defaultSyncLevel=FLUSH numRecordsToKeep=100 maxNumLogsToKeep=10 numVersionBuckets=65536
   [junit4]   2> 749713 INFO  (coreLoadExecutor-3013-thread-1-processing-n:127.0.0.1:32811_) [n:127.0.0.1:32811_ c:control_collection s:shard1 r:core_node1 x:collection1] o.a.s.c.SolrCore Hard AutoCommit: disabled
   [junit4]   2> 749713 INFO  (coreLoadExecutor-3013-thread-1-processing-n:127.0.0.1:32811_) [n:127.0.0.1:32811_ c:control_collection s:shard1 r:core_node1 x:collection1] o.a.s.c.SolrCore Soft AutoCommit: disabled
   [junit4]   2> 749713 INFO  (coreLoadExecutor-3013-thread-1-processing-n:127.0.0.1:32811_) [n:127.0.0.1:32811_ c:control_collection s:shard1 r:core_node1 x:collection1] o.a.s.u.RandomMergePolicy RandomMergePolicy wrapping class org.apache.lucene.index.AlcoholicMergePolicy: [AlcoholicMergePolicy: minMergeSize=0, mergeFactor=10, maxMergeSize=1794783190, maxMergeSizeForForcedMerge=9223372036854775807, calibrateSizeByDeletes=true, maxMergeDocs=2147483647, maxCFSSegmentSizeMB=8.796093022207999E12, noCFSRatio=0.1]
   [junit4]   2> 749714 INFO  (coreLoadExecutor-3013-thread-1-processing-n:127.0.0.1:32811_) [n:127.0.0.1:32811_ c:control_collection s:shard1 r:core_node1 x:collection1] o.a.s.c.SolrCore SolrDeletionPolicy.onInit: commits: num=1
   [junit4]   2> 	commit{dir=MockDirectoryWrapper(RAMDirectory@3b752647 lockFactory=org.apache.lucene.store.SingleInstanceLockFactory@3d00d500),segFN=segments_1,generation=1}
   [junit4]   2> 749714 INFO  (coreLoadExecutor-3013-thread-1-processing-n:127.0.0.1:32811_) [n:127.0.0.1:32811_ c:control_collection s:shard1 r:core_node1 x:collection1] o.a.s.c.SolrCore newest commit generation = 1
   [junit4]   2> 749714 INFO  (coreLoadExecutor-3013-thread-1-processing-n:127.0.0.1:32811_) [n:127.0.0.1:32811_ c:control_collection s:shard1 r:core_node1 x:collection1] o.a.s.s.SolrIndexSearcher Opening Searcher@6e7671dd[collection1] main
   [junit4]   2> 749714 INFO  (coreLoadExecutor-3013-thread-1-processing-n:127.0.0.1:32811_) [n:127.0.0.1:32811_ c:control_collection s:shard1 r:core_node1 x:collection1] o.a.s.c.c.ZkStateReader Load collection config from:/collections/control_collection
   [junit4]   2> 749714 INFO  (coreLoadExecutor-3013-thread-1-processing-n:127.0.0.1:32811_) [n:127.0.0.1:32811_ c:control_collection s:shard1 r:core_node1 x:collection1] o.a.s.c.c.ZkStateReader path=/collections/control_collection configName=conf1 specified config exists in ZooKeeper
   [junit4]   2> 749714 INFO  (coreLoadExecutor-3013-thread-1-processing-n:127.0.0.1:32811_) [n:127.0.0.1:32811_ c:control_collection s:shard1 r:core_node1 x:collection1] o.a.s.r.ManagedResourceStorage Setting up ZooKeeper-based storage for the RestManager with znodeBase: /configs/conf1
   [junit4]   2> 749715 INFO  (coreLoadExecutor-3013-thread-1-processing-n:127.0.0.1:32811_) [n:127.0.0.1:32811_ c:control_collection s:shard1 r:core_node1 x:collection1] o.a.s.r.ManagedResourceStorage Configured ZooKeeperStorageIO with znodeBase: /configs/conf1
   [junit4]   2> 749715 INFO  (coreLoadExecutor-3013-thread-1-processing-n:127.0.0.1:32811_) [n:127.0.0.1:32811_ c:control_collection s:shard1 r:core_node1 x:collection1] o.a.s.r.RestManager Initializing RestManager with initArgs: {}
   [junit4]   2> 749715 INFO  (coreLoadExecutor-3013-thread-1-processing-n:127.0.0.1:32811_) [n:127.0.0.1:32811_ c:control_collection s:shard1 r:core_node1 x:collection1] o.a.s.r.ManagedResourceStorage Reading _rest_managed.json using ZooKeeperStorageIO:path=/configs/conf1
   [junit4]   2> 749715 INFO  (coreLoadExecutor-3013-thread-1-processing-n:127.0.0.1:32811_) [n:127.0.0.1:32811_ c:control_collection s:shard1 r:core_node1 x:collection1] o.a.s.r.ManagedResourceStorage No data found for znode /configs/conf1/_rest_managed.json
   [junit4]   2> 749715 INFO  (coreLoadExecutor-3013-thread-1-processing-n:127.0.0.1:32811_) [n:127.0.0.1:32811_ c:control_collection s:shard1 r:core_node1 x:collection1] o.a.s.r.ManagedResourceStorage Loaded null at path _rest_managed.json using ZooKeeperStorageIO:path=/configs/conf1
   [junit4]   2> 749715 INFO  (coreLoadExecutor-3013-thread-1-processing-n:127.0.0.1:32811_) [n:127.0.0.1:32811_ c:control_collection s:shard1 r:core_node1 x:collection1] o.a.s.r.RestManager Initializing 0 registered ManagedResources
   [junit4]   2> 749715 INFO  (coreLoadExecutor-3013-thread-1-processing-n:127.0.0.1:32811_) [n:127.0.0.1:32811_ c:control_collection s:shard1 r:core_node1 x:collection1] o.a.s.h.ReplicationHandler Commits will be reserved for  10000
   [junit4]   2> 749716 INFO  (searcherExecutor-3014-thread-1-processing-n:127.0.0.1:32811_ x:collection1 s:shard1 c:control_collection r:core_node1) [n:127.0.0.1:32811_ c:control_collection s:shard1 r:core_node1 x:collection1] o.a.s.c.SolrCore [collection1] Registered new searcher Searcher@6e7671dd[collection1] main{ExitableDirectoryReader(UninvertingDirectoryReader())}
   [junit4]   2> 749716 INFO  (coreLoadExecutor-3013-thread-1-processing-n:127.0.0.1:32811_) [n:127.0.0.1:32811_ c:control_collection s:shard1 r:core_node1 x:collection1] o.a.s.u.UpdateLog Looking up max value of version field to seed version buckets
   [junit4]   2> 749716 INFO  (coreLoadExecutor-3013-thread-1-processing-n:127.0.0.1:32811_) [n:127.0.0.1:32811_ c:control_collection s:shard1 r:core_node1 x:collection1] o.a.s.u.VersionInfo Refreshing highest value of _version_ for 65536 version buckets from index
   [junit4]   2> 749716 INFO  (coreLoadExecutor-3013-thread-1-processing-n:127.0.0.1:32811_) [n:127.0.0.1:32811_ c:control_collection s:shard1 r:core_node1 x:collection1] o.a.s.u.VersionInfo No terms found for _version_, cannot seed version bucket highest value from index
   [junit4]   2> 749716 INFO  (coreLoadExecutor-3013-thread-1-processing-n:127.0.0.1:32811_) [n:127.0.0.1:32811_ c:control_collection s:shard1 r:core_node1 x:collection1] o.a.s.u.UpdateLog Could not find max version in index or recent updates, using new clock 1509828937216163840
   [junit4]   2> 749718 INFO  (coreLoadExecutor-3013-thread-1-processing-n:127.0.0.1:32811_) [n:127.0.0.1:32811_ c:control_collection s:shard1 r:core_node1 x:collection1] o.a.s.u.UpdateLog Took 2.0ms to seed version buckets with highest version 1509828937216163840
   [junit4]   2> 749719 INFO  (coreLoadExecutor-3013-thread-1-processing-n:127.0.0.1:32811_) [n:127.0.0.1:32811_ c:control_collection s:shard1 r:core_node1 x:collection1] o.a.s.c.ZkController watch zkdir /configs/conf1
   [junit4]   2> 749719 INFO  (coreLoadExecutor-3013-thread-1-processing-n:127.0.0.1:32811_) [n:127.0.0.1:32811_ c:control_collection s:shard1 r:core_node1 x:collection1] o.a.s.c.CoreContainer registering core: collection1
   [junit4]   2> 749719 INFO  (coreZkRegister-3007-thread-1-processing-n:127.0.0.1:32811_ x:collection1 s:shard1 c:control_collection r:core_node1) [n:127.0.0.1:32811_ c:control_collection s:shard1 r:core_node1 x:collection1] o.a.s.c.ZkController Register replica - core:collection1 address:http://127.0.0.1:32811 collection:control_collection shard:shard1
   [junit4]   2> 749720 INFO  (coreZkRegister-3007-thread-1-processing-n:127.0.0.1:32811_ x:collection1 s:shard1 c:control_collection r:core_node1) [n:127.0.0.1:32811_ c:control_collection s:shard1 r:core_node1 x:collection1] o.a.s.c.c.SolrZkClient makePath: /collections/control_collection/leader_elect/shard1/election
   [junit4]   2> 749721 INFO  (coreZkRegister-3007-thread-1-processing-n:127.0.0.1:32811_ x:collection1 s:shard1 c:control_collection r:core_node1) [n:127.0.0.1:32811_ c:control_collection s:shard1 r:core_node1 x:collection1] o.a.s.c.LeaderElector Joined leadership election with path: /collections/control_collection/leader_elect/shard1/election/94364308486291460-core_node1-n_0000000000
   [junit4]   2> 749721 INFO  (coreZkRegister-3007-thread-1-processing-n:127.0.0.1:32811_ x:collection1 s:shard1 c:control_collection r:core_node1) [n:127.0.0.1:32811_ c:control_collection s:shard1 r:core_node1 x:collection1] o.a.s.c.ShardLeaderElectionContext Running the leader process for shard shard1
   [junit4]   2> 749722 INFO  (zkCallback-1705-thread-1-processing-n:127.0.0.1:32811_) [n:127.0.0.1:32811_    ] o.a.s.c.DistributedQueue NodeChildrenChanged fired on path /overseer/queue state SyncConnected
   [junit4]   2> 749722 INFO  (coreZkRegister-3007-thread-1-processing-n:127.0.0.1:32811_ x:collection1 s:shard1 c:control_collection r:core_node1) [n:127.0.0.1:32811_ c:control_collection s:shard1 r:core_node1 x:collection1] o.a.s.c.ShardLeaderElectionContext Enough replicas found to continue.
   [junit4]   2> 749722 INFO  (coreZkRegister-3007-thread-1-processing-n:127.0.0.1:32811_ x:collection1 s:shard1 c:control_collection r:core_node1) [n:127.0.0.1:32811_ c:control_collection s:shard1 r:core_node1 x:collection1] o.a.s.c.ShardLeaderElectionContext I may be the new leader - try and sync
   [junit4]   2> 749722 INFO  (coreZkRegister-3007-thread-1-processing-n:127.0.0.1:32811_ x:collection1 s:shard1 c:control_collection r:core_node1) [n:127.0.0.1:32811_ c:control_collection s:shard1 r:core_node1 x:collection1] o.a.s.c.SyncStrategy Sync replicas to http://127.0.0.1:32811/collection1/
   [junit4]   2> 749722 INFO  (coreZkRegister-3007-thread-1-processing-n:127.0.0.1:32811_ x:collection1 s:shard1 c:control_collection r:core_node1) [n:127.0.0.1:32811_ c:control_collection s:shard1 r:core_node1 x:collection1] o.a.s.c.SyncStrategy Sync Success - now sync replicas to me
   [junit4]   2> 749722 INFO  (OverseerStateUpdate-94364308486291460-127.0.0.1:32811_-n_0000000000) [n:127.0.0.1:32811_    ] o.a.s.c.Overseer processMessage: queueSize: 1, message = {
   [junit4]   2>   "operation":"leader",
   [junit4]   2>   "shard":"shard1",
   [junit4]   2>   "collection":"control_collection"} current state version: 1
   [junit4]   2> 749722 INFO  (coreZkRegister-3007-thread-1-processing-n:127.0.0.1:32811_ x:collection1 s:shard1 c:control_collection r:core_node1) [n:127.0.0.1:32811_ c:control_collection s:shard1 r:core_node1 x:collection1] o.a.s.c.SyncStrategy http://127.0.0.1:32811/collection1/ has no replicas
   [junit4]   2> 749722 INFO  (coreZkRegister-3007-thread-1-processing-n:127.0.0.1:32811_ x:collection1 s:shard1 c:control_collection r:core_node1) [n:127.0.0.1:32811_ c:control_collection s:shard1 r:core_node1 x:collection1] o.a.s.c.ShardLeaderElectionContext I am the new leader: http://127.0.0.1:32811/collection1/ shard1
   [junit4]   2> 749722 INFO  (coreZkRegister-3007-thread-1-processing-n:127.0.0.1:32811_ x:collection1 s:shard1 c:control_collection r:core_node1) [n:127.0.0.1:32811_ c:control_collection s:shard1 r:core_node1 x:collection1] o.a.s.c.c.SolrZkClient makePath: /collections/control_collection/leaders/shard1
   [junit4]   2> 749723 INFO  (zkCallback-1705-thread-1-processing-n:127.0.0.1:32811_) [n:127.0.0.1:32811_    ] o.a.s.c.DistributedQueue NodeChildrenChanged fired on path /overseer/queue state SyncConnected
   [junit4]   2> 749724 INFO  (OverseerStateUpdate-94364308486291460-127.0.0.1:32811_-n_0000000000) [n:127.0.0.1:32811_    ] o.a.s.c.Overseer processMessage: queueSize: 1, message = {
   [junit4]   2>   "operation":"leader",
   [junit4]   2>   "shard":"shard1",
   [junit4]   2>   "collection":"control_collection",
   [junit4]   2>   "base_url":"http://127.0.0.1:32811",
   [junit4]   2>   "core":"collection1",
   [junit4]   2>   "state":"active"} current state version: 1
   [junit4]   2> 749825 INFO  (zkCallback-1705-thread-1-processing-n:127.0.0.1:32811_) [n:127.0.0.1:32811_    ] o.a.s.c.c.ZkStateReader A cluster state change: WatchedEvent state:SyncConnected type:NodeDataChanged path:/clusterstate.json, has occurred - updating... (live nodes size: 1)
   [junit4]   2> 749874 INFO  (coreZkRegister-3007-thread-1-processing-n:127.0.0.1:32811_ x:collection1 s:shard1 c:control_collection r:core_node1) [n:127.0.0.1:32811_ c:control_collection s:shard1 r:core_node1 x:collection1] o.a.s.c.ZkController We are http://127.0.0.1:32811/collection1/ and leader is http://127.0.0.1:32811/collection1/
   [junit4]   2> 749874 INFO  (coreZkRegister-3007-thread-1-processing-n:127.0.0.1:32811_ x:collection1 s:shard1 c:control_collection r:core_node1) [n:127.0.0.1:32811_ c:control_collection s:shard1 r:core_node1 x:collection1] o.a.s.c.ZkController No LogReplay needed for core=collection1 baseURL=http://127.0.0.1:32811
   [junit4]   2> 749874 INFO  (coreZkRegister-3007-thread-1-processing-n:127.0.0.1:32811_ x:collection1 s:shard1 c:control_collection r:core_node1) [n:127.0.0.1:32811_ c:control_collection s:shard1 r:core_node1 x:collection1] o.a.s.c.ZkController I am the leader, no recovery necessary
   [junit4]   2> 749874 INFO  (coreZkRegister-3007-thread-1-processing-n:127.0.0.1:32811_ x:collection1 s:shard1 c:control_collection r:core_node1) [n:127.0.0.1:32811_ c:control_collection s:shard1 r:core_node1 x:collection1] o.a.s.c.ZkController publishing state=active
   [junit4]   2> 749874 INFO  (coreZkRegister-3007-thread-1-processing-n:127.0.0.1:32811_ x:collection1 s:shard1 c:control_collection r:core_node1) [n:127.0.0.1:32811_ c:control_collection s:shard1 r:core_node1 x:collection1] o.a.s.c.ZkController numShards not found on descriptor - reading it from system property
   [junit4]   2> 749875 INFO  (zkCallback-1705-thread-1-processing-n:127.0.0.1:32811_) [n:127.0.0.1:32811_    ] o.a.s.c.DistributedQueue NodeChildrenChanged fired on path /overseer/queue state SyncConnected
   [junit4]   2> 749875 INFO  (OverseerStateUpdate-94364308486291460-127.0.0.1:32811_-n_0000000000) [n:127.0.0.1:32811_    ] o.a.s.c.Overseer processMessage: queueSize: 1, message = {
   [junit4]   2>   "core":"collection1",
   [junit4]   2>   "core_node_name":"core_node1",
   [junit4]   2>   "roles":null,
   [junit4]   2>   "base_url":"http://127.0.0.1:32811",
   [junit4]   2>   "node_name":"127.0.0.1:32811_",
   [junit4]   2>   "numShards":"1",
   [junit4]   2>   "state":"active",
   [junit4]   2>   "shard":"shard1",
   [junit4]   2>   "collection":"control_collection",
   [junit4]   2>   "operation":"state"} current state version: 2
   [junit4]   2> 749876 INFO  (OverseerStateUpdate-94364308486291460-127.0.0.1:32811_-n_0000000000) [n:127.0.0.1:32811_    ] o.a.s.c.o.ReplicaMutator Update state numShards=1 message={
   [junit4]   2>   "core":"collection1",
   [junit4]   2>   "core_node_name":"core_node1",
   [junit4]   2>   "roles":null,
   [junit4]   2>   "base_url":"http://127.0.0.1:32811",
   [junit4]   2>   "node_name":"127.0.0.1:32811_",
   [junit4]   2>   "numShards":"1",
   [junit4]   2>   "state":"active",
   [junit4]   2>   "shard":"shard1",
   [junit4]   2>   "collection":"control_collection",
   [junit4]   2>   "operation":"state"}
   [junit4]   2> 749977 INFO  (zkCallback-1705-thread-1-processing-n:127.0.0.1:32811_) [n:127.0.0.1:32811_    ] o.a.s.c.c.ZkStateReader A cluster state change: WatchedEvent state:SyncConnected type:NodeDataChanged path:/clusterstate.json, has occurred - updating... (live nodes size: 1)
   [junit4]   2> 750096 INFO  (TEST-HttpPartitionTest.test-seed#[48AAE2F144024F8]) [    ] o.a.s.c.c.SolrZkClient Using default ZkCredentialsProvider
   [junit4]   2> 750097 INFO  (TEST-HttpPartitionTest.test-seed#[48AAE2F144024F8]) [    ] o.a.s.c.c.ConnectionManager Waiting for client to connect to ZooKeeper
   [junit4]   2> 750097 INFO  (zkCallback-1707-thread-1) [    ] o.a.s.c.c.ConnectionManager Watcher org.apache.solr.common.cloud.ConnectionManager@5ae8aaf9 name:ZooKeeperConnection Watcher:127.0.0.1:52110/solr got event WatchedEvent state:SyncConnected type:None path:null path:null type:None
   [junit4]   2> 750097 INFO  (TEST-HttpPartitionTest.test-seed#[48AAE2F144024F8]) [    ] o.a.s.c.c.ConnectionManager Client is connected to ZooKeeper
   [junit4]   2> 750098 INFO  (TEST-HttpPartitionTest.test-seed#[48AAE2F144024F8]) [    ] o.a.s.c.c.SolrZkClient Using default ZkACLProvider
   [junit4]   2> 750098 INFO  (TEST-HttpPartitionTest.test-seed#[48AAE2F144024F8]) [    ] o.a.s.c.c.ZkStateReader Updating cluster state from ZooKeeper... 
   [junit4]   2> 750099 INFO  (TEST-HttpPartitionTest.test-seed#[48AAE2F144024F8]) [    ] o.a.s.c.ChaosMonkey monkey: init - expire sessions:false cause connection loss:false
   [junit4]   2> 750099 INFO  (TEST-HttpPartitionTest.test-seed#[48AAE2F144024F8]) [    ] o.a.s.c.AbstractFullDistribZkTestBase Creating collection1 with stateFormat=2
   [junit4]   2> 750099 INFO  (TEST-HttpPartitionTest.test-seed#[48AAE2F144024F8]) [    ] o.a.s.c.c.SolrZkClient Using default ZkCredentialsProvider
   [junit4]   2> 750099 INFO  (TEST-HttpPartitionTest.test-seed#[48AAE2F144024F8]) [    ] o.a.s.c.c.ConnectionManager Waiting for client to connect to ZooKeeper
   [junit4]   2> 750101 INFO  (zkCallback-1708-thread-1) [    ] o.a.s.c.c.ConnectionManager Watcher org.apache.solr.common.cloud.ConnectionManager@1ab2cba3 name:ZooKeeperConnection Watcher:127.0.0.1:52110/solr got event WatchedEvent state:SyncConnected type:None path:null path:null type:None
   [junit4]   2> 750101 INFO  (TEST-HttpPartitionTest.test-seed#[48AAE2F144024F8]) [    ] o.a.s.c.c.ConnectionManager Client is connected to ZooKeeper
   [junit4]   2> 750101 INFO  (TEST-HttpPartitionTest.test-seed#[48AAE2F144024F8]) [    ] o.a.s.c.c.SolrZkClient Using default ZkACLProvider
   [junit4]   2> 750102 INFO  (zkCallback-1705-thread-1-processing-n:127.0.0.1:32811_) [n:127.0.0.1:32811_    ] o.a.s.c.DistributedQueue NodeChildrenChanged fired on path /overseer/queue state SyncConnected
   [junit4]   2> 750102 INFO  (OverseerStateUpdate-94364308486291460-127.0.0.1:32811_-n_0000000000) [n:127.0.0.1:32811_    ] o.a.s.c.Overseer processMessage: queueSize: 1, message = {
   [junit4]   2>   "operation":"create",
   [junit4]   2>   "name":"collection1",
   [junit4]   2>   "numShards":"2",
   [junit4]   2>   "stateFormat":"2"} current state version: 3
   [junit4]   2> 750102 INFO  (OverseerStateUpdate-94364308486291460-127.0.0.1:32811_-n_0000000000) [n:127.0.0.1:32811_    ] o.a.s.c.o.ClusterStateMutator building a new cName: collection1
   [junit4]   2> 750179 INFO  (TEST-HttpPartitionTest.test-seed#[48AAE2F144024F8]) [    ] o.a.s.SolrTestCaseJ4 Writing core.properties file to /home/jenkins/workspace/Lucene-Solr-5.x-Linux/solr/build/solr-core/test/J1/temp/solr.cloud.HttpPartitionTest_48AAE2F144024F8-001/shard-1-001/cores/collection1
   [junit4]   2> 750180 INFO  (TEST-HttpPartitionTest.test-seed#[48AAE2F144024F8]) [    ] o.a.s.c.AbstractFullDistribZkTestBase create jetty 1 in directory /home/jenkins/workspace/Lucene-Solr-5.x-Linux/solr/build/solr-core/test/J1/temp/solr.cloud.HttpPartitionTest_48AAE2F144024F8-001/shard-1-001
   [junit4]   2> 750180 INFO  (TEST-HttpPartitionTest.test-seed#[48AAE2F144024F8]) [    ] o.e.j.s.Server jetty-9.2.11.v20150529
   [junit4]   2> 750181 INFO  (TEST-HttpPartitionTest.test-seed#[48AAE2F144024F8]) [    ] o.e.j.s.h.ContextHandler Started o.e.j.s.ServletContextHandler@5d8a155f{/,null,AVAILABLE}
   [junit4]   2> 750182 INFO  (TEST-HttpPartitionTest.test-seed#[48AAE2F144024F8]) [    ] o.e.j.s.ServerConnector Started ServerConnector@511fbf9e{HTTP/1.1}{127.0.0.1:36827}
   [junit4]   2> 750182 INFO  (TEST-HttpPartitionTest.test-seed#[48AAE2F144024F8]) [    ] o.e.j.s.Server Started @751645ms
   [junit4]   2> 750182 INFO  (TEST-HttpPartitionTest.test-seed#[48AAE2F144024F8]) [    ] o.a.s.c.s.e.JettySolrRunner Jetty properties: {solr.data.dir=/home/jenkins/workspace/Lucene-Solr-5.x-Linux/solr/build/solr-core/test/J1/temp/solr.cloud.HttpPartitionTest_48AAE2F144024F8-001/tempDir-001/jetty1, solrconfig=solrconfig.xml, hostContext=/, hostPort=50764, coreRootDirectory=/home/jenkins/workspace/Lucene-Solr-5.x-Linux/solr/build/solr-core/test/J1/temp/solr.cloud.HttpPartitionTest_48AAE2F144024F8-001/shard-1-001/cores}
   [junit4]   2> 750182 INFO  (TEST-HttpPartitionTest.test-seed#[48AAE2F144024F8]) [    ] o.a.s.s.SolrDispatchFilter SolrDispatchFilter.init(): sun.misc.Launcher$AppClassLoader@4e0e2f2a
   [junit4]   2> 750183 INFO  (TEST-HttpPartitionTest.test-seed#[48AAE2F144024F8]) [    ] o.a.s.c.SolrResourceLoader new SolrResourceLoader for directory: '/home/jenkins/workspace/Lucene-Solr-5.x-Linux/solr/build/solr-core/test/J1/temp/solr.cloud.HttpPartitionTest_48AAE2F144024F8-001/shard-1-001/'
   [junit4]   2> 750196 INFO  (TEST-HttpPartitionTest.test-seed#[48AAE2F144024F8]) [    ] o.a.s.c.c.SolrZkClient Using default ZkCredentialsProvider
   [junit4]   2> 750197 INFO  (TEST-HttpPartitionTest.test-seed#[48AAE2F144024F8]) [    ] o.a.s.c.c.ConnectionManager Waiting for client to connect to ZooKeeper
   [junit4]   2> 750197 INFO  (zkCallback-1709-thread-1) [    ] o.a.s.c.c.ConnectionManager Watcher org.apache.solr.common.cloud.ConnectionManager@1c6255cc name:ZooKeeperConnection Watcher:127.0.0.1:52110/solr got event WatchedEvent state:SyncConnected type:None path:null path:null type:None
   [junit4]   2> 750197 INFO  (TEST-HttpPartitionTest.test-seed#[48AAE2F144024F8]) [    ] o.a.s.c.c.ConnectionManager Client is connected to ZooKeeper
   [junit4]   2> 750198 INFO  (TEST-HttpPartitionTest.test-seed#[48AAE2F144024F8]) [    ] o.a.s.c.c.SolrZkClient Using default ZkACLProvider
   [junit4]   2> 750198 INFO  (TEST-HttpPartitionTest.test-seed#[48AAE2F144024F8]) [    ] o.a.s.s.SolrDispatchFilter Loading solr.xml from SolrHome (not found in ZooKeeper)
   [junit4]   2> 750198 INFO  (TEST-HttpPartitionTest.test-seed#[48AAE2F144024F8]) [    ] o.a.s.c.SolrXmlConfig Loading container configuration from /home/jenkins/workspace/Lucene-Solr-5.x-Linux/solr/build/solr-core/test/J1/temp/solr.cloud.HttpPartitionTest_48AAE2F144024F8-001/shard-1-001/solr.xml
   [junit4]   2> 750201 INFO  (TEST-HttpPartitionTest.test-seed#[48AAE2F144024F8]) [    ] o.a.s.c.CoresLocator Config-defined core root directory: /home/jenkins/workspace/Lucene-Solr-5.x-Linux/solr/build/solr-core/test/J1/temp/solr.cloud.HttpPartitionTest_48AAE2F144024F8-001/shard-1-001/cores
   [junit4]   2> 750201 INFO  (TEST-HttpPartitionTest.test-seed#[48AAE2F144024F8]) [    ] o.a.s.c.CoreContainer New CoreContainer 120589359
   [junit4]   2> 750201 INFO  (TEST-HttpPartitionTest.test-seed#[48AAE2F144024F8]) [    ] o.a.s.c.CoreContainer Loading cores into CoreContainer [instanceDir=/home/jenkins/workspace/Lucene-Solr-5.x-Linux/solr/build/solr-core/test/J1/temp/solr.cloud.HttpPartitionTest_48AAE2F144024F8-001/shard-1-001/]
   [junit4]   2> 750201 INFO  (TEST-HttpPartitionTest.test-seed#[48AAE2F144024F8]) [    ] o.a.s.c.CoreContainer loading shared library: /home/jenkins/workspace/Lucene-Solr-5.x-Linux/solr/build/solr-core/test/J1/temp/solr.cloud.HttpPartitionTest_48AAE2F144024F8-001/shard-1-001/lib
   [junit4]   2> 750201 WARN  (TEST-HttpPartitionTest.test-seed#[48AAE2F144024F8]) [    ] o.a.s.c.SolrResourceLoader Can't find (or read) directory to add to classloader: lib (resolved as: /home/jenkins/workspace/Lucene-Solr-5.x-Linux/solr/build/solr-core/test/J1/temp/solr.cloud.HttpPartitionTest_48AAE2F144024F8-001/shard-1-001/lib).
   [junit4]   2> 750204 INFO  (OverseerStateUpdate-94364308486291460-127.0.0.1:32811_-n_0000000000) [n:127.0.0.1:32811_    ] o.a.s.c.o.ZkStateWriter going to create_collection /collections/collection1/state.json
   [junit4]   2> 750205 INFO  (zkCallback-1707-thread-1) [    ] o.a.s.c.c.ZkStateReader A cluster state change: WatchedEvent state:SyncConnected type:NodeDataChanged path:/clusterstate.json, has occurred - updating... (live nodes size: 1)
   [junit4]   2> 750205 INFO  (zkCallback-1705-thread-1-processing-n:127.0.0.1:32811_) [n:127.0.0.1:32811_    ] o.a.s.c.c.ZkStateReader A cluster state change: WatchedEvent state:SyncConnected type:NodeDataChanged path:/clusterstate.json, has occurred - updating... (live nodes size: 1)
   [junit4]   2> 750206 INFO  (TEST-HttpPartitionTest.test-seed#[48AAE2F144024F8]) [    ] o.a.s.h.c.HttpShardHandlerFactory created with socketTimeout : 90000,urlScheme : ,connTimeout : 15000,maxConnectionsPerHost : 20,maxConnections : 10000,corePoolSize : 0,maximumPoolSize : 2147483647,maxThreadIdleTime : 5,sizeOfQueue : -1,fairnessPolicy : false,useRetries : false,
   [junit4]   2> 750207 INFO  (TEST-HttpPartitionTest.test-seed#[48AAE2F144024F8]) [    ] o.a.s.u.UpdateShardHandler Creating UpdateShardHandler HTTP client with params: socketTimeout=340000&connTimeout=45000&retry=true
   [junit4]   2> 750207 INFO  (TEST-HttpPartitionTest.test-seed#[48AAE2F144024F8]) [    ] o.a.s.l.LogWatcher SLF4J impl is org.slf4j.impl.Log4jLoggerFactory
   [junit4]   2> 750207 INFO  (TEST-HttpPartitionTest.test-seed#[48AAE2F144024F8]) [    ] o.a.s.l.LogWatcher Registering Log Listener [Log4j (org.slf4j.impl.Log4jLoggerFactory)]
   [junit4]   2> 750207 INFO  (TEST-HttpPartitionTest.test-seed#[48AAE2F144024F8]) [    ] o.a.s.c.ZkContainer Zookeeper client=127.0.0.1:52110/solr
   [junit4]   2> 750207 INFO  (TEST-HttpPartitionTest.test-seed#[48AAE2F144024F8]) [    ] o.a.s.c.ZkController zkHost includes chroot
   [junit4]   2> 750207 INFO  (TEST-HttpPartitionTest.test-seed#[48AAE2F144024F8]) [    ] o.a.s.c.c.SolrZkClient Using default ZkCredentialsProvider
   [junit4]   2> 750208 INFO  (TEST-HttpPartitionTest.test-seed#[48AAE2F144024F8]) [    ] o.a.s.c.c.ConnectionManager Waiting for client to connect to ZooKeeper
   [junit4]   2> 750209 INFO  (zkCallback-1711-thread-1) [    ] o.a.s.c.c.ConnectionManager Watcher org.apache.solr.common.cloud.ConnectionManager@116d7d10 name:ZooKeeperConnection Watcher:127.0.0.1:52110 got event WatchedEvent state:SyncConnected type:None path:null path:null type:None
   [junit4]   2> 750209 INFO  (TEST-HttpPartitionTest.test-seed#[48AAE2F144024F8]) [    ] o.a.s.c.c.ConnectionManager Client is connected to ZooKeeper
   [junit4]   2> 750209 INFO  (TEST-HttpPartitionTest.test-seed#[48AAE2F144024F8]) [    ] o.a.s.c.c.SolrZkClient Using default ZkACLProvider
   [junit4]   2> 750218 INFO  (TEST-HttpPartitionTest.test-seed#[48AAE2F144024F8]) [n:127.0.0.1:50764_    ] o.a.s.c.c.ConnectionManager Waiting for client to connect to ZooKeeper
   [junit4]   2> 750218 INFO  (zkCallback-1712-thread-1-processing-n:127.0.0.1:50764_) [n:127.0.0.1:50764_    ] o.a.s.c.c.ConnectionManager Watcher org.apache.solr.common.cloud.ConnectionManager@4fcd91ec name:ZooKeeperConnection Watcher:127.0.0.1:52110/solr got event WatchedEvent state:SyncConnected type:None path:null path:null type:None
   [junit4]   2> 750218 INFO  (TEST-HttpPartitionTest.test-seed#[48AAE2F144024F8]) [n:127.0.0.1:50764_    ] o.a.s.c.c.ConnectionManager Client is connected to ZooKeeper
   [junit4]   2> 750222 INFO  (TEST-HttpPartitionTest.test-seed#[48AAE2F144024F8]) [n:127.0.0.1:50764_    ] o.a.s.c.c.ZkStateReader Updating cluster state from ZooKeeper... 
   [junit4]   2> 751224 INFO  (TEST-HttpPartitionTest.test-seed#[48AAE2F144024F8]) [n:127.0.0.1:50764_    ] o.a.s.c.ZkController Register node as live in ZooKeeper:/live_nodes/127.0.0.1:50764_
   [junit4]   2> 751224 INFO  (TEST-HttpPartitionTest.test-seed#[48AAE2F144024F8]) [n:127.0.0.1:50764_    ] o.a.s.c.c.SolrZkClient makePath: /live_nodes/127.0.0.1:50764_
   [junit4]   2> 751224 INFO  (zkCallback-1712-thread-1-processing-n:127.0.0.1:50764_) [n:127.0.0.1:50764_    ] o.a.s.c.c.ZkStateReader A live node change: WatchedEvent state:SyncConnected type:NodeChildrenChanged path:/live_nodes, has occurred - updating... (live nodes size: 1)
   [junit4]   2> 751224 INFO  (zkCallback-1705-thread-1-processing-n:127.0.0.1:32811_) [n:127.0.0.1:32811_    ] o.a.s.c.c.ZkStateReader A live node change: WatchedEvent state:SyncConnected type:NodeChildrenChanged path:/live_nodes, has occurred - updating... (live nodes size: 1)
   [junit4]   2> 751224 INFO  (zkCallback-1707-thread-1) [    ] o.a.s.c.c.ZkStateReader A live node change: WatchedEvent state:SyncConnected type:NodeChildrenChanged path:/live_nodes, has occurred - updating... (live nodes size: 1)
   [junit4]   2> 751225 INFO  (TEST-HttpPartitionTest.test-seed#[48AAE2F144024F8]) [n:127.0.0.1:50764_    ] o.a.s.c.Overseer Overseer (id=null) closing
   [junit4]   2> 751226 INFO  (TEST-HttpPartitionTest.test-seed#[48AAE2F144024F8]) [n:127.0.0.1:50764_    ] o.a.s.c.LeaderElector Joined leadership election with path: /overseer_elect/election/94364308486291465-127.0.0.1:50764_-n_0000000001
   [junit4]   2> 751226 INFO  (TEST-HttpPartitionTest.test-seed#[48AAE2F144024F8]) [n:127.0.0.1:50764_    ] o.a.s.c.LeaderElector Watching path /overseer_elect/election/94364308486291460-127.0.0.1:32811_-n_0000000000 to know if I could be the leader
   [junit4]   2> 751237 INFO  (TEST-HttpPartitionTest.test-seed#[48AAE2F144024F8]) [n:127.0.0.1:50764_    ] o.a.s.c.CoreContainer Security conf doesn't exist. Skipping setup for authorization module.
   [junit4]   2> 751237 INFO  (TEST-HttpPartitionTest.test-seed#[48AAE2F144024F8]) [n:127.0.0.1:50764_    ] o.a.s.c.CoreContainer No authentication plugin used.
   [junit4]   2> 751238 INFO  (TEST-HttpPartitionTest.test-seed#[48AAE2F144024F8]) [n:127.0.0.1:50764_    ] o.a.s.c.CoresLocator Looking for core definitions underneath /home/jenkins/workspace/Lucene-Solr-5.x-Linux/solr/build/solr-core/test/J1/temp/solr.cloud.HttpPartitionTest_48AAE2F144024F8-001/shard-1-001/cores
   [junit4]   2> 751238 INFO  (TEST-HttpPartitionTest.test-seed#[48AAE2F144024F8]) [n:127.0.0.1:50764_    ] o.a.s.c.SolrCore Created CoreDescriptor: {name=collection1, config=solrconfig.xml, transient=false, schema=schema.xml, loadOnStartup=true, configSetProperties=configsetprops.json, instanceDir=/home/jenkins/workspace/Lucene-Solr-5.x-Linux/solr/build/solr-core/test/J1/temp/solr.cloud.HttpPartitionTest_48AAE2F144024F8-001/shard-1-001/cores/collection1, collection=collection1, absoluteInstDir=/home/jenkins/workspace/Lucene-Solr-5.x-Linux/solr/build/solr-core/test/J1/temp/solr.cloud.HttpPartitionTest_48AAE2F144024F8-001/shard-1-001/cores/collection1/, coreNodeName=, dataDir=data/, shard=}
   [junit4]   2> 751238 INFO  (TEST-HttpPartitionTest.test-seed#[48AAE2F144024F8]) [n:127.0.0.1:50764_    ] o.a.s.c.CoresLocator Found core collection1 in /home/jenkins/workspace/Lucene-Solr-5.x-Linux/solr/build/solr-core/test/J1/temp/solr.cloud.HttpPartitionTest_48AAE2F144024F8-001/shard-1-001/cores/collection1/
   [junit4]   2> 751239 INFO  (TEST-HttpPartitionTest.test-seed#[48AAE2F144024F8]) [n:127.0.0.1:50764_    ] o.a.s.c.CoresLocator Found 1 core definitions
   [junit4]   2> 751239 INFO  (TEST-HttpPartitionTest.test-seed#[48AAE2F144024F8]) [n:127.0.0.1:50764_    ] o.a.s.s.SolrDispatchFilter user.dir=/home/jenkins/workspace/Lucene-Solr-5.x-Linux/solr/build/solr-core/test/J1
   [junit4]   2> 751240 INFO  (TEST-HttpPartitionTest.test-seed#[48AAE2F144024F8]) [n:127.0.0.1:50764_    ] o.a.s.s.SolrDispatchFilter SolrDispatchFilter.init() done
   [junit4]   2> 751240 INFO  (coreLoadExecutor-3024-thread-1-processing-n:127.0.0.1:50764_) [n:127.0.0.1:50764_ c:collection1   x:collection1] o.a.s.c.ZkController publishing state=down
   [junit4]   2> 751240 INFO  (coreLoadExecutor-3024-thread-1-processing-n:127.0.0.1:50764_) [n:127.0.0.1:50764_ c:collection1   x:collection1] o.a.s.c.ZkController numShards not found on descriptor - reading it from system property
   [junit4]   2> 751241 INFO  (zkCallback-1705-thread-1-processing-n:127.0.0.1:32811_) [n:127.0.0.1:32811_    ] o.a.s.c.DistributedQueue NodeChildrenChanged fired on path /overseer/queue state SyncConnected
   [junit4]   2> 751241 INFO  (coreLoadExecutor-3024-thread-1-processing-n:127.0.0.1:50764_) [n:127.0.0.1:50764_ c:collection1   x:collection1] o.a.s.c.ZkController Registering watch for external collection collection1
   [junit4]   2> 751241 INFO  (coreLoadExecutor-3024-thread-1-processing-n:127.0.0.1:50764_) [n:127.0.0.1:50764_ c:collection1   x:collection1] o.a.s.c.c.ZkStateReader addZkWatch collection1
   [junit4]   2> 751241 INFO  (OverseerStateUpdate-94364308486291460-127.0.0.1:32811_-n_0000000000) [n:127.0.0.1:32811_    ] o.a.s.c.Overseer processMessage: queueSize: 1, message = {
   [junit4]   2>   "core":"collection1",
   [junit4]   2>   "roles":null,
   [junit4]   2>   "base_url":"http://127.0.0.1:50764",
   [junit4]   2>   "node_name":"127.0.0.1:50764_",
   [junit4]   2>   "numShards":"2",
   [junit4]   2>   "state":"down",
   [junit4]   2>   "shard":null,
   [junit4]   2>   "collection":"collection1",
   [junit4]   2>   "operation":"state"} current state version: 4
   [junit4]   2> 751242 INFO  (coreLoadExecutor-3024-thread-1-processing-n:127.0.0.1:50764_) [n:127.0.0.1:50764_ c:collection1   x:collection1] o.a.s.c.c.ZkStateReader Add data for collection1 ver 0 
   [junit4]   2> 751242 INFO  (coreLoadExecutor-3024-thread-1-processing-n:127.0.0.1:50764_) [n:127.0.0.1:50764_ c:collection1   x:collection1] o.a.s.c.ZkController look for our core node name
   [junit4]   2> 751242 INFO  (OverseerStateUpdate-94364308486291460-127.0.0.1:32811_-n_0000000000) [n:127.0.0.1:32811_    ] o.a.s.c.o.ReplicaMutator Update state numShards=2 message={
   [junit4]   2>   "core":"collection1",
   [junit4]   2>   "roles":null,
   [junit4]   2>   "base_url":"http://127.0.0.1:50764",
   [junit4]   2>   "node_name":"127.0.0.1:50764_",
   [junit4]   2>   "numShards":"2",
   [junit4]   2>   "state":"down",
   [junit4]   2>   "shard":null,
   [junit4]   2>   "collection":"collection1",
   [junit4]   2>   "operation":"state"}
   [junit4]   2> 751242 INFO  (OverseerStateUpdate-94364308486291460-127.0.0.1:32811_-n_0000000000) [n:127.0.0.1:32811_    ] o.a.s.c.o.ReplicaMutator Collection already exists with numShards=2
   [junit4]   2> 751242 INFO  (OverseerStateUpdate-94364308486291460-127.0.0.1:32811_-n_0000000000) [n:127.0.0.1:32811_    ] o.a.s.c.o.ReplicaMutator Assigning new node to shard shard=shard2
   [junit4]   2> 751343 INFO  (OverseerStateUpdate-94364308486291460-127.0.0.1:32811_-n_0000000000) [n:127.0.0.1:32811_    ] o.a.s.c.o.ZkStateWriter going to update_collection /collections/collection1/state.json version: 0
   [junit4]   2> 751344 INFO  (zkCallback-1712-thread-1-processing-n:127.0.0.1:50764_) [n:127.0.0.1:50764_    ] o.a.s.c.c.ZkStateReader A cluster state change: WatchedEvent state:SyncConnected type:NodeDataChanged path:/collections/collection1/state.json for collection collection1 has occurred - updating... (live nodes size: 2)
   [junit4]   2> 751344 INFO  (zkCallback-1712-thread-1-processing-n:127.0.0.1:50764_) [n:127.0.0.1:50764_    ] o.a.s.c.c.ZkStateReader Updating data for collection1 from 0 to 1 
   [junit4]   2> 752242 INFO  (coreLoadExecutor-3024-thread-1-processing-n:127.0.0.1:50764_) [n:127.0.0.1:50764_ c:collection1   x:collection1] o.a.s.c.ZkController waiting to find shard id in clusterstate for collection1
   [junit4]   2> 752242 INFO  (coreLoadExecutor-3024-thread-1-processing-n:127.0.0.1:50764_) [n:127.0.0.1:50764_ c:collection1   x:collection1] o.a.s.c.ZkController Check for collection zkNode:collection1
   [junit4]   2> 752243 INFO  (coreLoadExecutor-3024-thread-1-processing-n:127.0.0.1:50764_) [n:127.0.0.1:50764_ c:collection1   x:collection1] o.a.s.c.ZkController Collection zkNode exists
   [junit4]   2> 752243 INFO  (coreLoadExecutor-3024-thread-1-processing-n:127.0.0.1:50764_) [n:127.0.0.1:50764_ c:collection1   x:collection1] o.a.s.c.c.ZkStateReader Load collection config from:/collections/collection1
   [junit4]   2> 752243 INFO  (coreLoadExecutor-3024-thread-1-processing-n:127.0.0.1:50764_) [n:127.0.0.1:50764_ c:collection1   x:collection1] o.a.s.c.c.ZkStateReader path=/collections/collection1 configName=conf1 specified config exists in ZooKeeper
   [junit4]   2> 752243 INFO  (coreLoadExecutor-3024-thread-1-processing-n:127.0.0.1:50764_) [n:127.0.0.1:50764_ c:collection1   x:collection1] o.a.s.c.SolrResourceLoader new SolrResourceLoader for directory: '/home/jenkins/workspace/Lucene-Solr-5.x-Linux/solr/build/solr-core/test/J1/temp/solr.cloud.HttpPartitionTest_48AAE2F144024F8-001/shard-1-001/cores/collection1/'
   [junit4]   2> 752257 INFO  (coreLoadExecutor-3024-thread-1-processing-n:127.0.0.1:50764_) [n:127.0.0.1:50764_ c:collection1   x:collection1] o.a.s.c.Config loaded config solrconfig.xml with version 0 
   [junit4]   2> 752261 INFO  (coreLoadExecutor-3024-thread-1-processing-n:127.0.0.1:50764_) [n:127.0.0.1:50764_ c:collection1   x:collection1] o.a.s.c.SolrConfig current version of requestparams : -1
   [junit4]   2> 752264 INFO  (coreLoadExecutor-3024-thread-1-processing-n:127.0.0.1:50764_) [n:127.0.0.1:50764_ c:collection1   x:collection1] o.a.s.c.SolrConfig Using Lucene MatchVersion: 5.4.0
   [junit4]   2> 752271 INFO  (coreLoadExecutor-3024-thread-1-processing-n:127.0.0.1:50764_) [n:127.0.0.1:50764_ c:collection1   x:collection1] o.a.s.c.Config Loaded SolrConfig: solrconfig.xml
   [junit4]   2> 752273 INFO  (coreLoadExecutor-3024-thread-1-processing-n:127.0.0.1:50764_) [n:127.0.0.1:50764_ c:collection1   x:collection1] o.a.s.s.IndexSchema Reading Solr Schema from /configs/conf1/schema.xml
   [junit4]   2> 752277 INFO  (coreLoadExecutor-3024-thread-1-processing-n:127.0.0.1:50764_) [n:127.0.0.1:50764_ c:collection1   x:collection1] o.a.s.s.IndexSchema [collection1] Schema name=test
   [junit4]   2> 752356 INFO  (coreLoadExecutor-3024-thread-1-processing-n:127.0.0.1:50764_) [n:127.0.0.1:50764_ c:collection1   x:collection1] o.a.s.s.OpenExchangeRatesOrgProvider Initialized with rates=open-exchange-rates.json, refreshInterval=1440.
   [junit4]   2> 752360 INFO  (coreLoadExecutor-3024-thread-1-processing-n:127.0.0.1:50764_) [n:127.0.0.1:50764_ c:collection1   x:collection1] o.a.s.s.IndexSchema default search field in schema is text
   [junit4]   2> 752361 INFO  (coreLoadExecutor-3024-thread-1-processing-n:127.0.0.1:50764_) [n:127.0.0.1:50764_ c:collection1   x:collection1] o.a.s.s.IndexSchema unique key field: id
   [junit4]   2> 752364 INFO  (coreLoadExecutor-3024-thread-1-processing-n:127.0.0.1:50764_) [n:127.0.0.1:50764_ c:collection1   x:collection1] o.a.s.s.FileExchangeRateProvider Reloading exchange rates from file currency.xml
   [junit4]   2> 752366 INFO  (coreLoadExecutor-3024-thread-1-processing-n:127.0.0.1:50764_) [n:127.0.0.1:50764_ c:collection1   x:collection1] o.a.s.s.FileExchangeRateProvider Reloading exchange rates from file currency.xml
   [junit4]   2> 752367 INFO  (coreLoadExecutor-3024-thread-1-processing-n:127.0.0.1:50764_) [n:127.0.0.1:50764_ c:collection1   x:collection1] o.a.s.s.OpenExchangeRatesOrgProvider Reloading exchange rates from open-exchange-rates.json
   [junit4]   2> 752367 WARN  (coreLoadExecutor-3024-thread-1-processing-n:127.0.0.1:50764_) [n:127.0.0.1:50764_ c:collection1   x:collection1] o.a.s.s.OpenExchangeRatesOrgProvider Unknown key IMPORTANT NOTE
   [junit4]   2> 752367 WARN  (coreLoadExecutor-3024-thread-1-processing-n:127.0.0.1:50764_) [n:127.0.0.1:50764_ c:collection1   x:collection1] o.a.s.s.OpenExchangeRatesOrgProvider Expected key, got STRING
   [junit4]   2> 752367 INFO  (coreLoadExecutor-3024-thread-1-processing-n:127.0.0.1:50764_) [n:127.0.0.1:50764_ c:collection1   x:collection1] o.a.s.s.OpenExchangeRatesOrgProvider Reloading exchange rates from open-exchange-rates.json
   [junit4]   2> 752368 WARN  (coreLoadExecutor-3024-thread-1-processing-n:127.0.0.1:50764_) [n:127.0.0.1:50764_ c:collection1   x:collection1] o.a.s.s.OpenExchangeRatesOrgProvider Unknown key IMPORTANT NOTE
   [junit4]   2> 752368 WARN  (coreLoadExecutor-3024-thread-1-processing-n:127.0.0.1:50764_) [n:127.0.0.1:50764_ c:collection1   x:collection1] o.a.s.s.OpenExchangeRatesOrgProvider Expected key, got STRING
   [junit4]   2> 752369 INFO  (coreLoadExecutor-3024-thread-1-processing-n:127.0.0.1:50764_) [n:127.0.0.1:50764_ c:collection1   x:collection1] o.a.s.c.ConfigSetProperties Did not find ConfigSet properties, assuming default properties: Can't find resource 'configsetprops.json' in classpath or '/configs/conf1', cwd=/home/jenkins/workspace/Lucene-Solr-5.x-Linux/solr/build/solr-core/test/J1
   [junit4]   2> 752369 INFO  (coreLoadExecutor-3024-thread-1-processing-n:127.0.0.1:50764_) [n:127.0.0.1:50764_ c:collection1   x:collection1] o.a.s.c.CoreContainer Creating SolrCore 'collection1' using configuration from collection collection1
   [junit4]   2> 752369 INFO  (coreLoadExecutor-3024-thread-1-processing-n:127.0.0.1:50764_) [n:127.0.0.1:50764_ c:collection1 s:shard2 r:core_node1 x:collection1] o.a.s.c.SolrCore org.apache.solr.core.MockDirectoryFactory
   [junit4]   2> 752370 INFO  (coreLoadExecutor-3024-thread-1-processing-n:127.0.0.1:50764_) [n:127.0.0.1:50764_ c:collection1 s:shard2 r:core_node1 x:collection1] o.a.s.c.SolrCore [[collection1] ] Opening new SolrCore at [/home/jenkins/workspace/Lucene-Solr-5.x-Linux/solr/build/solr-core/test/J1/temp/solr.cloud.HttpPartitionTest_48AAE2F144024F8-001/shard-1-001/cores/collection1/], dataDir=[null]
   [junit4]   2> 752370 INFO  (coreLoadExecutor-3024-thread-1-processing-n:127.0.0.1:50764_) [n:127.0.0.1:50764_ c:collection1 s:shard2 r:core_node1 x:collection1] o.a.s.c.JmxMonitoredMap JMX monitoring is enabled. Adding Solr mbeans to JMX Server: com.sun.jmx.mbeanserver.JmxMBeanServer@78f55071
   [junit4]   2> 752370 INFO  (coreLoadExecutor-3024-thread-1-processing-n:127.0.0.1:50764_) [n:127.0.0.1:50764_ c:collection1 s:shard2 r:core_node1 x:collection1] o.a.s.c.CachingDirectoryFactory return new directory for /home/jenkins/workspace/Lucene-Solr-5.x-Linux/solr/build/solr-core/test/J1/temp/solr.cloud.HttpPartitionTest_48AAE2F144024F8-001/shard-1-001/cores/collection1/data
   [junit4]   2> 752370 INFO  (coreLoadExecutor-3024-thread-1-processing-n:127.0.0.1:50764_) [n:127.0.0.1:50764_ c:collection1 s:shard2 r:core_node1 x:collection1] o.a.s.c.SolrCore New index directory detected: old=null new=/home/jenkins/workspace/Lucene-Solr-5.x-Linux/solr/build/solr-core/test/J1/temp/solr.cloud.HttpPartitionTest_48AAE2F144024F8-001/shard-1-001/cores/collection1/data/index/
   [junit4]   2> 752370 WARN  (coreLoadExecutor-3024-thread-1-processing-n:127.0.0.1:50764_) [n:127.0.0.1:50764_ c:collection1 s:shard2 r:core_node1 x:collection1] o.a.s.c.SolrCore [collection1] Solr index directory '/home/jenkins/workspace/Lucene-Solr-5.x-Linux/solr/build/solr-core/test/J1/temp/solr.cloud.HttpPartitionTest_48AAE2F144024F8-001/shard-1-001/cores/collection1/data/index' doesn't exist. Creating new index...
   [junit4]   2> 752371 INFO  (coreLoadExecutor-3024-thread-1-processing-n:127.0.0.1:50764_) [n:127.0.0.1:50764_ c:collection1 s:shard2 r:core_node1 x:collection1] o.a.s.c.CachingDirectoryFactory return new directory for /home/jenkins/workspace/Lucene-Solr-5.x-Linux/solr/build/solr-core/test/J1/temp/solr.cloud.HttpPartitionTest_48AAE2F144024F8-001/shard-1-001/cores/collection1/data/index
   [junit4]   2> 752371 INFO  (coreLoadExecutor-3024-thread-1-processing-n:127.0.0.1:50764_) [n:127.0.0.1:50764_ c:collection1 s:shard2 r:core_node1 x:collection1] o.a.s.u.RandomMergePolicy RandomMergePolicy wrapping class org.apache.lucene.index.TieredMergePolicy: [TieredMergePolicy: maxMergeAtOnce=46, maxMergeAtOnceExplicit=17, maxMergedSegmentMB=74.01953125, floorSegmentMB=1.091796875, forceMergeDeletesPctAllowed=22.731458214570743, segmentsPerTier=47.0, maxCFSSegmentSizeMB=8.796093022207999E12, noCFSRatio=1.0
   [junit4]   2> 752371 INFO  (coreLoadExecutor-3024-thread-1-processing-n:127.0.0.1:50764_) [n:127.0.0.1:50764_ c:collection1 s:shard2 r:core_node1 x:collection1] o.a.s.c.SolrCore SolrDeletionPolicy.onCommit: commits: num=1
   [junit4]   2> 	commit{dir=MockDirectoryWrapper(RAMDirectory@15299e68 lockFactory=org.apache.lucene.store.SingleInstanceLockFactory@2d94960e),segFN=segments_1,generation=1}
   [junit4]   2> 752371 INFO  (coreLoadExecutor-3024-thread-1-processing-n:127.0.0.1:50764_) [n:127.0.0.1:50764_ c:collection1 s:shard2 r:core_node1 x:collection1] o.a.s.c.SolrCore newest commit generation = 1
   [junit4]   2> 752372 INFO  (OldIndexDirectoryCleanupThreadForCore-collection1) [n:127.0.0.1:50764_ c:collection1 s:shard2 r:core_node1 x:collection1] o.a.s.c.SolrCore Looking for old index directories to cleanup for core collection1 in /home/jenkins/workspace/Lucene-Solr-5.x-Linux/solr/build/solr-core/test/J1/temp/solr.cloud.HttpPartitionTest_48AAE2F144024F8-001/shard-1-001/cores/collection1/data/
   [junit4]   2> 752372 WARN  (OldIndexDirectoryCleanupThreadForCore-collection1) [n:127.0.0.1:50764_ c:collection1 s:shard2 r:core_node1 x:collection1] o.a.s.c.DirectoryFactory /home/jenkins/workspace/Lucene-Solr-5.x-Linux/solr/build/solr-core/test/J1/temp/solr.cloud.HttpPartitionTest_48AAE2F144024F8-001/shard-1-001/cores/collection1/data/ does not point to a valid data directory; skipping clean-up of old index directories.
   [junit4]   2> 752374 INFO  (coreLoadExecutor-3024-thread-1-processing-n:127.0.0.1:50764_) [n:127.0.0.1:50764_ c:collection1 s:shard2 r:core_node1 x:collection1] o.a.s.u.p.UpdateRequestProcessorChain creating updateRequestProcessorChain "nodistrib"
   [junit4]   2> 752374 INFO  (coreLoadExecutor-3024-thread-1-processing-n:127.0.0.1:50764_) [n:127.0.0.1:50764_ c:collection1 s:shard2 r:core_node1 x:collection1] o.a.s.u.p.UpdateRequestProcessorChain creating updateRequestProcessorChain "dedupe"
   [junit4]   2> 752374 INFO  (coreLoadExecutor-3024-thread-1-processing-n:127.0.0.1:50764_) [n:127.0.0.1:50764_ c:collection1 s:shard2 r:core_node1 x:collection1] o.a.s.u.p.UpdateRequestProcessorChain inserting DistributedUpdateProcessorFactory into updateRequestProcessorChain "dedupe"
   [junit4]   2> 752374 INFO  (coreLoadExecutor-3024-thread-1-processing-n:127.0.0.1:50764_) [n:127.0.0.1:50764_ c:collection1 s:shard2 r:core_node1 x:collection1] o.a.s.u.p.UpdateRequestProcessorChain creating updateRequestProcessorChain "stored_sig"
   [junit4]   2> 752374 INFO  (coreLoadExecutor-3024-thread-1-processing-n:127.0.0.1:50764_) [n:127.0.0.1:50764_ c:collection1 s:shard2 r:core_node1 x:collection1] o.a.s.u.p.UpdateRequestProcessorChain inserting DistributedUpdateProcessorFactory into updateRequestProcessorChain "stored_sig"
   [junit4]   2> 752374 INFO  (coreLoadExecutor-3024-thread-1-processing-n:127.0.0.1:50764_) [n:127.0.0.1:50764_ c:collection1 s:shard2 r:core_node1 x:collection1] o.a.s.u.p.UpdateRequestProcessorChain creating updateRequestProcessorChain "distrib-dup-test-chain-explicit"
   [junit4]   2> 752374 INFO  (coreLoadExecutor-3024-thread-1-processing-n:127.0.0.1:50764_) [n:127.0.0.1:50764_ c:collection1 s:shard2 r:core_node1 x:collection1] o.a.s.u.p.UpdateRequestProcessorChain creating updateRequestProcessorChain "distrib-dup-test-chain-implicit"
   [junit4]   2> 752375 INFO  (coreLoadExecutor-3024-thread-1-processing-n:127.0.0.1:50764_) [n:127.0.0.1:50764_ c:collection1 s:shard2 r:core_node1 x:collection1] o.a.s.u.p.UpdateRequestProcessorChain inserting DistributedUpdateProcessorFactory into updateRequestProcessorChain "distrib-dup-test-chain-implicit"
   [junit4]   2> 752375 INFO  (coreLoadExecutor-3024-thread-1-processing-n:127.0.0.1:50764_) [n:127.0.0.1:50764_ c:collection1 s:shard2 r:core_node1 x:collection1] o.a.s.c.SolrCore no updateRequestProcessorChain defined as default, creating implicit default
   [junit4]   2> 752376 INFO  (coreLoadExecutor-3024-thread-1-processing-n:127.0.0.1:50764_) [n:127.0.0.1:50764_ c:collection1 s:shard2 r:core_node1 x:collection1] o.a.s.h.l.XMLLoader xsltCacheLifetimeSeconds=60
   [junit4]   2> 752376 INFO  (coreLoadExecutor-3024-thread-1-processing-n:127.0.0.1:50764_) [n:127.0.0.1:50764_ c:collection1 s:shard2 r:core_node1 x:collection1] o.a.s.h.l.XMLLoader xsltCacheLifetimeSeconds=60
   [junit4]   2> 752377 INFO  (coreLoadExecutor-3024-thread-1-processing-n:127.0.0.1:50764_) [n:127.0.0.1:50764_ c:collection1 s:shard2 r:core_node1 x:collection1] o.a.s.h.l.XMLLoader

[...truncated too long message...]

ctUpdateHandler2.addDoc0(DirectUpdateHandler2.java:202)
   [junit4]   2> 	at org.apache.solr.update.DirectUpdateHandler2.addDoc(DirectUpdateHandler2.java:164)
   [junit4]   2> 	at org.apache.solr.update.processor.RunUpdateProcessor.processAdd(RunUpdateProcessorFactory.java:69)
   [junit4]   2> 	at org.apache.solr.update.processor.UpdateRequestProcessor.processAdd(UpdateRequestProcessor.java:51)
   [junit4]   2> 	at org.apache.solr.update.processor.DistributedUpdateProcessor.doLocalAdd(DistributedUpdateProcessor.java:954)
   [junit4]   2> 	at org.apache.solr.update.processor.DistributedUpdateProcessor.versionAdd(DistributedUpdateProcessor.java:1109)
   [junit4]   2> 	at org.apache.solr.update.processor.DistributedUpdateProcessor.processAdd(DistributedUpdateProcessor.java:705)
   [junit4]   2> 	at org.apache.solr.update.processor.LogUpdateProcessor.processAdd(LogUpdateProcessorFactory.java:104)
   [junit4]   2> 	at org.apache.solr.handler.loader.JavabinLoader$1.update(JavabinLoader.java:101)
   [junit4]   2> 	at org.apache.solr.client.solrj.request.JavaBinUpdateRequestCodec$1.readOuterMostDocIterator(JavaBinUpdateRequestCodec.java:179)
   [junit4]   2> 	at org.apache.solr.client.solrj.request.JavaBinUpdateRequestCodec$1.readIterator(JavaBinUpdateRequestCodec.java:135)
   [junit4]   2> 	at org.apache.solr.common.util.JavaBinCodec.readVal(JavaBinCodec.java:249)
   [junit4]   2> 	at org.apache.solr.client.solrj.request.JavaBinUpdateRequestCodec$1.readNamedList(JavaBinUpdateRequestCodec.java:121)
   [junit4]   2> 	at org.apache.solr.common.util.JavaBinCodec.readVal(JavaBinCodec.java:214)
   [junit4]   2> 	at org.apache.solr.common.util.JavaBinCodec.unmarshal(JavaBinCodec.java:134)
   [junit4]   2> 	at org.apache.solr.client.solrj.request.JavaBinUpdateRequestCodec.unmarshal(JavaBinUpdateRequestCodec.java:186)
   [junit4]   2> 	at org.apache.solr.handler.loader.JavabinLoader.parseAndLoadDocs(JavabinLoader.java:111)
   [junit4]   2> 	at org.apache.solr.handler.loader.JavabinLoader.load(JavabinLoader.java:58)
   [junit4]   2> 	at org.apache.solr.handler.UpdateRequestHandler$1.load(UpdateRequestHandler.java:98)
   [junit4]   2> 	at org.apache.solr.handler.ContentStreamHandlerBase.handleRequestBody(ContentStreamHandlerBase.java:74)
   [junit4]   2> 	at org.apache.solr.handler.RequestHandlerBase.handleRequest(RequestHandlerBase.java:151)
   [junit4]   2> 	at org.apache.solr.core.SolrCore.execute(SolrCore.java:2079)
   [junit4]   2> 	at org.apache.solr.servlet.HttpSolrCall.execute(HttpSolrCall.java:667)
   [junit4]   2> 	at org.apache.solr.servlet.HttpSolrCall.call(HttpSolrCall.java:460)
   [junit4]   2> 	at org.apache.solr.servlet.SolrDispatchFilter.doFilter(SolrDispatchFilter.java:210)
   [junit4]   2> 	at org.apache.solr.servlet.SolrDispatchFilter.doFilter(SolrDispatchFilter.java:179)
   [junit4]   2> 	at org.eclipse.jetty.servlet.ServletHandler$CachedChain.doFilter(ServletHandler.java:1652)
   [junit4]   2> 	at org.apache.solr.client.solrj.embedded.JettySolrRunner$DebugFilter.doFilter(JettySolrRunner.java:106)
   [junit4]   2> 	at org.eclipse.jetty.servlet.ServletHandler$CachedChain.doFilter(ServletHandler.java:1652)
   [junit4]   2> 	at org.eclipse.jetty.servlets.UserAgentFilter.doFilter(UserAgentFilter.java:83)
   [junit4]   2> 	at org.eclipse.jetty.servlets.GzipFilter.doFilter(GzipFilter.java:300)
   [junit4]   2> 	at org.eclipse.jetty.servlet.ServletHandler$CachedChain.doFilter(ServletHandler.java:1652)
   [junit4]   2> 	at org.eclipse.jetty.servlet.ServletHandler.doHandle(ServletHandler.java:585)
   [junit4]   2> 	at org.eclipse.jetty.server.session.SessionHandler.doHandle(SessionHandler.java:221)
   [junit4]   2> 	at org.eclipse.jetty.server.handler.ContextHandler.doHandle(ContextHandler.java:1127)
   [junit4]   2> 	at org.eclipse.jetty.servlet.ServletHandler.doScope(ServletHandler.java:515)
   [junit4]   2> 	at org.eclipse.jetty.server.session.SessionHandler.doScope(SessionHandler.java:185)
   [junit4]   2> 	at org.eclipse.jetty.server.handler.ContextHandler.doScope(ContextHandler.java:1061)
   [junit4]   2> 	at org.eclipse.jetty.server.handler.ScopedHandler.handle(ScopedHandler.java:141)
   [junit4]   2> 	at org.eclipse.jetty.server.handler.HandlerWrapper.handle(HandlerWrapper.java:97)
   [junit4]   2> 	at org.eclipse.jetty.server.Server.handle(Server.java:499)
   [junit4]   2> 	at org.eclipse.jetty.server.HttpChannel.handle(HttpChannel.java:310)
   [junit4]   2> 	at org.eclipse.jetty.server.HttpConnection.onFillable(HttpConnection.java:257)
   [junit4]   2> 	at org.eclipse.jetty.io.AbstractConnection$2.run(AbstractConnection.java:540)
   [junit4]   2> 	at org.eclipse.jetty.util.thread.QueuedThreadPool.runJob(QueuedThreadPool.java:635)
   [junit4]   2> 	at org.eclipse.jetty.util.thread.QueuedThreadPool$3.run(QueuedThreadPool.java:555)
   [junit4]   2> 	at java.lang.Thread.run(Thread.java:745)
   [junit4]   2> 
   [junit4]   2> Aug 18, 2015 8:06:52 AM com.carrotsearch.randomizedtesting.ThreadLeakControl checkThreadLeaks
   [junit4]   2> WARNING: Will linger awaiting termination of 1 leaked thread(s).
   [junit4]   2> NOTE: test params are: codec=Asserting(Lucene53): {range_facet_l_dv=PostingsFormat(name=Asserting), _version_=Lucene50(blocksize=128), multiDefault=PostingsFormat(name=LuceneVarGapFixedInterval), a_t=Lucene50(blocksize=128), intDefault=Lucene50(blocksize=128), id=PostingsFormat(name=Asserting), range_facet_i_dv=Lucene50(blocksize=128), text=PostingsFormat(name=Memory doPackFST= true), range_facet_l=Lucene50(blocksize=128), timestamp=Lucene50(blocksize=128)}, docValues:{range_facet_l_dv=DocValuesFormat(name=Memory), range_facet_i_dv=DocValuesFormat(name=Asserting), timestamp=DocValuesFormat(name=Asserting)}, sim=DefaultSimilarity, locale=ar_AE, timezone=Asia/Muscat
   [junit4]   2> NOTE: Linux 3.19.0-25-generic amd64/Oracle Corporation 1.8.0_51 (64-bit)/cpus=12,threads=1,free=201657008,total=518979584
   [junit4]   2> NOTE: All tests run in this JVM: [PreAnalyzedFieldTest, TestRemoveLastDynamicCopyField, CopyFieldTest, TestCoreDiscovery, FieldMutatingUpdateProcessorTest, TestRTGBase, EchoParamsTest, OpenCloseCoreStressTest, TestElisionMultitermQuery, ShardRoutingCustomTest, HdfsDirectoryTest, BadComponentTest, TestLeaderElectionZkExpiry, TestJsonFacets, TestCoreContainer, TestSolrConfigHandlerCloud, SpellCheckComponentTest, TestPHPSerializedResponseWriter, StatelessScriptUpdateProcessorFactoryTest, AnalysisAfterCoreReloadTest, SSLMigrationTest, DistributedQueueTest, TestCloudManagedSchemaConcurrent, TestValueSourceCache, RequiredFieldsTest, TestBlobHandler, SolrPluginUtilsTest, TestSolrDeletionPolicy2, ZkCLITest, TestTolerantSearch, CollectionReloadTest, FileUtilsTest, TestSearchPerf, HdfsWriteToMultipleCollectionsTest, DocumentAnalysisRequestHandlerTest, TestConfigOverlay, BasicFunctionalityTest, HdfsCollectionsAPIDistributedZkTest, TestAuthorizationFramework, CoreAdminRequestStatusTest, DocValuesMissingTest, TestCharFilters, DistributedFacetPivotSmallTest, TestDistributedStatsComponentCardinality, ScriptEngineTest, TestLRUCache, DistributedFacetPivotLargeTest, TestHashPartitioner, CacheHeaderTest, TestFiltering, TestSuggestSpellingConverter, TestDistributedGrouping, ReplicationFactorTest, TestSolrConfigHandlerConcurrent, RemoteQueryErrorTest, ZkSolrClientTest, RAMDirectoryFactoryTest, TestFastLRUCache, ShowFileRequestHandlerTest, TestReloadAndDeleteDocs, SolrCmdDistributorTest, HdfsChaosMonkeySafeLeaderTest, TestConfigSets, TestSortByMinMaxFunction, TestFieldSortValues, TestFileDictionaryLookup, CoreAdminHandlerTest, FieldAnalysisRequestHandlerTest, TestSolrCoreProperties, WordBreakSolrSpellCheckerTest, TriLevelCompositeIdRoutingTest, TestLFUCache, CloudMLTQParserTest, ShardRoutingTest, JSONWriterTest, CachingDirectoryFactoryTest, ChaosMonkeySafeLeaderTest, TestDistribDocBasedVersion, TestFastWriter, MergeStrategyTest, ConvertedLegacyTest, TestFieldCollectionResource, CollectionStateFormat2Test, TestExceedMaxTermLength, TestJsonRequest, JsonLoaderTest, HttpPartitionTest]
   [junit4]   2> NOTE: reproduce with: ant test  -Dtestcase=HttpPartitionTest -Dtests.seed=48AAE2F144024F8 -Dtests.multiplier=3 -Dtests.slow=true -Dtests.locale=ar_AE -Dtests.timezone=Asia/Muscat -Dtests.asserts=true -Dtests.file.encoding=ISO-8859-1
   [junit4] ERROR   0.00s J1 | HttpPartitionTest (suite) <<<
   [junit4]    > Throwable #1: java.lang.AssertionError: ObjectTracker found 1 object(s) that were not released!!! [TransactionLog]
   [junit4]    > 	at __randomizedtesting.SeedInfo.seed([48AAE2F144024F8]:0)
   [junit4]    > 	at org.apache.solr.SolrTestCaseJ4.afterClass(SolrTestCaseJ4.java:236)
   [junit4]    > 	at java.lang.Thread.run(Thread.java:745)
   [junit4] Completed [257/533] on J1 in 135.06s, 1 test, 1 failure <<< FAILURES!

[...truncated 854 lines...]
BUILD FAILED
/home/jenkins/workspace/Lucene-Solr-5.x-Linux/build.xml:785: The following error occurred while executing this line:
/home/jenkins/workspace/Lucene-Solr-5.x-Linux/build.xml:729: The following error occurred while executing this line:
/home/jenkins/workspace/Lucene-Solr-5.x-Linux/build.xml:59: The following error occurred while executing this line:
/home/jenkins/workspace/Lucene-Solr-5.x-Linux/solr/build.xml:233: The following error occurred while executing this line:
/home/jenkins/workspace/Lucene-Solr-5.x-Linux/solr/common-build.xml:524: The following error occurred while executing this line:
/home/jenkins/workspace/Lucene-Solr-5.x-Linux/lucene/common-build.xml:1449: The following error occurred while executing this line:
/home/jenkins/workspace/Lucene-Solr-5.x-Linux/lucene/common-build.xml:1003: There were test failures: 533 suites, 2114 tests, 1 suite-level error, 67 ignored (31 assumptions)

Total time: 44 minutes 48 seconds
Build step 'Invoke Ant' marked build as failure
Archiving artifacts
[WARNINGS] Skipping publisher since build result is FAILURE
Recording test results
Email was triggered for: Failure - Any
Sending email for trigger: Failure - Any



Mime
View raw message