lucene-dev mailing list archives

Site index · List index
Message view « Date » · « Thread »
Top « Date » · « Thread »
From Policeman Jenkins Server <jenk...@thetaphi.de>
Subject [JENKINS] Lucene-Solr-trunk-Linux (64bit/jdk1.8.0_51) - Build # 13942 - Failure!
Date Fri, 21 Aug 2015 08:09:46 GMT
Build: http://jenkins.thetaphi.de/job/Lucene-Solr-trunk-Linux/13942/
Java: 64bit/jdk1.8.0_51 -XX:-UseCompressedOops -XX:+UseParallelGC

2 tests failed.
FAILED:  junit.framework.TestSuite.org.apache.solr.cloud.HttpPartitionTest

Error Message:
ObjectTracker found 1 object(s) that were not released!!! [TransactionLog]

Stack Trace:
java.lang.AssertionError: ObjectTracker found 1 object(s) that were not released!!! [TransactionLog]
	at __randomizedtesting.SeedInfo.seed([EA3C0AEF8115A7B6]:0)
	at org.junit.Assert.fail(Assert.java:93)
	at org.junit.Assert.assertTrue(Assert.java:43)
	at org.junit.Assert.assertNull(Assert.java:551)
	at org.apache.solr.SolrTestCaseJ4.afterClass(SolrTestCaseJ4.java:236)
	at sun.reflect.GeneratedMethodAccessor32.invoke(Unknown Source)
	at sun.reflect.DelegatingMethodAccessorImpl.invoke(DelegatingMethodAccessorImpl.java:43)
	at java.lang.reflect.Method.invoke(Method.java:497)
	at com.carrotsearch.randomizedtesting.RandomizedRunner.invoke(RandomizedRunner.java:1627)
	at com.carrotsearch.randomizedtesting.RandomizedRunner$5.evaluate(RandomizedRunner.java:799)
	at com.carrotsearch.randomizedtesting.rules.StatementAdapter.evaluate(StatementAdapter.java:36)
	at com.carrotsearch.randomizedtesting.rules.SystemPropertiesRestoreRule$1.evaluate(SystemPropertiesRestoreRule.java:57)
	at org.apache.lucene.util.AbstractBeforeAfterRule$1.evaluate(AbstractBeforeAfterRule.java:46)
	at com.carrotsearch.randomizedtesting.rules.StatementAdapter.evaluate(StatementAdapter.java:36)
	at org.apache.lucene.util.TestRuleStoreClassName$1.evaluate(TestRuleStoreClassName.java:42)
	at com.carrotsearch.randomizedtesting.rules.NoShadowingOrOverridesOnMethodsRule$1.evaluate(NoShadowingOrOverridesOnMethodsRule.java:39)
	at com.carrotsearch.randomizedtesting.rules.NoShadowingOrOverridesOnMethodsRule$1.evaluate(NoShadowingOrOverridesOnMethodsRule.java:39)
	at com.carrotsearch.randomizedtesting.rules.StatementAdapter.evaluate(StatementAdapter.java:36)
	at com.carrotsearch.randomizedtesting.rules.StatementAdapter.evaluate(StatementAdapter.java:36)
	at com.carrotsearch.randomizedtesting.rules.StatementAdapter.evaluate(StatementAdapter.java:36)
	at org.apache.lucene.util.TestRuleAssertionsRequired$1.evaluate(TestRuleAssertionsRequired.java:54)
	at org.apache.lucene.util.TestRuleMarkFailure$1.evaluate(TestRuleMarkFailure.java:48)
	at org.apache.lucene.util.TestRuleIgnoreAfterMaxFailures$1.evaluate(TestRuleIgnoreAfterMaxFailures.java:65)
	at org.apache.lucene.util.TestRuleIgnoreTestSuites$1.evaluate(TestRuleIgnoreTestSuites.java:55)
	at com.carrotsearch.randomizedtesting.rules.StatementAdapter.evaluate(StatementAdapter.java:36)
	at com.carrotsearch.randomizedtesting.ThreadLeakControl$StatementRunner.run(ThreadLeakControl.java:365)
	at java.lang.Thread.run(Thread.java:745)


FAILED:  org.apache.solr.handler.TestReplicationHandler.doTestIndexAndConfigAliasReplication

Error Message:
[/home/jenkins/workspace/Lucene-Solr-trunk-Linux/solr/build/solr-core/test/J0/temp/solr.handler.TestReplicationHandler_EA3C0AEF8115A7B6-001/solr-instance-009/./collection1/data, /home/jenkins/workspace/Lucene-Solr-trunk-Linux/solr/build/solr-core/test/J0/temp/solr.handler.TestReplicationHandler_EA3C0AEF8115A7B6-001/solr-instance-009/./collection1/data/index.20150821035507673, /home/jenkins/workspace/Lucene-Solr-trunk-Linux/solr/build/solr-core/test/J0/temp/solr.handler.TestReplicationHandler_EA3C0AEF8115A7B6-001/solr-instance-009/./collection1/data/index.20150821035507772] expected:<2> but was:<3>

Stack Trace:
java.lang.AssertionError: [/home/jenkins/workspace/Lucene-Solr-trunk-Linux/solr/build/solr-core/test/J0/temp/solr.handler.TestReplicationHandler_EA3C0AEF8115A7B6-001/solr-instance-009/./collection1/data, /home/jenkins/workspace/Lucene-Solr-trunk-Linux/solr/build/solr-core/test/J0/temp/solr.handler.TestReplicationHandler_EA3C0AEF8115A7B6-001/solr-instance-009/./collection1/data/index.20150821035507673, /home/jenkins/workspace/Lucene-Solr-trunk-Linux/solr/build/solr-core/test/J0/temp/solr.handler.TestReplicationHandler_EA3C0AEF8115A7B6-001/solr-instance-009/./collection1/data/index.20150821035507772] expected:<2> but was:<3>
	at __randomizedtesting.SeedInfo.seed([EA3C0AEF8115A7B6:1D4FE4B747FD0850]:0)
	at org.junit.Assert.fail(Assert.java:93)
	at org.junit.Assert.failNotEquals(Assert.java:647)
	at org.junit.Assert.assertEquals(Assert.java:128)
	at org.junit.Assert.assertEquals(Assert.java:472)
	at org.apache.solr.handler.TestReplicationHandler.checkForSingleIndex(TestReplicationHandler.java:813)
	at org.apache.solr.handler.TestReplicationHandler.doTestIndexAndConfigAliasReplication(TestReplicationHandler.java:1243)
	at sun.reflect.NativeMethodAccessorImpl.invoke0(Native Method)
	at sun.reflect.NativeMethodAccessorImpl.invoke(NativeMethodAccessorImpl.java:62)
	at sun.reflect.DelegatingMethodAccessorImpl.invoke(DelegatingMethodAccessorImpl.java:43)
	at java.lang.reflect.Method.invoke(Method.java:497)
	at com.carrotsearch.randomizedtesting.RandomizedRunner.invoke(RandomizedRunner.java:1627)
	at com.carrotsearch.randomizedtesting.RandomizedRunner$6.evaluate(RandomizedRunner.java:836)
	at com.carrotsearch.randomizedtesting.RandomizedRunner$7.evaluate(RandomizedRunner.java:872)
	at com.carrotsearch.randomizedtesting.RandomizedRunner$8.evaluate(RandomizedRunner.java:886)
	at com.carrotsearch.randomizedtesting.rules.SystemPropertiesRestoreRule$1.evaluate(SystemPropertiesRestoreRule.java:57)
	at org.apache.lucene.util.TestRuleSetupTeardownChained$1.evaluate(TestRuleSetupTeardownChained.java:50)
	at org.apache.lucene.util.AbstractBeforeAfterRule$1.evaluate(AbstractBeforeAfterRule.java:46)
	at org.apache.lucene.util.TestRuleThreadAndTestName$1.evaluate(TestRuleThreadAndTestName.java:49)
	at org.apache.lucene.util.TestRuleIgnoreAfterMaxFailures$1.evaluate(TestRuleIgnoreAfterMaxFailures.java:65)
	at org.apache.lucene.util.TestRuleMarkFailure$1.evaluate(TestRuleMarkFailure.java:48)
	at com.carrotsearch.randomizedtesting.rules.StatementAdapter.evaluate(StatementAdapter.java:36)
	at com.carrotsearch.randomizedtesting.ThreadLeakControl$StatementRunner.run(ThreadLeakControl.java:365)
	at com.carrotsearch.randomizedtesting.ThreadLeakControl.forkTimeoutingTask(ThreadLeakControl.java:798)
	at com.carrotsearch.randomizedtesting.ThreadLeakControl$3.evaluate(ThreadLeakControl.java:458)
	at com.carrotsearch.randomizedtesting.RandomizedRunner.runSingleTest(RandomizedRunner.java:845)
	at com.carrotsearch.randomizedtesting.RandomizedRunner$3.evaluate(RandomizedRunner.java:747)
	at com.carrotsearch.randomizedtesting.RandomizedRunner$4.evaluate(RandomizedRunner.java:781)
	at com.carrotsearch.randomizedtesting.RandomizedRunner$5.evaluate(RandomizedRunner.java:792)
	at com.carrotsearch.randomizedtesting.rules.StatementAdapter.evaluate(StatementAdapter.java:36)
	at com.carrotsearch.randomizedtesting.rules.SystemPropertiesRestoreRule$1.evaluate(SystemPropertiesRestoreRule.java:57)
	at org.apache.lucene.util.AbstractBeforeAfterRule$1.evaluate(AbstractBeforeAfterRule.java:46)
	at com.carrotsearch.randomizedtesting.rules.StatementAdapter.evaluate(StatementAdapter.java:36)
	at org.apache.lucene.util.TestRuleStoreClassName$1.evaluate(TestRuleStoreClassName.java:42)
	at com.carrotsearch.randomizedtesting.rules.NoShadowingOrOverridesOnMethodsRule$1.evaluate(NoShadowingOrOverridesOnMethodsRule.java:39)
	at com.carrotsearch.randomizedtesting.rules.NoShadowingOrOverridesOnMethodsRule$1.evaluate(NoShadowingOrOverridesOnMethodsRule.java:39)
	at com.carrotsearch.randomizedtesting.rules.StatementAdapter.evaluate(StatementAdapter.java:36)
	at com.carrotsearch.randomizedtesting.rules.StatementAdapter.evaluate(StatementAdapter.java:36)
	at com.carrotsearch.randomizedtesting.rules.StatementAdapter.evaluate(StatementAdapter.java:36)
	at org.apache.lucene.util.TestRuleAssertionsRequired$1.evaluate(TestRuleAssertionsRequired.java:54)
	at org.apache.lucene.util.TestRuleMarkFailure$1.evaluate(TestRuleMarkFailure.java:48)
	at org.apache.lucene.util.TestRuleIgnoreAfterMaxFailures$1.evaluate(TestRuleIgnoreAfterMaxFailures.java:65)
	at org.apache.lucene.util.TestRuleIgnoreTestSuites$1.evaluate(TestRuleIgnoreTestSuites.java:55)
	at com.carrotsearch.randomizedtesting.rules.StatementAdapter.evaluate(StatementAdapter.java:36)
	at com.carrotsearch.randomizedtesting.ThreadLeakControl$StatementRunner.run(ThreadLeakControl.java:365)
	at java.lang.Thread.run(Thread.java:745)




Build Log:
[...truncated 9950 lines...]
   [junit4] Suite: org.apache.solr.handler.TestReplicationHandler
   [junit4]   2> Creating dataDir: /home/jenkins/workspace/Lucene-Solr-trunk-Linux/solr/build/solr-core/test/J0/temp/solr.handler.TestReplicationHandler_EA3C0AEF8115A7B6-001/init-core-data-001
   [junit4]   2> 762028 INFO  (TEST-TestReplicationHandler.testEmptyCommits-seed#[EA3C0AEF8115A7B6]) [    ] o.a.s.SolrTestCaseJ4 ###Starting testEmptyCommits
   [junit4]   2> 762029 INFO  (TEST-TestReplicationHandler.testEmptyCommits-seed#[EA3C0AEF8115A7B6]) [    ] o.a.s.SolrTestCaseJ4 Writing core.properties file to /home/jenkins/workspace/Lucene-Solr-trunk-Linux/solr/build/solr-core/test/J0/temp/solr.handler.TestReplicationHandler_EA3C0AEF8115A7B6-001/solr-instance-001/collection1
   [junit4]   2> 762031 INFO  (TEST-TestReplicationHandler.testEmptyCommits-seed#[EA3C0AEF8115A7B6]) [    ] o.e.j.s.Server jetty-9.2.13.v20150730
   [junit4]   2> 762032 INFO  (TEST-TestReplicationHandler.testEmptyCommits-seed#[EA3C0AEF8115A7B6]) [    ] o.e.j.s.h.ContextHandler Started o.e.j.s.ServletContextHandler@54d1f043{/solr,null,AVAILABLE}
   [junit4]   2> 762034 INFO  (TEST-TestReplicationHandler.testEmptyCommits-seed#[EA3C0AEF8115A7B6]) [    ] o.e.j.s.ServerConnector Started ServerConnector@53a58ac8{HTTP/1.1}{127.0.0.1:35852}
   [junit4]   2> 762034 INFO  (TEST-TestReplicationHandler.testEmptyCommits-seed#[EA3C0AEF8115A7B6]) [    ] o.e.j.s.Server Started @763783ms
   [junit4]   2> 762034 INFO  (TEST-TestReplicationHandler.testEmptyCommits-seed#[EA3C0AEF8115A7B6]) [    ] o.a.s.c.s.e.JettySolrRunner Jetty properties: {solr.data.dir=/home/jenkins/workspace/Lucene-Solr-trunk-Linux/solr/build/solr-core/test/J0/temp/solr.handler.TestReplicationHandler_EA3C0AEF8115A7B6-001/solr-instance-001/collection1/data, hostContext=/solr, hostPort=35852}
   [junit4]   2> 762034 INFO  (TEST-TestReplicationHandler.testEmptyCommits-seed#[EA3C0AEF8115A7B6]) [    ] o.a.s.s.SolrDispatchFilter SolrDispatchFilter.init(): sun.misc.Launcher$AppClassLoader@4e0e2f2a
   [junit4]   2> 762034 INFO  (TEST-TestReplicationHandler.testEmptyCommits-seed#[EA3C0AEF8115A7B6]) [    ] o.a.s.c.SolrResourceLoader new SolrResourceLoader for directory: '/home/jenkins/workspace/Lucene-Solr-trunk-Linux/solr/build/solr-core/test/J0/temp/solr.handler.TestReplicationHandler_EA3C0AEF8115A7B6-001/solr-instance-001/'
   [junit4]   2> 762042 INFO  (TEST-TestReplicationHandler.testEmptyCommits-seed#[EA3C0AEF8115A7B6]) [    ] o.a.s.c.SolrXmlConfig Loading container configuration from /home/jenkins/workspace/Lucene-Solr-trunk-Linux/solr/build/solr-core/test/J0/temp/solr.handler.TestReplicationHandler_EA3C0AEF8115A7B6-001/solr-instance-001/solr.xml
   [junit4]   2> 762045 INFO  (TEST-TestReplicationHandler.testEmptyCommits-seed#[EA3C0AEF8115A7B6]) [    ] o.a.s.c.CoresLocator Config-defined core root directory: /home/jenkins/workspace/Lucene-Solr-trunk-Linux/solr/build/solr-core/test/J0/temp/solr.handler.TestReplicationHandler_EA3C0AEF8115A7B6-001/solr-instance-001/.
   [junit4]   2> 762045 INFO  (TEST-TestReplicationHandler.testEmptyCommits-seed#[EA3C0AEF8115A7B6]) [    ] o.a.s.c.CoreContainer New CoreContainer 2089559190
   [junit4]   2> 762045 INFO  (TEST-TestReplicationHandler.testEmptyCommits-seed#[EA3C0AEF8115A7B6]) [    ] o.a.s.c.CoreContainer Loading cores into CoreContainer [instanceDir=/home/jenkins/workspace/Lucene-Solr-trunk-Linux/solr/build/solr-core/test/J0/temp/solr.handler.TestReplicationHandler_EA3C0AEF8115A7B6-001/solr-instance-001/]
   [junit4]   2> 762045 INFO  (TEST-TestReplicationHandler.testEmptyCommits-seed#[EA3C0AEF8115A7B6]) [    ] o.a.s.c.CoreContainer loading shared library: /home/jenkins/workspace/Lucene-Solr-trunk-Linux/solr/build/solr-core/test/J0/temp/solr.handler.TestReplicationHandler_EA3C0AEF8115A7B6-001/solr-instance-001/lib
   [junit4]   2> 762045 WARN  (TEST-TestReplicationHandler.testEmptyCommits-seed#[EA3C0AEF8115A7B6]) [    ] o.a.s.c.SolrResourceLoader Can't find (or read) directory to add to classloader: lib (resolved as: /home/jenkins/workspace/Lucene-Solr-trunk-Linux/solr/build/solr-core/test/J0/temp/solr.handler.TestReplicationHandler_EA3C0AEF8115A7B6-001/solr-instance-001/lib).
   [junit4]   2> 762049 INFO  (TEST-TestReplicationHandler.testEmptyCommits-seed#[EA3C0AEF8115A7B6]) [    ] o.a.s.h.c.HttpShardHandlerFactory created with socketTimeout : 90000,urlScheme : ,connTimeout : 15000,maxConnectionsPerHost : 20,maxConnections : 10000,corePoolSize : 0,maximumPoolSize : 2147483647,maxThreadIdleTime : 5,sizeOfQueue : -1,fairnessPolicy : false,useRetries : false,
   [junit4]   2> 762050 INFO  (TEST-TestReplicationHandler.testEmptyCommits-seed#[EA3C0AEF8115A7B6]) [    ] o.a.s.u.UpdateShardHandler Creating UpdateShardHandler HTTP client with params: socketTimeout=340000&connTimeout=45000&retry=true
   [junit4]   2> 762050 INFO  (TEST-TestReplicationHandler.testEmptyCommits-seed#[EA3C0AEF8115A7B6]) [    ] o.a.s.l.LogWatcher SLF4J impl is org.slf4j.impl.Log4jLoggerFactory
   [junit4]   2> 762050 INFO  (TEST-TestReplicationHandler.testEmptyCommits-seed#[EA3C0AEF8115A7B6]) [    ] o.a.s.l.LogWatcher Registering Log Listener [Log4j (org.slf4j.impl.Log4jLoggerFactory)]
   [junit4]   2> 762051 INFO  (TEST-TestReplicationHandler.testEmptyCommits-seed#[EA3C0AEF8115A7B6]) [    ] o.a.s.c.CoreContainer Security conf doesn't exist. Skipping setup for authorization module.
   [junit4]   2> 762051 INFO  (TEST-TestReplicationHandler.testEmptyCommits-seed#[EA3C0AEF8115A7B6]) [    ] o.a.s.c.CoreContainer No authentication plugin used.
   [junit4]   2> 762051 INFO  (TEST-TestReplicationHandler.testEmptyCommits-seed#[EA3C0AEF8115A7B6]) [    ] o.a.s.c.CoresLocator Looking for core definitions underneath /home/jenkins/workspace/Lucene-Solr-trunk-Linux/solr/build/solr-core/test/J0/temp/solr.handler.TestReplicationHandler_EA3C0AEF8115A7B6-001/solr-instance-001/.
   [junit4]   2> 762052 INFO  (TEST-TestReplicationHandler.testEmptyCommits-seed#[EA3C0AEF8115A7B6]) [    ] o.a.s.c.SolrCore Created CoreDescriptor: {name=collection1, config=solrconfig.xml, transient=false, schema=schema.xml, loadOnStartup=true, configSetProperties=configsetprops.json, instanceDir=/home/jenkins/workspace/Lucene-Solr-trunk-Linux/solr/build/solr-core/test/J0/temp/solr.handler.TestReplicationHandler_EA3C0AEF8115A7B6-001/solr-instance-001/./collection1, absoluteInstDir=/home/jenkins/workspace/Lucene-Solr-trunk-Linux/solr/build/solr-core/test/J0/temp/solr.handler.TestReplicationHandler_EA3C0AEF8115A7B6-001/solr-instance-001/./collection1/, dataDir=data/}
   [junit4]   2> 762052 INFO  (TEST-TestReplicationHandler.testEmptyCommits-seed#[EA3C0AEF8115A7B6]) [    ] o.a.s.c.CoresLocator Found core collection1 in /home/jenkins/workspace/Lucene-Solr-trunk-Linux/solr/build/solr-core/test/J0/temp/solr.handler.TestReplicationHandler_EA3C0AEF8115A7B6-001/solr-instance-001/./collection1/
   [junit4]   2> 762052 INFO  (TEST-TestReplicationHandler.testEmptyCommits-seed#[EA3C0AEF8115A7B6]) [    ] o.a.s.c.CoresLocator Found 1 core definitions
   [junit4]   2> 762052 INFO  (coreLoadExecutor-2308-thread-1) [    ] o.a.s.c.SolrResourceLoader new SolrResourceLoader for directory: '/home/jenkins/workspace/Lucene-Solr-trunk-Linux/solr/build/solr-core/test/J0/temp/solr.handler.TestReplicationHandler_EA3C0AEF8115A7B6-001/solr-instance-001/./collection1/'
   [junit4]   2> 762052 INFO  (TEST-TestReplicationHandler.testEmptyCommits-seed#[EA3C0AEF8115A7B6]) [    ] o.a.s.s.SolrDispatchFilter user.dir=/home/jenkins/workspace/Lucene-Solr-trunk-Linux/solr/build/solr-core/test/J0
   [junit4]   2> 762052 INFO  (TEST-TestReplicationHandler.testEmptyCommits-seed#[EA3C0AEF8115A7B6]) [    ] o.a.s.s.SolrDispatchFilter SolrDispatchFilter.init() done
   [junit4]   2> 762061 INFO  (coreLoadExecutor-2308-thread-1) [    ] o.a.s.c.SolrConfig current version of requestparams : -1
   [junit4]   2> 762063 INFO  (coreLoadExecutor-2308-thread-1) [    ] o.a.s.c.SolrConfig Using Lucene MatchVersion: 6.0.0
   [junit4]   2> 762077 INFO  (coreLoadExecutor-2308-thread-1) [    ] o.a.s.c.Config Loaded SolrConfig: solrconfig.xml
   [junit4]   2> 762078 INFO  (coreLoadExecutor-2308-thread-1) [    ] o.a.s.s.IndexSchema Reading Solr Schema from /home/jenkins/workspace/Lucene-Solr-trunk-Linux/solr/build/solr-core/test/J0/temp/solr.handler.TestReplicationHandler_EA3C0AEF8115A7B6-001/solr-instance-001/./collection1/conf/schema.xml
   [junit4]   2> 762080 INFO  (coreLoadExecutor-2308-thread-1) [    ] o.a.s.s.IndexSchema [collection1] Schema name=test
   [junit4]   2> 762081 INFO  (coreLoadExecutor-2308-thread-1) [    ] o.a.s.s.IndexSchema unique key field: id
   [junit4]   2> 762082 INFO  (coreLoadExecutor-2308-thread-1) [    ] o.a.s.c.ConfigSetProperties Did not find ConfigSet properties, assuming default properties: Can't find resource 'configsetprops.json' in classpath or '/home/jenkins/workspace/Lucene-Solr-trunk-Linux/solr/build/solr-core/test/J0/temp/solr.handler.TestReplicationHandler_EA3C0AEF8115A7B6-001/solr-instance-001/./collection1/conf'
   [junit4]   2> 762082 INFO  (coreLoadExecutor-2308-thread-1) [    ] o.a.s.c.CoreContainer Creating SolrCore 'collection1' using configuration from instancedir /home/jenkins/workspace/Lucene-Solr-trunk-Linux/solr/build/solr-core/test/J0/temp/solr.handler.TestReplicationHandler_EA3C0AEF8115A7B6-001/solr-instance-001/./collection1/
   [junit4]   2> 762082 INFO  (coreLoadExecutor-2308-thread-1) [    x:collection1] o.a.s.c.SolrCore org.apache.solr.core.MockDirectoryFactory
   [junit4]   2> 762082 INFO  (coreLoadExecutor-2308-thread-1) [    x:collection1] o.a.s.c.SolrCore [[collection1] ] Opening new SolrCore at [/home/jenkins/workspace/Lucene-Solr-trunk-Linux/solr/build/solr-core/test/J0/temp/solr.handler.TestReplicationHandler_EA3C0AEF8115A7B6-001/solr-instance-001/./collection1/], dataDir=[null]
   [junit4]   2> 762082 INFO  (coreLoadExecutor-2308-thread-1) [    x:collection1] o.a.s.c.SolrCore JMX monitoring not detected for core: collection1
   [junit4]   2> 762082 INFO  (coreLoadExecutor-2308-thread-1) [    x:collection1] o.a.s.c.CachingDirectoryFactory return new directory for /home/jenkins/workspace/Lucene-Solr-trunk-Linux/solr/build/solr-core/test/J0/temp/solr.handler.TestReplicationHandler_EA3C0AEF8115A7B6-001/solr-instance-001/./collection1/data
   [junit4]   2> 762082 INFO  (coreLoadExecutor-2308-thread-1) [    x:collection1] o.a.s.c.SolrCore New index directory detected: old=null new=/home/jenkins/workspace/Lucene-Solr-trunk-Linux/solr/build/solr-core/test/J0/temp/solr.handler.TestReplicationHandler_EA3C0AEF8115A7B6-001/solr-instance-001/./collection1/data/index/
   [junit4]   2> 762083 WARN  (coreLoadExecutor-2308-thread-1) [    x:collection1] o.a.s.c.SolrCore [collection1] Solr index directory '/home/jenkins/workspace/Lucene-Solr-trunk-Linux/solr/build/solr-core/test/J0/temp/solr.handler.TestReplicationHandler_EA3C0AEF8115A7B6-001/solr-instance-001/./collection1/data/index' doesn't exist. Creating new index...
   [junit4]   2> 762083 INFO  (coreLoadExecutor-2308-thread-1) [    x:collection1] o.a.s.c.CachingDirectoryFactory return new directory for /home/jenkins/workspace/Lucene-Solr-trunk-Linux/solr/build/solr-core/test/J0/temp/solr.handler.TestReplicationHandler_EA3C0AEF8115A7B6-001/solr-instance-001/./collection1/data/index
   [junit4]   2> 762083 INFO  (coreLoadExecutor-2308-thread-1) [    x:collection1] o.a.s.u.RandomMergePolicy RandomMergePolicy wrapping class org.apache.lucene.index.LogByteSizeMergePolicy: [LogByteSizeMergePolicy: minMergeSize=1677721, mergeFactor=24, maxMergeSize=2147483648, maxMergeSizeForForcedMerge=9223372036854775807, calibrateSizeByDeletes=true, maxMergeDocs=2147483647, maxCFSSegmentSizeMB=8.796093022207999E12, noCFSRatio=1.0]
   [junit4]   2> 762083 INFO  (coreLoadExecutor-2308-thread-1) [    x:collection1] o.a.s.c.SolrCore SolrDeletionPolicy.onCommit: commits: num=1
   [junit4]   2> 	commit{dir=MockDirectoryWrapper(RAMDirectory@e40d68 lockFactory=org.apache.lucene.store.SingleInstanceLockFactory@29e0d87f),segFN=segments_1,generation=1}
   [junit4]   2> 762083 INFO  (coreLoadExecutor-2308-thread-1) [    x:collection1] o.a.s.c.SolrCore newest commit generation = 1
   [junit4]   2> 762084 INFO  (OldIndexDirectoryCleanupThreadForCore-collection1) [    x:collection1] o.a.s.c.SolrCore Looking for old index directories to cleanup for core collection1 in /home/jenkins/workspace/Lucene-Solr-trunk-Linux/solr/build/solr-core/test/J0/temp/solr.handler.TestReplicationHandler_EA3C0AEF8115A7B6-001/solr-instance-001/./collection1/data/
   [junit4]   2> 762085 INFO  (coreLoadExecutor-2308-thread-1) [    x:collection1] o.a.s.c.SolrCore no updateRequestProcessorChain defined as default, creating implicit default
   [junit4]   2> 762086 INFO  (coreLoadExecutor-2308-thread-1) [    x:collection1] o.a.s.h.l.XMLLoader xsltCacheLifetimeSeconds=60
   [junit4]   2> 762086 INFO  (coreLoadExecutor-2308-thread-1) [    x:collection1] o.a.s.h.l.XMLLoader xsltCacheLifetimeSeconds=60
   [junit4]   2> 762087 INFO  (coreLoadExecutor-2308-thread-1) [    x:collection1] o.a.s.h.l.XMLLoader xsltCacheLifetimeSeconds=60
   [junit4]   2> 762087 INFO  (coreLoadExecutor-2308-thread-1) [    x:collection1] o.a.s.h.l.XMLLoader xsltCacheLifetimeSeconds=60
   [junit4]   2> 762089 INFO  (coreLoadExecutor-2308-thread-1) [    x:collection1] o.a.s.c.PluginBag requestHandler : 'lazy' created with startup=lazy 
   [junit4]   2> 762089 INFO  (coreLoadExecutor-2308-thread-1) [    x:collection1] o.a.s.c.RequestHandlers Registered paths: /admin/mbeans,standard,lazy,/update/csv,/update/json/docs,/admin/luke,/admin/segments,/get,/admin/system,/replication,/admin/properties,defaults,/config,/schema,/admin/plugins,/admin/logging,/update/json,/admin/threads,/admin/ping,/update,/admin/file
   [junit4]   2> 762090 INFO  (coreLoadExecutor-2308-thread-1) [    x:collection1] o.a.s.c.SolrCore Using default statsCache cache: org.apache.solr.search.stats.LocalStatsCache
   [junit4]   2> 762090 INFO  (coreLoadExecutor-2308-thread-1) [    x:collection1] o.a.s.c.SolrCore Hard AutoCommit: disabled
   [junit4]   2> 762090 INFO  (coreLoadExecutor-2308-thread-1) [    x:collection1] o.a.s.c.SolrCore Soft AutoCommit: disabled
   [junit4]   2> 762090 INFO  (coreLoadExecutor-2308-thread-1) [    x:collection1] o.a.s.u.RandomMergePolicy RandomMergePolicy wrapping class org.apache.lucene.index.AlcoholicMergePolicy: [AlcoholicMergePolicy: minMergeSize=0, mergeFactor=10, maxMergeSize=1142661903, maxMergeSizeForForcedMerge=9223372036854775807, calibrateSizeByDeletes=true, maxMergeDocs=2147483647, maxCFSSegmentSizeMB=8.796093022207999E12, noCFSRatio=0.1]
   [junit4]   2> 762090 INFO  (coreLoadExecutor-2308-thread-1) [    x:collection1] o.a.s.c.SolrCore SolrDeletionPolicy.onInit: commits: num=1
   [junit4]   2> 	commit{dir=MockDirectoryWrapper(RAMDirectory@e40d68 lockFactory=org.apache.lucene.store.SingleInstanceLockFactory@29e0d87f),segFN=segments_1,generation=1}
   [junit4]   2> 762090 INFO  (coreLoadExecutor-2308-thread-1) [    x:collection1] o.a.s.c.SolrCore newest commit generation = 1
   [junit4]   2> 762091 INFO  (coreLoadExecutor-2308-thread-1) [    x:collection1] o.a.s.s.SolrIndexSearcher Opening Searcher@42c386d0[collection1] main
   [junit4]   2> 762091 INFO  (coreLoadExecutor-2308-thread-1) [    x:collection1] o.a.s.r.ManagedResourceStorage File-based storage initialized to use dir: /home/jenkins/workspace/Lucene-Solr-trunk-Linux/solr/build/solr-core/test/J0/temp/solr.handler.TestReplicationHandler_EA3C0AEF8115A7B6-001/solr-instance-001/./collection1/conf
   [junit4]   2> 762091 INFO  (coreLoadExecutor-2308-thread-1) [    x:collection1] o.a.s.r.RestManager Initializing RestManager with initArgs: {storageDir=/home/jenkins/workspace/Lucene-Solr-trunk-Linux/solr/build/solr-core/test/J0/temp/solr.handler.TestReplicationHandler_EA3C0AEF8115A7B6-001/solr-instance-001/./collection1/conf}
   [junit4]   2> 762091 INFO  (coreLoadExecutor-2308-thread-1) [    x:collection1] o.a.s.r.ManagedResourceStorage Reading _rest_managed.json using file:dir=/home/jenkins/workspace/Lucene-Solr-trunk-Linux/solr/build/solr-core/test/J0/temp/solr.handler.TestReplicationHandler_EA3C0AEF8115A7B6-001/solr-instance-001/./collection1/conf
   [junit4]   2> 762092 INFO  (coreLoadExecutor-2308-thread-1) [    x:collection1] o.a.s.r.RestManager Initializing 0 registered ManagedResources
   [junit4]   2> 762092 INFO  (coreLoadExecutor-2308-thread-1) [    x:collection1] o.a.s.h.ReplicationHandler Replication enabled for following config files: schema.xml,xslt/dummy.xsl
   [junit4]   2> 762092 INFO  (coreLoadExecutor-2308-thread-1) [    x:collection1] o.a.s.h.ReplicationHandler Commits will be reserved for  10000
   [junit4]   2> 762092 INFO  (searcherExecutor-2309-thread-1-processing-x:collection1) [    x:collection1] o.a.s.c.SolrCore [collection1] Registered new searcher Searcher@42c386d0[collection1] main{ExitableDirectoryReader(UninvertingDirectoryReader())}
   [junit4]   2> 762092 INFO  (coreLoadExecutor-2308-thread-1) [    x:collection1] o.a.s.c.CoreContainer registering core: collection1
   [junit4]   2> 762553 INFO  (TEST-TestReplicationHandler.testEmptyCommits-seed#[EA3C0AEF8115A7B6]) [    ] o.a.s.SolrTestCaseJ4 Writing core.properties file to /home/jenkins/workspace/Lucene-Solr-trunk-Linux/solr/build/solr-core/test/J0/temp/solr.handler.TestReplicationHandler_EA3C0AEF8115A7B6-001/solr-instance-002/collection1
   [junit4]   2> 762555 INFO  (TEST-TestReplicationHandler.testEmptyCommits-seed#[EA3C0AEF8115A7B6]) [    ] o.e.j.s.Server jetty-9.2.13.v20150730
   [junit4]   2> 762556 INFO  (TEST-TestReplicationHandler.testEmptyCommits-seed#[EA3C0AEF8115A7B6]) [    ] o.e.j.s.h.ContextHandler Started o.e.j.s.ServletContextHandler@1f971bc0{/solr,null,AVAILABLE}
   [junit4]   2> 762556 INFO  (TEST-TestReplicationHandler.testEmptyCommits-seed#[EA3C0AEF8115A7B6]) [    ] o.e.j.s.ServerConnector Started ServerConnector@39b29373{HTTP/1.1}{127.0.0.1:38117}
   [junit4]   2> 762556 INFO  (TEST-TestReplicationHandler.testEmptyCommits-seed#[EA3C0AEF8115A7B6]) [    ] o.e.j.s.Server Started @764306ms
   [junit4]   2> 762556 INFO  (TEST-TestReplicationHandler.testEmptyCommits-seed#[EA3C0AEF8115A7B6]) [    ] o.a.s.c.s.e.JettySolrRunner Jetty properties: {solr.data.dir=/home/jenkins/workspace/Lucene-Solr-trunk-Linux/solr/build/solr-core/test/J0/temp/solr.handler.TestReplicationHandler_EA3C0AEF8115A7B6-001/solr-instance-002/collection1/data, hostContext=/solr, hostPort=38117}
   [junit4]   2> 762557 INFO  (TEST-TestReplicationHandler.testEmptyCommits-seed#[EA3C0AEF8115A7B6]) [    ] o.a.s.s.SolrDispatchFilter SolrDispatchFilter.init(): sun.misc.Launcher$AppClassLoader@4e0e2f2a
   [junit4]   2> 762557 INFO  (TEST-TestReplicationHandler.testEmptyCommits-seed#[EA3C0AEF8115A7B6]) [    ] o.a.s.c.SolrResourceLoader new SolrResourceLoader for directory: '/home/jenkins/workspace/Lucene-Solr-trunk-Linux/solr/build/solr-core/test/J0/temp/solr.handler.TestReplicationHandler_EA3C0AEF8115A7B6-001/solr-instance-002/'
   [junit4]   2> 762564 INFO  (TEST-TestReplicationHandler.testEmptyCommits-seed#[EA3C0AEF8115A7B6]) [    ] o.a.s.c.SolrXmlConfig Loading container configuration from /home/jenkins/workspace/Lucene-Solr-trunk-Linux/solr/build/solr-core/test/J0/temp/solr.handler.TestReplicationHandler_EA3C0AEF8115A7B6-001/solr-instance-002/solr.xml
   [junit4]   2> 762567 INFO  (TEST-TestReplicationHandler.testEmptyCommits-seed#[EA3C0AEF8115A7B6]) [    ] o.a.s.c.CoresLocator Config-defined core root directory: /home/jenkins/workspace/Lucene-Solr-trunk-Linux/solr/build/solr-core/test/J0/temp/solr.handler.TestReplicationHandler_EA3C0AEF8115A7B6-001/solr-instance-002/.
   [junit4]   2> 762567 INFO  (TEST-TestReplicationHandler.testEmptyCommits-seed#[EA3C0AEF8115A7B6]) [    ] o.a.s.c.CoreContainer New CoreContainer 2107752612
   [junit4]   2> 762567 INFO  (TEST-TestReplicationHandler.testEmptyCommits-seed#[EA3C0AEF8115A7B6]) [    ] o.a.s.c.CoreContainer Loading cores into CoreContainer [instanceDir=/home/jenkins/workspace/Lucene-Solr-trunk-Linux/solr/build/solr-core/test/J0/temp/solr.handler.TestReplicationHandler_EA3C0AEF8115A7B6-001/solr-instance-002/]
   [junit4]   2> 762567 INFO  (TEST-TestReplicationHandler.testEmptyCommits-seed#[EA3C0AEF8115A7B6]) [    ] o.a.s.c.CoreContainer loading shared library: /home/jenkins/workspace/Lucene-Solr-trunk-Linux/solr/build/solr-core/test/J0/temp/solr.handler.TestReplicationHandler_EA3C0AEF8115A7B6-001/solr-instance-002/lib
   [junit4]   2> 762567 WARN  (TEST-TestReplicationHandler.testEmptyCommits-seed#[EA3C0AEF8115A7B6]) [    ] o.a.s.c.SolrResourceLoader Can't find (or read) directory to add to classloader: lib (resolved as: /home/jenkins/workspace/Lucene-Solr-trunk-Linux/solr/build/solr-core/test/J0/temp/solr.handler.TestReplicationHandler_EA3C0AEF8115A7B6-001/solr-instance-002/lib).
   [junit4]   2> 762571 INFO  (TEST-TestReplicationHandler.testEmptyCommits-seed#[EA3C0AEF8115A7B6]) [    ] o.a.s.h.c.HttpShardHandlerFactory created with socketTimeout : 90000,urlScheme : ,connTimeout : 15000,maxConnectionsPerHost : 20,maxConnections : 10000,corePoolSize : 0,maximumPoolSize : 2147483647,maxThreadIdleTime : 5,sizeOfQueue : -1,fairnessPolicy : false,useRetries : false,
   [junit4]   2> 762572 INFO  (TEST-TestReplicationHandler.testEmptyCommits-seed#[EA3C0AEF8115A7B6]) [    ] o.a.s.u.UpdateShardHandler Creating UpdateShardHandler HTTP client with params: socketTimeout=340000&connTimeout=45000&retry=true
   [junit4]   2> 762572 INFO  (TEST-TestReplicationHandler.testEmptyCommits-seed#[EA3C0AEF8115A7B6]) [    ] o.a.s.l.LogWatcher SLF4J impl is org.slf4j.impl.Log4jLoggerFactory
   [junit4]   2> 762572 INFO  (TEST-TestReplicationHandler.testEmptyCommits-seed#[EA3C0AEF8115A7B6]) [    ] o.a.s.l.LogWatcher Registering Log Listener [Log4j (org.slf4j.impl.Log4jLoggerFactory)]
   [junit4]   2> 762572 INFO  (TEST-TestReplicationHandler.testEmptyCommits-seed#[EA3C0AEF8115A7B6]) [    ] o.a.s.c.CoreContainer Security conf doesn't exist. Skipping setup for authorization module.
   [junit4]   2> 762573 INFO  (TEST-TestReplicationHandler.testEmptyCommits-seed#[EA3C0AEF8115A7B6]) [    ] o.a.s.c.CoreContainer No authentication plugin used.
   [junit4]   2> 762573 INFO  (TEST-TestReplicationHandler.testEmptyCommits-seed#[EA3C0AEF8115A7B6]) [    ] o.a.s.c.CoresLocator Looking for core definitions underneath /home/jenkins/workspace/Lucene-Solr-trunk-Linux/solr/build/solr-core/test/J0/temp/solr.handler.TestReplicationHandler_EA3C0AEF8115A7B6-001/solr-instance-002/.
   [junit4]   2> 762573 INFO  (TEST-TestReplicationHandler.testEmptyCommits-seed#[EA3C0AEF8115A7B6]) [    ] o.a.s.c.SolrCore Created CoreDescriptor: {name=collection1, config=solrconfig.xml, transient=false, schema=schema.xml, loadOnStartup=true, configSetProperties=configsetprops.json, instanceDir=/home/jenkins/workspace/Lucene-Solr-trunk-Linux/solr/build/solr-core/test/J0/temp/solr.handler.TestReplicationHandler_EA3C0AEF8115A7B6-001/solr-instance-002/./collection1, absoluteInstDir=/home/jenkins/workspace/Lucene-Solr-trunk-Linux/solr/build/solr-core/test/J0/temp/solr.handler.TestReplicationHandler_EA3C0AEF8115A7B6-001/solr-instance-002/./collection1/, dataDir=data/}
   [junit4]   2> 762573 INFO  (TEST-TestReplicationHandler.testEmptyCommits-seed#[EA3C0AEF8115A7B6]) [    ] o.a.s.c.CoresLocator Found core collection1 in /home/jenkins/workspace/Lucene-Solr-trunk-Linux/solr/build/solr-core/test/J0/temp/solr.handler.TestReplicationHandler_EA3C0AEF8115A7B6-001/solr-instance-002/./collection1/
   [junit4]   2> 762574 INFO  (TEST-TestReplicationHandler.testEmptyCommits-seed#[EA3C0AEF8115A7B6]) [    ] o.a.s.c.CoresLocator Found 1 core definitions
   [junit4]   2> 762574 INFO  (coreLoadExecutor-2318-thread-1) [    ] o.a.s.c.SolrResourceLoader new SolrResourceLoader for directory: '/home/jenkins/workspace/Lucene-Solr-trunk-Linux/solr/build/solr-core/test/J0/temp/solr.handler.TestReplicationHandler_EA3C0AEF8115A7B6-001/solr-instance-002/./collection1/'
   [junit4]   2> 762574 INFO  (TEST-TestReplicationHandler.testEmptyCommits-seed#[EA3C0AEF8115A7B6]) [    ] o.a.s.s.SolrDispatchFilter user.dir=/home/jenkins/workspace/Lucene-Solr-trunk-Linux/solr/build/solr-core/test/J0
   [junit4]   2> 762574 INFO  (TEST-TestReplicationHandler.testEmptyCommits-seed#[EA3C0AEF8115A7B6]) [    ] o.a.s.s.SolrDispatchFilter SolrDispatchFilter.init() done
   [junit4]   2> 762582 INFO  (coreLoadExecutor-2318-thread-1) [    ] o.a.s.c.SolrConfig current version of requestparams : -1
   [junit4]   2> 762584 INFO  (coreLoadExecutor-2318-thread-1) [    ] o.a.s.c.SolrConfig Using Lucene MatchVersion: 6.0.0
   [junit4]   2> 762589 INFO  (coreLoadExecutor-2318-thread-1) [    ] o.a.s.c.Config Loaded SolrConfig: solrconfig.xml
   [junit4]   2> 762589 INFO  (coreLoadExecutor-2318-thread-1) [    ] o.a.s.s.IndexSchema Reading Solr Schema from /home/jenkins/workspace/Lucene-Solr-trunk-Linux/solr/build/solr-core/test/J0/temp/solr.handler.TestReplicationHandler_EA3C0AEF8115A7B6-001/solr-instance-002/./collection1/conf/schema.xml
   [junit4]   2> 762591 INFO  (coreLoadExecutor-2318-thread-1) [    ] o.a.s.s.IndexSchema [collection1] Schema name=test
   [junit4]   2> 762592 INFO  (coreLoadExecutor-2318-thread-1) [    ] o.a.s.s.IndexSchema unique key field: id
   [junit4]   2> 762593 INFO  (coreLoadExecutor-2318-thread-1) [    ] o.a.s.c.ConfigSetProperties Did not find ConfigSet properties, assuming default properties: Can't find resource 'configsetprops.json' in classpath or '/home/jenkins/workspace/Lucene-Solr-trunk-Linux/solr/build/solr-core/test/J0/temp/solr.handler.TestReplicationHandler_EA3C0AEF8115A7B6-001/solr-instance-002/./collection1/conf'
   [junit4]   2> 762593 INFO  (coreLoadExecutor-2318-thread-1) [    ] o.a.s.c.CoreContainer Creating SolrCore 'collection1' using configuration from instancedir /home/jenkins/workspace/Lucene-Solr-trunk-Linux/solr/build/solr-core/test/J0/temp/solr.handler.TestReplicationHandler_EA3C0AEF8115A7B6-001/solr-instance-002/./collection1/
   [junit4]   2> 762593 INFO  (coreLoadExecutor-2318-thread-1) [    x:collection1] o.a.s.c.SolrCore org.apache.solr.core.MockDirectoryFactory
   [junit4]   2> 762593 INFO  (coreLoadExecutor-2318-thread-1) [    x:collection1] o.a.s.c.SolrCore [[collection1] ] Opening new SolrCore at [/home/jenkins/workspace/Lucene-Solr-trunk-Linux/solr/build/solr-core/test/J0/temp/solr.handler.TestReplicationHandler_EA3C0AEF8115A7B6-001/solr-instance-002/./collection1/], dataDir=[null]
   [junit4]   2> 762593 INFO  (coreLoadExecutor-2318-thread-1) [    x:collection1] o.a.s.c.SolrCore JMX monitoring not detected for core: collection1
   [junit4]   2> 762593 INFO  (coreLoadExecutor-2318-thread-1) [    x:collection1] o.a.s.c.CachingDirectoryFactory return new directory for /home/jenkins/workspace/Lucene-Solr-trunk-Linux/solr/build/solr-core/test/J0/temp/solr.handler.TestReplicationHandler_EA3C0AEF8115A7B6-001/solr-instance-002/./collection1/data
   [junit4]   2> 762593 INFO  (coreLoadExecutor-2318-thread-1) [    x:collection1] o.a.s.c.SolrCore New index directory detected: old=null new=/home/jenkins/workspace/Lucene-Solr-trunk-Linux/solr/build/solr-core/test/J0/temp/solr.handler.TestReplicationHandler_EA3C0AEF8115A7B6-001/solr-instance-002/./collection1/data/index/
   [junit4]   2> 762594 WARN  (coreLoadExecutor-2318-thread-1) [    x:collection1] o.a.s.c.SolrCore [collection1] Solr index directory '/home/jenkins/workspace/Lucene-Solr-trunk-Linux/solr/build/solr-core/test/J0/temp/solr.handler.TestReplicationHandler_EA3C0AEF8115A7B6-001/solr-instance-002/./collection1/data/index' doesn't exist. Creating new index...
   [junit4]   2> 762594 INFO  (coreLoadExecutor-2318-thread-1) [    x:collection1] o.a.s.c.CachingDirectoryFactory return new directory for /home/jenkins/workspace/Lucene-Solr-trunk-Linux/solr/build/solr-core/test/J0/temp/solr.handler.TestReplicationHandler_EA3C0AEF8115A7B6-001/solr-instance-002/./collection1/data/index
   [junit4]   2> 762594 INFO  (coreLoadExecutor-2318-thread-1) [    x:collection1] o.a.s.u.RandomMergePolicy RandomMergePolicy wrapping class org.apache.lucene.index.LogByteSizeMergePolicy: [LogByteSizeMergePolicy: minMergeSize=1677721, mergeFactor=24, maxMergeSize=2147483648, maxMergeSizeForForcedMerge=9223372036854775807, calibrateSizeByDeletes=true, maxMergeDocs=2147483647, maxCFSSegmentSizeMB=8.796093022207999E12, noCFSRatio=1.0]
   [junit4]   2> 762594 INFO  (coreLoadExecutor-2318-thread-1) [    x:collection1] o.a.s.c.SolrCore SolrDeletionPolicy.onCommit: commits: num=1
   [junit4]   2> 	commit{dir=MockDirectoryWrapper(RAMDirectory@2ff423df lockFactory=org.apache.lucene.store.SingleInstanceLockFactory@725da131),segFN=segments_1,generation=1}
   [junit4]   2> 762594 INFO  (coreLoadExecutor-2318-thread-1) [    x:collection1] o.a.s.c.SolrCore newest commit generation = 1
   [junit4]   2> 762594 INFO  (OldIndexDirectoryCleanupThreadForCore-collection1) [    x:collection1] o.a.s.c.SolrCore Looking for old index directories to cleanup for core collection1 in /home/jenkins/workspace/Lucene-Solr-trunk-Linux/solr/build/solr-core/test/J0/temp/solr.handler.TestReplicationHandler_EA3C0AEF8115A7B6-001/solr-instance-002/./collection1/data/
   [junit4]   2> 762596 INFO  (coreLoadExecutor-2318-thread-1) [    x:collection1] o.a.s.c.SolrCore no updateRequestProcessorChain defined as default, creating implicit default
   [junit4]   2> 762597 INFO  (coreLoadExecutor-2318-thread-1) [    x:collection1] o.a.s.h.l.XMLLoader xsltCacheLifetimeSeconds=60
   [junit4]   2> 762597 INFO  (coreLoadExecutor-2318-thread-1) [    x:collection1] o.a.s.h.l.XMLLoader xsltCacheLifetimeSeconds=60
   [junit4]   2> 762597 INFO  (coreLoadExecutor-2318-thread-1) [    x:collection1] o.a.s.h.l.XMLLoader xsltCacheLifetimeSeconds=60
   [junit4]   2> 762598 INFO  (coreLoadExecutor-2318-thread-1) [    x:collection1] o.a.s.h.l.XMLLoader xsltCacheLifetimeSeconds=60
   [junit4]   2> 762598 INFO  (coreLoadExecutor-2318-thread-1) [    x:collection1] o.a.s.c.PluginBag requestHandler : 'lazy' created with startup=lazy 
   [junit4]   2> 762598 INFO  (coreLoadExecutor-2318-thread-1) [    x:collection1] o.a.s.c.RequestHandlers Registered paths: /admin/mbeans,standard,lazy,/update/csv,/update/json/docs,/admin/luke,/admin/segments,/get,/admin/system,/replication,/admin/properties,defaults,/config,/schema,/admin/plugins,/admin/logging,/update/json,/admin/threads,/admin/ping,/update,/admin/file
   [junit4]   2> 762599 INFO  (coreLoadExecutor-2318-thread-1) [    x:collection1] o.a.s.c.SolrCore Using default statsCache cache: org.apache.solr.search.stats.LocalStatsCache
   [junit4]   2> 762599 INFO  (coreLoadExecutor-2318-thread-1) [    x:collection1] o.a.s.c.SolrCore Hard AutoCommit: disabled
   [junit4]   2> 762599 INFO  (coreLoadExecutor-2318-thread-1) [    x:collection1] o.a.s.c.SolrCore Soft AutoCommit: disabled
   [junit4]   2> 762600 INFO  (coreLoadExecutor-2318-thread-1) [    x:collection1] o.a.s.u.RandomMergePolicy RandomMergePolicy wrapping class org.apache.lucene.index.AlcoholicMergePolicy: [AlcoholicMergePolicy: minMergeSize=0, mergeFactor=10, maxMergeSize=1142661903, maxMergeSizeForForcedMerge=9223372036854775807, calibrateSizeByDeletes=true, maxMergeDocs=2147483647, maxCFSSegmentSizeMB=8.796093022207999E12, noCFSRatio=0.1]
   [junit4]   2> 762600 INFO  (coreLoadExecutor-2318-thread-1) [    x:collection1] o.a.s.c.SolrCore SolrDeletionPolicy.onInit: commits: num=1
   [junit4]   2> 	commit{dir=MockDirectoryWrapper(RAMDirectory@2ff423df lockFactory=org.apache.lucene.store.SingleInstanceLockFactory@725da131),segFN=segments_1,generation=1}
   [junit4]   2> 762600 INFO  (coreLoadExecutor-2318-thread-1) [    x:collection1] o.a.s.c.SolrCore newest commit generation = 1
   [junit4]   2> 762600 INFO  (coreLoadExecutor-2318-thread-1) [    x:collection1] o.a.s.s.SolrIndexSearcher Opening Searcher@43c36b2d[collection1] main
   [junit4]   2> 762600 INFO  (coreLoadExecutor-2318-thread-1) [    x:collection1] o.a.s.r.ManagedResourceStorage File-based storage initialized to use dir: /home/jenkins/workspace/Lucene-Solr-trunk-Linux/solr/build/solr-core/test/J0/temp/solr.handler.TestReplicationHandler_EA3C0AEF8115A7B6-001/solr-instance-002/./collection1/conf
   [junit4]   2> 762600 INFO  (coreLoadExecutor-2318-thread-1) [    x:collection1] o.a.s.r.RestManager Initializing RestManager with initArgs: {storageDir=/home/jenkins/workspace/Lucene-Solr-trunk-Linux/solr/build/solr-core/test/J0/temp/solr.handler.TestReplicationHandler_EA3C0AEF8115A7B6-001/solr-instance-002/./collection1/conf}
   [junit4]   2> 762600 INFO  (coreLoadExecutor-2318-thread-1) [    x:collection1] o.a.s.r.ManagedResourceStorage Reading _rest_managed.json using file:dir=/home/jenkins/workspace/Lucene-Solr-trunk-Linux/solr/build/solr-core/test/J0/temp/solr.handler.TestReplicationHandler_EA3C0AEF8115A7B6-001/solr-instance-002/./collection1/conf
   [junit4]   2> 762601 INFO  (coreLoadExecutor-2318-thread-1) [    x:collection1] o.a.s.r.RestManager Initializing 0 registered ManagedResources
   [junit4]   2> 762602 INFO  (coreLoadExecutor-2318-thread-1) [    x:collection1] o.a.s.h.ReplicationHandler Poll scheduled at an interval of 1000ms
   [junit4]   2> 762602 INFO  (searcherExecutor-2319-thread-1-processing-x:collection1) [    x:collection1] o.a.s.c.SolrCore [collection1] Registered new searcher Searcher@43c36b2d[collection1] main{ExitableDirectoryReader(UninvertingDirectoryReader())}
   [junit4]   2> 762602 INFO  (coreLoadExecutor-2318-thread-1) [    x:collection1] o.a.s.c.CoreContainer registering core: collection1
   [junit4]   2> 762604 INFO  (qtp1982718321-5724) [    x:collection1] o.a.s.c.S.Request [collection1] webapp=/solr path=/replication params={qt=/replication&wt=javabin&version=2&command=indexversion} status=0 QTime=0 
   [junit4]   2> 763076 INFO  (qtp1982718321-5725) [    x:collection1] o.a.s.c.S.Request [collection1] webapp=/solr path=/select params={q=*:*&sort=id+desc&wt=javabin&version=2} hits=0 status=0 QTime=0 
   [junit4]   2> 763078 INFO  (qtp1982718321-5726) [    x:collection1] o.a.s.u.p.LogUpdateProcessor [collection1] webapp=/solr path=/update params={wt=javabin&version=2} {add=[1]} 0 0
   [junit4]   2> 763079 INFO  (qtp1982718321-5724) [    x:collection1] o.a.s.u.UpdateHandler start commit{,optimize=false,openSearcher=true,waitSearcher=true,expungeDeletes=false,softCommit=false,prepareCommit=false}
   [junit4]   2> 763080 INFO  (qtp1982718321-5724) [    x:collection1] o.a.s.c.SolrCore SolrDeletionPolicy.onCommit: commits: num=2
   [junit4]   2> 	commit{dir=MockDirectoryWrapper(RAMDirectory@e40d68 lockFactory=org.apache.lucene.store.SingleInstanceLockFactory@29e0d87f),segFN=segments_1,generation=1}
   [junit4]   2> 	commit{dir=MockDirectoryWrapper(RAMDirectory@e40d68 lockFactory=org.apache.lucene.store.SingleInstanceLockFactory@29e0d87f),segFN=segments_2,generation=2}
   [junit4]   2> 763081 INFO  (qtp1982718321-5724) [    x:collection1] o.a.s.c.SolrCore newest commit generation = 2
   [junit4]   2> 763081 INFO  (qtp1982718321-5724) [    x:collection1] o.a.s.s.SolrIndexSearcher Opening Searcher@df240c2[collection1] main
   [junit4]   2> 763082 INFO  (qtp1982718321-5724) [    x:collection1] o.a.s.u.UpdateHandler end_commit_flush
   [junit4]   2> 763082 INFO  (searcherExecutor-2309-thread-1-processing-x:collection1) [    x:collection1] o.a.s.c.SolrCore [collection1] Registered new searcher Searcher@df240c2[collection1] main{ExitableDirectoryReader(UninvertingDirectoryReader(Uninverting(_0(6.0.0):c1)))}
   [junit4]   2> 763082 INFO  (qtp1982718321-5724) [    x:collection1] o.a.s.u.p.LogUpdateProcessor [collection1] webapp=/solr path=/update params={commit=true&wt=javabin&version=2} {commit=} 0 2
   [junit4]   2> 763094 WARN  (explicit-fetchindex-cmd) [    x:collection1] o.a.s.h.IndexFetcher 'masterUrl' must be specified without the /replication suffix
   [junit4]   2> 763096 INFO  (qtp1982718321-5725) [    x:collection1] o.a.s.c.S.Request [collection1] webapp=/solr path=/replication params={qt=/replication&wt=javabin&version=2&command=indexversion} status=0 QTime=0 
   [junit4]   2> 763097 INFO  (explicit-fetchindex-cmd) [    x:collection1] o.a.s.h.IndexFetcher Master's generation: 2
   [junit4]   2> 763097 INFO  (explicit-fetchindex-cmd) [    x:collection1] o.a.s.h.IndexFetcher Slave's generation: 1
   [junit4]   2> 763097 INFO  (explicit-fetchindex-cmd) [    x:collection1] o.a.s.h.IndexFetcher Starting replication process
   [junit4]   2> 763100 INFO  (qtp1982718321-5726) [    x:collection1] o.a.s.c.S.Request [collection1] webapp=/solr path=/replication params={generation=2&qt=/replication&wt=javabin&version=2&command=filelist} status=0 QTime=1 
   [junit4]   2> 763100 INFO  (explicit-fetchindex-cmd) [    x:collection1] o.a.s.h.IndexFetcher Number of files in latest index in master: 4
   [junit4]   2> 763101 INFO  (explicit-fetchindex-cmd) [    x:collection1] o.a.s.c.CachingDirectoryFactory return new directory for /home/jenkins/workspace/Lucene-Solr-trunk-Linux/solr/build/solr-core/test/J0/temp/solr.handler.TestReplicationHandler_EA3C0AEF8115A7B6-001/solr-instance-002/./collection1/data/index.20150821035446311
   [junit4]   2> 763101 INFO  (explicit-fetchindex-cmd) [    x:collection1] o.a.s.u.DefaultSolrCoreState Creating new IndexWriter...
   [junit4]   2> 763101 INFO  (explicit-fetchindex-cmd) [    x:collection1] o.a.s.u.DefaultSolrCoreState Waiting until IndexWriter is unused... core=collection1
   [junit4]   2> 763101 INFO  (explicit-fetchindex-cmd) [    x:collection1] o.a.s.u.DefaultSolrCoreState Rollback old IndexWriter... core=collection1
   [junit4]   2> 763101 INFO  (explicit-fetchindex-cmd) [    x:collection1] o.a.s.u.RandomMergePolicy RandomMergePolicy wrapping class org.apache.lucene.index.TieredMergePolicy: [TieredMergePolicy: maxMergeAtOnce=17, maxMergeAtOnceExplicit=37, maxMergedSegmentMB=62.494140625, floorSegmentMB=1.3427734375, forceMergeDeletesPctAllowed=20.077109814240465, segmentsPerTier=36.0, maxCFSSegmentSizeMB=8.796093022207999E12, noCFSRatio=0.49467623169944297
   [junit4]   2> 763102 INFO  (explicit-fetchindex-cmd) [    x:collection1] o.a.s.c.SolrCore SolrDeletionPolicy.onInit: commits: num=1
   [junit4]   2> 	commit{dir=MockDirectoryWrapper(RAMDirectory@2ff423df lockFactory=org.apache.lucene.store.SingleInstanceLockFactory@725da131),segFN=segments_1,generation=1}
   [junit4]   2> 763102 INFO  (explicit-fetchindex-cmd) [    x:collection1] o.a.s.c.SolrCore newest commit generation = 1
   [junit4]   2> 763102 INFO  (explicit-fetchindex-cmd) [    x:collection1] o.a.s.u.DefaultSolrCoreState New IndexWriter is ready to be used.
   [junit4]   2> 763102 INFO  (explicit-fetchindex-cmd) [    x:collection1] o.a.s.c.SolrCore SolrDeletionPolicy.onCommit: commits: num=1
   [junit4]   2> 	commit{dir=MockDirectoryWrapper(RAMDirectory@2ff423df lockFactory=org.apache.lucene.store.SingleInstanceLockFactory@725da131),segFN=segments_1,generation=1}
   [junit4]   2> 763102 INFO  (explicit-fetchindex-cmd) [    x:collection1] o.a.s.c.SolrCore newest commit generation = 1
   [junit4]   2> 763102 INFO  (explicit-fetchindex-cmd) [    x:collection1] o.a.s.u.DefaultSolrCoreState Closing IndexWriter...
   [junit4]   2> 763102 INFO  (explicit-fetchindex-cmd) [    x:collection1] o.a.s.u.DefaultSolrCoreState Waiting until IndexWriter is unused... core=collection1
   [junit4]   2> 763102 INFO  (explicit-fetchindex-cmd) [    x:collection1] o.a.s.u.DefaultSolrCoreState Rollback old IndexWriter... core=collection1
   [junit4]   2> 763103 INFO  (explicit-fetchindex-cmd) [    x:collection1] o.a.s.h.IndexFetcher Starting download to MockDirectoryWrapper(RAMDirectory@33514718 lockFactory=org.apache.lucene.store.SingleInstanceLockFactory@6bb1785c) fullCopy=false
   [junit4]   2> 763104 INFO  (qtp1982718321-5724) [    x:collection1] o.a.s.c.S.Request [collection1] webapp=/solr path=/replication params={generation=2&qt=/replication&file=_0.cfe&checksum=true&wt=filestream&command=filecontent} status=0 QTime=0 
   [junit4]   2> 763106 INFO  (qtp1982718321-5725) [    x:collection1] o.a.s.c.S.Request [collection1] webapp=/solr path=/replication params={generation=2&qt=/replication&file=_0.si&checksum=true&wt=filestream&command=filecontent} status=0 QTime=0 
   [junit4]   2> 763109 INFO  (qtp1982718321-5726) [    x:collection1] o.a.s.c.S.Request [collection1] webapp=/solr path=/replication params={generation=2&qt=/replication&file=_0.cfs&checksum=true&wt=filestream&command=filecontent} status=0 QTime=0 
   [junit4]   2> 763111 INFO  (qtp1982718321-5724) [    x:collection1] o.a.s.c.S.Request [collection1] webapp=/solr path=/replication params={generation=2&qt=/replication&file=segments_2&checksum=true&wt=filestream&command=filecontent} status=0 QTime=0 
   [junit4]   2> 763111 INFO  (explicit-fetchindex-cmd) [    x:collection1] o.a.s.h.IndexFetcher Total time taken for download: 0 secs
   [junit4]   2> 763112 INFO  (explicit-fetchindex-cmd) [    x:collection1] o.a.s.u.DefaultSolrCoreState Creating new IndexWriter...
   [junit4]   2> 763112 INFO  (explicit-fetchindex-cmd) [    x:collection1] o.a.s.u.RandomMergePolicy RandomMergePolicy wrapping class org.apache.lucene.index.TieredMergePolicy: [TieredMergePolicy: maxMergeAtOnce=26, maxMergeAtOnceExplicit=32, maxMergedSegmentMB=0.5595703125, floorSegmentMB=1.7158203125, forceMergeDeletesPctAllowed=26.897401867002827, segmentsPerTier=44.0, maxCFSSegmentSizeMB=8.796093022207999E12, noCFSRatio=0.31838294991707655
   [junit4]   2> 763113 INFO  (explicit-fetchindex-cmd) [    x:collection1] o.a.s.c.SolrCore SolrDeletionPolicy.onInit: commits: num=2
   [junit4]   2> 	commit{dir=MockDirectoryWrapper(RAMDirectory@2ff423df lockFactory=org.apache.lucene.store.SingleInstanceLockFactory@725da131),segFN=segments_1,generation=1}
   [junit4]   2> 	commit{dir=MockDirectoryWrapper(RAMDirectory@2ff423df lockFactory=org.apache.lucene.store.SingleInstanceLockFactory@725da131),segFN=segments_2,generation=2}
   [junit4]   2> 763113 INFO  (explicit-fetchindex-cmd) [    x:collection1] o.a.s.c.SolrCore newest commit generation = 2
   [junit4]   2> 763113 INFO  (explicit-fetchindex-cmd) [    x:collection1] o.a.s.u.DefaultSolrCoreState New IndexWriter is ready to be used.
   [junit4]   2> 763113 INFO  (explicit-fetchindex-cmd) [    x:collection1] o.a.s.s.SolrIndexSearcher Opening Searcher@bbf05e1[collection1] main
   [junit4]   2> 763113 INFO  (searcherExecutor-2319-thread-1-processing-x:collection1) [    x:collection1] o.a.s.c.SolrCore [collection1] Registered new searcher Searcher@bbf05e1[collection1] main{ExitableDirectoryReader(UninvertingDirectoryReader(Uninverting(_0(6.0.0):c1)))}
   [junit4]   2> 763113 INFO  (explicit-fetchindex-cmd) [    x:collection1] o.a.s.c.CachingDirectoryFactory looking to close /home/jenkins/workspace/Lucene-Solr-trunk-Linux/solr/build/solr-core/test/J0/temp/solr.handler.TestReplicationHandler_EA3C0AEF8115A7B6-001/solr-instance-002/./collection1/data/index.20150821035446311 [CachedDir<<refCount=0;path=/home/jenkins/workspace/Lucene-Solr-trunk-Linux/solr/build/solr-core/test/J0/temp/solr.handler.TestReplicationHandler_EA3C0AEF8115A7B6-001/solr-instance-002/./collection1/data/index.20150821035446311;done=true>>]
   [junit4]   2> 763113 INFO  (explicit-fetchindex-cmd) [    x:collection1] o.a.s.c.CachingDirectoryFactory Closing directory: /home/jenkins/workspace/Lucene-Solr-trunk-Linux/solr/build/solr-core/test/J0/temp/solr.handler.TestReplicationHandler_EA3C0AEF8115A7B6-001/solr-instance-002/./collection1/data/index.20150821035446311
   [junit4]   2> 763114 INFO  (qtp534711906-5742) [    x:collection1] o.a.s.c.S.Request [collection1] webapp=/solr path=/replication params={wait=true&masterUrl=http://127.0.0.1:35852/solr/collection1/replication&command=fetchindex} status=0 QTime=19 
   [junit4]   2> 763120 INFO  (qtp534711906-5743) [    x:collection1] o.a.s.c.S.Request [collection1] webapp=/solr path=/select params={q=name:empty1&sort=id+desc&wt=javabin&version=2} hits=1 status=0 QTime=0 
   [junit4]   2> 763120 INFO  (TEST-TestReplicationHandler.testEmptyCommits-seed#[EA3C0AEF8115A7B6]) [    ] o.a.s.SolrTestCaseJ4 Waited for 0ms and found 1 docs
   [junit4]   2> 763122 INFO  (qtp1982718321-5725) [    x:collection1] o.a.s.c.S.Request [collection1] webapp=/solr path=/replication params={_trace=getDetails&qt=/replication&wt=javabin&version=2&command=details} status=0 QTime=0 
   [junit4]   2> 763123 INFO  (qtp1982718321-5726) [    x:collection1] o.a.s.c.S.Request [collection1] webapp=/solr path=/replication params={_trace=getDetails&qt=/replication&wt=javabin&version=2&command=details} status=0 QTime=0 
   [junit4]   2> 763127 INFO  (qtp1982718321-5724) [    x:collection1] o.a.s.c.S.Request [collection1] webapp=/solr path=/replication params={slave=false&qt=/replication&wt=javabin&version=2&command=details} status=0 QTime=0 
   [junit4]   2> 763128 INFO  (qtp534711906-5744) [    x:collection1] o.a.s.c.S.Request [collection1] webapp=/solr path=/replication params={_trace=getDetails&qt=/replication&wt=javabin&version=2&command=details} status=0 QTime=3 
   [junit4]   2> 763129 INFO  (qtp1982718321-5725) [    x:collection1] o.a.s.c.S.Request [collection1] webapp=/solr path=/replication params={_trace=assertVersions&qt=/replication&wt=javabin&version=2&command=indexversion} status=0 QTime=0 
   [junit4]   2> 763131 INFO  (qtp534711906-5742) [    x:collection1] o.a.s.c.S.Request [collection1] webapp=/solr path=/replication params={_trace=assertVersions&qt=/replication&wt=javabin&version=2&command=indexversion} status=0 QTime=0 
   [junit4]   2> 763132 INFO  (qtp1982718321-5726) [    x:collection1] o.a.s.u.UpdateHandler start commit{,optimize=false,openSearcher=true,waitSearcher=true,expungeDeletes=false,softCommit=false,prepareCommit=false}
   [junit4]   2> 763132 INFO  (qtp1982718321-5726) [    x:collection1] o.a.s.u.UpdateHandler No uncommitted changes. Skipping IW.commit.
   [junit4]   2> 763133 INFO  (qtp1982718321-5726) [    x:collection1] o.a.s.c.SolrCore SolrIndexSearcher has not changed - not re-opening: org.apache.solr.search.SolrIndexSearcher
   [junit4]   2> 763133 INFO  (qtp1982718321-5726) [    x:collection1] o.a.s.u.UpdateHandler end_commit_flush
   [junit4]   2> 763133 INFO  (qtp1982718321-5726) [    x:collection1] o.a.s.u.p.LogUpdateProcessor [collection1] webapp=/solr path=/update params={commit=true&wt=javabin&version=2} {commit=} 0 0
   [junit4]   2> 763134 WARN  (explicit-fetchindex-cmd) [    x:collection1] o.a.s.h.IndexFetcher 'masterUrl' must be specified without the /replication suffix
   [junit4]   2> 763136 INFO  (qtp1982718321-5724) [    x:collection1] o.a.s.c.S.Request [collection1] webapp=/solr path=/replication params={qt=/replication&wt=javabin&version=2&command=indexversion} status=0 QTime=0 
   [junit4]   2> 763136 INFO  (explicit-fetchindex-cmd) [    x:collection1] o.a.s.h.IndexFetcher Slave in sync with master.
   [junit4]   2> 763136 INFO  (qtp534711906-5743) [    x:collection1] o.a.s.c.S.Request [collection1] webapp=/solr path=/replication params={wait=true&masterUrl=http://127.0.0.1:35852/solr/collection1/replication&command=fetchindex} status=0 QTime=2 
   [junit4]   2> 763139 INFO  (qtp1982718321-5725) [    x:collection1] o.a.s.u.p.LogUpdateProcessor [collection1] webapp=/solr path=/update params={wt=javabin&version=2} {add=[2]} 0 1
   [junit4]   2> 763141 INFO  (qtp1982718321-5726) [    x:collection1] o.a.s.u.UpdateHandler start commit{,optimize=false,openSearcher=true,waitSearcher=true,expungeDeletes=false,softCommit=false,prepareCommit=false}
   [junit4]   2> 763142 INFO  (qtp1982718321-5726) [    x:collection1] o.a.s.c.SolrCore SolrDeletionPolicy.onCommit: commits: num=3
   [junit4]   2> 	commit{dir=MockDirectoryWrapper(RAMDirectory@e40d68 lockFactory=org.apache.lucene.store.SingleInstanceLockFactory@29e0d87f),segFN=segments_1,generation=1}
   [junit4]   2> 	commit{dir=MockDirectoryWrapper(RAMDirectory@e40d68 lockFactory=org.apache.lucene.store.SingleInstanceLockFactory@29e0d87f),segFN=segments_2,generation=2}
   [junit4]   2> 	commit{dir=MockDirectoryWrapper(RAMDirectory@e40d68 lockFactory=org.apache.lucene.store.SingleInstanceLockFactory@29e0d87f),segFN=segments_3,generation=3}
   [junit4]   2> 763142 INFO  (qtp1982718321-5726) [    x:collection1] o.a.s.c.SolrCore newest commit generation = 3
   [junit4]   2> 763142 INFO  (qtp1982718321-5726) [    x:collection1] o.a.s.s.SolrIndexSearcher Opening Searcher@3ea12365[collection1] main
   [junit4]   2> 763142 INFO  (qtp1982718321-5726) [    x:collection1] o.a.s.u.UpdateHandler end_commit_flush
   [junit4]   2> 763143 INFO  (searcherExecutor-2309-thread-1-processing-x:collection1) [    x:collection1] o.a.s.c.SolrCore [collection1] Registered new searcher Searcher@3ea12365[collection1] main{ExitableDirectoryReader(UninvertingDirectoryReader(Uninverting(_0(6.0.0):c1) Uninverting(_1(6.0.0):c1)))}
   [junit4]   2> 763143 INFO  (qtp1982718321-5726) [    x:collection1] o.a.s.u.p.LogUpdateProcessor [collection1] webapp=/solr path=/update params={commit=true&wt=javabin&version=2} {commit=} 0 2
   [junit4]   2> 763144 WARN  (explicit-fetchindex-cmd) [    x:collection1] o.a.s.h.IndexFetcher 'masterUrl' must be specified without the /replication suffix
   [junit4]   2> 763145 INFO  (qtp1982718321-5724) [    x:collection1] o.a.s.c.S.Request [collection1] webapp=/solr path=/replication params={qt=/replication&wt=javabin&version=2&command=indexversion} status=0 QTime=0 
   [junit4]   2> 763146 INFO  (explicit-fetchindex-cmd) [    x:collection1] o.a.s.h.IndexFetcher Master's generation: 3
   [junit4]   2> 763146 INFO  (explicit-fetchindex-cmd) [    x:collection1] o.a.s.h.IndexFetcher Slave's generation: 2
   [junit4]   2> 763146 INFO  (explicit-fetchindex-cmd) [    x:collection1] o.a.s.h.IndexFetcher Starting replication process
   [junit4]   2> 763148 INFO  (qtp1982718321-5725) [    x:collection1] o.a.s.c.S.Request [collection1] webapp=/solr path=/replication params={generation=3&qt=/replication&wt=javabin&version=2&command=filelist} status=0 QTime=0 
   [junit4]   2> 763148 INFO  (explicit-fetchindex-cmd) [    x:collection1] o.a.s.h.IndexFetcher Number of files in latest index in master: 7
   [junit4]   2> 763148 INFO  (explicit-fetchindex-cmd) [    x:collection1] o.a.s.c.CachingDirectoryFactory return new directory for /home/jenkins/workspace/Lucene-Solr-trunk-Linux/solr/build/solr-core/test/J0/temp/solr.handler.TestReplicationHandler_EA3C0AEF8115A7B6-001/solr-instance-002/./collection1/data/index.20150821035446359
   [junit4]   2> 763149 INFO  (explicit-fetchindex-cmd) [    x:collection1] o.a.s.u.DefaultSolrCoreState Creating new IndexWriter...
   [junit4]   2> 763149 INFO  (explicit-fetchindex-cmd) [    x:collection1] o.a.s.u.DefaultSolrCoreState Waiting until IndexWriter is unused... core=collection1
   [junit4]   2> 763149 INFO  (explicit-fetchindex-cmd) [    x:collection1] o.a.s.u.DefaultSolrCoreState Rollback old IndexWriter... core=collection1
   [junit4]   2> 763149 INFO  (explicit-fetchindex-cmd) [    x:collection1] o.a.s.u.RandomMergePolicy RandomMergePolicy wrapping class org.apache.lucene.index.TieredMergePolicy: [TieredMergePolicy: maxMergeAtOnce=17, maxMergeAtOnceExplicit=37, maxMergedSegmentMB=62.494140625, floorSegmentMB=1.3427734375, forceMergeDeletesPctAllowed=20.077109814240465, segmentsPerTier=36.0, maxCFSSegmentSizeMB=8.796093022207999E12, noCFSRatio=0.49467623169944297
   [junit4]   2> 763150 INFO  (explicit-fetchindex-cmd) [    x:collection1] o.a.s.c.SolrCore SolrDeletionPolicy.onInit: commits: num=1
   [junit4]   2> 	commit{dir=MockDirectoryWrapper(RAMDirectory@2ff423df lockFactory=org.apache.lucene.store.SingleInstanceLockFactory@725da131),segFN=segments_2,generation=2}
   [junit4]   2> 763150 INFO  (explicit-fetchindex-cmd) [    x:collection1] o.a.s.c.SolrCore newest commit generation = 2
   [junit4]   2> 763150 INFO  (explicit-fetchindex-cmd) [    x:collection1] o.a.s.u.DefaultSolrCoreState New IndexWriter is ready to be used.
   [junit4]   2> 763150 INFO  (explicit-fetchindex-cmd) [    x:collection1] o.a.s.c.SolrCore SolrDeletionPolicy.onCommit: commits: num=1
   [junit4]   2> 	commit{dir=MockDirectoryWrapper(RAMDirectory@2ff423df lockFactory=org.apache.lucene.store.SingleInstanceLockFactory@725da131),segFN=segments_2,generation=2}
   [junit4]   2> 763150 INFO  (explicit-fetchindex-cmd) [    x:collection1] o.a.s.c.SolrCore newest commit generation = 2
   [junit4]   2> 763150 INFO  (explicit-fetchindex-cmd) [    x:collection1] o.a.s.u.DefaultSolrCoreState Closing IndexWriter...
   [junit4]   2> 763150 INFO  (explicit-fetchindex-cmd) [    x:collection1] o.a.s.u.DefaultSolrCoreState Waiting until IndexWriter is unused... core=collection1
   [junit4]   2> 763150 INFO  (explicit-fetchindex-cmd) [    x:collection1] o.a.s.u.DefaultSolrCoreState Rollback old IndexWriter... core=collection1
   [junit4]   2> 763150 INFO  (explicit-fetchindex-cmd) [    x:collection1] o.a.s.h.IndexFetcher Starting download to MockDirectoryWrapper(RAMDirectory@35298ed7 lockFactory=org.apache.lucene.store.SingleInstanceLockFactory@4b01044e) fullCopy=false
   [junit4]   2> 763150 INFO  (explicit-fetchindex-cmd) [    x:collection1] o.a.s.h.IndexFetcher Skipping download for _0.cfe because it already exists
   [junit4]   2> 763151 INFO  (explicit-fetchindex-cmd) [    x:collection1] o.a.s.h.IndexFetcher Skipping download for _0.si because it already exists
   [junit4]   2> 763151 INFO  (explicit-fetchindex-cmd) [    x:collection1] o.a.s.h.IndexFetcher Skipping download for _0.cfs because it already exists
   [junit4]   2> 763152 INFO  (qtp1982718321-5726) [    x:collection1] o.a.s.c.S.Request [collection1] webapp=/solr path=/replication params={generation=3&qt=/replication&file=_1.cfs&checksum=true&wt=filestream&command=filecontent} status=0 QTime=0 
   [junit4]   2> 763154 INFO  (qtp1982718321-5724) [    x:collection1] o.a.s.c.S.Request [collection1] webapp=/solr path=/replication params={generation=3&qt=/replication&file=_1.cfe&checksum=true&wt=filestream&command=filecontent} status=0 QTime=0 
   [junit4]   2> 763156 INFO  (qtp1982718321-5725) [    x:collection1] o.a.s.c.S.Request [collection1] webapp=/solr path=/replication params={generation=3&qt=/replication&file=_1.si&checksum=true&wt=filestream&command=filecontent} status=0 QTime=0 
   [junit4]   2> 763158 INFO  (qtp1982718321-5726) [    x:collection1] o.a.s.c.S.Request [collection1] webapp=/solr path=/replication params={generation=3&qt=/replication&file=segments_3&checksum=true&wt=filestream&command=filecontent} status=0 QTime=0 
   [junit4]   2> 763158 INFO  (explicit-fetchindex-cmd) [    x:collection1] o.a.s.h.IndexFetcher Total time taken for download: 0 secs
   [junit4]   2> 763160 INFO  (explicit-fetchindex-cmd) [    x:collection1] o.a.s.u.DefaultSolrCoreState Creating new IndexWriter...
   [junit4]   2> 763160 INFO  (explicit-fetchindex-cmd) [    x:collection1] o.a.s.u.RandomMergePolicy RandomMergePolicy wrapping class org.apache.lucene.index.TieredMergePolicy: [TieredMergePolicy: maxMergeAtOnce=26, maxMergeAtOnceExplicit=32, maxMergedSegmentMB=0.5595703125, floorSegmentMB=1.7158203125, forceMergeDeletesPctAllowed=26.897401867002827, segmentsPerTier=44.0, maxCFSSegmentSizeMB=8.796093022207999E12, noCFSRatio=0.31838294991707655
   [junit4]   2> 763161 INFO  (explicit-fetchindex-cmd) [    x:collection1] o.a.s.c.SolrCore SolrDeletionPolicy.onInit: commits: num=2
   [junit4]   2> 	commit{dir=MockDirectoryWrapper(RAMDirectory@2ff423df lockFactory=org.apache.lucene.store.SingleInstanceLockFactory@725da131),segFN=segments_2,generation=2}
   [junit4]   2> 	commit{dir=MockDirectoryWrapper(RAMDirectory@2ff423df lockFactory=org.apache.lucene.store.SingleInstanceLockFactory@725da131),segFN=segments_3,generation=3}
   [junit4]   2> 763161 INFO  (explicit-fetchindex-cmd) [    x:collection1] o.a.s.c.SolrCore newest commit generation = 3
   [junit4]   2> 763161 INFO  (explicit-fetchindex-cmd) [    x:collection1] o.a.s.u.DefaultSolrCoreState New IndexWriter is ready to be used.
   [junit4]   2> 763162 INFO  (explicit-fetchindex-cmd) [    x:collection1] o.a.s.s.SolrIndexSearcher Opening Searcher@7ac54022[collection1] main
   [junit4]   2> 763162 INFO  (searcherExecutor-2319-thread-1-processing-x:collection1) [    x:collection1] o.a.s.c.SolrCore [collection1] Registered new searcher Searcher@7ac54022[collection1] main{ExitableDirectoryReader(UninvertingDirectoryReader(Uninverting(_0(6.0.0):c1) Uninverting(_1(6.0.0):c1)))}
   [junit4]   2> 763162 INFO  (explicit-fetchindex-cmd) [    x:collection1] o.a.s.c.CachingDirectoryFactory looking to close /home/jenkins/workspace/Lucene-Solr-trunk-Linux/solr/build/solr-core/test/J0/temp/solr.handler.TestReplicationHandler_EA3C0AEF8115A7B6-001/solr-instance-002/./collection1/data/index.20150821035446359 [CachedDir<<refCount=0;path=/home/jenkins/workspace/Lucene-Solr-trunk-Linux/solr/build/solr-core/test/J0/temp/solr.handler.TestReplicationHandler_EA3C0AEF8115A7B6-001/solr-instance-002/./collection1/data/index.20150821035446359;done=true>>]
   [junit4]   2> 763162 INFO  (explicit-fetchindex-cmd) [    x:collection1] o.a.s.c.CachingDirectoryFactory Closing directory: /home/jenkins/workspace/Lucene-Solr-trunk-Linux/solr/build/solr-core/test/J0/temp/solr.handler.TestReplicationHandler_EA3C0AEF8115A7B6-001/solr-instance-002/./collection1/data/index.20150821035446359
   [junit4]   2> 763162 INFO  (qtp534711906-5744) [    x:collection1] o.a.s.c.S.Request [collection1] webapp=/solr path=/replication params={wait=true&masterUrl=http://127.0.0.1:35852/solr/collection1/replication&command=fetchindex} status=0 QTime=19 
   [junit4]   2> 763165 INFO  (qtp534711906-5742) [    x:collection1] o.a.s.c.S.Request [collection1] webapp=/solr path=/select params={q=name:empty2&sort=id+desc&wt=javabin&version=2} hits=1 status=0 QTime=0 
   [junit4]   2> 763165 INFO  (TEST-TestReplicationHandler.testEmptyCommits-seed#[EA3C0AEF8115A7B6]) [    ] o.a.s.SolrTestCaseJ4 Waited for 0ms and found 1 docs
   [junit4]   2> 763167 INFO  (qtp1982718321-5724) [    x:collection1] o.a.s.c.S.Request [collection1] webapp=/solr path=/replication params={_trace=getDetails&qt=/replication&wt=javabin&version=2&command=details} status=0 QTime=0 
   [junit4]   2> 763168 INFO  (qtp1982718321-5725) [    x:collection1] o.a.s.c.S.Request [collection1] webapp=/solr path=/replication params={_trace=getDetails&qt=/replication&wt=javabin&version=2&command=details} status=0 QTime=0 
   [junit4]   2> 763171 INFO  (qtp1982718321-5726) [    x:collection1] o.a.s.c.S.Request [collection1] webapp=/solr path=/replication params={slave=false&qt=/replication&wt=javabin&version=2&command=details} status=0 QTime=0 
   [junit4]   2> 763172 INFO  (qtp534711906-5743) [    x:collection1] o.a.s.c.S.Request [collection1] webapp=/solr path=/replication params={_trace=getDetails&qt=/replication&wt=javabin&version=2&command=details} status=0 QTime=1 
   [junit4]   2> 763173 INFO  (qtp1982718321-5724) [    x:collection1] o.a.s.c.S.Request [collection1] webapp=/solr path=/replication params={_trace=assertVersions&qt=/replication&wt=javabin&version=2&command=indexversion} status=0 QTime=0 
   [junit4]   2> 763174 INFO  (qtp534711906-5744) [    x:collection1] o.a.s.c.S.Request [collection1] webapp=/solr path=/replication params={_trace=assertVersions&qt=/replication&wt=javabin&version=2&command=indexversion} status=0 QTime=0 
   [junit4]   2> 763176 INFO  (qtp1982718321-5725) [    x:collection1] o.a.s.u.p.LogUpdateProcessor [collection1] webapp=/solr path=/update params={wt=javabin&version=2} {add=[3]} 0 0
   [junit4]   2> 763178 INFO  (qtp1982718321-5726) [    x:collection1] o.a.s.u.UpdateHandler start commit{,optimize=false,openSearcher=false,waitSearcher=true,expungeDeletes=false,softCommit=false,prepareCommit=false}
   [junit4]   2> 763179 INFO  (qtp1982718321-5726) [    x:collection1] o.a.s.c.SolrCore SolrDeletionPolicy.onCommit: commits: num=4
   [junit4]   2> 	commit{dir=MockDirectoryWrapper(RAMDirectory@e40d68 lockFactory=org.apache.lucene.store.SingleInstanceLockFactory@29e0d87f),segFN=segments_1,generation=1}
   [junit4]   2> 	commit{dir=MockDirectoryWrapper(RAMDirectory@e40d68 lockFactory=org.apache.lucene.store.SingleInstanceLockFactory@29e0d87f),segFN=segments_2,generation=2}
   [junit4]   2> 	commit{dir=MockDirectoryWrapper(RAMDirectory@e40d68 lockFactory=org.apache.lucene.store.SingleInstanceLockFactory@29e0d87f),segFN=segments_3,generation=3}
   [junit4]   2> 	commit{dir=MockDirectoryWrapper(RAMDirectory@e40d68 lockFactory=org.apache.lucene.store.SingleInstanceLockFactory@29e0d87f),segFN=segments_4,generation=4}
   [junit4]   2> 763179 INFO  (qtp1982718321-5726) [    x:collection1] o.a.s.c.SolrCore newest commit generation = 4
   [junit4]   2> 763179 INFO  (qtp1982718321-5726) [    x:collection1] o.a.s.s.SolrIndexSearcher Opening Searcher@7ab443c4[collection1] realtime
   [junit4]   2> 763179 INFO  (qtp1982718321-5726) [    x:collection1] o.a.s.u.UpdateHandler end_commit_flush
   [junit4]   2> 763179 INFO  (qtp1982718321-5726) [    x:collection1] o.a.s.u.p.LogUpdateProcessor [collection1] webapp=/solr path=/update params={openSearcher=false&commit=true&wt=javabin&version=2} {commit=} 0 1
   [junit4]   2> 763180 WARN  (explicit-fetchindex-cmd) [    x:collection1] o.a.s.h.IndexFetcher 'masterUrl' must be specified without the /replication suffix
   [junit4]   2> 763182 INFO  (qtp1982718321-5724) [    x:collection1] o.a.s.c.S.Request [collection1] webapp=/solr path=/replication params={qt=/replication&wt=javabin&version=2&command=indexversion} status=0 QTime=0 
   [junit4]   2> 763182 INFO  (explicit-fetchindex-cmd) [    x:collection1] o.a.s.h.IndexFetcher Master's generation: 4
   [junit4]   2> 763182 INFO  (explicit-fetchindex-cmd) [    x:collection1] o.a.s.h.IndexFetcher Slave's generation: 3
   [junit4]   2> 763182 INFO  (explicit-fetchindex-cmd) [    x:collection1] o.a.s.h.IndexFetcher Starting replication process
   [junit4]   2> 763184 INFO  (qtp1982718321-5725) [    x:collection1] o.a.s.c.S.Request [collection1] webapp=/solr path=/replication params={generation=4&qt=/replication&wt=javabin&version=2&command=filelist} status=0 QTime=0 
   [junit4]   2> 763184 INFO  (explicit-fetchindex-cmd) [    x:collection1] o.a.s.h.IndexFetcher Number of files in latest index in master: 10
   [junit4]   2> 763184 INFO  (explicit-fetchindex-cmd) [    x:collection1] o.a.s.c.CachingDirectoryFactory return new directory for /home/jenkins/workspace/Lucene-Solr-trunk-Linux/solr/build/solr-core/test/J0/temp/solr.handler.TestReplicationHandler_EA3C0AEF8115A7B6-001/solr-instance-002/./collection1/data/index.20150821035446395
   [junit4]   2> 763184 INFO  (explicit-fetchindex-cmd) [    x:collection1] o.a.s.u.DefaultSolrCoreState Creating new IndexWriter...
   [junit4]   2> 763184 INFO  (explicit-fetchindex-cmd) [    x:collection1] o.a.s.u.DefaultSolrCoreState Waiting until IndexWriter is unused... core=collection1
   [junit4]   2> 763185 INFO  (explicit-fetchindex-cmd) [    x:collection1] o.a.s.u.DefaultSolrCoreState Rollback old IndexWriter... core=collection1
   [junit4]   2> 763185 INFO  (explicit-fetchindex-cmd) [    x:collection1] o.a.s.u.RandomMergePolicy RandomMergePolicy wrapping class org.apache.lucene.index.TieredMergePolicy: [TieredMergePolicy: maxMergeAtOnce=17, maxMergeAtOnceExplicit=37, maxMergedSegmentMB=62.494140625, floorSegmentMB=1.3427734375, forceMergeDeletesPctAllowed=20.077109814240465, segmentsPerTier=36.0, maxCFSSegmentSizeMB=8.796093022207999E12, noCFSRatio=0.49467623169944297
   [junit4]   2> 763185 INFO  (explicit-fetchindex-cmd) [    x:collection1] o.a.s.c.SolrCore SolrDeletionPolicy.onInit: commits: num=2
   [junit4]   2> 	commit{dir=MockDirectoryWrapper(RAMDirectory@2ff423df lockFactory=org.apache.lucene.store.SingleInstanceLockFactory@725da131),segFN=segments_2,generation=2}
   [junit4]   2> 	commit{dir=MockDirectoryWrapper(RAMDirectory@2ff423df lockFactory=org.apache.lucene.store.SingleInstanceLockFactory@725da131),segFN=segments_3,generation=3}
   [junit4]   2> 763185 INFO  (explicit-fetchindex-cmd) [    x:collection1] o.a.s.c.SolrCore newest commit generation = 3
   [junit4]   2> 763185 INFO  (explicit-fetchindex-cmd) [    x:collection1] o.a.s.u.DefaultSolrCoreState New IndexWriter is ready to be used.
   [junit4]   2> 763185 INFO  (explicit-fetchindex-cmd) [    x:collection1] o.a.s.c.SolrCore SolrDeletionPolicy.onCommit: commits: num=2
   [junit4]   2> 	commit{dir=MockDirectoryWrapper(RAMDirectory@2ff423df lockFactory=org.apache.lucene.store.SingleInstanceLockFactory@725da131),segFN=segments_2,generation=2}
   [junit4]   2> 	commit{dir=MockDirectoryWrapper(RAMDirectory@2ff423df lockFactory=org.apache.lucene.store.SingleInstanceLockFactory@725da131),segFN=segments_3,generation=3}
   [junit4]   2> 763185 INFO  (explicit-fetchindex-cmd) [    x:collection1] o.a.s.c.SolrCore newest commit generation = 3
   [junit4]   2> 763185 INFO  (explicit-fetchindex-cmd) [    x:collection1] o.a.s.h.IndexFetcher Found unused file: segments_2
   [junit4]   2> 763186 INFO  (explicit-fetchindex-cmd) [    x:collection1] o.a.s.c.SolrCore SolrDeletionPolicy.onCommit: commits: num=2
   [junit4]   2> 	commit{dir=MockDirectoryWrapper(RAMDirectory@2ff423df lockFactory=org.apache.lucene.store.SingleInstanceLockFactory@725da131),segFN=segments_2,generation=2}
   [junit4]   2> 	commit{dir=MockDirectoryWrapper(RAMDirectory@2ff423df lockFactory=org.apache.lucene.store.SingleInstanceLockFactory@725da131),segFN=segments_3,generation=3}
   [junit4]   2> 763186 INFO  (explicit-fetchindex-cmd) [    x:collection1] o.a.s.c.SolrCore newest commit generation = 3
   [junit4]   2> 763186 INFO  (explicit-fetchindex-cmd) [    x:collection1] o.a.s.h.IndexFetcher Sleeping for 1000ms to wait for unused lucene index files to be delete-able
   [junit4]   2> 764186 INFO  (explicit-fetchindex-cmd) [    x:collection1] o.a.s.h.IndexFetcher Found unused file: segments_2
   [junit4]   2> 764186 INFO  (explicit-fetchindex-cmd) [    x:collection1] o.a.s.c.SolrCore SolrDeletionPolicy.onCommit: commits: num=2
   [junit4]   2> 	commit{dir=MockDirectoryWrapper(RAMDirectory@2ff423df lockFactory=org.apache.lucene.store.SingleInstanceLockFactory@725da131),segFN=segments_2,generation=2}
   [junit4]   2> 	commit{dir=MockDirectoryWrapper(RAMDirectory@2ff423df lockFactory=org.apache.lucene.store.SingleInstanceLockFactory@725da131),segFN=segments_3,generation=3}
   [junit4]   2> 764186 INFO  (explicit-fetchindex-cmd) [    x:collection1] o.a.s.c.SolrCore newest commit generation = 3
   [junit4]   2> 764186 INFO  (explicit-fetchindex-cmd) [    x:collection1] o.a.s.h.IndexFetcher Sleeping for 1000ms to wait for unused lucene index files to be delete-able
   [junit4]   2> 765187 INFO  (explicit-fetchindex-cmd) [    x:collection1] o.a.s.h.IndexFetcher Found unused file: segments_2
   [junit4]   2> 765188 INFO  (explicit-fetchindex-cmd) [    x:collection1] o.a.s.c.SolrCore SolrDeletionPolicy.onCommit: commits: num=2
   [junit4]   2> 	commit{dir=MockDirectoryWrapper(RAMDirectory@2ff423df lockFactory=org.apache.lucene.store.SingleInstanceLockFactory@725da131),segFN=segments_2,generation=2}
   [junit4]   2> 	commit{dir=MockDirectoryWrapper(RAMDirectory@2ff423df lockFactory=org.apache.lucene.store.SingleInstanceLockFactory@725da131),segFN=segments_3,generation=3}
   [junit4]   2> 765188 INFO  (explicit-fetchindex-cmd) [    x:collection1] o.a.s.c.SolrCore newest commit generation = 3
   [junit4]   2> 765188 INFO  (explicit-fetchindex-cmd) [    x:collection1] o.a.s.h.IndexFetcher Sleeping for 1000ms to wait for unused lucene index files to be delete-able
   [junit4]   2> 766188 INFO  (explicit-fetchindex-cmd) [    x:collection1] o.a.s.h.IndexFetcher Found unused file: segments_2
   [junit4]   2> 766188 INFO  (explicit-fetchindex-cmd) [    x:collection1] o.a.s.c.SolrCore SolrDeletionPolicy.onCommit: commits: num=2
   [junit4]   2> 	commit{dir=MockDirectoryWrapper(RAMDirectory@2ff423df lockFactory=org.apache.lucene.store.SingleInstanceLockFactory@725da131),segFN=segments_2,generation=2}
   [junit4]   2> 	commit{dir=MockDirectoryWrapper(RAMDirectory@2ff423df lockFactory=org.apache.lucene.store.SingleInstanceLockFactory@725da131),segFN=segments_3,generation=3}
   [junit4]   2> 766189 INFO  (explicit-fetchindex-cmd) [    x:collection1] o.a.s.c.SolrCore newest commit generation = 3
   [junit4]   2> 766189 INFO  (explicit-fetchindex-cmd) [    x:collection1] o.a.s.h.IndexFetcher Sleeping for 1000ms to wait for unused lucene index files to be delete-able
   [junit4]   2> 767189 INFO  (explicit-fetchindex-cmd) [    x:collection1] o.a.s.h.IndexFetcher Found unused file: segments_2
   [junit4]   2> 767189 INFO  (explicit-fetchindex-cmd) [    x:collection1] o.a.s.c.SolrCore SolrDeletionPolicy.onCommit: commits: num=2
   [junit4]   2> 	commit{dir=MockDirectoryWrapper(RAMDirectory@2ff423df lockFactory=org.apache.lucene.store.SingleInstanceLockFactory@725da131),segFN=segments_2,generation=2}
   [junit4]   2> 	commit{dir=MockDirectoryWrapper(RAMDirectory@2ff423df lockFactory=org.apache.lucene.store.SingleInstanceLockFactory@725da131),segFN=segments_3,generation=3}
   [junit4]   2> 767189 INFO  (explicit-fetchindex-cmd) [    x:collection1] o.a.s.c.SolrCore newest commit generation = 3
   [junit4]   2> 767189 INFO  (explicit-fetchindex-cmd) [    x:collection1] o.a.s.h.IndexFetcher Sleeping for 1000ms to wait for unused lucene index files to be delete-able
   [junit4]   2> 768190 INFO  (explicit-fetchindex-cmd) [    x:collection1] o.a.s.h.IndexFetcher Found unused file: segments_2
   [junit4]   2> 768190 INFO  (explicit-fetchindex-cmd) [    x:collection1] o.a.s.c.SolrCore SolrDeletionPolicy.onCommit: commits: num=2
   [junit4]   2> 	commit{dir=MockDirectoryWrapper(RAMDirectory@2ff423df lockFactory=org.apache.lucene.store.SingleInstanceLockFactory@725da131),segFN=segments_2,generation=2}
   [junit4]   2> 	commit{dir=MockDirectoryWrapper(RAMDirectory@2ff423df lockFactory=org.apache.lucene.store.SingleInstanceLockFactory@725da131),segFN=segments_3,generation=3}
   [junit4]   2> 768190 INFO  (explicit-fetchindex-cmd) [    x:collection1] o.a.s.c.SolrCore newest commit generation = 3
   [junit4]   2> 768190 INFO  (explicit-fetchindex-cmd) [    x:collection1] o.a.s.h.IndexFetcher Sleeping for 1000ms to wait for unused lucene index files to be delete-able
   [junit4]   2> 769190 INFO  (explicit-fetchindex-cmd) [    x:collection1] o.a.s.h.IndexFetcher Found unused file: segments_2
   [junit4]   2> 769190 INFO  (explicit-fetchindex-cmd) [    x:collection1] o.a.s.c.SolrCore SolrDeletionPolicy.onCommit: commits: num=2
   [junit4]   2> 	commit{dir=MockDirectoryWrapper(RAMDirectory@2ff423df lockFactory=org.apache.lucene.store.SingleInstanceLockFactory@725da131),segFN=segments_2,generation=2}
   [junit4]   2> 	commit{dir=MockDirectoryWrapper(RAMDirectory@2ff423df lockFactory=org.apache.lucene.store.SingleInstanceLockFactory@725da131),segFN=segments_3,generation=3}
   [junit4]   2> 769190 INFO  (explicit-fetchindex-cmd) [    x:collection1] o.a.s.c.SolrCore newest commit generation = 3
   [junit4]   2> 769190 INFO  (explicit-fetchindex-cmd) [    x:collection1] o.a.s.h.IndexFetcher Sleeping for 1000ms to wait for unused lucene index files to be delete-able
   [junit4]   2> 770191 INFO  (explicit-fetchindex-cmd) [    x:collection1] o.a.s.h.IndexFetcher Found unused file: segments_2
   [junit4]   2> 770191 INFO  (explicit-fetchindex-cmd) [    x:collection1] o.a.s.c.SolrCore SolrDeletionPolicy.onCommit: commits: num=2
   [junit4]   2> 	commit{dir=MockDirectoryWrapper(RAMDirectory@2ff423df lockFactory=org.apache.lucene.store.SingleInstanceLockFactory@725da131),segFN=segments_2,generation=2}
   [junit4]   2> 	commit{dir=MockDirectoryWrapper(RAMDirectory@2ff423df lockFactory=org.apache.lucene.store.SingleInstanceLockFactory@725da131),segFN=segments_3,generation=3}
   [junit4]   2> 770191 INFO  (explicit-fetchindex-cmd) [    x:collection1] o.a.s.c.SolrCore newest commit generation = 3
   [junit4]   2> 770191 INFO  (explicit-fetchindex-cmd) [    x:collection1] o.a.s.h.IndexFetcher Sleeping for 1000ms to wait for unused lucene index files to be delete-able
   [junit4]   2> 771192 INFO  (explicit-fetchindex-cmd) [    x:collection1] o.a.s.h.IndexFetcher Found unused file: segments_2
   [junit4]   2> 771192 INFO  (explicit-fetchindex-cmd) [    x:collection1] o.a.s.c.SolrCore SolrDeletionPolicy.onCommit: commits: num=2
   [junit4]   2> 	commit{dir=MockDirectoryWrapper(RAMDirectory@2ff423df lockFactory=org.apache.lucene.store.SingleInstanceLockFactory@725da131),segFN=segments_2,generation=2}
   [junit4]   2> 	commit{dir=MockDirectoryWrapper(RAMDirectory@2ff423df lockFactory=org.apache.lucene.store.SingleInstanceLockFactory@725da131),segFN=segments_3,generation=3}
   [junit4]   2> 771192 INFO  (explicit-fetchindex-cmd) [    x:collection1] o.a.s.c.SolrCore newest commit generation = 3
   [junit4]   2> 771192 INFO  (explicit-fetchindex-cmd) [    x:collection1] o.a.s.h.IndexFetcher Sleeping for 1000ms to wait for unused lucene index files to be delete-able
   [junit4]   2> 772192 INFO  (explicit-fetchindex-cmd) [    x:collection1] o.a.s.h.IndexFetcher Found unused file: segments_2
   [junit4]   2> 772192 INFO  (explicit-fetchindex-cmd) [    x:collection1] o.a.s.c.SolrCore SolrDeletionPolicy.onCommit: commits: num=2
   [junit4]   2> 	commit{dir=MockDirectoryWrapper(RAMDirectory@2ff423df lockFactory=org.apache.lucene.store.SingleInstanceLockFactory@725da131),segFN=segments_2,generation=2}
   [junit4]   2> 	commit{dir=MockDirectoryWrapper(RAMDirectory@2ff423df lockFactory=org.apache.lucene.store.SingleInstanceLockFactory@725da131),segFN=segments_3,generation=3}
   [junit4]   2> 772193 INFO  (explicit-fetchindex-cmd) [    x:collection1] o.a.s.c.SolrCore newest commit generation = 3
   [junit4]   2> 772193 INFO  (explicit-fetchindex-cmd) [    x:collection1] o.a.s.h.IndexFetcher Sleeping for 1000ms to wait for unused lucene index files to be delete-able
   [junit4]   2> 773193 INFO  (explicit-fetchindex-cmd) [    x:collection1] o.a.s.h.IndexFetcher Found unused file: segments_2
   [junit4]   2> 773193 INFO  (explicit-fetchindex-cmd) [    x:collection1] o.a.s.c.SolrCore SolrDeletionPolicy.onCommit: commits: num=2
   [junit4]   2> 	commit{dir=MockDirectoryWrapper(RAMDirectory@2ff423df lockFactory=org.apache.lucene.store.SingleInstanceLockFactory@725da131),segFN=segments_2,generation=2}
   [junit4]   2> 	commit{dir=MockDirectoryWrapper(RAMDirectory@2ff423df lockFactory=org.apache.lucene.store.SingleInstanceLockFactory@725da131),segFN=segments_3,generation=3}
   [junit4]   2> 773193 INFO  (explicit-fetchindex-cmd) [    x:collection1] o.a.s.c.SolrCore newest commit generation = 3
   [junit4]   2> 773193 INFO  (explicit-fetchindex-cmd) [    x:collection1] o.a.s.h.IndexFetcher Sleeping for 1000ms to wait for unused lucene index files to be delete-able
   [junit4]   2> 774194 INFO  (explicit-fetchindex-cmd) [    x:collection1] o.a.s.h.IndexFetcher IndexFetcher slept for 11000ms for unused lucene index files to be delete-able
   [junit4]   2> 774194 INFO  (explicit-fetchindex-cmd) [    x:collection1] o.a.s.u.DefaultSolrCoreState Closing IndexWriter...
   [junit4]   2> 774194 INFO  (explicit-fetchindex-cmd) [    x:collection1] o.a.s.u.DefaultSolrCoreState Waiting until IndexWriter is unused... core=collection1
   [junit4]   2> 774194 INFO  (explicit-fetchindex-cmd) [    x:collection1] o.a.s.u.DefaultSolrCoreState Rollback old IndexWriter... core=collection1
   [junit4]   2> 774194 INFO  (explicit-fetchindex-cmd) [    x:collection1] o.a.s.h.IndexFetcher Starting download to MockDirectoryWrapper(RAMDirectory@4859aae8 lockFactory=org.apache.lucene.store.SingleInstanceLockFactory@287acbb7) fullCopy=false
   [junit4]   2> 774194 INFO  (explicit-fetchindex-cmd) [    x:collection1] o.a.s.h.IndexFetcher Skipping download for _0.cfe because it already exists
   [junit4]   2> 774195 INFO  (explicit-fetchindex-cmd) [    x:collection1] o.a.s.h.IndexFetcher Skipping download for _0.si because it already exists
   [junit4]   2> 774196 INFO  (explicit-fetchindex-cmd) [    x:collection1] o.a.s.h.IndexFetcher Skipping download for _0.cfs because it already exists
   [junit4]   2> 774196 INFO  (explicit-fetchindex-cmd) [    x:collection1] o.a.s.h.IndexFetcher Skipping download for _1.cfs because it already exists
   [junit4]   2> 774196 INFO  (explicit-fetchindex-cmd) [    x:collection1] o.a.s.h.IndexFetcher Skipping download for _1.cfe because it already exists
   [junit4]   2> 774196 INFO  (explicit-fetchindex-cmd) [    x:collection1] o.a.s.h.IndexFetcher Skipping download for _1.si because it already exists
   [junit4]   2> 774200 INFO  (qtp1982718321-5726) [    x:collection1] o.a.s.c.S.Request [collection1] webapp=/solr path=/replication params={generation=4&qt=/replication&file=_2.si&checksum=true&wt=filestream&command=filecontent} status=0 QTime=0 
   [junit4]   2> 774202 INFO  (qtp1982718321-5724) [    x:collection1] o.a.s.c.S.Request [collection1] webapp=/solr path=/replication params={generation=4&qt=/replication&file=_2.cfe&checksum=true&wt=filestream&command=filecontent} status=0 QTime=0 
   [junit4]   2> 774214 INFO  (qtp1982718321-5725) [    x:collection1] o.a.s.c.S.Request [collection1] webapp=/solr path=/replication params={generation=4&qt=/replication&file=_2.cfs&checksum=true&wt=filestream&command=filecontent} status=0 QTime=0 
   [junit4]   2> 774217 INFO  (qtp1982718321-5726) [    x:collection1] o.a.s.c.S.Request [collection1] webapp=/solr path=/replication params={generation=4&qt=/replication&file=segments_4&checksum=true&wt=filestream&command=filecontent} status=0 QTime=0 
   [junit4]   2> 774218 INFO  (explicit-fetchindex-cmd) [    x:collection1] o.a.s.h.IndexFetcher Total time taken for download: 11 secs
   [junit4]   2> 774219 INFO  (explicit-fetchindex-cmd) [    x:collection1] o.a.s.u.DefaultSolrCoreState Creating new IndexWriter...
   [junit4]   2> 774219 INFO  (explicit-fetchindex-cmd) [    x:collection1] o.a.s.u.RandomMergePolicy RandomMergePolicy wrapping class org.apache.lucene.index.TieredMergePolicy: [TieredMergePolicy: maxMergeAtOnce=26, maxMergeAtOnceExplicit=32, maxMergedSegmentMB=0.5595703125, floorSegmentMB=1.7158203125, forceMergeDeletesPctAllowed=26.897401867002827, segmentsPerTier=44.0, maxCFSSegmentSizeMB=8.796093022207999E12, noCFSRatio=0.31838294991707655
   [junit4]   2> 774220 INFO  (explicit-fetchindex-cmd) [    x:collection1] o.a.s.c.SolrCore SolrDeletionPolicy.onInit: commits: num=2
   [junit4]   2> 	commit{dir=MockDirectoryWrapper(RAMDirectory@2ff423df lockFactory=org.apache.lucene.store.SingleInstanceLockFactory@725da131),segFN=segments_3,generation=3}
   [junit4]   2> 	commit{dir=MockDirectoryWrapper(RAMDirectory@2ff423df lockFactory=org.apache.lucene.store.SingleInstanceLockFactory@725da131),segFN=segments_4,generation=4}
   [junit4]   2> 774220 INFO  (explicit-fetchindex-cmd) [    x:collection1] o.a.s.c.SolrCore newest commit generation = 4
   [junit4]   2> 774220 INFO  (explicit-fetchindex-cmd) [    x:collection1] o.a.s.u.DefaultSolrCoreState New IndexWriter is ready to be used.
   [junit4]   2> 774221 INFO  (explicit-fetchindex-cmd) [    x:collection1] o.a.s.s.SolrIndexSearcher Opening Searcher@4f0d6c83[collection1] main
   [junit4]   2> 774223 INFO  (searcherExecutor-2319-thread-1-processing-x:collection1) [    x:collection1] o.a.s.c.SolrCore [collection1] Registered new searcher Searcher@4f0d6c83[collection1] main{ExitableDirectoryReader(UninvertingDirectoryReader(Uninverting(_0(6.0.0):c1) Uninverting(_1(6.0.0):c1) Uninverting(_2(6.0.0):c1)))}
   [junit4]   2> 774224 INFO  (explicit-fetchindex-cmd) [    x:collection1] o.a.s.c.CachingDirectoryFactory looking to close /home/jenkins/workspace/Lucene-Solr-trunk-Linux/solr/build/solr-core/test/J0/temp/solr.handler.TestReplicationHandler_EA3C0AEF8115A7B6-001/solr-instance-002/./collection1/data/index.20150821035446395 [CachedDir<<refCount=0;path=/home/jenkins/workspace/Lucene-Solr-trunk-Linux/solr/build/solr-core/test/J0/temp/solr.handler.TestReplicationHandler_EA3C0AEF8115A7B6-001/solr-instance-002/./collection1/data/index.20150821035446395;done=true>>]
   [junit4]   2> 774224 INFO  (explicit-fetchindex-cmd) [    x:collection1] o.a.s.c.CachingDirectoryFactory Closing directory: /home/jenkins/workspace/Lucene-Solr-trunk-Linux/solr/build/solr-core/test/J0/temp/solr.handler.TestReplicationHandler_EA3C0AEF8115A7B6-001/solr-instance-002/./collection1/data/index.20150821035446395
   [junit4]   2> 774224 INFO  (qtp534711906-5742) [    x:collection1] o.a.s.c.S.Request [collection1] webapp=/solr path=/replication params={wait=true&masterUrl=http://127.0.0.1:35852/solr/collection1/replication&command=fetchindex} status=0 QTime=11044 
   [junit4]   2> 774237 INFO  (qtp1982718321-5724) [    x:collection1] o.a.s.c.S.Request [collection1] webapp=/solr path=/select params={q=name:empty3&sort=id+desc&wt=javabin&version=2} hits=0 status=0 QTime=0 
   [junit4]   2> 774237 INFO  (TEST-TestReplicationHandler.testEmptyCommits-seed#[EA3C0AEF8115A7B6]) [    ] o.a.s.SolrTestCaseJ4 Waited for 0ms and found 0 docs
   [junit4]   2> 774240 INFO  (qtp534711906-5743) [    x:collection1] o.a.s.c.S.Request [collection1] webapp=/solr path=/select params={q=name:empty3&sort=id+desc&wt=javabin&version=2} hits=1 status=0 QTime=0 
   [junit4]   2> 774240 INFO  (TEST-TestReplicationHandler.testEmptyCommits-seed#[EA3C0AEF8115A7B6]) [    ] o.a.s.SolrTestCaseJ4 Waited for 0ms and fo

[...truncated too long message...]

   [junit4]   2> 	at org.apache.solr.common.util.JavaBinCodec.readVal(JavaBinCodec.java:249)
   [junit4]   2> 	at org.apache.solr.client.solrj.request.JavaBinUpdateRequestCodec$1.readNamedList(JavaBinUpdateRequestCodec.java:121)
   [junit4]   2> 	at org.apache.solr.common.util.JavaBinCodec.readVal(JavaBinCodec.java:214)
   [junit4]   2> 	at org.apache.solr.common.util.JavaBinCodec.unmarshal(JavaBinCodec.java:134)
   [junit4]   2> 	at org.apache.solr.client.solrj.request.JavaBinUpdateRequestCodec.unmarshal(JavaBinUpdateRequestCodec.java:186)
   [junit4]   2> 	at org.apache.solr.handler.loader.JavabinLoader.parseAndLoadDocs(JavabinLoader.java:111)
   [junit4]   2> 	at org.apache.solr.handler.loader.JavabinLoader.load(JavabinLoader.java:58)
   [junit4]   2> 	at org.apache.solr.handler.UpdateRequestHandler$1.load(UpdateRequestHandler.java:98)
   [junit4]   2> 	at org.apache.solr.handler.ContentStreamHandlerBase.handleRequestBody(ContentStreamHandlerBase.java:74)
   [junit4]   2> 	at org.apache.solr.handler.RequestHandlerBase.handleRequest(RequestHandlerBase.java:151)
   [junit4]   2> 	at org.apache.solr.core.SolrCore.execute(SolrCore.java:2079)
   [junit4]   2> 	at org.apache.solr.servlet.HttpSolrCall.execute(HttpSolrCall.java:667)
   [junit4]   2> 	at org.apache.solr.servlet.HttpSolrCall.call(HttpSolrCall.java:460)
   [junit4]   2> 	at org.apache.solr.servlet.SolrDispatchFilter.doFilter(SolrDispatchFilter.java:210)
   [junit4]   2> 	at org.apache.solr.servlet.SolrDispatchFilter.doFilter(SolrDispatchFilter.java:179)
   [junit4]   2> 	at org.eclipse.jetty.servlet.ServletHandler$CachedChain.doFilter(ServletHandler.java:1652)
   [junit4]   2> 	at org.apache.solr.client.solrj.embedded.JettySolrRunner$DebugFilter.doFilter(JettySolrRunner.java:106)
   [junit4]   2> 	at org.eclipse.jetty.servlet.ServletHandler$CachedChain.doFilter(ServletHandler.java:1652)
   [junit4]   2> 	at org.eclipse.jetty.servlets.UserAgentFilter.doFilter(UserAgentFilter.java:83)
   [junit4]   2> 	at org.eclipse.jetty.servlets.GzipFilter.doFilter(GzipFilter.java:300)
   [junit4]   2> 	at org.eclipse.jetty.servlet.ServletHandler$CachedChain.doFilter(ServletHandler.java:1652)
   [junit4]   2> 	at org.eclipse.jetty.servlet.ServletHandler.doHandle(ServletHandler.java:585)
   [junit4]   2> 	at org.eclipse.jetty.server.session.SessionHandler.doHandle(SessionHandler.java:221)
   [junit4]   2> 	at org.eclipse.jetty.server.handler.ContextHandler.doHandle(ContextHandler.java:1127)
   [junit4]   2> 	at org.eclipse.jetty.servlet.ServletHandler.doScope(ServletHandler.java:515)
   [junit4]   2> 	at org.eclipse.jetty.server.session.SessionHandler.doScope(SessionHandler.java:185)
   [junit4]   2> 	at org.eclipse.jetty.server.handler.ContextHandler.doScope(ContextHandler.java:1061)
   [junit4]   2> 	at org.eclipse.jetty.server.handler.ScopedHandler.handle(ScopedHandler.java:141)
   [junit4]   2> 	at org.eclipse.jetty.server.handler.HandlerWrapper.handle(HandlerWrapper.java:97)
   [junit4]   2> 	at org.eclipse.jetty.server.Server.handle(Server.java:499)
   [junit4]   2> 	at org.eclipse.jetty.server.HttpChannel.handle(HttpChannel.java:310)
   [junit4]   2> 	at org.eclipse.jetty.server.HttpConnection.onFillable(HttpConnection.java:257)
   [junit4]   2> 	at org.eclipse.jetty.io.AbstractConnection$2.run(AbstractConnection.java:540)
   [junit4]   2> 	at org.eclipse.jetty.util.thread.QueuedThreadPool.runJob(QueuedThreadPool.java:635)
   [junit4]   2> 	at org.eclipse.jetty.util.thread.QueuedThreadPool$3.run(QueuedThreadPool.java:555)
   [junit4]   2> 	at java.lang.Thread.run(Thread.java:745)
   [junit4]   2> 
   [junit4]   2> NOTE: test params are: codec=Asserting(Lucene53): {range_facet_l_dv=PostingsFormat(name=Direct), _version_=PostingsFormat(name=MockRandom), multiDefault=PostingsFormat(name=LuceneVarGapDocFreqInterval), a_t=PostingsFormat(name=LuceneVarGapDocFreqInterval), intDefault=PostingsFormat(name=MockRandom), id=PostingsFormat(name=Direct), range_facet_i_dv=PostingsFormat(name=LuceneVarGapDocFreqInterval), text=BlockTreeOrds(blocksize=128), range_facet_l=PostingsFormat(name=LuceneVarGapDocFreqInterval), timestamp=PostingsFormat(name=LuceneVarGapDocFreqInterval)}, docValues:{range_facet_l_dv=DocValuesFormat(name=Memory), range_facet_i_dv=DocValuesFormat(name=Direct), timestamp=DocValuesFormat(name=Direct)}, sim=RandomSimilarityProvider(queryNorm=true,coord=yes): {}, locale=de_DE, timezone=Asia/Ashkhabad
   [junit4]   2> NOTE: Linux 3.19.0-25-generic amd64/Oracle Corporation 1.8.0_51 (64-bit)/cpus=12,threads=1,free=297520920,total=528482304
   [junit4]   2> NOTE: All tests run in this JVM: [TestExactSharedStatsCache, SolrIndexSplitterTest, TestBinaryResponseWriter, DistributedFacetPivotSmallTest, TestInitQParser, NumericFieldsTest, DistributedFacetPivotWhiteBoxTest, TestImplicitCoreProperties, TestTrie, TestDocBasedVersionConstraints, OverseerTest, SmileWriterTest, FileBasedSpellCheckerTest, NotRequiredUniqueKeyTest, TestDistributedMissingSort, TestRecovery, TestMissingGroups, XmlUpdateRequestHandlerTest, DistributedExpandComponentTest, BlockDirectoryTest, ZkStateWriterTest, StatsComponentTest, TestIntervalFaceting, MultiThreadedOCPTest, OutOfBoxZkACLAndCredentialsProvidersTest, CachingDirectoryFactoryTest, ReplicationFactorTest, CircularListTest, SimpleFacetsTest, SOLR749Test, CdcrRequestHandlerTest, BadIndexSchemaTest, TestStressRecovery, AsyncMigrateRouteKeyTest, TestBlendedInfixSuggestions, DistributedQueryElevationComponentTest, TestFreeTextSuggestions, SolrXmlInZkTest, TestDefaultSimilarityFactory, XsltUpdateRequestHandlerTest, TestReload, AtomicUpdatesTest, TestReloadAndDeleteDocs, UUIDUpdateProcessorFallbackTest, DistribCursorPagingTest, DistribDocExpirationUpdateProcessorTest, TermVectorComponentDistributedTest, BitVectorTest, TestStandardQParsers, SoftAutoCommitTest, BasicDistributedZk2Test, TestHighFrequencyDictionaryFactory, SynonymTokenizerTest, TestSchemaManager, AliasIntegrationTest, TestPartialUpdateDeduplication, TestSort, UnloadDistributedZkTest, TestSolrCloudWithKerberosAlt, TestReloadDeadlock, TestExtendedDismaxParser, AnalyticsQueryTest, PluginInfoTest, DirectUpdateHandlerTest, TestQueryTypes, FacetPivotSmallTest, TestRestoreCore, TestSolrJ, BinaryUpdateRequestHandlerTest, SecurityConfHandlerTest, TestObjectReleaseTracker, OverseerRolesTest, PolyFieldTest, TestQuerySenderNoQuery, DirectUpdateHandlerOptimizeTest, AssignTest, TestSurroundQueryParser, HdfsBasicDistributedZk2Test, TestFieldCollectionResource, TestPivotHelperCode, TestCloudInspectUtil, TestSolr4Spatial2, ChaosMonkeySafeLeaderTest, CollectionsAPIDistributedZkTest, ClusterStateUpdateTest, LeaderElectionTest, ZkSolrClientTest, TestRandomDVFaceting, TestFaceting, TestHashPartitioner, TestStressReorder, HardAutoCommitTest, TestRangeQuery, TestCoreContainer, SolrCoreTest, TestGroupingSearch, TestFiltering, DocValuesTest, SuggesterTest, WordBreakSolrSpellCheckerTest, TestPseudoReturnFields, QueryEqualityTest, SortByFunctionTest, TestRemoteStreaming, DocValuesMultiTest, SolrInfoMBeanTest, CacheHeaderTest, LukeRequestHandlerTest, StandardRequestHandlerTest, TestReversedWildcardFilterFactory, DocumentAnalysisRequestHandlerTest, TermsComponentTest, PathHierarchyTokenizerFactoryTest, TestIndexingPerformance, MoreLikeThisHandlerTest, TestArbitraryIndexDir, RegexBoostProcessorTest, TestJmxIntegration, UpdateRequestProcessorFactoryTest, TestCSVResponseWriter, UniqFieldsUpdateProcessorFactoryTest, TestPHPSerializedResponseWriter, SearchHandlerTest, ResponseLogComponentTest, TestSolrDeletionPolicy2, SampleTest, OutputWriterTest, DirectSolrConnectionTest, TestPhraseSuggestions, TestPerFieldSimilarity, TestLMJelinekMercerSimilarityFactory, TestBM25SimilarityFactory, TimeZoneUtilsTest, TestFastOutputStream, OpenExchangeRatesOrgProviderTest, TestFastLRUCache, PrimUtilsTest, DateFieldTest, ZkNodePropsTest, SolrTestCaseJ4Test, TestCursorMarkWithoutUniqueKey, TestHighlightDedupGrouping, CdcrReplicationHandlerTest, DeleteShardTest, HttpPartitionTest]
   [junit4]   2> NOTE: reproduce with: ant test  -Dtestcase=HttpPartitionTest -Dtests.seed=EA3C0AEF8115A7B6 -Dtests.multiplier=3 -Dtests.slow=true -Dtests.locale=de_DE -Dtests.timezone=Asia/Ashkhabad -Dtests.asserts=true -Dtests.file.encoding=US-ASCII
   [junit4] ERROR   0.00s J2 | HttpPartitionTest (suite) <<<
   [junit4]    > Throwable #1: java.lang.AssertionError: ObjectTracker found 1 object(s) that were not released!!! [TransactionLog]
   [junit4]    > 	at __randomizedtesting.SeedInfo.seed([EA3C0AEF8115A7B6]:0)
   [junit4]    > 	at org.apache.solr.SolrTestCaseJ4.afterClass(SolrTestCaseJ4.java:236)
   [junit4]    > 	at java.lang.Thread.run(Thread.java:745)
   [junit4] Completed [422/541] on J2 in 136.91s, 1 test, 1 failure <<< FAILURES!

[...truncated 391 lines...]
BUILD FAILED
/home/jenkins/workspace/Lucene-Solr-trunk-Linux/build.xml:775: The following error occurred while executing this line:
/home/jenkins/workspace/Lucene-Solr-trunk-Linux/build.xml:719: The following error occurred while executing this line:
/home/jenkins/workspace/Lucene-Solr-trunk-Linux/build.xml:59: The following error occurred while executing this line:
/home/jenkins/workspace/Lucene-Solr-trunk-Linux/solr/build.xml:233: The following error occurred while executing this line:
/home/jenkins/workspace/Lucene-Solr-trunk-Linux/solr/common-build.xml:514: The following error occurred while executing this line:
/home/jenkins/workspace/Lucene-Solr-trunk-Linux/lucene/common-build.xml:1431: The following error occurred while executing this line:
/home/jenkins/workspace/Lucene-Solr-trunk-Linux/lucene/common-build.xml:986: There were test failures: 541 suites, 2134 tests, 1 suite-level error, 1 failure, 68 ignored (32 assumptions)

Total time: 46 minutes 16 seconds
Build step 'Invoke Ant' marked build as failure
Archiving artifacts
[WARNINGS] Skipping publisher since build result is FAILURE
Recording test results
Email was triggered for: Failure - Any
Sending email for trigger: Failure - Any



Mime
View raw message