lucene-dev mailing list archives

Site index · List index
Message view « Date » · « Thread »
Top « Date » · « Thread »
From Policeman Jenkins Server <jenk...@thetaphi.de>
Subject [JENKINS] Lucene-Solr-trunk-Windows (64bit/jdk1.8.0_51) - Build # 5128 - Still Failing!
Date Sun, 09 Aug 2015 14:23:12 GMT
Build: http://jenkins.thetaphi.de/job/Lucene-Solr-trunk-Windows/5128/
Java: 64bit/jdk1.8.0_51 -XX:-UseCompressedOops -XX:+UseParallelGC

1 tests failed.
FAILED:  org.apache.solr.search.TestStressReorder.testStressReorderVersions

Error Message:
Captured an uncaught exception in thread: Thread[id=12381, name=READER3, state=RUNNABLE, group=TGRP-TestStressReorder]

Stack Trace:
com.carrotsearch.randomizedtesting.UncaughtExceptionError: Captured an uncaught exception in thread: Thread[id=12381, name=READER3, state=RUNNABLE, group=TGRP-TestStressReorder]
	at __randomizedtesting.SeedInfo.seed([DA5C3DC3EE491C03:C69A04D5E482988E]:0)
Caused by: java.lang.RuntimeException: java.lang.AssertionError
	at __randomizedtesting.SeedInfo.seed([DA5C3DC3EE491C03]:0)
	at org.apache.solr.search.TestStressReorder$2.run(TestStressReorder.java:316)
Caused by: java.lang.AssertionError
	at org.junit.Assert.fail(Assert.java:92)
	at org.junit.Assert.assertTrue(Assert.java:43)
	at org.junit.Assert.assertTrue(Assert.java:54)
	at org.apache.solr.search.TestStressReorder$2.run(TestStressReorder.java:309)




Build Log:
[...truncated 10315 lines...]
   [junit4] Suite: org.apache.solr.search.TestStressReorder
   [junit4]   2> Creating dataDir: C:\Users\JenkinsSlave\workspace\Lucene-Solr-trunk-Windows\solr\build\solr-core\test\J0\temp\solr.search.TestStressReorder_DA5C3DC3EE491C03-001\init-core-data-001
   [junit4]   2> 1571496 INFO  (SUITE-TestStressReorder-seed#[DA5C3DC3EE491C03]-worker) [    ] o.a.s.SolrTestCaseJ4 Randomized ssl (false) and clientAuth (false)
   [junit4]   2> 1571497 INFO  (SUITE-TestStressReorder-seed#[DA5C3DC3EE491C03]-worker) [    ] o.a.s.SolrTestCaseJ4 ####initCore
   [junit4]   2> 1571497 INFO  (SUITE-TestStressReorder-seed#[DA5C3DC3EE491C03]-worker) [    ] o.a.s.c.SolrResourceLoader new SolrResourceLoader for directory: 'C:\Users\JenkinsSlave\workspace\Lucene-Solr-trunk-Windows\solr\core\src\test-files\solr\collection1\'
   [junit4]   2> 1571498 INFO  (SUITE-TestStressReorder-seed#[DA5C3DC3EE491C03]-worker) [    ] o.a.s.c.SolrResourceLoader Adding 'file:/C:/Users/JenkinsSlave/workspace/Lucene-Solr-trunk-Windows/solr/core/src/test-files/solr/collection1/lib/classes/' to classloader
   [junit4]   2> 1571499 INFO  (SUITE-TestStressReorder-seed#[DA5C3DC3EE491C03]-worker) [    ] o.a.s.c.SolrResourceLoader Adding 'file:/C:/Users/JenkinsSlave/workspace/Lucene-Solr-trunk-Windows/solr/core/src/test-files/solr/collection1/lib/README' to classloader
   [junit4]   2> 1571529 INFO  (SUITE-TestStressReorder-seed#[DA5C3DC3EE491C03]-worker) [    ] o.a.s.c.SolrConfig current version of requestparams : -1
   [junit4]   2> 1571531 INFO  (SUITE-TestStressReorder-seed#[DA5C3DC3EE491C03]-worker) [    ] o.a.s.c.SolrConfig Using Lucene MatchVersion: 6.0.0
   [junit4]   2> 1571536 INFO  (SUITE-TestStressReorder-seed#[DA5C3DC3EE491C03]-worker) [    ] o.a.s.c.Config Loaded SolrConfig: solrconfig-tlog.xml
   [junit4]   2> 1571537 INFO  (SUITE-TestStressReorder-seed#[DA5C3DC3EE491C03]-worker) [    ] o.a.s.s.IndexSchema Reading Solr Schema from C:\Users\JenkinsSlave\workspace\Lucene-Solr-trunk-Windows\solr\core\src\test-files\solr\collection1\conf\schema15.xml
   [junit4]   2> 1571541 INFO  (SUITE-TestStressReorder-seed#[DA5C3DC3EE491C03]-worker) [    ] o.a.s.s.IndexSchema [null] Schema name=test
   [junit4]   2> 1571606 INFO  (SUITE-TestStressReorder-seed#[DA5C3DC3EE491C03]-worker) [    ] o.a.s.s.IndexSchema default search field in schema is text
   [junit4]   2> 1571607 INFO  (SUITE-TestStressReorder-seed#[DA5C3DC3EE491C03]-worker) [    ] o.a.s.s.IndexSchema unique key field: id
   [junit4]   2> 1571607 INFO  (SUITE-TestStressReorder-seed#[DA5C3DC3EE491C03]-worker) [    ] o.a.s.s.FileExchangeRateProvider Reloading exchange rates from file currency.xml
   [junit4]   2> 1571609 INFO  (SUITE-TestStressReorder-seed#[DA5C3DC3EE491C03]-worker) [    ] o.a.s.s.FileExchangeRateProvider Reloading exchange rates from file currency.xml
   [junit4]   2> 1571616 INFO  (SUITE-TestStressReorder-seed#[DA5C3DC3EE491C03]-worker) [    ] o.a.s.c.SolrResourceLoader JNDI not configured for solr (NoInitialContextEx)
   [junit4]   2> 1571616 INFO  (SUITE-TestStressReorder-seed#[DA5C3DC3EE491C03]-worker) [    ] o.a.s.c.SolrResourceLoader using system property solr.solr.home: C:\Users\JenkinsSlave\workspace\Lucene-Solr-trunk-Windows\solr\core\src\test-files\solr
   [junit4]   2> 1571616 INFO  (SUITE-TestStressReorder-seed#[DA5C3DC3EE491C03]-worker) [    ] o.a.s.c.SolrResourceLoader new SolrResourceLoader for directory: 'C:\Users\JenkinsSlave\workspace\Lucene-Solr-trunk-Windows\solr\core\src\test-files\solr\'
   [junit4]   2> 1571626 INFO  (SUITE-TestStressReorder-seed#[DA5C3DC3EE491C03]-worker) [    ] o.a.s.c.CoreContainer New CoreContainer 763331860
   [junit4]   2> 1571627 INFO  (SUITE-TestStressReorder-seed#[DA5C3DC3EE491C03]-worker) [    ] o.a.s.c.CoreContainer Loading cores into CoreContainer [instanceDir=C:\Users\JenkinsSlave\workspace\Lucene-Solr-trunk-Windows\solr\core\src\test-files\solr\]
   [junit4]   2> 1571627 INFO  (SUITE-TestStressReorder-seed#[DA5C3DC3EE491C03]-worker) [    ] o.a.s.c.CoreContainer loading shared library: C:\Users\JenkinsSlave\workspace\Lucene-Solr-trunk-Windows\solr\core\src\test-files\solr\lib
   [junit4]   2> 1571627 WARN  (SUITE-TestStressReorder-seed#[DA5C3DC3EE491C03]-worker) [    ] o.a.s.c.SolrResourceLoader Can't find (or read) directory to add to classloader: lib (resolved as: C:\Users\JenkinsSlave\workspace\Lucene-Solr-trunk-Windows\solr\core\src\test-files\solr\lib).
   [junit4]   2> 1571633 INFO  (SUITE-TestStressReorder-seed#[DA5C3DC3EE491C03]-worker) [    ] o.a.s.h.c.HttpShardHandlerFactory created with socketTimeout : 600000,connTimeout : 60000,maxConnectionsPerHost : 20,maxConnections : 10000,corePoolSize : 0,maximumPoolSize : 2147483647,maxThreadIdleTime : 5,sizeOfQueue : -1,fairnessPolicy : false,useRetries : false,
   [junit4]   2> 1571636 INFO  (SUITE-TestStressReorder-seed#[DA5C3DC3EE491C03]-worker) [    ] o.a.s.u.UpdateShardHandler Creating UpdateShardHandler HTTP client with params: socketTimeout=30000&connTimeout=30000&retry=true
   [junit4]   2> 1571636 INFO  (SUITE-TestStressReorder-seed#[DA5C3DC3EE491C03]-worker) [    ] o.a.s.l.LogWatcher SLF4J impl is org.slf4j.impl.Log4jLoggerFactory
   [junit4]   2> 1571636 INFO  (SUITE-TestStressReorder-seed#[DA5C3DC3EE491C03]-worker) [    ] o.a.s.l.LogWatcher Registering Log Listener [Log4j (org.slf4j.impl.Log4jLoggerFactory)]
   [junit4]   2> 1571636 INFO  (SUITE-TestStressReorder-seed#[DA5C3DC3EE491C03]-worker) [    ] o.a.s.c.CoreContainer Security conf doesn't exist. Skipping setup for authorization module.
   [junit4]   2> 1571636 INFO  (SUITE-TestStressReorder-seed#[DA5C3DC3EE491C03]-worker) [    ] o.a.s.c.CoreContainer No authentication plugin used.
   [junit4]   2> 1571638 INFO  (SUITE-TestStressReorder-seed#[DA5C3DC3EE491C03]-worker) [    ] o.a.s.c.SolrCore Created CoreDescriptor: {name=collection1, config=solrconfig-tlog.xml, transient=false, schema=schema15.xml, loadOnStartup=true, configSetProperties=configsetprops.json, instanceDir=collection1, collection=collection1, absoluteInstDir=C:\Users\JenkinsSlave\workspace\Lucene-Solr-trunk-Windows\solr\core\src\test-files\solr\collection1\, dataDir=C:\Users\JenkinsSlave\workspace\Lucene-Solr-trunk-Windows\solr\build\solr-core\test\J0\temp\solr.search.TestStressReorder_DA5C3DC3EE491C03-001\init-core-data-001, shard=shard1}
   [junit4]   2> 1571639 INFO  (coreLoadExecutor-5383-thread-1) [    ] o.a.s.c.SolrResourceLoader new SolrResourceLoader for directory: 'C:\Users\JenkinsSlave\workspace\Lucene-Solr-trunk-Windows\solr\core\src\test-files\solr\collection1\'
   [junit4]   2> 1571639 INFO  (coreLoadExecutor-5383-thread-1) [    ] o.a.s.c.SolrResourceLoader Adding 'file:/C:/Users/JenkinsSlave/workspace/Lucene-Solr-trunk-Windows/solr/core/src/test-files/solr/collection1/lib/classes/' to classloader
   [junit4]   2> 1571640 INFO  (coreLoadExecutor-5383-thread-1) [    ] o.a.s.c.SolrResourceLoader Adding 'file:/C:/Users/JenkinsSlave/workspace/Lucene-Solr-trunk-Windows/solr/core/src/test-files/solr/collection1/lib/README' to classloader
   [junit4]   2> 1571652 INFO  (coreLoadExecutor-5383-thread-1) [    ] o.a.s.c.SolrConfig current version of requestparams : -1
   [junit4]   2> 1571654 INFO  (coreLoadExecutor-5383-thread-1) [    ] o.a.s.c.SolrConfig Using Lucene MatchVersion: 6.0.0
   [junit4]   2> 1571660 INFO  (coreLoadExecutor-5383-thread-1) [    ] o.a.s.c.Config Loaded SolrConfig: solrconfig-tlog.xml
   [junit4]   2> 1571661 INFO  (coreLoadExecutor-5383-thread-1) [    ] o.a.s.s.IndexSchema Reading Solr Schema from C:\Users\JenkinsSlave\workspace\Lucene-Solr-trunk-Windows\solr\core\src\test-files\solr\collection1\conf\schema15.xml
   [junit4]   2> 1571664 INFO  (coreLoadExecutor-5383-thread-1) [    ] o.a.s.s.IndexSchema [collection1] Schema name=test
   [junit4]   2> 1571714 INFO  (coreLoadExecutor-5383-thread-1) [    ] o.a.s.s.IndexSchema default search field in schema is text
   [junit4]   2> 1571715 INFO  (coreLoadExecutor-5383-thread-1) [    ] o.a.s.s.IndexSchema unique key field: id
   [junit4]   2> 1571716 INFO  (coreLoadExecutor-5383-thread-1) [    ] o.a.s.s.FileExchangeRateProvider Reloading exchange rates from file currency.xml
   [junit4]   2> 1571717 INFO  (coreLoadExecutor-5383-thread-1) [    ] o.a.s.s.FileExchangeRateProvider Reloading exchange rates from file currency.xml
   [junit4]   2> 1571725 INFO  (coreLoadExecutor-5383-thread-1) [    ] o.a.s.c.ConfigSetProperties Did not find ConfigSet properties, assuming default properties: Can't find resource 'configsetprops.json' in classpath or 'C:\Users\JenkinsSlave\workspace\Lucene-Solr-trunk-Windows\solr\core\src\test-files\solr\collection1\conf'
   [junit4]   2> 1571725 INFO  (coreLoadExecutor-5383-thread-1) [    ] o.a.s.c.CoreContainer Creating SolrCore 'collection1' using configuration from instancedir C:\Users\JenkinsSlave\workspace\Lucene-Solr-trunk-Windows\solr\core\src\test-files\solr\collection1\
   [junit4]   2> 1571725 INFO  (coreLoadExecutor-5383-thread-1) [    x:collection1] o.a.s.c.SolrCore org.apache.solr.core.MockDirectoryFactory
   [junit4]   2> 1571725 INFO  (coreLoadExecutor-5383-thread-1) [    x:collection1] o.a.s.c.SolrCore [[collection1] ] Opening new SolrCore at [C:\Users\JenkinsSlave\workspace\Lucene-Solr-trunk-Windows\solr\core\src\test-files\solr\collection1\], dataDir=[null]
   [junit4]   2> 1571726 INFO  (coreLoadExecutor-5383-thread-1) [    x:collection1] o.a.s.c.JmxMonitoredMap JMX monitoring is enabled. Adding Solr mbeans to JMX Server: com.sun.jmx.mbeanserver.JmxMBeanServer@7df016f0
   [junit4]   2> 1571726 INFO  (coreLoadExecutor-5383-thread-1) [    x:collection1] o.a.s.c.CachingDirectoryFactory return new directory for C:\Users\JenkinsSlave\workspace\Lucene-Solr-trunk-Windows\solr\build\solr-core\test\J0\temp\solr.search.TestStressReorder_DA5C3DC3EE491C03-001\init-core-data-001\
   [junit4]   2> 1571726 INFO  (coreLoadExecutor-5383-thread-1) [    x:collection1] o.a.s.c.SolrCore New index directory detected: old=null new=C:\Users\JenkinsSlave\workspace\Lucene-Solr-trunk-Windows\solr\build\solr-core\test\J0\temp\solr.search.TestStressReorder_DA5C3DC3EE491C03-001\init-core-data-001\index/
   [junit4]   2> 1571726 WARN  (coreLoadExecutor-5383-thread-1) [    x:collection1] o.a.s.c.SolrCore [collection1] Solr index directory 'C:\Users\JenkinsSlave\workspace\Lucene-Solr-trunk-Windows\solr\build\solr-core\test\J0\temp\solr.search.TestStressReorder_DA5C3DC3EE491C03-001\init-core-data-001\index' doesn't exist. Creating new index...
   [junit4]   2> 1571726 INFO  (coreLoadExecutor-5383-thread-1) [    x:collection1] o.a.s.c.CachingDirectoryFactory return new directory for C:\Users\JenkinsSlave\workspace\Lucene-Solr-trunk-Windows\solr\build\solr-core\test\J0\temp\solr.search.TestStressReorder_DA5C3DC3EE491C03-001\init-core-data-001\index
   [junit4]   2> 1571726 INFO  (coreLoadExecutor-5383-thread-1) [    x:collection1] o.a.s.u.RandomMergePolicy RandomMergePolicy wrapping class org.apache.lucene.index.LogByteSizeMergePolicy: [LogByteSizeMergePolicy: minMergeSize=1677721, mergeFactor=45, maxMergeSize=2147483648, maxMergeSizeForForcedMerge=9223372036854775807, calibrateSizeByDeletes=false, maxMergeDocs=2147483647, maxCFSSegmentSizeMB=8.796093022207999E12, noCFSRatio=0.0]
   [junit4]   2> 1571727 INFO  (coreLoadExecutor-5383-thread-1) [    x:collection1] o.a.s.c.SolrCore SolrDeletionPolicy.onCommit: commits: num=1
   [junit4]   2> 	commit{dir=MockDirectoryWrapper(RAMDirectory@1e7c54ae lockFactory=org.apache.lucene.store.SingleInstanceLockFactory@64f24ad1),segFN=segments_1,generation=1}
   [junit4]   2> 1571727 INFO  (coreLoadExecutor-5383-thread-1) [    x:collection1] o.a.s.c.SolrCore newest commit generation = 1
   [junit4]   2> 1571728 INFO  (OldIndexDirectoryCleanupThreadForCore-collection1) [    x:collection1] o.a.s.c.SolrCore Looking for old index directories to cleanup for core collection1 in C:\Users\JenkinsSlave\workspace\Lucene-Solr-trunk-Windows\solr\build\solr-core\test\J0\temp\solr.search.TestStressReorder_DA5C3DC3EE491C03-001\init-core-data-001\
   [junit4]   2> 1571729 INFO  (coreLoadExecutor-5383-thread-1) [    x:collection1] o.a.s.u.p.UpdateRequestProcessorChain creating updateRequestProcessorChain "nodistrib"
   [junit4]   2> 1571729 INFO  (coreLoadExecutor-5383-thread-1) [    x:collection1] o.a.s.u.p.UpdateRequestProcessorChain creating updateRequestProcessorChain "dedupe"
   [junit4]   2> 1571729 INFO  (coreLoadExecutor-5383-thread-1) [    x:collection1] o.a.s.u.p.UpdateRequestProcessorChain inserting DistributedUpdateProcessorFactory into updateRequestProcessorChain "dedupe"
   [junit4]   2> 1571730 INFO  (coreLoadExecutor-5383-thread-1) [    x:collection1] o.a.s.u.p.UpdateRequestProcessorChain creating updateRequestProcessorChain "stored_sig"
   [junit4]   2> 1571730 INFO  (coreLoadExecutor-5383-thread-1) [    x:collection1] o.a.s.u.p.UpdateRequestProcessorChain inserting DistributedUpdateProcessorFactory into updateRequestProcessorChain "stored_sig"
   [junit4]   2> 1571730 INFO  (coreLoadExecutor-5383-thread-1) [    x:collection1] o.a.s.u.p.UpdateRequestProcessorChain creating updateRequestProcessorChain "distrib-dup-test-chain-explicit"
   [junit4]   2> 1571730 INFO  (coreLoadExecutor-5383-thread-1) [    x:collection1] o.a.s.u.p.UpdateRequestProcessorChain creating updateRequestProcessorChain "distrib-dup-test-chain-implicit"
   [junit4]   2> 1571730 INFO  (coreLoadExecutor-5383-thread-1) [    x:collection1] o.a.s.u.p.UpdateRequestProcessorChain inserting DistributedUpdateProcessorFactory into updateRequestProcessorChain "distrib-dup-test-chain-implicit"
   [junit4]   2> 1571730 INFO  (coreLoadExecutor-5383-thread-1) [    x:collection1] o.a.s.c.SolrCore no updateRequestProcessorChain defined as default, creating implicit default
   [junit4]   2> 1571733 INFO  (coreLoadExecutor-5383-thread-1) [    x:collection1] o.a.s.h.l.XMLLoader xsltCacheLifetimeSeconds=60
   [junit4]   2> 1571734 INFO  (coreLoadExecutor-5383-thread-1) [    x:collection1] o.a.s.h.l.XMLLoader xsltCacheLifetimeSeconds=60
   [junit4]   2> 1571735 INFO  (coreLoadExecutor-5383-thread-1) [    x:collection1] o.a.s.h.l.XMLLoader xsltCacheLifetimeSeconds=60
   [junit4]   2> 1571736 INFO  (coreLoadExecutor-5383-thread-1) [    x:collection1] o.a.s.h.l.XMLLoader xsltCacheLifetimeSeconds=60
   [junit4]   2> 1571737 INFO  (coreLoadExecutor-5383-thread-1) [    x:collection1] o.a.s.c.RequestHandlers Registered paths: /admin/mbeans,standard,/update/csv,/update/json/docs,/admin/luke,/admin/segments,/get,/admin/system,/replication,/admin/properties,/config,/schema,/admin/plugins,/admin/logging,/update/json,/admin/threads,/admin/ping,/update,/admin/file
   [junit4]   2> 1571738 INFO  (coreLoadExecutor-5383-thread-1) [    x:collection1] o.a.s.c.SolrCore Using default statsCache cache: org.apache.solr.search.stats.LocalStatsCache
   [junit4]   2> 1571739 INFO  (coreLoadExecutor-5383-thread-1) [    x:collection1] o.a.s.u.UpdateHandler Using UpdateLog implementation: org.apache.solr.update.UpdateLog
   [junit4]   2> 1571739 INFO  (coreLoadExecutor-5383-thread-1) [    x:collection1] o.a.s.u.UpdateLog Initializing UpdateLog: dataDir= defaultSyncLevel=FLUSH numRecordsToKeep=100 maxNumLogsToKeep=10 numVersionBuckets=65536
   [junit4]   2> 1571739 INFO  (coreLoadExecutor-5383-thread-1) [    x:collection1] o.a.s.c.SolrCore Hard AutoCommit: disabled
   [junit4]   2> 1571740 INFO  (coreLoadExecutor-5383-thread-1) [    x:collection1] o.a.s.c.SolrCore Soft AutoCommit: disabled
   [junit4]   2> 1571740 INFO  (coreLoadExecutor-5383-thread-1) [    x:collection1] o.a.s.u.RandomMergePolicy RandomMergePolicy wrapping class org.apache.lucene.index.LogDocMergePolicy: [LogDocMergePolicy: minMergeSize=1000, mergeFactor=31, maxMergeSize=9223372036854775807, maxMergeSizeForForcedMerge=9223372036854775807, calibrateSizeByDeletes=false, maxMergeDocs=2147483647, maxCFSSegmentSizeMB=8.796093022207999E12, noCFSRatio=0.606224704960588]
   [junit4]   2> 1571740 INFO  (coreLoadExecutor-5383-thread-1) [    x:collection1] o.a.s.c.SolrCore SolrDeletionPolicy.onInit: commits: num=1
   [junit4]   2> 	commit{dir=MockDirectoryWrapper(RAMDirectory@1e7c54ae lockFactory=org.apache.lucene.store.SingleInstanceLockFactory@64f24ad1),segFN=segments_1,generation=1}
   [junit4]   2> 1571740 INFO  (coreLoadExecutor-5383-thread-1) [    x:collection1] o.a.s.c.SolrCore newest commit generation = 1
   [junit4]   2> 1571740 INFO  (coreLoadExecutor-5383-thread-1) [    x:collection1] o.a.s.s.SolrIndexSearcher Opening Searcher@4c858835[collection1] main
   [junit4]   2> 1571741 WARN  (coreLoadExecutor-5383-thread-1) [    x:collection1] o.a.s.r.ManagedResourceStorage Cannot write to config directory C:\Users\JenkinsSlave\workspace\Lucene-Solr-trunk-Windows\solr\core\src\test-files\solr\collection1\conf; switching to use InMemory storage instead.
   [junit4]   2> 1571741 INFO  (coreLoadExecutor-5383-thread-1) [    x:collection1] o.a.s.r.RestManager Initializing RestManager with initArgs: {}
   [junit4]   2> 1571741 INFO  (coreLoadExecutor-5383-thread-1) [    x:collection1] o.a.s.r.ManagedResourceStorage Reading _rest_managed.json using InMemoryStorage
   [junit4]   2> 1571741 INFO  (coreLoadExecutor-5383-thread-1) [    x:collection1] o.a.s.r.RestManager Initializing 0 registered ManagedResources
   [junit4]   2> 1571741 INFO  (coreLoadExecutor-5383-thread-1) [    x:collection1] o.a.s.h.ReplicationHandler Commits will be reserved for  10000
   [junit4]   2> 1571741 INFO  (searcherExecutor-5384-thread-1-processing-x:collection1) [    x:collection1] o.a.s.c.SolrCore [collection1] Registered new searcher Searcher@4c858835[collection1] main{ExitableDirectoryReader(UninvertingDirectoryReader())}
   [junit4]   2> 1571742 INFO  (coreLoadExecutor-5383-thread-1) [    x:collection1] o.a.s.u.UpdateLog Looking up max value of version field to seed version buckets
   [junit4]   2> 1571742 INFO  (coreLoadExecutor-5383-thread-1) [    x:collection1] o.a.s.u.VersionInfo Refreshing highest value of _version_ for 65536 version buckets from index
   [junit4]   2> 1571743 INFO  (coreLoadExecutor-5383-thread-1) [    x:collection1] o.a.s.u.VersionInfo No terms found for _version_, cannot seed version bucket highest value from index
   [junit4]   2> 1571743 INFO  (coreLoadExecutor-5383-thread-1) [    x:collection1] o.a.s.u.UpdateLog Could not find max version in index or recent updates, using new clock 1509035948154814464
   [junit4]   2> 1571744 INFO  (coreLoadExecutor-5383-thread-1) [    x:collection1] o.a.s.u.UpdateLog Took 1.0ms to seed version buckets with highest version 1509035948154814464
   [junit4]   2> 1571744 INFO  (coreLoadExecutor-5383-thread-1) [    x:collection1] o.a.s.c.CoreContainer registering core: collection1
   [junit4]   2> 1571745 INFO  (SUITE-TestStressReorder-seed#[DA5C3DC3EE491C03]-worker) [    ] o.a.s.SolrTestCaseJ4 ####initCore end
   [junit4]   2> 1571746 INFO  (TEST-TestStressReorder.testStressReorderVersions-seed#[DA5C3DC3EE491C03]) [    ] o.a.s.SolrTestCaseJ4 ###Starting testStressReorderVersions
   [junit4]   2> 1571746 INFO  (TEST-TestStressReorder.testStressReorderVersions-seed#[DA5C3DC3EE491C03]) [    ] o.a.s.c.SolrCore [collection1] REMOVING ALL DOCUMENTS FROM INDEX
   [junit4]   2> 1571748 INFO  (TEST-TestStressReorder.testStressReorderVersions-seed#[DA5C3DC3EE491C03]) [    ] o.a.s.s.SolrIndexSearcher Opening Searcher@1406957f[collection1] realtime
   [junit4]   2> 1571748 INFO  (TEST-TestStressReorder.testStressReorderVersions-seed#[DA5C3DC3EE491C03]) [    ] o.a.s.u.p.LogUpdateProcessor [collection1] webapp=null path=null params={_version_=-9223372036854775807&update.distrib=FROMLEADER&versions=true&wt=json&indent=true} {deleteByQuery=*:* (-9223372036854775807)} 0 0
   [junit4]   2> 1571748 INFO  (TEST-TestStressReorder.testStressReorderVersions-seed#[DA5C3DC3EE491C03]) [    ] o.a.s.u.UpdateHandler start commit{,optimize=false,openSearcher=true,waitSearcher=true,expungeDeletes=false,softCommit=false,prepareCommit=false}
   [junit4]   2> 1571748 INFO  (TEST-TestStressReorder.testStressReorderVersions-seed#[DA5C3DC3EE491C03]) [    ] o.a.s.c.SolrCore SolrDeletionPolicy.onCommit: commits: num=2
   [junit4]   2> 	commit{dir=MockDirectoryWrapper(RAMDirectory@1e7c54ae lockFactory=org.apache.lucene.store.SingleInstanceLockFactory@64f24ad1),segFN=segments_1,generation=1}
   [junit4]   2> 	commit{dir=MockDirectoryWrapper(RAMDirectory@1e7c54ae lockFactory=org.apache.lucene.store.SingleInstanceLockFactory@64f24ad1),segFN=segments_2,generation=2}
   [junit4]   2> 1571749 INFO  (TEST-TestStressReorder.testStressReorderVersions-seed#[DA5C3DC3EE491C03]) [    ] o.a.s.c.SolrCore newest commit generation = 2
   [junit4]   2> 1571749 INFO  (TEST-TestStressReorder.testStressReorderVersions-seed#[DA5C3DC3EE491C03]) [    ] o.a.s.s.SolrIndexSearcher Opening Searcher@342426a[collection1] main
   [junit4]   2> 1571749 INFO  (TEST-TestStressReorder.testStressReorderVersions-seed#[DA5C3DC3EE491C03]) [    ] o.a.s.u.UpdateHandler end_commit_flush
   [junit4]   2> 1571749 INFO  (searcherExecutor-5384-thread-1) [    ] o.a.s.c.SolrCore [collection1] Registered new searcher Searcher@342426a[collection1] main{ExitableDirectoryReader(UninvertingDirectoryReader())}
   [junit4]   2> 1571750 INFO  (TEST-TestStressReorder.testStressReorderVersions-seed#[DA5C3DC3EE491C03]) [    ] o.a.s.u.p.LogUpdateProcessor [collection1] webapp=null path=null params={} {commit=} 0 1
   [junit4]   2> 1571751 INFO  (TEST-TestStressReorder.testStressReorderVersions-seed#[DA5C3DC3EE491C03]) [    ] o.a.s.s.TestStressReorder VERBOSE: commitPercent 16 softCommitPercent 74 deletePercent 17 deleteByQueryPercent 7 ndocs 20 nWriteThreads 25 percentRealtimeQuery 75 operations 50000 nReadThreads 10
   [junit4]   2> 1571754 INFO  (WRITER2) [    ] o.a.s.s.TestStressReorder VERBOSE: softCommit start
   [junit4]   2> 1571754 INFO  (WRITER0) [    ] o.a.s.s.TestStressReorder VERBOSE: adding id 2 val= 2 version 1
   [junit4]   2> 1571754 INFO  (WRITER2) [    ] o.a.s.u.UpdateHandler start commit{,optimize=false,openSearcher=true,waitSearcher=true,expungeDeletes=false,softCommit=true,prepareCommit=false}
   [junit4]   2> 1571754 INFO  (WRITER1) [    ] o.a.s.s.TestStressReorder VERBOSE: adding id 13 val= 2 version 2
   [junit4]   2> 1571757 INFO  (READER4) [    ] o.a.s.c.S.Request [collection1] webapp=null path=null params={qt=/get&ids=8&wt=json} status=0 QTime=0 
   [junit4]   2> 1571757 INFO  (READER3) [    ] o.a.s.c.S.Request [collection1] webapp=null path=null params={qt=/get&ids=18&wt=json} status=0 QTime=0 
   [junit4]   2> 1571757 INFO  (READER4) [    ] o.a.s.c.S.Request [collection1] webapp=null path=null params={qt=/get&ids=8&wt=json} status=0 QTime=0 
   [junit4]   2> 1571757 INFO  (READER4) [    ] o.a.s.c.S.Request [collection1] webapp=null path=null params={qt=/get&ids=6&wt=json} status=0 QTime=0 
   [junit4]   2> 1571757 INFO  (READER2) [    ] o.a.s.c.S.Request [collection1] webapp=null path=null params={qt=/get&ids=14&wt=json} status=0 QTime=0 
   [junit4]   2> 1571758 INFO  (READER5) [    ] o.a.s.c.S.Request [collection1] webapp=null path=null params={qt=/get&ids=10&wt=json} status=0 QTime=0 
   [junit4]   2> 1571758 INFO  (READER7) [    ] o.a.s.c.S.Request [collection1] webapp=null path=null params={qt=/get&ids=8&wt=json} status=0 QTime=0 
   [junit4]   2> 1571758 INFO  (READER5) [    ] o.a.s.c.S.Request [collection1] webapp=null path=null params={qt=/get&ids=13&wt=json} status=0 QTime=0 
   [junit4]   2> 1571757 INFO  (READER0) [    ] o.a.s.c.S.Request [collection1] webapp=null path=null params={qt=/get&ids=19&wt=json} status=0 QTime=0 
   [junit4]   2> 1571765 INFO  (READER9) [    ] o.a.s.c.S.Request [collection1] webapp=null path=null params={q=id:13&omitHeader=true&wt=json} hits=0 status=0 QTime=0 
   [junit4]   2> 1571765 INFO  (READER0) [    ] o.a.s.c.S.Request [collection1] webapp=null path=null params={q=id:8&omitHeader=true&wt=json} hits=0 status=0 QTime=0 
   [junit4]   2> 1571766 INFO  (READER1) [    ] o.a.s.c.S.Request [collection1] webapp=null path=null params={q=id:17&omitHeader=true&wt=json} hits=0 status=0 QTime=0 
   [junit4]   2> 1571766 INFO  (READER0) [    ] o.a.s.c.S.Request [collection1] webapp=null path=null params={q=id:8&omitHeader=true&wt=json} hits=0 status=0 QTime=0 
   [junit4]   2> 1571766 INFO  (READER1) [    ] o.a.s.c.S.Request [collection1] webapp=null path=null params={qt=/get&ids=16&wt=json} status=0 QTime=0 
   [junit4]   2> 1571766 INFO  (WRITER0) [    ] o.a.s.u.p.LogUpdateProcessor [collection1] webapp=null path=null params={update.distrib=FROMLEADER&versions=true&wt=json&indent=true} {add=[2 (1)]} 0 11
   [junit4]   2> 1571766 INFO  (READER1) [    ] o.a.s.c.S.Request [collection1] webapp=null path=null params={q=id:6&omitHeader=true&wt=json} hits=0 status=0 QTime=0 
   [junit4]   2> 1571766 INFO  (WRITER0) [    ] o.a.s.s.TestStressReorder VERBOSE: adding id 15 val= 2 version 22
   [junit4]   2> 1571766 INFO  (READER1) [    ] o.a.s.c.S.Request [collection1] webapp=null path=null params={q=id:9&omitHeader=true&wt=json} hits=0 status=0 QTime=0 
   [junit4]   2> 1571766 INFO  (READER1) [    ] o.a.s.c.S.Request [collection1] webapp=null path=null params={qt=/get&ids=15&wt=json} status=0 QTime=0 
   [junit4]   2> 1571756 INFO  (WRITER24) [    ] o.a.s.s.TestStressReorder VERBOSE: deleting id 8 val= 2 version 21
   [junit4]   2> 1571755 INFO  (WRITER7) [    ] o.a.s.s.TestStressReorder VERBOSE: adding id 5 val= 2 version 3
   [junit4]   2> 1571756 INFO  (WRITER3) [    ] o.a.s.s.TestStressReorder VERBOSE: adding id 8 val= 2 version 20
   [junit4]   2> 1571766 INFO  (READER9) [    ] o.a.s.c.S.Request [collection1] webapp=null path=null params={qt=/get&ids=18&wt=json} status=0 QTime=1 
   [junit4]   2> 1571766 INFO  (READER3) [    ] o.a.s.c.S.Request [collection1] webapp=null path=null params={q=id:8&omitHeader=true&wt=json} hits=0 status=0 QTime=0 
   [junit4]   2> 1571766 INFO  (READER3) [    ] o.a.s.c.S.Request [collection1] webapp=null path=null params={qt=/get&ids=9&wt=json} status=0 QTime=0 
   [junit4]   2> 1571766 INFO  (READER3) [    ] o.a.s.c.S.Request [collection1] webapp=null path=null params={q=id:2&omitHeader=true&wt=json} hits=0 status=0 QTime=0 
   [junit4]   2> 1571756 INFO  (WRITER23) [    ] o.a.s.s.TestStressReorder VERBOSE: deleting id 8 val= 2 version 19
   [junit4]   2> 1571767 INFO  (READER4) [    ] o.a.s.c.S.Request [collection1] webapp=null path=null params={q=id:17&omitHeader=true&wt=json} hits=0 status=0 QTime=0 
   [junit4]   2> 1571767 INFO  (READER4) [    ] o.a.s.c.S.Request [collection1] webapp=null path=null params={qt=/get&ids=1&wt=json} status=0 QTime=0 
   [junit4]   2> 1571767 INFO  (READER4) [    ] o.a.s.c.S.Request [collection1] webapp=null path=null params={qt=/get&ids=15&wt=json} status=0 QTime=0 
   [junit4]   2> 1571767 INFO  (READER4) [    ] o.a.s.c.S.Request [collection1] webapp=null path=null params={qt=/get&ids=16&wt=json} status=0 QTime=0 
   [junit4]   2> 1571767 INFO  (READER4) [    ] o.a.s.c.S.Request [collection1] webapp=null path=null params={qt=/get&ids=10&wt=json} status=0 QTime=0 
   [junit4]   2> 1571767 INFO  (READER4) [    ] o.a.s.c.S.Request [collection1] webapp=null path=null params={qt=/get&ids=15&wt=json} status=0 QTime=0 
   [junit4]   2> 1571767 INFO  (READER4) [    ] o.a.s.c.S.Request [collection1] webapp=null path=null params={qt=/get&ids=5&wt=json} status=0 QTime=0 
   [junit4]   2> 1571767 INFO  (WRITER0) [    ] o.a.s.u.p.LogUpdateProcessor [collection1] webapp=null path=null params={update.distrib=FROMLEADER&versions=true&wt=json&indent=true} {add=[15 (22)]} 0 1
   [junit4]   2> 1571767 INFO  (READER4) [    ] o.a.s.c.S.Request [collection1] webapp=null path=null params={q=id:9&omitHeader=true&wt=json} hits=0 status=0 QTime=0 
   [junit4]   2> 1571767 INFO  (WRITER0) [    ] o.a.s.s.TestStressReorder VERBOSE: adding id 8 val= 2 version 23
   [junit4]   2> 1571767 INFO  (READER4) [    ] o.a.s.c.S.Request [collection1] webapp=null path=null params={q=id:18&omitHeader=true&wt=json} hits=0 status=0 QTime=0 
   [junit4]   2> 1571768 INFO  (READER4) [    ] o.a.s.c.S.Request [collection1] webapp=null path=null params={q=id:15&omitHeader=true&wt=json} hits=0 status=0 QTime=0 
   [junit4]   2> 1571768 INFO  (READER4) [    ] o.a.s.c.S.Request [collection1] webapp=null path=null params={qt=/get&ids=15&wt=json} status=0 QTime=0 
   [junit4]   2> 1571768 INFO  (READER6) [    ] o.a.s.c.S.Request [collection1] webapp=null path=null params={q=id:8&omitHeader=true&wt=json} hits=0 status=0 QTime=0 
   [junit4]   2> 1571768 INFO  (READER6) [    ] o.a.s.c.S.Request [collection1] webapp=null path=null params={qt=/get&ids=7&wt=json} status=0 QTime=0 
   [junit4]   2> 1571768 INFO  (WRITER1) [    ] o.a.s.u.p.LogUpdateProcessor [collection1] webapp=null path=null params={update.distrib=FROMLEADER&versions=true&wt=json&indent=true} {add=[13 (2)]} 0 11
   [junit4]   2> 1571756 INFO  (WRITER22) [    ] o.a.s.s.TestStressReorder VERBOSE: adding id 8 val= 2 version 18
   [junit4]   2> 1571756 INFO  (WRITER19) [    ] o.a.s.s.TestStressReorder VERBOSE: deleting id 8 val= 2 version 16
   [junit4]   2> 1571756 INFO  (WRITER20) [    ] o.a.s.s.TestStressReorder VERBOSE: adding id 9 val= 2 version 17
   [junit4]   2> 1571769 INFO  (READER7) [    ] o.a.s.c.S.Request [collection1] webapp=null path=null params={qt=/get&ids=4&wt=json} status=0 QTime=0 
   [junit4]   2> 1571769 INFO  (WRITER20) [    ] o.a.s.u.p.LogUpdateProcessor [collection1] webapp=null path=null params={update.distrib=FROMLEADER&versions=true&wt=json&indent=true} {add=[9 (17)]} 0 0
   [junit4]   2> 1571769 INFO  (WRITER24) [    ] o.a.s.u.p.LogUpdateProcessor [collection1] webapp=null path=null params={_version_=-21&update.distrib=FROMLEADER&versions=true&wt=json&indent=true} {delete=[8 (-21)]} 0 3
   [junit4]   2> 1571769 INFO  (WRITER0) [    ] o.a.s.u.p.LogUpdateProcessor [collection1] webapp=null path=null params={update.distrib=FROMLEADER&versions=true&wt=json&indent=true} {add=[8 (23)]} 0 1
   [junit4]   2> 1571769 INFO  (WRITER3) [    ] o.a.s.u.p.LogUpdateProcessor [collection1] webapp=null path=null params={update.distrib=FROMLEADER&versions=true&wt=json&indent=true} {add=[8 (20)]} 0 3
   [junit4]   2> 1571769 INFO  (WRITER20) [    ] o.a.s.s.TestStressReorder VERBOSE: adding id 9 val= 3 version 25
   [junit4]   2> 1571756 INFO  (WRITER18) [    ] o.a.s.s.TestStressReorder VERBOSE: adding id 8 val= 2 version 15
   [junit4]   2> 1571770 INFO  (WRITER20) [    ] o.a.s.u.p.LogUpdateProcessor [collection1] webapp=null path=null params={update.distrib=FROMLEADER&versions=true&wt=json&indent=true} {add=[9 (25)]} 0 0
   [junit4]   2> 1571756 INFO  (WRITER17) [    ] o.a.s.s.TestStressReorder VERBOSE: adding id 14 val= 2 version 14
   [junit4]   2> 1571756 INFO  (WRITER15) [    ] o.a.s.s.TestStressReorder VERBOSE: adding id 14 val= 2 version 13
   [junit4]   2> 1571770 INFO  (WRITER17) [    ] o.a.s.u.p.LogUpdateProcessor [collection1] webapp=null path=null params={update.distrib=FROMLEADER&versions=true&wt=json&indent=true} {add=[14 (14)]} 0 0
   [junit4]   2> 1571755 INFO  (WRITER4) [    ] o.a.s.s.TestStressReorder VERBOSE: adding id 19 val= 2 version 12
   [junit4]   2> 1571755 INFO  (WRITER16) [    ] o.a.s.s.TestStressReorder VERBOSE: adding id 0 val= 2 version 11
   [junit4]   2> 1571771 INFO  (WRITER4) [    ] o.a.s.u.p.LogUpdateProcessor [collection1] webapp=null path=null params={update.distrib=FROMLEADER&versions=true&wt=json&indent=true} {add=[19 (12)]} 0 0
   [junit4]   2> 1571771 INFO  (WRITER16) [    ] o.a.s.u.p.LogUpdateProcessor [collection1] webapp=null path=null params={update.distrib=FROMLEADER&versions=true&wt=json&indent=true} {add=[0 (11)]} 0 0
   [junit4]   2> 1571771 INFO  (WRITER16) [    ] o.a.s.s.TestStressReorder VERBOSE: softCommit start
   [junit4]   2> 1571755 INFO  (WRITER14) [    ] o.a.s.s.TestStressReorder VERBOSE: adding id 7 val= 2 version 10
   [junit4]   2> 1571755 INFO  (WRITER12) [    ] o.a.s.s.TestStressReorder VERBOSE: adding id 15 val= 2 version 9
   [junit4]   2> 1571771 INFO  (WRITER14) [    ] o.a.s.u.p.LogUpdateProcessor [collection1] webapp=null path=null params={update.distrib=FROMLEADER&versions=true&wt=json&indent=true} {add=[7 (10)]} 0 0
   [junit4]   2> 1571771 INFO  (WRITER12) [    ] o.a.s.u.p.LogUpdateProcessor [collection1] webapp=null path=null params={update.distrib=FROMLEADER&versions=true&wt=json&indent=true} {add=[15 (9)]} 0 0
   [junit4]   2> 1571755 INFO  (WRITER6) [    ] o.a.s.s.TestStressReorder VERBOSE: deleting id 7 val= 2 version 8
   [junit4]   2> 1571755 INFO  (WRITER5) [    ] o.a.s.s.TestStressReorder VERBOSE: adding id 6 val= 2 version 7
   [junit4]   2> 1571755 INFO  (WRITER11) [    ] o.a.s.s.TestStressReorder VERBOSE: adding id 4 val= 2 version 6
   [junit4]   2> 1571772 INFO  (WRITER5) [    ] o.a.s.u.p.LogUpdateProcessor [collection1] webapp=null path=null params={update.distrib=FROMLEADER&versions=true&wt=json&indent=true} {add=[6 (7)]} 0 0
   [junit4]   2> 1571772 INFO  (WRITER11) [    ] o.a.s.u.p.LogUpdateProcessor [collection1] webapp=null path=null params={update.distrib=FROMLEADER&versions=true&wt=json&indent=true} {add=[4 (6)]} 0 0
   [junit4]   2> 1571755 INFO  (WRITER10) [    ] o.a.s.s.TestStressReorder VERBOSE: adding id 5 val= 2 version 5
   [junit4]   2> 1571755 INFO  (WRITER9) [    ] o.a.s.s.TestStressReorder VERBOSE: adding id 6 val= 2 version 4
   [junit4]   2> 1571773 INFO  (WRITER10) [    ] o.a.s.u.p.LogUpdateProcessor [collection1] webapp=null path=null params={update.distrib=FROMLEADER&versions=true&wt=json&indent=true} {add=[5 (5)]} 0 0
   [junit4]   2> 1571772 INFO  (WRITER11) [    ] o.a.s.s.TestStressReorder VERBOSE: adding id 8 val= 3 version 33
   [junit4]   2> 1571772 INFO  (WRITER5) [    ] o.a.s.s.TestStressReorder VERBOSE: deleting id 15 val= 3 version 32
   [junit4]   2> 1571773 INFO  (WRITER11) [    ] o.a.s.u.p.LogUpdateProcessor [collection1] webapp=null path=null params={update.distrib=FROMLEADER&versions=true&wt=json&indent=true} {add=[8 (33)]} 0 0
   [junit4]   2> 1571773 INFO  (WRITER5) [    ] o.a.s.u.p.LogUpdateProcessor [collection1] webapp=null path=null params={_version_=-32&update.distrib=FROMLEADER&versions=true&wt=json&indent=true} {delete=[15 (-32)]} 0 0
   [junit4]   2> 1571772 INFO  (WRITER6) [    ] o.a.s.u.p.LogUpdateProcessor [collection1] webapp=null path=null params={_version_=-8&update.distrib=FROMLEADER&versions=true&wt=json&indent=true} {delete=[7 (-8)]} 0 0
   [junit4]   2> 1571772 INFO  (WRITER12) [    ] o.a.s.s.TestStressReorder VERBOSE: hardCommit start
   [junit4]   2> 1571771 INFO  (WRITER14) [    ] o.a.s.s.TestStressReorder VERBOSE: adding id 18 val= 2 version 31
   [junit4]   2> 1571771 INFO  (WRITER16) [    ] o.a.s.u.UpdateHandler start commit{,optimize=false,openSearcher=true,waitSearcher=true,expungeDeletes=false,softCommit=true,prepareCommit=false}
   [junit4]   2> 1571773 INFO  (WRITER14) [    ] o.a.s.u.p.LogUpdateProcessor [collection1] webapp=null path=null params={update.distrib=FROMLEADER&versions=true&wt=json&indent=true} {add=[18 (31)]} 0 0
   [junit4]   2> 1571771 INFO  (WRITER4) [    ] o.a.s.s.TestStressReorder VERBOSE: deleting id 8 val= 3 version 30
   [junit4]   2> 1571771 INFO  (WRITER17) [    ] o.a.s.s.TestStressReorder VERBOSE: adding id 17 val= 2 version 29
   [junit4]   2> 1571771 INFO  (WRITER15) [    ] o.a.s.u.p.LogUpdateProcessor [collection1] webapp=null path=null params={update.distrib=FROMLEADER&versions=true&wt=json&indent=true} {add=[14 (13)]} 0 0
   [junit4]   2> 1571774 INFO  (WRITER17) [    ] o.a.s.u.p.LogUpdateProcessor [collection1] webapp=null path=null params={update.distrib=FROMLEADER&versions=true&wt=json&indent=true} {add=[17 (29)]} 0 0
   [junit4]   2> 1571770 INFO  (WRITER20) [    ] o.a.s.s.TestStressReorder VERBOSE: adding id 18 val= 2 version 28
   [junit4]   2> 1571770 INFO  (WRITER18) [    ] o.a.s.u.p.LogUpdateProcessor [collection1] webapp=null path=null params={update.distrib=FROMLEADER&versions=true&wt=json&indent=true} {add=[8 (15)]} 0 0
   [junit4]   2> 1571770 INFO  (WRITER2) [    ] o.a.s.s.SolrIndexSearcher Opening Searcher@67edc4dd[collection1] main
   [junit4]   2> 1571769 INFO  (WRITER3) [    ] o.a.s.s.TestStressReorder VERBOSE: adding id 8 val= 3 version 27
   [junit4]   2> 1571774 INFO  (WRITER2) [    ] o.a.s.u.UpdateHandler end_commit_flush
   [junit4]   2> 1571774 INFO  (WRITER3) [    ] o.a.s.u.p.LogUpdateProcessor [collection1] webapp=null path=null params={update.distrib=FROMLEADER&versions=true&wt=json&indent=true} {add=[8 (27)]} 0 0
   [junit4]   2> 1571769 INFO  (WRITER0) [    ] o.a.s.s.TestStressReorder VERBOSE: adding id 8 val= 3 version 26
   [junit4]   2> 1571774 INFO  (searcherExecutor-5384-thread-1) [    ] o.a.s.c.SolrCore [collection1] Registered new searcher Searcher@67edc4dd[collection1] main{ExitableDirectoryReader(UninvertingDirectoryReader(Uninverting(_0(6.0.0):c1)))}
   [junit4]   2> 1571769 INFO  (WRITER23) [    ] o.a.s.u.p.LogUpdateProcessor [collection1] webapp=null path=null params={_version_=-19&update.distrib=FROMLEADER&versions=true&wt=json&indent=true} {delete=[8 (-19)]} 0 2
   [junit4]   2> 1571775 INFO  (WRITER23) [    ] o.a.s.s.TestStressReorder VERBOSE: deleting id 8 val= 2 version 19 DONE
   [junit4]   2> 1571775 INFO  (WRITER23) [    ] o.a.s.s.TestStressReorder VERBOSE: softCommit start
   [junit4]   2> 1571775 INFO  (WRITER23) [    ] o.a.s.u.UpdateHandler start commit{,optimize=false,openSearcher=true,waitSearcher=true,expungeDeletes=false,softCommit=true,prepareCommit=false}
   [junit4]   2> 1571769 INFO  (WRITER24) [    ] o.a.s.s.TestStressReorder VERBOSE: deleting id 8 val= 2 version 21 DONE
   [junit4]   2> 1571776 INFO  (WRITER24) [    ] o.a.s.s.TestStressReorder VERBOSE: adding id 8 val= 4 version 41
   [junit4]   2> 1571769 INFO  (WRITER22) [    ] o.a.s.u.p.LogUpdateProcessor [collection1] webapp=null path=null params={update.distrib=FROMLEADER&versions=true&wt=json&indent=true} {add=[8 (18)]} 0 1
   [junit4]   2> 1571769 INFO  (WRITER19) [    ] o.a.s.u.p.LogUpdateProcessor [collection1] webapp=null path=null params={_version_=-16&update.distrib=FROMLEADER&versions=true&wt=json&indent=true} {delete=[8 (-16)]} 0 1
   [junit4]   2> 1571776 INFO  (WRITER19) [    ] o.a.s.s.TestStressReorder VERBOSE: deleting id 8 val= 2 version 16 DONE
   [junit4]   2> 1571776 INFO  (WRITER24) [    ] o.a.s.u.p.LogUpdateProcessor [collection1] webapp=null path=null params={update.distrib=FROMLEADER&versions=true&wt=json&indent=true} {add=[8 (41)]} 0 0
   [junit4]   2> 1571769 INFO  (WRITER1) [    ] o.a.s.s.TestStressReorder VERBOSE: adding id 15 val= 3 version 24
   [junit4]   2> 1571769 INFO  (READER8) [    ] o.a.s.c.S.Request [collection1] webapp=null path=null params={qt=/get&ids=11&wt=json} status=0 QTime=0 
   [junit4]   2> 1571769 INFO  (READER7) [    ] o.a.s.c.S.Request [collection1] webapp=null path=null params={q=id:15&omitHeader=true&wt=json} hits=0 status=0 QTime=0 
   [junit4]   2> 1571777 INFO  (READER8) [    ] o.a.s.c.S.Request [collection1] webapp=null path=null params={qt=/get&ids=12&wt=json} status=0 QTime=0 
   [junit4]   2> 1571777 INFO  (READER8) [    ] o.a.s.c.S.Request [collection1] webapp=null path=null params={qt=/get&ids=8&wt=json} status=0 QTime=0 
   [junit4]   2> 1571768 INFO  (READER6) [    ] o.a.s.c.S.Request [collection1] webapp=null path=null params={qt=/get&ids=7&wt=json} status=0 QTime=0 
   [junit4]   2> 1571777 INFO  (READER8) [    ] o.a.s.c.S.Request [collection1] webapp=null path=null params={qt=/get&ids=7&wt=json} status=0 QTime=0 
   [junit4]   2> 1571777 INFO  (READER6) [    ] o.a.s.c.S.Request [collection1] webapp=null path=null params={qt=/get&ids=10&wt=json} status=0 QTime=0 
   [junit4]   2> 1571777 INFO  (READER8) [    ] o.a.s.c.S.Request [collection1] webapp=null path=null params={qt=/get&ids=4&wt=json} status=0 QTime=0 
   [junit4]   2> 1571777 INFO  (READER6) [    ] o.a.s.c.S.Request [collection1] webapp=null path=null params={qt=/get&ids=8&wt=json} status=0 QTime=0 
   [junit4]   2> 1571777 INFO  (READER8) [    ] o.a.s.c.S.Request [collection1] webapp=null path=null params={qt=/get&ids=8&wt=json} status=0 QTime=0 
   [junit4]   2> 1571768 INFO  (READER4) [    ] o.a.s.c.S.Request [collection1] webapp=null path=null params={qt=/get&ids=15&wt=json} status=0 QTime=0 
   [junit4]   2> 1571778 INFO  (READER8) [    ] o.a.s.c.S.Request [collection1] webapp=null path=null params={qt=/get&ids=4&wt=json} status=0 QTime=0 
   [junit4]   2> 1571778 INFO  (READER4) [    ] o.a.s.c.S.Request [collection1] webapp=null path=null params={qt=/get&ids=18&wt=json} status=0 QTime=0 
   [junit4]   2> 1571778 INFO  (READER8) [    ] o.a.s.c.S.Request [collection1] webapp=null path=null params={qt=/get&ids=7&wt=json} status=0 QTime=0 
   [junit4]   2> 1571778 INFO  (READER4) [    ] o.a.s.c.S.Request [collection1] webapp=null path=null params={qt=/get&ids=3&wt=json} status=0 QTime=0 
   [junit4]   2> 1571778 INFO  (READER8) [    ] o.a.s.c.S.Request [collection1] webapp=null path=null params={q=id:16&omitHeader=true&wt=json} hits=0 status=0 QTime=0 
   [junit4]   2> 1571778 INFO  (READER4) [    ] o.a.s.c.S.Request [collection1] webapp=null path=null params={q=id:14&omitHeader=true&wt=json} hits=0 status=0 QTime=0 
   [junit4]   2> 1571778 INFO  (READER8) [    ] o.a.s.c.S.Request [collection1] webapp=null path=null params={qt=/get&ids=19&wt=json} status=0 QTime=0 
   [junit4]   2> 1571778 INFO  (READER4) [    ] o.a.s.c.S.Request [collection1] webapp=null path=null params={q=id:17&omitHeader=true&wt=json} hits=0 status=0 QTime=0 
   [junit4]   2> 1571766 INFO  (READER3) [    ] o.a.s.c.S.Request [collection1] webapp=null path=null params={qt=/get&ids=15&wt=json} status=0 QTime=0 
   [junit4]   2> 1571779 INFO  (READER4) [    ] o.a.s.c.S.Request [collection1] webapp=null path=null params={qt=/get&ids=8&wt=json} status=0 QTime=0 
   [junit4]   2> 1571779 INFO  (READER3) [    ] o.a.s.c.S.Request [collection1] webapp=null path=null params={q=id:8&omitHeader=true&wt=json} hits=0 status=0 QTime=0 
   [junit4]   2> 1571779 INFO  (READER4) [    ] o.a.s.c.S.Request [collection1] webapp=null path=null params={qt=/get&ids=8&wt=json} status=0 QTime=0 
   [junit4]   2> 1571779 INFO  (READER3) [    ] o.a.s.c.S.Request [collection1] webapp=null path=null params={qt=/get&ids=8&wt=json} status=0 QTime=0 
   [junit4]   2> 1571779 INFO  (READER4) [    ] o.a.s.c.S.Request [collection1] webapp=null path=null params={qt=/get&ids=8&wt=json} status=0 QTime=0 
   [junit4]   2> 1571779 INFO  (READER3) [    ] o.a.s.c.S.Request [collection1] webapp=null path=null params={qt=/get&ids=8&wt=json} status=0 QTime=0 
   [junit4]   2> 1571779 INFO  (READER4) [    ] o.a.s.c.S.Request [collection1] webapp=null path=null params={qt=/get&ids=2&wt=json} status=0 QTime=0 
   [junit4]   2> 1571779 INFO  (READER3) [    ] o.a.s.c.S.Request [collection1] webapp=null path=null params={q=id:8&omitHeader=true&wt=json} hits=0 status=0 QTime=0 
   [junit4]   2> 1571767 INFO  (WRITER7) [    ] o.a.s.u.p.LogUpdateProcessor [collection1] webapp=null path=null params={update.distrib=FROMLEADER&versions=true&wt=json&indent=true} {add=[5 (3)]} 0 0
   [junit4]   2> 1571779 INFO  (READER3) [    ] o.a.s.c.S.Request [collection1] webapp=null path=null params={qt=/get&ids=8&wt=json} status=0 QTime=0 
   [junit4]   2> 1571779 INFO  (WRITER7) [    ] o.a.s.s.TestStressReorder VERBOSE: adding id 5 val= 3 version 44
   [junit4]   2> 1571779 INFO  (READER3) [    ] o.a.s.c.S.Request [collection1] webapp=null path=null params={q=id:5&omitHeader=true&wt=json} hits=0 status=0 QTime=0 
   [junit4]   2> 1571766 INFO  (READER9) [    ] o.a.s.c.S.Request [collection1] webapp=null path=null params={qt=/get&ids=11&wt=json} status=0 QTime=0 
   [junit4]   2> 1571780 INFO  (WRITER7) [    ] o.a.s.u.p.LogUpdateProcessor [collection1] webapp=null path=null params={update.distrib=FROMLEADER&versions=true&wt=json&indent=true} {add=[5 (44)]} 0 0
   [junit4]   2> 1571780 INFO  (READER9) [    ] o.a.s.c.S.Request [collection1] webapp=null path=null params={q=id:11&omitHeader=true&wt=json} hits=0 status=0 QTime=0 
   [junit4]   2> 1571780 INFO  (READER3) [    ] o.a.s.c.S.Request [collection1] webapp=null path=null params={qt=/get&ids=14&wt=json} status=0 QTime=0 
   [junit4]   2> 1571780 INFO  (READER9) [    ] o.a.s.c.S.Request [collection1] webapp=null path=null params={qt=/get&ids=17&wt=json} status=0 QTime=0 
   [junit4]   2> 1571780 INFO  (READER3) [    ] o.a.s.c.S.Request [collection1] webapp=null path=null params={qt=/get&ids=17&wt=json} status=0 QTime=0 
   [junit4]   2> 1571780 INFO  (READER9) [    ] o.a.s.c.S.Request [collection1] webapp=null path=null params={qt=/get&ids=15&wt=json} status=0 QTime=0 
   [junit4]   2> 1571766 INFO  (READER1) [    ] o.a.s.c.S.Request [collection1] webapp=null path=null params={qt=/get&ids=19&wt=json} status=0 QTime=0 
   [junit4]   2> 1571766 INFO  (READER5) [    ] o.a.s.c.S.Request [collection1] webapp=null path=null params={qt=/get&ids=8&wt=json} status=0 QTime=0 
   [junit4]   2> 1571781 INFO  (READER1) [    ] o.a.s.c.S.Request [collection1] webapp=null path=null params={q=id:17&omitHeader=true&wt=json} hits=0 status=0 QTime=0 
   [junit4]   2> 1571781 INFO  (READER5) [    ] o.a.s.c.S.Request [collection1] webapp=null path=null params={qt=/get&ids=11&wt=json} status=0 QTime=0 
   [junit4]   2> 1571781 INFO  (READER1) [    ] o.a.s.c.S.Request [collection1] webapp=null path=null params={qt=/get&ids=18&wt=json} status=0 QTime=0 
   [junit4]   2> 1571781 INFO  (READER5) [    ] o.a.s.c.S.Request [collection1] webapp=null path=null params={qt=/get&ids=17&wt=json} status=0 QTime=0 
   [junit4]   2> 1571766 INFO  (READER0) [    ] o.a.s.c.S.Request [collection1] webapp=null path=null params={qt=/get&ids=0&wt=json} status=0 QTime=0 
   [junit4]   2> 1571765 INFO  (WRITER21) [    ] o.a.s.s.TestStressReorder VERBOSE: softCommit start
   [junit4]   2> 1571781 INFO  (READER0) [    ] o.a.s.c.S.Request [collection1] webapp=null path=null params={q=id:17&omitHeader=true&wt=json} hits=0 status=0 QTime=0 
   [junit4]   2> 1571781 INFO  (WRITER21) [    ] o.a.s.u.UpdateHandler start commit{,optimize=false,openSearcher=true,waitSearcher=true,expungeDeletes=false,softCommit=true,prepareCommit=false}
   [junit4]   2> 1571781 INFO  (READER0) [    ] o.a.s.c.S.Request [collection1] webapp=null path=null params={qt=/get&ids=14&wt=json} status=0 QTime=0 
   [junit4]   2> 1571765 INFO  (WRITER13) [    ] o.a.s.s.TestStressReorder VERBOSE: softCommit start
   [junit4]   2> 1571781 INFO  (READER0) [    ] o.a.s.c.S.Request [collection1] webapp=null path=null params={q=id:19&omitHeader=true&wt=json} hits=0 status=0 QTime=0 
   [junit4]   2> 1571781 INFO  (WRITER13) [    ] o.a.s.u.UpdateHandler start commit{,optimize=false,openSearcher=true,waitSearcher=true,expungeDeletes=false,softCommit=true,prepareCommit=false}
   [junit4]   2> 1571781 INFO  (READER0) [    ] o.a.s.c.S.Request [collection1] webapp=null path=null params={qt=/get&ids=7&wt=json} status=0 QTime=0 
   [junit4]   2> 1571765 INFO  (WRITER8) [    ] o.a.s.s.TestStressReorder VERBOSE: hardCommit start
   [junit4]   2> 1571758 INFO  (READER2) [    ] o.a.s.c.S.Request [collection1] webapp=null path=null params={qt=/get&ids=8&wt=json} status=0 QTime=0 
   [junit4]   2> 1571782 INFO  (READER0) [    ] o.a.s.c.S.Request [collection1] webapp=null path=null params={qt=/get&ids=15&wt=json} status=0 QTime=0 
   [junit4]   2> 1571781 INFO  (READER5) [    ] o.a.s.c.S.Request [collection1] webapp=null path=null params={qt=/get&ids=12&wt=json} status=0 QTime=0 
   [junit4]   2> 1571783 INFO  (READER0) [    ] o.a.s.c.S.Request [collection1] webapp=null path=null params={q=id:17&omitHeader=true&wt=json} hits=0 status=0 QTime=0 
   [junit4]   2> 1571783 INFO  (READER5) [    ] o.a.s.c.S.Request [collection1] webapp=null path=null params={q=id:19&omitHeader=true&wt=json} hits=0 status=0 QTime=0 
   [junit4]   2> 1571783 INFO  (READER0) [    ] o.a.s.c.S.Request [collection1] webapp=null path=null params={qt=/get&ids=17&wt=json} status=0 QTime=0 
   [junit4]   2> 1571781 INFO  (READER1) [    ] o.a.s.c.S.Request [collection1] webapp=null path=null params={qt=/get&ids=17&wt=json} status=0 QTime=0 
   [junit4]   2> 1571780 INFO  (READER3) [    ] o.a.s.c.S.Request [collection1] webapp=null path=null params={q=id:2&omitHeader=true&wt=json} hits=1 status=0 QTime=0 
   [junit4]   2> 1571783 INFO  (READER1) [    ] o.a.s.c.S.Request [collection1] webapp=null path=null params={qt=/get&ids=3&wt=json} status=0 QTime=0 
   [junit4]   2> 1571780 INFO  (READER9) [    ] o.a.s.c.S.Request [collection1] webapp=null path=null params={qt=/get&ids=16&wt=json} status=0 QTime=0 
   [junit4]   2> 1571784 INFO  (READER1) [    ] o.a.s.c.S.Request [collection1] webapp=null path=null params={qt=/get&ids=4&wt=json} status=0 QTime=0 
   [junit4]   2> 1571784 INFO  (READER9) [    ] o.a.s.c.S.Request [collection1] webapp=null path=null params={qt=/get&ids=17&wt=json} status=0 QTime=0 
   [junit4]   2> 1571784 INFO  (READER1) [    ] o.a.s.c.S.Request [collection1] webapp=null path=null params={q=id:17&omitHeader=true&wt=json} hits=0 status=0 QTime=0 
   [junit4]   2> 1571784 INFO  (READER9) [    ] o.a.s.c.S.Request [collection1] webapp=null path=null params={qt=/get&ids=18&wt=json} status=0 QTime=0 
   [junit4]   2> 1571784 INFO  (READER1) [    ] o.a.s.c.S.Request [collection1] webapp=null path=null params={qt=/get&ids=17&wt=json} status=0 QTime=0 
   [junit4]   2> 1571784 INFO  (READER9) [    ] o.a.s.c.S.Request [collection1] webapp=null path=null params={qt=/get&ids=11&wt=json} status=0 QTime=0 
   [junit4]   2> 1571784 INFO  (READER1) [    ] o.a.s.c.S.Request [collection1] webapp=null path=null params={qt=/get&ids=18&wt=json} status=0 QTime=0 
   [junit4]   2> 1571784 INFO  (READER9) [    ] o.a.s.c.S.Request [collection1] webapp=null path=null params={qt=/get&ids=5&wt=json} status=0 QTime=0 
   [junit4]   2> 1571784 INFO  (READER1) [    ] o.a.s.c.S.Request [collection1] webapp=null path=null params={qt=/get&ids=17&wt=json} status=0 QTime=0 
   [junit4]   2> 1571784 INFO  (READER9) [    ] o.a.s.c.S.Request [collection1] webapp=null path=null params={q=id:1&omitHeader=true&wt=json} hits=0 status=0 QTime=0 
   [junit4]   2> 1571785 INFO  (READER1) [    ] o.a.s.c.S.Request [collection1] webapp=null path=null params={qt=/get&ids=4&wt=json} status=0 QTime=0 
   [junit4]   2> 1571785 INFO  (READER9) [    ] o.a.s.c.S.Request [collection1] webapp=null path=null params={q=id:18&omitHeader=true&wt=json} hits=0 status=0 QTime=0 
   [junit4]   2> 1571785 INFO  (READER1) [    ] o.a.s.c.S.Request [collection1] webapp=null path=null params={qt=/get&ids=17&wt=json} status=0 QTime=0 
   [junit4]   2> 1571780 INFO  (WRITER7) [    ] o.a.s.s.TestStressReorder VERBOSE: adding id 17 val= 3 version 45
   [junit4]   2> 1571785 INFO  (READER1) [    ] o.a.s.c.S.Request [collection1] webapp=null path=null params={qt=/get&ids=17&wt=json} status=0 QTime=0 
   [junit4]   2> 1571785 INFO  (READER1) [    ] o.a.s.c.S.Request [collection1] webapp=null path=null params={qt=/get&ids=3&wt=json} status=0 QTime=0 
   [junit4]   2> 1571785 INFO  (WRITER7) [    ] o.a.s.u.p.LogUpdateProcessor [collection1] webapp=null path=null params={update.distrib=FROMLEADER&versions=true&wt=json&indent=true} {add=[17 (45)]} 0 0
   [junit4]   2> 1571785 INFO  (READER1) [    ] o.a.s.c.S.Request [collection1] webapp=null path=null params={qt=/get&ids=17&wt=json} status=0 QTime=0 
   [junit4]   2> 1571785 INFO  (WRITER7) [    ] o.a.s.s.TestStressReorder VERBOSE: adding id 17 val= 4 version 46
   [junit4]   2> 1571785 INFO  (READER1) [    ] o.a.s.c.S.Request [collection1] webapp=null path=null params={q=id:17&omitHeader=true&wt=json} hits=0 status=0 QTime=0 
   [junit4]   2> 1571779 INFO  (READER4) [    ] o.a.s.c.S.Request [collection1] webapp=null path=null params={q=id:16&omitHeader=true&wt=json} hits=0 status=0 QTime=0 
   [junit4]   2> 1571785 INFO  (READER1) [    ] o.a.s.c.S.Request [collection1] webapp=null path=null params={qt=/get&ids=17&wt=json} status=0 QTime=0 
   [junit4]   2> 1571786 INFO  (READER4) [    ] o.a.s.c.S.Request [collection1] webapp=null path=null params={qt=/get&ids=17&wt=json} status=0 QTime=0 
   [junit4]   2> 1571786 INFO  (READER1) [    ] o.a.s.c.S.Request [collection1] webapp=null path=null params={q=id:6&omitHeader=true&wt=json} hits=0 status=0 QTime=0 
   [junit4]   2> 1571786 INFO  (READER4) [    ] o.a.s.c.S.Request [collection1] webapp=null path=null params={q=id:2&omitHeader=true&wt=json} hits=1 status=0 QTime=0 
   [junit4]   2> 1571786 INFO  (READER1) [    ] o.a.s.c.S.Request [collection1] webapp=null path=null params={qt=/get&ids=7&wt=json} status=0 QTime=0 
   [junit4]   2> 1571779 INFO  (READER8) [    ] o.a.s.c.S.Request [collection1] webapp=null path=null params={q=id:8&omitHeader=true&wt=json} hits=0 status=0 QTime=0 
   [junit4]   2> 1571786 INFO  (READER1) [    ] o.a.s.c.S.Request [collection1] webapp=null path=null params={q=id:3&omitHeader=true&wt=json} hits=0 status=0 QTime=0 
   [junit4]   2> 1571786 INFO  (READER8) [    ] o.a.s.c.S.Request [collection1] webapp=null path=null params={qt=/get&ids=17&wt=json} status=0 QTime=0 
   [junit4]   2> 1571786 INFO  (READER1) [    ] o.a.s.c.S.Request [collection1] webapp=null path=null params={qt=/get&ids=12&wt=json} status=0 QTime=0 
   [junit4]   2> 1571786 INFO  (READER8) [    ] o.a.s.c.S.Request [collection1] webapp=null path=null params={qt=/get&ids=17&wt=json} status=0 QTime=0 
   [junit4]   2> 1571787 INFO  (READER1) [    ] o.a.s.c.S.Request [collection1] webapp=null path=null params={qt=/get&ids=5&wt=json} status=0 QTime=0 
   [junit4]   2> 1571787 INFO  (READER8) [    ] o.a.s.c.S.Request [collection1] webapp=null path=null params={q=id:9&omitHeader=true&wt=json} hits=0 status=0 QTime=0 
   [junit4]   2> 1571778 INFO  (READER6) [    ] o.a.s.c.S.Request [collection1] webapp=null path=null params={q=id:6&omitHeader=true&wt=json} hits=0 status=0 QTime=1 
   [junit4]   2> 1571787 INFO  (READER8) [    ] o.a.s.c.S.Request [collection1] webapp=null path=null params={q=id:16&omitHeader=true&wt=json} hits=0 status=0 QTime=0 
   [junit4]   2> 1571787 INFO  (READER6) [    ] o.a.s.c.S.Request [collection1] webapp=null path=null params={qt=/get&ids=7&wt=json} status=0 QTime=0 
   [junit4]   2> 1571787 INFO  (READER8) [    ] o.a.s.c.S.Request [collection1] webapp=null path=null params={qt=/get&ids=12&wt=json} status=0 QTime=0 
   [junit4]   2> 1571787 INFO  (READER6) [    ] o.a.s.c.S.Request [collection1] webapp=null path=null params={qt=/get&ids=0&wt=json} status=0 QTime=0 
   [junit4]   2> 1571778 INFO  (WRITER16) [    ] o.a.s.s.SolrIndexSearcher Opening Searcher@103173f0[collection1] main
   [junit4]   2> 1571787 INFO  (READER6) [    ] o.a.s.c.S.Request [collection1] webapp=null path=null params={q=id:5&omitHeader=true&wt=json} hits=0 status=0 QTime=0 
   [junit4]   2> 1571777 INFO  (READER7) [    ] o.a.s.c.S.Request [collection1] webapp=null path=null params={qt=/get&ids=15&wt=json} status=0 QTime=0 
   [junit4]   2> 1571788 INFO  (READER6) [    ] o.a.s.c.S.Request [collection1] webapp=null path=null params={qt=/get&ids=5&wt=json} status=0 QTime=0 
   [junit4]   2> 1571788 INFO  (READER6) [    ] o.a.s.c.S.Request [collection1] webapp=null path=null params={qt=/get&ids=8&wt=json} status=0 QTime=0 
   [junit4]   2> 1571776 INFO  (WRITER1) [    ] o.a.s.u.p.LogUpdateProcessor [collection1] webapp=null path=null params={update.distrib=FROMLEADER&versions=true&wt=json&indent=true} {add=[15 (24)]} 0 0
   [junit4]   2> 1571776 INFO  (WRITER24) [    ] o.a.s.s.TestStressReorder VERBOSE: adding id 8 val= 5 version 43
   [junit4]   2> 1571789 INFO  (WRITER1) [    ] o.a.s.s.TestStressReorder VERBOSE: adding id 9 val= 4 version 47
   [junit4]   2> 1571789 INFO  (WRITER24) [    ] o.a.s.u.p.LogUpdateProcessor [collection1] webapp=null path=null params={update.distrib=FROMLEADER&versions=true&wt=json&indent=true} {add=[8 (43)]} 0 0
   [junit4]   2> 1571776 INFO  (WRITER19) [    ] o.a.s.s.TestStressReorder VERBOSE: hardCommit start
   [junit4]   2> 1571776 INFO  (WRITER22) [    ] o.a.s.s.TestStressReorder VERBOSE: deleting id 8 val= 4 version 42
   [junit4]   2> 1571789 INFO  (WRITER22) [    ] o.a.s.u.p.LogUpdateProcessor [collection1] webapp=null path=null params={_version_=-42&update.distrib=FROMLEADER&versions=true&wt=json&indent=true} {delete=[8 (-42)]} 0 0
   [junit4]   2> 1571775 INFO  (WRITER2) [    ] o.a.s.u.p.LogUpdateProcessor [collection1] webapp=null path=null params={} {commit=} 0 21
   [junit4]   2> 1571775 INFO  (WRITER0) [    ] o.a.s.u.p.LogUpdateProcessor [collection1] webapp=null path=null params={update.distrib=FROMLEADER&versions=true&wt=json&indent=true} {add=[8 (26)]} 0 0
   [junit4]   2> 1571789 INFO  (WRITER0) [    ] o.a.s.s.TestStressReorder VERBOSE: adding id 3 val= 2 version 49
   [junit4]   2> 1571774 INFO  (WRITER3) [    ] o.a.s.s.TestStressReorder VERBOSE: deleting id 2 val= 3 version 40
   [junit4]   2> 1571774 INFO  (WRITER18) [    ] o.a.s.s.TestStressReorder VERBOSE: deleting id 16 val= 2 version 39
   [junit4]   2> 1571774 INFO  (WRITER20) [    ] o.a.s.u.p.LogUpdateProcessor [collection1] webapp=null path=null params={update.distrib=FROMLEADER&versions=true&wt=json&indent=true} {add=[18 (28)]} 0 0
   [junit4]   2> 1571774 INFO  (WRITER17) [    ] o.a.s.s.TestStressReorder VERBOSE: adding id 1 val= 2 version 38
   [junit4]   2> 1571774 INFO  (WRITER15) [    ] o.a.s.s.TestStressReorder VERBOSE: adding id 18 val= 3 version 37
   [junit4]   2> 1571774 INFO  (WRITER4) [    ] o.a.s.u.p.LogUpdateProcessor [collection1] webapp=null path=null params={_version_=-30&update.distrib=FROMLEADER&versions=true&wt=json&indent=true} {delete=[8 (-30)]} 0 0
   [junit4]   2> 1571774 INFO  (WRITER14) [    ] o.a.s.s.TestStressReorder VERBOSE: adding id 18 val= 3 version 36
   [junit4]   2> 1571773 INFO  (WRITER12) [    ] o.a.s.u.UpdateHandler start commit{,optimize=false,openSearcher=true,waitSearcher=true,expungeDeletes=false,softCommit=false,prepareCommit=false}
   [junit4]   2> 1571773 INFO  (WRITER6) [    ] o.a.s.s.TestStressReorder VERBOSE: deleting id 7 val= 2 version 8 DONE
   [junit4]   2> 1571791 INFO  (WRITER6) [    ] o.a.s.s.TestStressReorder VERBOSE: adding id 18 val= 3 version 51
   [junit4]   2> 1571773 INFO  (WRITER5) [    ] o.a.s.s.TestStressReorder VERBOSE: deleting id 15 val= 3 version 32 DONE
   [junit4]   2> 1571791 INFO  (WRITER5) [    ] o.a.s.s.TestStressReorder VERBOSE: adding id 6 val= 3 version 52
   [junit4]   2> 1571791 INFO  (WRITER2) [    ] o.a.s.s.TestStressReorder VERBOSE: softCommit end
   [junit4]   2> 1571773 INFO  (WRITER11) [    ] o.a.s.s.TestStressReorder VERBOSE: adding id 10 val= 2 version 35
   [junit4]   2> 1571773 INFO  (WRITER10) [    ] o.a.s.s.TestStressReorder VERBOSE: adding id 17 val= 2 version 34
   [junit4]   2> 1571773 INFO  (WRITER9) [    ] o.a.s.u.p.LogUpdateProcessor [collection1] webapp=null path=null params={update.distrib=FROMLEADER&versions=true&wt=json&indent=true} {add=[6 (4)]} 0 0
   [junit4]   2> 1571791 INFO  (WRITER10) [    ] o.a.s.u.p.LogUpdateProcessor [collection1] webapp=null path=null params={update.distrib=FROMLEADER&versions=true&wt=json&indent=true} {add=[17 (34)]} 0 0
   [junit4]   2> 1571791 INFO  (WRITER2) [    ] o.a.s.s.TestStressReorder VERBOSE: softCommit start
   [junit4]   2> 1571790 INFO  (WRITER4) [    ] o.a.s.s.TestStressReorder VERBOSE: deleting id 8 val= 3 version 30 DONE
   [junit4]   2> 1571792 INFO  (WRITER4) [    ] o.a.s.s.TestStressReorder VERBOSE: adding id 17 val= 4 version 55
   [junit4]   2> 1571790 INFO  (WRITER20) [    ] o.a.s.s.TestStressReorder VERBOSE: adding id 18 val= 3 version 50
   [junit4]   2> 1571792 INFO  (WRITER4) [    ] o.a.s.u.p.LogUpdateProcessor [collection1] webapp=null path=null params={update.distrib=FROMLEADER&versions=true&wt=json&indent=true} {add=[17 (55)]} 0 0
   [junit4]   2> 1571789 INFO  (WRITER22) [    ] o.a.s.s.TestStressReorder VERBOSE: deleting id 8 val= 4 version 42 DONE
   [junit4]   2> 1571792 INFO  (WRITER4) [    ] o.a.s.s.TestStressReorder VERBOSE: deleting id 3 val= 2 version 56
   [junit4]   2> 1571789 INFO  (WRITER24) [    ] o.a.s.s.TestStressReorder VERBOSE: deleting id 9 val= 4 version 48
   [junit4]   2> 1571788 INFO  (WRITER16) [    ] o.a.s.u.UpdateHandler end_commit_flush
   [junit4]   2> 1571788 INFO  (searcherExecutor-5384-thread-1) [    ] o.a.s.c.SolrCore [collection1] Registered new searcher Searcher@103173f0[collection1] main{ExitableDirectoryReader(UninvertingDirectoryReader(Uninverting(_0(6.0.0):c1) Uninverting(_2(6.0.0):c14/2:delGen=1)))}
   [junit4]   2> 1571788 INFO  (READER8) [    ] o.a.s.c.S.Request [collection1] webapp=null path=null params={q=id:2&omitHeader=true&wt=json} hits=1 status=0 QTime=0 
   [junit4]   2> 1571787 INFO  (READER1) [    ] o.a.s.c.S.Request [collection1] webapp=null path=null params={qt=/get&ids=15&wt=json} status=0 QTime=0 
   [junit4]   2> 1571786 INFO  (READER4) [    ] o.a.s.c.S.Request [collection1] webapp=null path=null params={qt=/get&ids=2&wt=json} status=0 QTime=0 
   [junit4]   2> 1571795 INFO  (WRITER5) [    ] o.a.s.u.p.LogUpdateProcessor [collection1] webapp=null path=null params={update.distrib=FROMLEADER&versions=true&wt=json&indent=true} {add=[6 (52)]} 0 3
   [junit4]   2> 1571795 INFO  (WRITER5) [    ] o.a.s.s.TestStressReorder VERBOSE: adding id 13 val= 3 version 58
   [junit4]   2> 1571795 INFO  (WRITER15) [    ] o.a.s.u.p.LogUpdateProcessor [collection1] webapp=null path=null params={update.distrib=FROMLEADER&versions=true&wt=json&indent=true} {add=[18 (37)]} 0 4
   [junit4]   2> 1571795 INFO  (READER8) [    ] o.a.s.c.S.Request [collection1] webapp=null path=null params={q=id:15&omitHeader=true&wt=json} hits=0 status=0 QTime=0 
   [junit4]   2> 1571795 INFO  (WRITER15) [    ] o.a.s.s.TestStressReorder VERBOSE: deleteByQuery id 15 val= 4 version 59
   [junit4]   2> 1571785 INFO  (WRITER7) [    ] o.a.s.u.p.LogUpdateProcessor [collection1] webapp=null path=null params={update.distrib=FROMLEADER&versions=true&wt=json&indent=true} {add=[17 (46)]} 0 0
   [junit4]   2> 1571797 INFO  (WRITER24) [    ] o.a.s.u.p.LogUpdateProcessor [collection1] webapp=null path=null params={_version_=-48&update.distrib=FROMLEADER&versions=true&wt=json&indent=true} {delete=[9 (-48)]} 0 3
   [junit4]   2> 1571797 INFO  (WRITER24) [    ] o.a.s.s.TestStressReorder VERBOSE: deleting id 9 val= 4 version 48 DONE
   [junit4]   2> 1571785 INFO  (READER9) [    ] o.a.s.c.S.Request [collection1] webapp=null path=null params={q=id:5&omitHeader=true&wt=json} hits=0 status=0 QTime=0 
   [junit4]   2> 1571797 INFO  (READER9) [    ] o.a.s.c.S.Request [collection1] webapp=null path=null params={qt=/get&ids=3&wt=json} status=0 QTime=0 
   [junit4]   2> 1571797 INFO  (READER9) [    ] o.a.s.c.S.Request [collection1] webapp=null path=null params={qt=/get&ids=6&wt=json} status=0 QTime=0 
   [junit4]   2> 1571797 INFO  (READER6) [    ] o.a.s.c.S.Request [collection1] webapp=null path=null params={qt=/get&ids=13&wt=json} status=0 QTime=8 
   [junit4]   2> 1571797 INFO  (READER9) [    ] o.a.s.c.S.Request [collection1] webapp=null path=null params={q=id:15&omitHeader=true&wt=json} hits=0 status=0 QTime=0 
   [junit4]   2> 1571797 INFO  (READER6) [    ] o.a.s.c.S.Request [collection1] webapp=null path=null params={q=id:0&omitHeader=true&wt=json} hits=1 status=0 QTime=0 
   [junit4]   2> 1571798 INFO  (READER7) [    ] o.a.s.c.S.Request [collection1] webapp=null path=null params={qt=/get&ids=7&wt=json} status=0 QTime=9 
   [junit4]   2> 1571798 INFO  (READER6) [    ] o.a.s.c.S.Request [collection1] webapp=null path=null params={qt=/get&ids=7&wt=json} status=0 QTime=0 
   [junit4]   2> 1571798 INFO  (READER7) [    ] o.a.s.c.S.Request [collection1] webapp=null path=null params={qt=/get&ids=14&wt=json} status=0 QTime=0 
   [junit4]   2> 1571798 INFO  (READER6) [    ] o.a.s.c.S.Request [collection1] webapp=null path=null params={qt=/get&ids=9&wt=json} status=0 QTime=0 
   [junit4]   2> 1571798 INFO  (READER7) [    ] o.a.s.c.S.Request [collection1] webapp=null path=null params={qt=/get&ids=10&wt=json} status=0 QTime=0 
   [junit4]   2> 1571798 INFO  (READER6) [    ] o.a.s.c.S.Request [collection1] webapp=null path=null params={q=id:12&omitHeader=true&wt=json} hits=0 status=0 QTime=0 
   [junit4]   2> 1571784 INFO  (READER3) [    ] o.a.s.c.S.Request [collection1] webapp=null path=null params={q=id:14&omitHeader=true&wt=json} hits=0 status=0 QTime=0 
   [junit4]   2> 1571799 INFO  (READER7) [    ] o.a.s.c.S.Request [collection1] webapp=null path=null params={q=id:9&omitHeader=true&wt=json} hits=1 status=0 QTime=0 
   [junit4]   2> 1571799 INFO  (READER3) [    ] o.a.s.c.S.Request [collection1] webapp=null path=null params={qt=/get&ids=11&wt=json} status=0 QTime=0 
   [junit4]   2> 1571799 INFO  (READER7) [    ] o.a.s.c.S.Request [collection1] webapp=null path=null params={qt=/get&ids=15&wt=json} status=0 QTime=0 
   [junit4]   2> 1571799 INFO  (READER3) [    ] o.a.s.c.S.Request [collection1] webapp=null path=null params={q=id:17&omitHeader=true&wt=json} hits=1 status=0 QTime=0 
   [junit4]   2> 1571783 INFO  (READER0) [    ] o.a.s.c.S.Request [collection1] webapp=null path=null params={q=id:2&omitHeader=true&wt=json} hits=1 status=0 QTime=0 
   [junit4]   2> 1571799 INFO  (READER3) [    ] o.a.s.c.S.Request [collection1] webapp=null path=null params={qt=/get&ids=9&wt=json} status=0 QTime=0 
   [junit4]   2> 1571799 INFO  (READER3) [    ] o.a.s.c.S.Request [collection1] webapp=null path=null params={qt=/get&ids=2&wt=json} status=0 QTime=0 
   [junit4]   2> 1571783 INFO  (READER5) [    ] o.a.s.c.S.Request [collection1] webapp=null path=null params={qt=/get&ids=17&wt=json} status=0 QTime=0 
   [junit4]   2> 1571799 INFO  (READER0) [    ] o.a.s.c.S.Request [collection1] webapp=null path=null params={qt=/get&ids=9&wt=json} status=0 QTime=0 
   [junit4]   2> 1571799 INFO  (READER5) [    ] o.a.s.c.S.Request [collection1] webapp=null path=null params={qt=/get&ids=1&wt=json} status=0 QTime=0 
   [junit4]   2> 1571800 INFO  (READER0) [    ] o.a.s.c.S.Request [collection1] webapp=null path=null params={qt=/get&ids=1&wt=json} status=0 QTime=0 
   [junit4]   2> 1571800 INFO  (READER5) [    ] o.a.s.c.S.Request [collection1] webapp=null path=null params={qt=/get&ids=9&wt=json} status=0 QTime=0 
   [junit4]   2> 1571800 INFO  (READER0) [    ] o.a.s.c.S.Request [collection1] webapp=null path=null params={qt=/get&ids=2&wt=json} status=0 QTime=0 
   [junit4]   2> 1571782 INFO  (READER2) [    ] o.a.s.c.S.Request [collection1] webapp=null path=null params={qt=/get&ids=8&wt=json} status=0 QTime=0 
   [junit4]   2> 1571801 INFO  (READER5) [    ] o.a.s.c.S.Request [collection1] webapp=null path=null params={qt=/get&ids=4&wt=json} status=0 QTime=0 
   [junit4]   2> 1571801 INFO  (READER2) [    ] o.a.s.c.S.Request [collection1] webapp=null path=null params={qt=/get&ids=9&wt=json} status=0 QTime=0 
   [junit4]   2> 1571801 INFO  (READER5) [    ] o.a.s.c.S.Request [collection1] webapp=null path=null params={qt=/get&ids=9&wt=json} status=0 QTime=0 
   [junit4]   2> 1571801 INFO  (READER2) [    ] o.a.s.c.S.Request [collection1] webapp=null path=null params={qt=/get&ids=15&wt=json} status=0 QTime=0 
   [junit4]   2> 1571801 INFO  (READER5) [    ] o.a.s.c.S.Request [collection1] webapp=null path=null params={q=id:9&omitHeader=true&wt=json} hits=1 status=0 QTime=0 
   [junit4]   2> 1571800 INFO  (READER0) [    ] o.a.s.c.S.Request [collection1] webapp=null path=null params={qt=/get&ids=1&wt=json} status=0 QTime=0 
   [junit4]   2> 1571801 INFO  (READER5) [    ] o.a.s.c.S.Request [collection1] webapp=null path=null params={qt=/get&ids=8&wt=json} status=0 QTime=0 
   [junit4]   2> 1571801 INFO  (READER0) [    ] o.a.s.c.S.Request [collection1] webapp=null path=null params={qt=/get&ids=1&wt=json} status=0 QTime=0 
   [junit4]   2> 1571801 INFO  (READER5) [    ] o.a.s.c.S.Request [collection1] webapp=null path=null params={qt=/get&ids=9&wt=json} status=0 QTime=0 
   [junit4]   2> 1571801 INFO  (READER0) [    ] o.a.s.c.S.Request [collection1] webapp=null path=null params={q=id:4&omitHeader=true&wt=json} hits=1 status=0 QTime=0 
   [junit4]   2> 1571802 INFO  (READER5) [    ] o.a.s.c.S.Request [collection1] webapp=null path=null params={qt=/get&ids=0&wt=json} status=0 QTime=0 
   [junit4]   2> 1571802 INFO  (READER0) [    ] o.a.s.c.S.Request [collection1] webapp=null path=null params={q=id:2&omitHeader=true&wt=json} hits=1 status=0 QTime=0 
   [junit4]   2> 1571800 INFO  (WRITER13) [    ] o.a.s.s.SolrIndexSearcher Opening Searcher@2b67d19a[collection1] main
   [junit4]   2> 1571802 INFO  (READER0) [    ] o.a.s.c.S.Request [collection1] webapp=null path=null params={qt=/get&ids=4&wt=json} status=0 QTime=0 
   [junit4]   2> 1571802 INFO  (WRITER13) [    ] o.a.s.u.UpdateHandler end_commit_flush
   [junit4]   2> 1571802 WARN  (WRITER21) [    ] o.a.s.c.SolrCore [collection1] PERFORMANCE WARNING: Overlapping onDeckSearchers=2
   [junit4]   2> 1571799 INFO  (READER3) [    ] o.a.s.c.S.Request [collection1] webapp=null path=null params={qt=/get&ids=15&wt=json} status=0 QTime=0 
   [junit4]   2> 1571799 INFO  (READER7) [    ] o.a.s.c.S.Request [collection1] webapp=null path=null params={qt=/get&ids=9&wt=json} status=0 QTime=0 
   [junit4]   2> 1571799 INFO  (READER6) [    ] o.a.s.c.S.Request [collection1] webapp=null path=null params={qt=/get&ids=18&wt=json} status=0 QTime=0 
   [junit4]   2> 1571803 INFO  (READER7) [    ] o.a.s.c.S.Request [collection1] webapp=null path=null params={qt=/get&ids=16&wt=json} status=0 QTime=0 
   [junit4]   2> 1571803 INFO  (READER6) [    ] o.a.s.c.S.Request [collection1] webapp=null path=null params={qt=/get&ids=18&wt=json} status=0 QTime=0 
   [junit4]   2> 1571803 INFO  (READER7) [    ] o.a.s.c.S.Request [collection1] webapp=null path=null params={qt=/get&ids=9&wt=json} status=0 QTime=0 
   [junit4]   2> 1571798 INFO  (READER9) [    ] o.a.s.c.S.Request [collection1] webapp=null path=null params={qt=/get&ids=9&wt=json} status=0 QTime=0 
   [junit4]   2> 1571798 INFO  (READER1) [    ] o.a.s.c.S.Request [collection1] webapp=null path=null params={qt=/get&ids=19&wt=json} status=0 QTime=3 
   [junit4]   2> 1571797 INFO  (WRITER24) [    ] o.a.s.s.TestStressReorder VERBOSE: deleting id 9 val= 5 version 61
   [junit4]   2> 1571803 INFO  (READER1) [    ] o.a.s.c.S.Request [collection1] webapp=null path=null params={qt=/get&ids=10&wt=json} status=0 QTime=0 
   [junit4]   2> 1571797 INFO  (WRITER7) [    ] o.a.s.s.TestStressReorder VERBOSE: adding id 17 val= 5 version 60
   [junit4]   2> 1571796 INFO  (WRITER1) [    ] o.a.s.u.p.LogUpdateProcessor [collection1] webapp=null path=null params={update.distrib=FROMLEADER&versions=true&wt=json&indent=true} {add=[9 (47)]} 0 6
   [junit4]   2> 1571804 INFO  (WRITER1) [    ] o.a.s.s.TestStressReorder VERBOSE: deleting id 9 val= 5 version 62
   [junit4]   2> 1571796 INFO  (WRITER4) [    ] o.a.s.u.p.LogUpdateProcessor [collection1] webapp=null path=null params={_version_=-56&update.distrib=FROMLEADER&versions=true&wt=json&indent=true} {delete=[3 (-56)]} 0 3
   [junit4]   2> 1571796 INFO  (WRITER14) [    ] o.a.s.u.p.LogUpdateProcessor [collection1] webapp=null path=null params={update.distrib=FROMLEADER&versions=true&wt=json&indent=true} {add=[18 (36)]} 0 4
   [junit4]   2> 1571804 INFO  (WRITER14) [    ] o.a.s.s.TestStressReorder VERBOSE: adding id 14 val= 3 version 63
   [junit4]   2> 1571796 INFO  (WRITER6) [    ] o.a.s.u.p.LogUpdateProcessor [collection1] webapp=null path=null params={update.distrib=FROMLEADER&versions=true&wt=json&indent=true} {add=[18 (51)]} 0 4
   [junit4]   2> 1571796 INFO  (WRITER0) [    ] o.a.s.u.p.LogUpdateProcessor [collection1] webapp=null path=null params={update.distrib=FROMLEADER&versions=true&wt=json&indent=true} {add=[3 (49)]} 0 5
   [junit4]   2> 1571796 INFO  (WRITER3) [    ] o.a.s.u.p.LogUpdateProcessor [collection1] webapp=null path=null params={_version_=-40&update.distrib=FROMLEADER&versions=true&wt=json&indent=true} {delete=[2 (-40)]} 0 5
   [junit4]   2> 1571796 INFO  (WRITER20) [    ] o.a.s.u.p.LogUpdateProcessor [collection1] webapp=null path=null params={update.distrib=FROMLEADER&versions=true&wt=json&indent=true} {add=[18 (50)]} 0 3
   [junit4]   2> 1571796 INFO  (READER8) [    ] o.a.s.c.S.Request [collection1] webapp=null path=null params={qt=/get&ids=13&wt=json} status=0 QTime=0 
   [junit4]   2> 1571795 INFO  (WRITER5) [    ] o.a.s.u.p.LogUpdateProcessor [collection1] webapp=null path=null params={update.distrib=FROMLEADER&versions=true&wt=json&indent=true} {add=[13 (58)]} 0 0
   [junit4]   2> 1571805 INFO  (WRITER5) [    ] o.a.s.s.TestStressReorder VERBOSE: deleting id 10 val= 2 version 66
   [junit4]   2> 1571795 INFO  (READER4) [    ] o.a.s.c.S.Request [collection1] webapp=null path=null params={qt=/get&ids=13&wt=json} status=0 QTime=0 
   [junit4]   2> 1571795 INFO  (WRITER18) [    ] o.a.s.u.p.LogUpdateProcessor [collection1] webapp=null path=null params={_version_=-39&update.distrib=FROMLEADER&versions=true&wt=json&indent=true} {delete=[16 (-39)]} 0 4
   [junit4]   2> 1571805 INFO  (READER4) [    ] o.a.s.c.S.Request [collection1] webapp=null path=null params={qt=/get&ids=8&wt=json} status=0 QTime=0 
   [junit4]   2> 1571795 INFO  (WRITER17) [    ] o.a.s.u.p.LogUpdateProcessor [collection1] webapp=null path=null params={update.distrib=FROMLEADER&versions=true&wt=json&indent=true} {add=[1 (38)]} 0 3
   [junit4]   2> 1571806 INFO  (READER4) [    ] o.a.s.c.S.Request [collection1] webapp=null path=null params={qt=/get&ids=6&wt=json} status=0 QTime=0 
   [junit4]   2> 1571794 INFO  (WRITER11) [    ] o.a.s.u.p.LogUpdateProcessor [collection1] webapp=null path=null params={update.distrib=FROMLEADER&versions=true&wt=json&indent=true} {add=[10 (35)]} 0 2
   [junit4]   2> 1571793 INFO  (WRITER16) [    ] o.a.s.u.p.LogUpdateProcessor [collection1] webapp=null path=null params={} {commit=} 0 21
   [junit4]   2> 1571792 INFO  (WRITER22) [    ] o.a.s.s.TestStressReorder VERBOSE: adding id 13 val= 3 version 57
   [junit4]   2> 1571792 INFO  (WRITER2) [    ] o.a.s.u.UpdateHandler start commit{,optimize=false,openSearcher=true,waitSearcher=true,expungeDeletes=false,softCommit=true,prepareCommit=false}
   [junit4]   2> 1571792 INFO  (WRITER10) [    ] o.a.s.s.TestStressReorder VERBOSE: adding id 7 val= 3 version 54
   [junit4]   2> 1571792 INFO  (WRITER9) [    ] o.a.s.s.TestStressReorder VERBOSE: adding id 7 val= 3 version 53
   [junit4]   2> 1571806 INFO  (WRITER11) [    ] o.a.s.s.TestStressReorder VERBOSE: adding id 10 val= 3 version 68
   [junit4]   2> 1571806 INFO  (WRITER17) [    ] o.a.s.s.TestStressReorder VERBOSE: deleting id 1 val= 3 version 67
   [junit4]   2> 1571805 INFO  (WRITER18) [    ] o.a.s.s.TestStressReorder VERBOSE: deleting id 16 val= 2 version 39 DONE
   [junit4]   2> 1571805 INFO  (WRITER20) [    ] o.a.s.s.TestStressReorder VERBOSE: adding id 18 val= 4 version 65
   [junit4]   2> 1571805 INFO  (WRITER3) [    ] o.a.s.s.TestStressReorder VERBOSE: deleting id 2 val= 3 version 40 DONE
   [junit4]   2> 1571807 INFO  (WRITER3) [    ] o.a.s.s.TestStressReorder VERBOSE: adding id 16 val= 3 version 70
   [junit4]   2> 1571805 INFO  (WRITER0) [    ] o.a.s.s.TestStressReorder VERBOSE: softCommit start
   [junit4]   2> 1571804 INFO  (WRITER6) [    ] o.a.s.s.TestStressReorder VERBOSE: adding id 18 val= 4 version 64
   [junit4]   2> 1571804 INFO  (WRITER4) [    ] o.a.s.s.TestStressReorder VERBOSE: deleting id 3 val= 2 version 56 DONE
   [junit4]   2> 1571807 INFO  (WRITER4) [    ] o.a.s.s.TestStressReorder VERBOSE: hardCommit start
   [junit4]   2> 1571803 INFO  (READER9) [    ] o.a.s.c.S.Request [collection1] webapp=null path=null params={qt=/get&ids=13&wt=json} status=0 QTime=0 
   [junit4]   2> 1571803 INFO  (searcherExecutor-5384-thread-1) [    ] o.a.s.c.SolrCore [collection1] Registered new searcher Searcher@2b67d19a[collection1] main{ExitableDirectoryReader(UninvertingDirectoryReader(Uninverting(_2(6.0.0):c14/9:delGen=1) Uninverting(_3(6.0.0):c15/7:delGen=1)))}
   [junit4]   2> 1571802 INFO  (READER0) [    ] o.a.s.c.S.Request [collection1] webapp=null path=null params={qt=/get&ids=9&wt=json} status=0 QTime=0 
   [junit4]   2> 1571807 INFO  (READER8) [    ] o.a.s.c.S.Request [collection1] webapp=null path=null params={qt=/get&ids=12&wt=json} status=0 QTime=2 
   [junit4]   2> 1571807 INFO  (READER0) [    ] o.a.s.c.S.Request [collection1] webapp=null path=null params={qt=/get&ids=3&wt=json} status=0 QTime=0 
   [junit4]   2> 1571807 INFO  (READER6) [    ] o.a.s.c.S.Request [collection1] webapp=null path=null params={qt=/get&ids=0&wt=json} status=0 QTime=4 
   [junit4]   2> 1571807 INFO  (READER0) [    ] o.a.s.c.S.Request [collection1] webapp=null path=null params={qt=/get&ids=17&wt=json} status=0 QTime=0 
   [junit4]   2> 1571808 INFO  (READER6) [    ] o.a.s.c.S.Request [collection1] webapp=null path=null params={qt=/get&ids=3&wt=json} status=0 QTime=0 
   [junit4]   2> 1571808 INFO  (READER0) [    ] o.a.s.c.S.Request [collection1] webapp=null path=null params={qt=/get&ids=12&wt=json} status=0 QTime=0 
   [junit4]   2> 1571808 INFO  (READER6) [    ] o.a.s.c.S.Request [collection1] webapp=null path=null params={qt=/get&ids=3&wt=json} status=0 QTime=0 
   [junit4]   2> 1571802 INFO  (READER5) [    ] o.a.s.c.S.Request [collection1] webapp=null path=null params={qt=/get&ids=9&wt=json} status=0 QTime=0 
   [junit4]   2> 1571808 INFO  (READER6) [    ] o.a.s.c.S.Request [collection1] webapp=null path=null params={qt=/get&ids=5&wt=json} status=0 QTime=0 
   [junit4]   2> 1571808 INFO  (READER5) [    ] o.a.s.c.S.Request [collection1] webapp=null path=null params={qt=/get&ids=16&wt=json} status=0 QTime=0 
   [junit4]   2> 1571808 INFO  (READER6) [    ] o.a.s.c.S.Request [collection1] webapp=null path=null params={qt=/get&ids=3&wt=json} status=0 QTime=0 
   [junit4]   2> 1571808 INFO  (READER5) [    ] o.a.s.c.S.Request [collection1] webapp=null path=null params={qt=/get&ids=3&wt=json} status=0 QTime=0 
   [junit4]   2> 1571808 INFO  (READER6) [    ] o.a.s.c.S.Request [collection1] webapp=null path=null params={qt=/get&ids=0&wt=json} status=0 QTime=0 
   [junit4]   2> 1571808 INFO  (READER5) [    ] o.a.s.c.S.Request [collection1] webapp=null path=null params={q=id:5&omitHeader=true&wt=json} hits=1 status=0 QTime=0 
   [junit4]   2> 1571808 INFO  (READER6) [    ] o.a.s.c.S.Request [collection1] webapp=null path=null params={qt=/get&ids=0&wt=json} status=0 QTime=0 
   [junit4]   2> 1571808 INFO  (READER5) [    ] o.a.s.c.S.Request [collection1] webapp=null path=null params={qt=/get&ids=3&wt=json} status=0 QTime=0 
   [junit4]   2> 1571808 INFO  (READER6) [    ] o.a.s.c.S.Request [collection1] webapp=null path=null params={qt=/get&ids=3&wt=json} status=0 QTime=0 
   [junit4]   2> 1571801 INFO  (READER2) [    ] o.a.s.c.S.Request [collection1] webapp=null path=null params={q=id:8&omitHeader=true&wt=json} hits=1 status=0 QTime=0 
   [junit4]   2> 1571808 INFO  (READER6) [    ] o.a.s.c.S.Request [collection1] webapp=null path=null params={qt=/get&ids=13&wt=json} status=0 QTime=0 
   [junit4]   2> 1571808 INFO  (READER6) [    ] o.a.s.c.S.Request [collection1] webapp=null path=null params={qt=/get&ids=3&wt=json} status=0 QTime=0 
   [junit4]   2> 1571808 INFO  (READER6) [    ] o.a.s.c.S.Request [collection1] webapp=null path=null params={q=id:5&omitHeader=true&wt=json} hits=1 status=0 QTime=0 
   [junit4]   2> 1571808 INFO  (READER2) [    ] o.a.s.c.S.Request [collection1] webapp=null path=null params={q=id:15&omitHeader=true&wt=json} hits=0 status=0 QTime=0 
   [junit4]   2> 1571809 INFO  (READER6) [    ] o.a.s.c.S.Request [collection1] webapp=null path=null params={qt=/get&ids=1&wt=json} status=0 QTime=0 
   [junit4]   2> 1571809 INFO  (READER2) [    ] o.a.s.c.S.Request [collection1] webapp=null path=null params={qt=/get&ids=3&wt=json} status=0 QTime=0 
   [junit4]   2> 1571809 INFO  (READER6) [    ] o.a.s.c.S.Request [collection1] webapp=null path=null params={qt=/get&ids=14&wt=json} status=0 QTime=0 
   [junit4]   2> 1571809 INFO  (READER2) [    ] o.a.s.c.S.Request [collection1] webapp=null path=null params={qt=/get&ids=3&wt=json} status=0 QTime=0 
   [junit4]   2> 1571809 INFO  (READER6) [    ] o.a.s.c.S.Request [collection1] webapp=null path=null params={qt=/get&ids=3&wt=json} status=0 QTime=0 
   [junit4]   2> 1571809 INFO  (READER2) [    ] o.a.s.c.S.Request [collection1] webapp=null path=null params={qt=/get&ids=19&wt=json} status=0 QTime=0 
   [junit4]   2> 1571809 INFO  (READER6) [    ] o.a.s.c.S.Request [collection1] webapp=null path=null params={qt=/get&ids=3&wt=json} status=0 QTime=0 
   [junit4]   2> 1571809 INFO  (READER2) [    ] o.a.s.c.S.Request [collection1] webapp=null path=null params={qt=/get&ids=3&wt=json} status=0 QTime=0 
   [junit4]   2> 1571809 INFO  (READER6) [    ] o.a.s.c.S.Request [collection1] webapp=null path=null params={qt=/get&ids=3&wt=json} status=0 QTime=0 
   [junit4]   2> 1571809 INFO  (READER2) [    ] o.a.s.c.S.Request [collection1] webapp=null path=null params={qt=/get&ids=17&wt=json} status=0 QTime=0 
   [junit4]   2> 1571809 INFO  (READER6) [    ] o.a.s.c.S.Request [collection1] webapp=null path=null params={qt=/get&ids=10&wt=json} status=0 QTime=0 
   [junit4]   2> 1571809 INFO  (READER2) [    ] o.a.s.c.S.Request [collection1] webapp=null path=null params={q=id:14&omitHeader=true&wt=json} hits=1 status=0 QTime=0 
   [junit4]   2> 1571809 INFO  (READER6) [    ] o.a.s.c.S.Request [collection1] webapp=null path=null params={qt=/get&ids=1&wt=json} status=0 QTime=0 
   [junit4]   2> 1571809 INFO  (READER2) [    ] o.a.s.c.S.Request [collection1] webapp=null path=null params={qt=/get&ids=18&wt=json} status=0 QTime=0 
   [junit4]   2> 1571809 INFO  (READER6) [    ] o.a.s.c.S.Request [collection1] webapp=null path=null params={qt=/get&ids=3&wt=json} status=0 QTime=0 
   [junit4]   2> 1571810 INFO  (READER2) [    ] o.a.s.c.S.Request [collection1] webapp=null path=null params={qt=/get&ids=3&wt=json} status=0 QTime=0 
   [junit4]   2> 1571810 INFO  (READER6) [    ] o.a.s.c.S.Request [collection1] webapp=null path=null params={qt=/get&ids=15&wt=json} status=0 QTime=0 
   [junit4]   2> 1571810 INFO  (READER2) [    ] o.a.s.c.S.Request [collection1] webapp=null path=null params={qt=/get&ids=3&wt=json} status=0 QTime=0 
   [junit4]   2> 1571810 INFO  (READER6) [    ] o.a.s.c.S.Request [collection1] webapp=null path=null params={qt=/get&ids=9&wt=json} status=0 QTime=0 
   [junit4]   2> 1571810 INFO  (READER2) [    ] o.a.s.c.S.Request [collection1] webapp=null path=null params={qt=/get&ids=3&wt=json} status=0 QTime=0 
   [junit4]   2> 1571810 INFO  (READER6) [    ] o.a.s.c.S.Request [collection1] webapp=null path=null params={qt=/get&ids=9&wt=json} status=0 QTime=0 
   [junit4]   2> 1571810 INFO  (READER2) [    ] o.a.s.c.S.Request [collection1] webapp=null path=null params={qt=/get&ids=3&wt=json} status=0 QTime=0 
   [junit4]   2> 1571810 INFO  (READER6) [    ] o.a.s.c.S.Request [collection1] webapp=null path=null params={qt=/get&ids=0&wt=json} status=0 QTime=0 
   [junit4]   2> 1571810 INFO  (READER2) [    ] o.a.s.c.S.Request [collection1] webapp=null path=null params={qt=/get&ids=3&wt=json} status=0 QTime=0 
   [junit4]   2> 1571810 INFO  (READER6) [    ] o.a.s.c.S.Request [collection1] webapp=null path=null params={q=id:14&omitHeader=true&wt=json} hits=1 status=0 QTime=0 
   [junit4]   2> 1571810 INFO  (READER2) [    ] o.a.s.c.S.Request [collection1] webapp=null path=null params={qt=/get&ids=3&wt=json} status=0 QTime=0 
   [junit4]   2> 1571810 INFO  (READER6) [    ] o.a.s.c.S.Request [collection1] webapp=null path=null params={q=id:6&omitHeader=true&wt=json} hits=1 status=0 QTime=0 
   [junit4]   2> 1571808 INFO  (READER5) [    ] o.a.s.c.S.Request [collection1] webapp=null path=null params={qt=/get&ids=6&wt=json} status=0 QTime=0 
   [junit4]   2> 1571810 INFO  (READER6) [    ] o.a.s.c.S.Request [collection1] webapp=null path=null params={qt=/get&ids=18&wt=json} status=0 QTime=0 
   [junit4]   2> 1571811 INFO  (READER5) [    ] o.a.s.c.S.Request [collection1] webapp=null path=null params={qt=/get&ids=6&wt=json} status=0 QTime=0 
   [junit4]   2> 1571811 INFO  (READER6) [    ] o.a.s.c.S.Request [collection1] webapp=null path=null params={q=id:18&omitHeader=true&wt=json} hits=1 status=0 QTime=0 
   [junit4]   2> 1571811 INFO  (READER5) [    ] o.a.s.c.S.Request [collection1] webapp=null path=null params={qt=/get&ids=15&wt=json} status=0 QTime=0 
   [junit4]   2> 1571811 INFO  (READER6) [    ] o.a.s.c.S.Request [collection1] webapp=null path=null params={q=id:15&omitHeader=true&wt=json} hits=0 status=0 QTime=0 
   [junit4]   2> 1571808 INFO  (READER0) [    ] o.a.s.c.S.Request [collection1] webapp=null path=null params={q=id:7&omitHeader=true&wt=json} hits=1 status=0 QTime=0 
   [junit4]   2> 1571811 INFO  (READER6) [    ] o.a.s.c.S.Request [collection1] webapp=null path=null params={qt=/get&ids=9&wt=json} status=0 QTime=0 
   [junit4]   2> 1571811 INFO  (READER6) [    ] o.a.s.c.S.Request [collection1] webapp=null path=null params={qt=/get&ids=6&wt=json} status=0 QTime=0 
   [junit4]   2> 1571811 INFO  (READER6) [    ] o.a.s.c.S.Request [collection1] webapp=null path=null params={qt=/get&ids=3&wt=json} status=0 QTime=0 
   [junit4]   2> 1571811 INFO  (READER6) [    ] o.a.s.c.S.Request [collection1] webapp=null path=null params={q=id:3&omitHeader=true&wt=json} hits=0 status=0 QTime=0 
   [junit4]   2> 1571807 INFO  (WRITER21) [    ] o.a.s.c.SolrCore SolrIndexSearcher has not changed - not re-opening: org.apache.solr.search.SolrIndexSearcher
   [junit4]   2> 1571812 INFO  (READER0) [    ] o.a.s.c.S.Request [collection1] webapp=null path=null params={qt=/get&ids=3&wt=json} status=0 QTime=0 
   [junit4]   2> 1571812 INFO  (WRITER23) [    ] o.a.s.c.SolrCore SolrIndexSearcher has not changed - not re-opening: org.apache.solr.search.SolrIndexSearcher
   [junit4]   2> 1571812 INFO  (READER0) [    ] o.a.s.c.S.Request [collection1] webapp=null path=null params={qt=/get&ids=8&wt=json} status=0 QTime=0 
   [junit4]   2> 1571812 INFO  (WRITER2) [    ] o.a.s.c.SolrCore SolrIndexSearcher has not changed - not re-opening: org.apache.solr.search.SolrIndexSearcher
   [junit4]   2> 1571812 INFO  (READER0) [    ] o.a.s.c.S.Request [collection1] webapp=null path=null params={qt=/get&ids=13&wt=json} status=0 QTime=0 
   [junit4]   2> 1571812 INFO  (READER0) [    ] o.a.s.c.S.Request [collection1] webapp=null path=null params={qt=/get&ids=3&wt=json} status=0 QTime=0 
   [junit4]   2> 1571813 INFO  (READER0) [    ] o.a.s.c.S.Request [collection1] webapp=null path=null params={qt=/get&ids=12&wt=json} status=0 QTime=0 
   [junit4]   2> 1571813 INFO  (READER0) [    ] o.a.s.c.S.Request [collection1] webapp=null path=null params={qt=/get&ids=3&wt=json} status=0 QTime=0 
   [junit4]   2> 1571807 INFO  (READER3) [    ] o.a.s.c.S.Request [collection1] webapp=null path=null params={qt=/get&ids=15&wt=json} status=0 QTime=4 
   [junit4]   2> 1571813 INFO  (READER0) [    ] o.a.s.c.S.Request [collection1] webapp=null path=null params={q=id:10&omitHeader=true&wt=json} hits=1 status=0 QTime=0 
   [junit4]   2> 1571813 INFO  (READER3) [    ] o.a.s.c.S.Request [collection1] webapp=null path=null params={q=id:3&omitHeader=true&wt=json} hits=0 status=0 QTime=0 
   [junit4]   2> 1571813 INFO  (READER0) [    ] o.a.s.c.S.Request [collection1] webapp=null path=null params={q=id:17&omitHeader=true&wt=json} hits=1 status=0 QTime=0 
   [junit4]   2> 1571813 INFO  (READER3) [    ] o.a.s.c.S.Request [collection1] webapp=null path=null params={qt=/get&ids=4&wt=json} status=0 QTime=0 
   [junit4]   2> 1571813 INFO  (READER0) [    ] o.a.s.c.S.Request [collection1] webapp=null path=null params={q=id:11&omitHeader=true&wt=json} hits=0 status=0 QTime=0 
   [junit4]   2> 1571813 INFO  (READER3) [    ] o.a.s.c.S.Request [collection1] webapp=null path=null params={qt=/get&ids=16&wt=json} status=0 QTime=0 
   [junit4]   2> 1571813 INFO  (READER0) [    ] o.a.s.c.S.Request [collection1] webapp=null path=null params={q=id:10&omitHeader=true&wt=json} hits=1 status=0 QTime=0 
   [junit4]   2> 1571807 INFO  (READER8) [    ] o.a.s.c.S.Request [collection1] webapp=null path=null params={qt=/

[...truncated too long message...]

 uncaught exception in thread: Thread[id=12381, name=READER3, state=RUNNABLE, group=TGRP-TestStressReorder]
   [junit4]    > 	at __randomizedtesting.SeedInfo.seed([DA5C3DC3EE491C03:C69A04D5E482988E]:0)
   [junit4]    > Caused by: java.lang.RuntimeException: java.lang.AssertionError
   [junit4]    > 	at __randomizedtesting.SeedInfo.seed([DA5C3DC3EE491C03]:0)
   [junit4]    > 	at org.apache.solr.search.TestStressReorder$2.run(TestStressReorder.java:316)
   [junit4]    > Caused by: java.lang.AssertionError
   [junit4]    > 	at org.apache.solr.search.TestStressReorder$2.run(TestStressReorder.java:309)
   [junit4]   2> 1576228 INFO  (SUITE-TestStressReorder-seed#[DA5C3DC3EE491C03]-worker) [    ] o.a.s.SolrTestCaseJ4 ###deleteCore
   [junit4]   2> 1576228 INFO  (SUITE-TestStressReorder-seed#[DA5C3DC3EE491C03]-worker) [    ] o.a.s.c.CoreContainer Shutting down CoreContainer instance=763331860
   [junit4]   2> 1576229 INFO  (SUITE-TestStressReorder-seed#[DA5C3DC3EE491C03]-worker) [    x:collection1] o.a.s.c.SolrCore [collection1]  CLOSING SolrCore org.apache.solr.core.SolrCore@6dbcec39
   [junit4]   2> 1576229 INFO  (SUITE-TestStressReorder-seed#[DA5C3DC3EE491C03]-worker) [    x:collection1] o.a.s.u.UpdateHandler closing DirectUpdateHandler2{commits=420,autocommits=0,soft autocommits=0,optimizes=0,rollbacks=0,expungeDeletes=0,docsPending=31,adds=2,deletesById=1,deletesByQuery=0,errors=1,cumulative_adds=1208,cumulative_deletesById=345,cumulative_deletesByQuery=168,cumulative_errors=1,transaction_logs_total_size=4833,transaction_logs_total_number=3}
   [junit4]   2> 1576229 INFO  (SUITE-TestStressReorder-seed#[DA5C3DC3EE491C03]-worker) [    x:collection1] o.a.s.u.SolrCoreState Closing SolrCoreState
   [junit4]   2> 1576229 INFO  (SUITE-TestStressReorder-seed#[DA5C3DC3EE491C03]-worker) [    x:collection1] o.a.s.u.DefaultSolrCoreState SolrCoreState ref count has reached 0 - closing IndexWriter
   [junit4]   2> 1576229 INFO  (SUITE-TestStressReorder-seed#[DA5C3DC3EE491C03]-worker) [    x:collection1] o.a.s.u.DefaultSolrCoreState closing IndexWriter with IndexWriterCloser
   [junit4]   2> 1576230 INFO  (SUITE-TestStressReorder-seed#[DA5C3DC3EE491C03]-worker) [    x:collection1] o.a.s.u.UpdateHandler Committing on IndexWriter close.
   [junit4]   2> 1576232 INFO  (SUITE-TestStressReorder-seed#[DA5C3DC3EE491C03]-worker) [    x:collection1] o.a.s.c.SolrCore SolrDeletionPolicy.onCommit: commits: num=2
   [junit4]   2> 	commit{dir=MockDirectoryWrapper(RAMDirectory@1e7c54ae lockFactory=org.apache.lucene.store.SingleInstanceLockFactory@64f24ad1),segFN=segments_1z,generation=71}
   [junit4]   2> 	commit{dir=MockDirectoryWrapper(RAMDirectory@1e7c54ae lockFactory=org.apache.lucene.store.SingleInstanceLockFactory@64f24ad1),segFN=segments_20,generation=72}
   [junit4]   2> 1576232 INFO  (SUITE-TestStressReorder-seed#[DA5C3DC3EE491C03]-worker) [    x:collection1] o.a.s.c.SolrCore newest commit generation = 72
   [junit4]   2> 1576233 INFO  (SUITE-TestStressReorder-seed#[DA5C3DC3EE491C03]-worker) [    x:collection1] o.a.s.c.SolrCore [collection1] Closing main searcher on request.
   [junit4]   2> 1576242 INFO  (SUITE-TestStressReorder-seed#[DA5C3DC3EE491C03]-worker) [    x:collection1] o.a.s.c.CachingDirectoryFactory Closing MockDirectoryFactory - 2 directories currently being tracked
   [junit4]   2> 1576242 INFO  (SUITE-TestStressReorder-seed#[DA5C3DC3EE491C03]-worker) [    x:collection1] o.a.s.c.CachingDirectoryFactory looking to close C:\Users\JenkinsSlave\workspace\Lucene-Solr-trunk-Windows\solr\build\solr-core\test\J0\temp\solr.search.TestStressReorder_DA5C3DC3EE491C03-001\init-core-data-001\index [CachedDir<<refCount=0;path=C:\Users\JenkinsSlave\workspace\Lucene-Solr-trunk-Windows\solr\build\solr-core\test\J0\temp\solr.search.TestStressReorder_DA5C3DC3EE491C03-001\init-core-data-001\index;done=false>>]
   [junit4]   2> 1576242 INFO  (SUITE-TestStressReorder-seed#[DA5C3DC3EE491C03]-worker) [    x:collection1] o.a.s.c.CachingDirectoryFactory Closing directory: C:\Users\JenkinsSlave\workspace\Lucene-Solr-trunk-Windows\solr\build\solr-core\test\J0\temp\solr.search.TestStressReorder_DA5C3DC3EE491C03-001\init-core-data-001\index
   [junit4]   2> 1576243 INFO  (SUITE-TestStressReorder-seed#[DA5C3DC3EE491C03]-worker) [    x:collection1] o.a.s.c.CachingDirectoryFactory looking to close C:\Users\JenkinsSlave\workspace\Lucene-Solr-trunk-Windows\solr\build\solr-core\test\J0\temp\solr.search.TestStressReorder_DA5C3DC3EE491C03-001\init-core-data-001\ [CachedDir<<refCount=0;path=C:\Users\JenkinsSlave\workspace\Lucene-Solr-trunk-Windows\solr\build\solr-core\test\J0\temp\solr.search.TestStressReorder_DA5C3DC3EE491C03-001\init-core-data-001\;done=false>>]
   [junit4]   2> 1576243 INFO  (SUITE-TestStressReorder-seed#[DA5C3DC3EE491C03]-worker) [    x:collection1] o.a.s.c.CachingDirectoryFactory Closing directory: C:\Users\JenkinsSlave\workspace\Lucene-Solr-trunk-Windows\solr\build\solr-core\test\J0\temp\solr.search.TestStressReorder_DA5C3DC3EE491C03-001\init-core-data-001\
   [junit4]   2> NOTE: test params are: codec=Asserting(Lucene53): {val_l=PostingsFormat(name=Asserting), _version_=PostingsFormat(name=Direct), id=Lucene50(blocksize=128)}, docValues:{}, sim=DefaultSimilarity, locale=ms, timezone=America/Tortola
   [junit4]   2> NOTE: Windows 7 6.1 amd64/Oracle Corporation 1.8.0_51 (64-bit)/cpus=3,threads=1,free=133617864,total=409993216
   [junit4]   2> NOTE: All tests run in this JVM: [TestFreeTextSuggestions, HdfsSyncSliceTest, SortByFunctionTest, ShardRoutingTest, AnalysisAfterCoreReloadTest, TestDefaultStatsCache, TestConfigReload, TestOmitPositions, TestBinaryResponseWriter, TestShardHandlerFactory, TestConfigSets, LeaderElectionTest, TestExactStatsCache, HardAutoCommitTest, SliceStateTest, SolrPluginUtilsTest, TestFastLRUCache, HLLUtilTest, ExitableDirectoryReaderTest, ZkStateReaderTest, TestSQLHandler, HdfsChaosMonkeySafeLeaderTest, TestObjectReleaseTracker, DirectUpdateHandlerTest, SmileWriterTest, CursorMarkTest, TestIndexSearcher, TestSort, CloudMLTQParserTest, NoCacheHeaderTest, HdfsCollectionsAPIDistributedZkTest, PathHierarchyTokenizerFactoryTest, DistributedFacetPivotSmallTest, DirectSolrConnectionTest, OutOfBoxZkACLAndCredentialsProvidersTest, RecoveryAfterSoftCommitTest, RemoteQueryErrorTest, TestManagedResource, BlockCacheTest, TestSimpleQParserPlugin, TestConfigSetImmutable, DistributedVersionInfoTest, TestSerializedLuceneMatchVersion, DistributedSpellCheckComponentTest, ClusterStateUpdateTest, DocValuesTest, DeleteShardTest, ConnectionManagerTest, HdfsNNFailoverTest, TestSchemaNameResource, NumericFieldsTest, TestUpdate, RequestLoggingTest, TestStressVersions, TestSolrCLIRunExample, BadCopyFieldTest, HdfsBasicDistributedZkTest, ResponseHeaderTest, HdfsRecoveryZkTest, IndexSchemaRuntimeFieldTest, OverseerTest, CdcrRequestHandlerTest, SuggesterFSTTest, OutputWriterTest, BitVectorTest, HLLSerializationTest, DistributedFacetPivotWhiteBoxTest, CoreMergeIndexesAdminHandlerTest, TestNamedUpdateProcessors, AssignTest, SuggesterTest, TestRebalanceLeaders, TestDistribIDF, BasicDistributedZkTest, TestXIncludeConfig, SolrInfoMBeanTest, TestInitQParser, CircularListTest, TestCryptoKeys, TestPostingsSolrHighlighter, TimeZoneUtilsTest, TestSchemaManager, TestSchemaSimilarityResource, PeerSyncTest, CoreAdminRequestStatusTest, TestSolrIndexConfig, TestFileDictionaryLookup, VMParamsZkACLAndCredentialsProvidersTest, TestFunctionQuery, OverseerRolesTest, TestSolrQueryParserDefaultOperatorResource, TestCharFilters, TestIBSimilarityFactory, FieldAnalysisRequestHandlerTest, TestBM25SimilarityFactory, TestJmxIntegration, TestTrieFacet, TestExceedMaxTermLength, RequestHandlersTest, CollectionStateFormat2Test, SegmentsInfoRequestHandlerTest, TestHashPartitioner, TestScoreJoinQPNoScore, TestLFUCache, TestTrackingShardHandlerFactory, TestJmxMonitoredMap, TestPhraseSuggestions, TestShortCircuitedRequests, TestArbitraryIndexDir, IgnoreCommitOptimizeUpdateProcessorFactoryTest, BigEndianAscendingWordSerializerTest, TestFieldResource, TestRandomDVFaceting, HdfsDirectoryTest, SoftAutoCommitTest, MergeStrategyTest, DistributedFacetPivotLargeTest, TestQueryUtils, TestManagedResourceStorage, TestLRUCache, DistributedSuggestComponentTest, TestPerFieldSimilarity, TestQueryTypes, SampleTest, TestSolrConfigHandlerCloud, TestMiniSolrCloudCluster, TestHashQParserPlugin, TestAnalyzeInfixSuggestions, TestClusterStateMutator, TestManagedSchemaFieldResource, OpenCloseCoreStressTest, RecoveryZkTest, TestReplicationHandler, AutoCommitTest, TestFaceting, TestRecovery, TermVectorComponentDistributedTest, ZkControllerTest, TestRealTimeGet, TestStressReorder]
   [junit4] Completed [286/540] on J0 in 4.79s, 1 test, 1 error <<< FAILURES!

[...truncated 793 lines...]
BUILD FAILED
C:\Users\JenkinsSlave\workspace\Lucene-Solr-trunk-Windows\build.xml:716: The following error occurred while executing this line:
C:\Users\JenkinsSlave\workspace\Lucene-Solr-trunk-Windows\build.xml:660: The following error occurred while executing this line:
C:\Users\JenkinsSlave\workspace\Lucene-Solr-trunk-Windows\build.xml:59: The following error occurred while executing this line:
C:\Users\JenkinsSlave\workspace\Lucene-Solr-trunk-Windows\solr\build.xml:230: The following error occurred while executing this line:
C:\Users\JenkinsSlave\workspace\Lucene-Solr-trunk-Windows\solr\common-build.xml:514: The following error occurred while executing this line:
C:\Users\JenkinsSlave\workspace\Lucene-Solr-trunk-Windows\lucene\common-build.xml:1429: The following error occurred while executing this line:
C:\Users\JenkinsSlave\workspace\Lucene-Solr-trunk-Windows\lucene\common-build.xml:984: There were test failures: 540 suites, 2127 tests, 1 error, 77 ignored (41 assumptions)

Total time: 67 minutes 16 seconds
Build step 'Invoke Ant' marked build as failure
Archiving artifacts
Recording test results
Email was triggered for: Failure - Any
Sending email for trigger: Failure - Any



Mime
View raw message