lucene-dev mailing list archives

Site index · List index
Message view « Date » · « Thread »
Top « Date » · « Thread »
From Policeman Jenkins Server <jenk...@thetaphi.de>
Subject [JENKINS] Lucene-Solr-trunk-MacOSX (64bit/jdk1.8.0) - Build # 2639 - Failure!
Date Mon, 17 Aug 2015 19:18:16 GMT
Build: http://jenkins.thetaphi.de/job/Lucene-Solr-trunk-MacOSX/2639/
Java: 64bit/jdk1.8.0 -XX:+UseCompressedOops -XX:+UseSerialGC

2 tests failed.
FAILED:  org.apache.solr.cloud.CdcrReplicationHandlerTest.doTest

Error Message:
There are still nodes recoverying - waited for 330 seconds

Stack Trace:
java.lang.AssertionError: There are still nodes recoverying - waited for 330 seconds
	at __randomizedtesting.SeedInfo.seed([B16B7B33D9E4BEA1:162FC397B45FAD18]:0)
	at org.junit.Assert.fail(Assert.java:93)
	at org.apache.solr.cloud.AbstractDistribZkTestBase.waitForRecoveriesToFinish(AbstractDistribZkTestBase.java:172)
	at org.apache.solr.cloud.AbstractDistribZkTestBase.waitForRecoveriesToFinish(AbstractDistribZkTestBase.java:133)
	at org.apache.solr.cloud.AbstractDistribZkTestBase.waitForRecoveriesToFinish(AbstractDistribZkTestBase.java:128)
	at org.apache.solr.cloud.BaseCdcrDistributedZkTest.waitForRecoveriesToFinish(BaseCdcrDistributedZkTest.java:465)
	at org.apache.solr.cloud.BaseCdcrDistributedZkTest.clearSourceCollection(BaseCdcrDistributedZkTest.java:319)
	at org.apache.solr.cloud.CdcrReplicationHandlerTest.doTestPartialReplicationWithTruncatedTlog(CdcrReplicationHandlerTest.java:121)
	at org.apache.solr.cloud.CdcrReplicationHandlerTest.doTest(CdcrReplicationHandlerTest.java:52)
	at sun.reflect.NativeMethodAccessorImpl.invoke0(Native Method)
	at sun.reflect.NativeMethodAccessorImpl.invoke(NativeMethodAccessorImpl.java:62)
	at sun.reflect.DelegatingMethodAccessorImpl.invoke(DelegatingMethodAccessorImpl.java:43)
	at java.lang.reflect.Method.invoke(Method.java:497)
	at com.carrotsearch.randomizedtesting.RandomizedRunner.invoke(RandomizedRunner.java:1627)
	at com.carrotsearch.randomizedtesting.RandomizedRunner$6.evaluate(RandomizedRunner.java:836)
	at com.carrotsearch.randomizedtesting.RandomizedRunner$7.evaluate(RandomizedRunner.java:872)
	at com.carrotsearch.randomizedtesting.RandomizedRunner$8.evaluate(RandomizedRunner.java:886)
	at org.apache.solr.BaseDistributedSearchTestCase$ShardsRepeatRule$ShardsFixedStatement.callStatement(BaseDistributedSearchTestCase.java:963)
	at org.apache.solr.BaseDistributedSearchTestCase$ShardsRepeatRule$ShardsStatement.evaluate(BaseDistributedSearchTestCase.java:938)
	at com.carrotsearch.randomizedtesting.rules.SystemPropertiesRestoreRule$1.evaluate(SystemPropertiesRestoreRule.java:57)
	at org.apache.lucene.util.TestRuleSetupTeardownChained$1.evaluate(TestRuleSetupTeardownChained.java:50)
	at org.apache.lucene.util.AbstractBeforeAfterRule$1.evaluate(AbstractBeforeAfterRule.java:46)
	at org.apache.lucene.util.TestRuleThreadAndTestName$1.evaluate(TestRuleThreadAndTestName.java:49)
	at org.apache.lucene.util.TestRuleIgnoreAfterMaxFailures$1.evaluate(TestRuleIgnoreAfterMaxFailures.java:65)
	at org.apache.lucene.util.TestRuleMarkFailure$1.evaluate(TestRuleMarkFailure.java:48)
	at com.carrotsearch.randomizedtesting.rules.StatementAdapter.evaluate(StatementAdapter.java:36)
	at com.carrotsearch.randomizedtesting.ThreadLeakControl$StatementRunner.run(ThreadLeakControl.java:365)
	at com.carrotsearch.randomizedtesting.ThreadLeakControl.forkTimeoutingTask(ThreadLeakControl.java:798)
	at com.carrotsearch.randomizedtesting.ThreadLeakControl$3.evaluate(ThreadLeakControl.java:458)
	at com.carrotsearch.randomizedtesting.RandomizedRunner.runSingleTest(RandomizedRunner.java:845)
	at com.carrotsearch.randomizedtesting.RandomizedRunner$3.evaluate(RandomizedRunner.java:747)
	at com.carrotsearch.randomizedtesting.RandomizedRunner$4.evaluate(RandomizedRunner.java:781)
	at com.carrotsearch.randomizedtesting.RandomizedRunner$5.evaluate(RandomizedRunner.java:792)
	at com.carrotsearch.randomizedtesting.rules.StatementAdapter.evaluate(StatementAdapter.java:36)
	at com.carrotsearch.randomizedtesting.rules.SystemPropertiesRestoreRule$1.evaluate(SystemPropertiesRestoreRule.java:57)
	at org.apache.lucene.util.AbstractBeforeAfterRule$1.evaluate(AbstractBeforeAfterRule.java:46)
	at com.carrotsearch.randomizedtesting.rules.StatementAdapter.evaluate(StatementAdapter.java:36)
	at org.apache.lucene.util.TestRuleStoreClassName$1.evaluate(TestRuleStoreClassName.java:42)
	at com.carrotsearch.randomizedtesting.rules.NoShadowingOrOverridesOnMethodsRule$1.evaluate(NoShadowingOrOverridesOnMethodsRule.java:39)
	at com.carrotsearch.randomizedtesting.rules.NoShadowingOrOverridesOnMethodsRule$1.evaluate(NoShadowingOrOverridesOnMethodsRule.java:39)
	at com.carrotsearch.randomizedtesting.rules.StatementAdapter.evaluate(StatementAdapter.java:36)
	at com.carrotsearch.randomizedtesting.rules.StatementAdapter.evaluate(StatementAdapter.java:36)
	at com.carrotsearch.randomizedtesting.rules.StatementAdapter.evaluate(StatementAdapter.java:36)
	at org.apache.lucene.util.TestRuleAssertionsRequired$1.evaluate(TestRuleAssertionsRequired.java:54)
	at org.apache.lucene.util.TestRuleMarkFailure$1.evaluate(TestRuleMarkFailure.java:48)
	at org.apache.lucene.util.TestRuleIgnoreAfterMaxFailures$1.evaluate(TestRuleIgnoreAfterMaxFailures.java:65)
	at org.apache.lucene.util.TestRuleIgnoreTestSuites$1.evaluate(TestRuleIgnoreTestSuites.java:55)
	at com.carrotsearch.randomizedtesting.rules.StatementAdapter.evaluate(StatementAdapter.java:36)
	at com.carrotsearch.randomizedtesting.ThreadLeakControl$StatementRunner.run(ThreadLeakControl.java:365)
	at java.lang.Thread.run(Thread.java:745)


FAILED:  junit.framework.TestSuite.org.apache.solr.cloud.HttpPartitionTest

Error Message:
ObjectTracker found 1 object(s) that were not released!!! [TransactionLog]

Stack Trace:
java.lang.AssertionError: ObjectTracker found 1 object(s) that were not released!!! [TransactionLog]
	at __randomizedtesting.SeedInfo.seed([B16B7B33D9E4BEA1]:0)
	at org.junit.Assert.fail(Assert.java:93)
	at org.junit.Assert.assertTrue(Assert.java:43)
	at org.junit.Assert.assertNull(Assert.java:551)
	at org.apache.solr.SolrTestCaseJ4.afterClass(SolrTestCaseJ4.java:236)
	at sun.reflect.GeneratedMethodAccessor31.invoke(Unknown Source)
	at sun.reflect.DelegatingMethodAccessorImpl.invoke(DelegatingMethodAccessorImpl.java:43)
	at java.lang.reflect.Method.invoke(Method.java:497)
	at com.carrotsearch.randomizedtesting.RandomizedRunner.invoke(RandomizedRunner.java:1627)
	at com.carrotsearch.randomizedtesting.RandomizedRunner$5.evaluate(RandomizedRunner.java:799)
	at com.carrotsearch.randomizedtesting.rules.StatementAdapter.evaluate(StatementAdapter.java:36)
	at com.carrotsearch.randomizedtesting.rules.SystemPropertiesRestoreRule$1.evaluate(SystemPropertiesRestoreRule.java:57)
	at org.apache.lucene.util.AbstractBeforeAfterRule$1.evaluate(AbstractBeforeAfterRule.java:46)
	at com.carrotsearch.randomizedtesting.rules.StatementAdapter.evaluate(StatementAdapter.java:36)
	at org.apache.lucene.util.TestRuleStoreClassName$1.evaluate(TestRuleStoreClassName.java:42)
	at com.carrotsearch.randomizedtesting.rules.NoShadowingOrOverridesOnMethodsRule$1.evaluate(NoShadowingOrOverridesOnMethodsRule.java:39)
	at com.carrotsearch.randomizedtesting.rules.NoShadowingOrOverridesOnMethodsRule$1.evaluate(NoShadowingOrOverridesOnMethodsRule.java:39)
	at com.carrotsearch.randomizedtesting.rules.StatementAdapter.evaluate(StatementAdapter.java:36)
	at com.carrotsearch.randomizedtesting.rules.StatementAdapter.evaluate(StatementAdapter.java:36)
	at com.carrotsearch.randomizedtesting.rules.StatementAdapter.evaluate(StatementAdapter.java:36)
	at org.apache.lucene.util.TestRuleAssertionsRequired$1.evaluate(TestRuleAssertionsRequired.java:54)
	at org.apache.lucene.util.TestRuleMarkFailure$1.evaluate(TestRuleMarkFailure.java:48)
	at org.apache.lucene.util.TestRuleIgnoreAfterMaxFailures$1.evaluate(TestRuleIgnoreAfterMaxFailures.java:65)
	at org.apache.lucene.util.TestRuleIgnoreTestSuites$1.evaluate(TestRuleIgnoreTestSuites.java:55)
	at com.carrotsearch.randomizedtesting.rules.StatementAdapter.evaluate(StatementAdapter.java:36)
	at com.carrotsearch.randomizedtesting.ThreadLeakControl$StatementRunner.run(ThreadLeakControl.java:365)
	at java.lang.Thread.run(Thread.java:745)




Build Log:
[...truncated 9709 lines...]
   [junit4] Suite: org.apache.solr.cloud.HttpPartitionTest
   [junit4]   2> Creating dataDir: /Users/jenkins/workspace/Lucene-Solr-trunk-MacOSX/solr/build/solr-core/test/J0/temp/solr.cloud.HttpPartitionTest_B16B7B33D9E4BEA1-001/init-core-data-001
   [junit4]   2> 491666 INFO  (SUITE-HttpPartitionTest-seed#[B16B7B33D9E4BEA1]-worker) [    ] o.a.s.BaseDistributedSearchTestCase Setting hostContext system property: /
   [junit4]   2> 491668 INFO  (TEST-HttpPartitionTest.test-seed#[B16B7B33D9E4BEA1]) [    ] o.a.s.c.ZkTestServer STARTING ZK TEST SERVER
   [junit4]   2> 491669 INFO  (Thread-1276) [    ] o.a.s.c.ZkTestServer client port:0.0.0.0/0.0.0.0:0
   [junit4]   2> 491669 INFO  (Thread-1276) [    ] o.a.s.c.ZkTestServer Starting server
   [junit4]   2> 491770 INFO  (TEST-HttpPartitionTest.test-seed#[B16B7B33D9E4BEA1]) [    ] o.a.s.c.ZkTestServer start zk server on port:56442
   [junit4]   2> 491770 INFO  (TEST-HttpPartitionTest.test-seed#[B16B7B33D9E4BEA1]) [    ] o.a.s.c.c.SolrZkClient Using default ZkCredentialsProvider
   [junit4]   2> 491771 INFO  (TEST-HttpPartitionTest.test-seed#[B16B7B33D9E4BEA1]) [    ] o.a.s.c.c.ConnectionManager Waiting for client to connect to ZooKeeper
   [junit4]   2> 491778 INFO  (zkCallback-518-thread-1) [    ] o.a.s.c.c.ConnectionManager Watcher org.apache.solr.common.cloud.ConnectionManager@69b2e7a6 name:ZooKeeperConnection Watcher:127.0.0.1:56442 got event WatchedEvent state:SyncConnected type:None path:null path:null type:None
   [junit4]   2> 491778 INFO  (TEST-HttpPartitionTest.test-seed#[B16B7B33D9E4BEA1]) [    ] o.a.s.c.c.ConnectionManager Client is connected to ZooKeeper
   [junit4]   2> 491778 INFO  (TEST-HttpPartitionTest.test-seed#[B16B7B33D9E4BEA1]) [    ] o.a.s.c.c.SolrZkClient Using default ZkACLProvider
   [junit4]   2> 491779 INFO  (TEST-HttpPartitionTest.test-seed#[B16B7B33D9E4BEA1]) [    ] o.a.s.c.c.SolrZkClient makePath: /solr
   [junit4]   2> 491782 INFO  (TEST-HttpPartitionTest.test-seed#[B16B7B33D9E4BEA1]) [    ] o.a.s.c.c.SolrZkClient Using default ZkCredentialsProvider
   [junit4]   2> 491784 INFO  (TEST-HttpPartitionTest.test-seed#[B16B7B33D9E4BEA1]) [    ] o.a.s.c.c.ConnectionManager Waiting for client to connect to ZooKeeper
   [junit4]   2> 491785 INFO  (zkCallback-519-thread-1) [    ] o.a.s.c.c.ConnectionManager Watcher org.apache.solr.common.cloud.ConnectionManager@6916f7e9 name:ZooKeeperConnection Watcher:127.0.0.1:56442/solr got event WatchedEvent state:SyncConnected type:None path:null path:null type:None
   [junit4]   2> 491786 INFO  (TEST-HttpPartitionTest.test-seed#[B16B7B33D9E4BEA1]) [    ] o.a.s.c.c.ConnectionManager Client is connected to ZooKeeper
   [junit4]   2> 491786 INFO  (TEST-HttpPartitionTest.test-seed#[B16B7B33D9E4BEA1]) [    ] o.a.s.c.c.SolrZkClient Using default ZkACLProvider
   [junit4]   2> 491786 INFO  (TEST-HttpPartitionTest.test-seed#[B16B7B33D9E4BEA1]) [    ] o.a.s.c.c.SolrZkClient makePath: /collections/collection1
   [junit4]   2> 491789 INFO  (TEST-HttpPartitionTest.test-seed#[B16B7B33D9E4BEA1]) [    ] o.a.s.c.c.SolrZkClient makePath: /collections/collection1/shards
   [junit4]   2> 491791 INFO  (TEST-HttpPartitionTest.test-seed#[B16B7B33D9E4BEA1]) [    ] o.a.s.c.c.SolrZkClient makePath: /collections/control_collection
   [junit4]   2> 491794 INFO  (TEST-HttpPartitionTest.test-seed#[B16B7B33D9E4BEA1]) [    ] o.a.s.c.c.SolrZkClient makePath: /collections/control_collection/shards
   [junit4]   2> 491797 INFO  (TEST-HttpPartitionTest.test-seed#[B16B7B33D9E4BEA1]) [    ] o.a.s.c.AbstractZkTestCase put /Users/jenkins/workspace/Lucene-Solr-trunk-MacOSX/solr/core/src/test-files/solr/collection1/conf/solrconfig-tlog.xml to /configs/conf1/solrconfig.xml
   [junit4]   2> 491797 INFO  (TEST-HttpPartitionTest.test-seed#[B16B7B33D9E4BEA1]) [    ] o.a.s.c.c.SolrZkClient makePath: /configs/conf1/solrconfig.xml
   [junit4]   2> 491810 INFO  (TEST-HttpPartitionTest.test-seed#[B16B7B33D9E4BEA1]) [    ] o.a.s.c.AbstractZkTestCase put /Users/jenkins/workspace/Lucene-Solr-trunk-MacOSX/solr/core/src/test-files/solr/collection1/conf/schema.xml to /configs/conf1/schema.xml
   [junit4]   2> 491810 INFO  (TEST-HttpPartitionTest.test-seed#[B16B7B33D9E4BEA1]) [    ] o.a.s.c.c.SolrZkClient makePath: /configs/conf1/schema.xml
   [junit4]   2> 491814 INFO  (TEST-HttpPartitionTest.test-seed#[B16B7B33D9E4BEA1]) [    ] o.a.s.c.AbstractZkTestCase put /Users/jenkins/workspace/Lucene-Solr-trunk-MacOSX/solr/core/src/test-files/solr/collection1/conf/solrconfig.snippet.randomindexconfig.xml to /configs/conf1/solrconfig.snippet.randomindexconfig.xml
   [junit4]   2> 491814 INFO  (TEST-HttpPartitionTest.test-seed#[B16B7B33D9E4BEA1]) [    ] o.a.s.c.c.SolrZkClient makePath: /configs/conf1/solrconfig.snippet.randomindexconfig.xml
   [junit4]   2> 491817 INFO  (TEST-HttpPartitionTest.test-seed#[B16B7B33D9E4BEA1]) [    ] o.a.s.c.AbstractZkTestCase put /Users/jenkins/workspace/Lucene-Solr-trunk-MacOSX/solr/core/src/test-files/solr/collection1/conf/stopwords.txt to /configs/conf1/stopwords.txt
   [junit4]   2> 491817 INFO  (TEST-HttpPartitionTest.test-seed#[B16B7B33D9E4BEA1]) [    ] o.a.s.c.c.SolrZkClient makePath: /configs/conf1/stopwords.txt
   [junit4]   2> 491819 INFO  (TEST-HttpPartitionTest.test-seed#[B16B7B33D9E4BEA1]) [    ] o.a.s.c.AbstractZkTestCase put /Users/jenkins/workspace/Lucene-Solr-trunk-MacOSX/solr/core/src/test-files/solr/collection1/conf/protwords.txt to /configs/conf1/protwords.txt
   [junit4]   2> 491820 INFO  (TEST-HttpPartitionTest.test-seed#[B16B7B33D9E4BEA1]) [    ] o.a.s.c.c.SolrZkClient makePath: /configs/conf1/protwords.txt
   [junit4]   2> 491822 INFO  (TEST-HttpPartitionTest.test-seed#[B16B7B33D9E4BEA1]) [    ] o.a.s.c.AbstractZkTestCase put /Users/jenkins/workspace/Lucene-Solr-trunk-MacOSX/solr/core/src/test-files/solr/collection1/conf/currency.xml to /configs/conf1/currency.xml
   [junit4]   2> 491822 INFO  (TEST-HttpPartitionTest.test-seed#[B16B7B33D9E4BEA1]) [    ] o.a.s.c.c.SolrZkClient makePath: /configs/conf1/currency.xml
   [junit4]   2> 491825 INFO  (TEST-HttpPartitionTest.test-seed#[B16B7B33D9E4BEA1]) [    ] o.a.s.c.AbstractZkTestCase put /Users/jenkins/workspace/Lucene-Solr-trunk-MacOSX/solr/core/src/test-files/solr/collection1/conf/enumsConfig.xml to /configs/conf1/enumsConfig.xml
   [junit4]   2> 491825 INFO  (TEST-HttpPartitionTest.test-seed#[B16B7B33D9E4BEA1]) [    ] o.a.s.c.c.SolrZkClient makePath: /configs/conf1/enumsConfig.xml
   [junit4]   2> 491827 INFO  (TEST-HttpPartitionTest.test-seed#[B16B7B33D9E4BEA1]) [    ] o.a.s.c.AbstractZkTestCase put /Users/jenkins/workspace/Lucene-Solr-trunk-MacOSX/solr/core/src/test-files/solr/collection1/conf/open-exchange-rates.json to /configs/conf1/open-exchange-rates.json
   [junit4]   2> 491827 INFO  (TEST-HttpPartitionTest.test-seed#[B16B7B33D9E4BEA1]) [    ] o.a.s.c.c.SolrZkClient makePath: /configs/conf1/open-exchange-rates.json
   [junit4]   2> 491830 INFO  (TEST-HttpPartitionTest.test-seed#[B16B7B33D9E4BEA1]) [    ] o.a.s.c.AbstractZkTestCase put /Users/jenkins/workspace/Lucene-Solr-trunk-MacOSX/solr/core/src/test-files/solr/collection1/conf/mapping-ISOLatin1Accent.txt to /configs/conf1/mapping-ISOLatin1Accent.txt
   [junit4]   2> 491830 INFO  (TEST-HttpPartitionTest.test-seed#[B16B7B33D9E4BEA1]) [    ] o.a.s.c.c.SolrZkClient makePath: /configs/conf1/mapping-ISOLatin1Accent.txt
   [junit4]   2> 491833 INFO  (TEST-HttpPartitionTest.test-seed#[B16B7B33D9E4BEA1]) [    ] o.a.s.c.AbstractZkTestCase put /Users/jenkins/workspace/Lucene-Solr-trunk-MacOSX/solr/core/src/test-files/solr/collection1/conf/old_synonyms.txt to /configs/conf1/old_synonyms.txt
   [junit4]   2> 491833 INFO  (TEST-HttpPartitionTest.test-seed#[B16B7B33D9E4BEA1]) [    ] o.a.s.c.c.SolrZkClient makePath: /configs/conf1/old_synonyms.txt
   [junit4]   2> 491835 INFO  (TEST-HttpPartitionTest.test-seed#[B16B7B33D9E4BEA1]) [    ] o.a.s.c.AbstractZkTestCase put /Users/jenkins/workspace/Lucene-Solr-trunk-MacOSX/solr/core/src/test-files/solr/collection1/conf/synonyms.txt to /configs/conf1/synonyms.txt
   [junit4]   2> 491835 INFO  (TEST-HttpPartitionTest.test-seed#[B16B7B33D9E4BEA1]) [    ] o.a.s.c.c.SolrZkClient makePath: /configs/conf1/synonyms.txt
   [junit4]   2> 492129 INFO  (TEST-HttpPartitionTest.test-seed#[B16B7B33D9E4BEA1]) [    ] o.a.s.SolrTestCaseJ4 Writing core.properties file to /Users/jenkins/workspace/Lucene-Solr-trunk-MacOSX/solr/build/solr-core/test/J0/temp/solr.cloud.HttpPartitionTest_B16B7B33D9E4BEA1-001/control-001/cores/collection1
   [junit4]   2> 492133 INFO  (TEST-HttpPartitionTest.test-seed#[B16B7B33D9E4BEA1]) [    ] o.e.j.s.Server jetty-9.2.11.v20150529
   [junit4]   2> 492136 INFO  (TEST-HttpPartitionTest.test-seed#[B16B7B33D9E4BEA1]) [    ] o.e.j.s.h.ContextHandler Started o.e.j.s.ServletContextHandler@34009b8a{/,null,AVAILABLE}
   [junit4]   2> 492137 INFO  (TEST-HttpPartitionTest.test-seed#[B16B7B33D9E4BEA1]) [    ] o.e.j.s.ServerConnector Started ServerConnector@66340b09{HTTP/1.1}{127.0.0.1:56446}
   [junit4]   2> 492137 INFO  (TEST-HttpPartitionTest.test-seed#[B16B7B33D9E4BEA1]) [    ] o.e.j.s.Server Started @496185ms
   [junit4]   2> 492137 INFO  (TEST-HttpPartitionTest.test-seed#[B16B7B33D9E4BEA1]) [    ] o.a.s.c.s.e.JettySolrRunner Jetty properties: {solr.data.dir=/Users/jenkins/workspace/Lucene-Solr-trunk-MacOSX/solr/build/solr-core/test/J0/temp/solr.cloud.HttpPartitionTest_B16B7B33D9E4BEA1-001/tempDir-001/control/data, hostContext=/, hostPort=56445, coreRootDirectory=/Users/jenkins/workspace/Lucene-Solr-trunk-MacOSX/solr/build/solr-core/test/J0/temp/solr.cloud.HttpPartitionTest_B16B7B33D9E4BEA1-001/control-001/cores}
   [junit4]   2> 492138 INFO  (TEST-HttpPartitionTest.test-seed#[B16B7B33D9E4BEA1]) [    ] o.a.s.s.SolrDispatchFilter SolrDispatchFilter.init(): sun.misc.Launcher$AppClassLoader@74a14482
   [junit4]   2> 492138 INFO  (TEST-HttpPartitionTest.test-seed#[B16B7B33D9E4BEA1]) [    ] o.a.s.c.SolrResourceLoader new SolrResourceLoader for directory: '/Users/jenkins/workspace/Lucene-Solr-trunk-MacOSX/solr/build/solr-core/test/J0/temp/solr.cloud.HttpPartitionTest_B16B7B33D9E4BEA1-001/control-001/'
   [junit4]   2> 492161 INFO  (TEST-HttpPartitionTest.test-seed#[B16B7B33D9E4BEA1]) [    ] o.a.s.c.c.SolrZkClient Using default ZkCredentialsProvider
   [junit4]   2> 492163 INFO  (TEST-HttpPartitionTest.test-seed#[B16B7B33D9E4BEA1]) [    ] o.a.s.c.c.ConnectionManager Waiting for client to connect to ZooKeeper
   [junit4]   2> 492164 INFO  (zkCallback-520-thread-1) [    ] o.a.s.c.c.ConnectionManager Watcher org.apache.solr.common.cloud.ConnectionManager@303ec049 name:ZooKeeperConnection Watcher:127.0.0.1:56442/solr got event WatchedEvent state:SyncConnected type:None path:null path:null type:None
   [junit4]   2> 492164 INFO  (TEST-HttpPartitionTest.test-seed#[B16B7B33D9E4BEA1]) [    ] o.a.s.c.c.ConnectionManager Client is connected to ZooKeeper
   [junit4]   2> 492164 INFO  (TEST-HttpPartitionTest.test-seed#[B16B7B33D9E4BEA1]) [    ] o.a.s.c.c.SolrZkClient Using default ZkACLProvider
   [junit4]   2> 492166 INFO  (TEST-HttpPartitionTest.test-seed#[B16B7B33D9E4BEA1]) [    ] o.a.s.s.SolrDispatchFilter Loading solr.xml from SolrHome (not found in ZooKeeper)
   [junit4]   2> 492166 INFO  (TEST-HttpPartitionTest.test-seed#[B16B7B33D9E4BEA1]) [    ] o.a.s.c.SolrXmlConfig Loading container configuration from /Users/jenkins/workspace/Lucene-Solr-trunk-MacOSX/solr/build/solr-core/test/J0/temp/solr.cloud.HttpPartitionTest_B16B7B33D9E4BEA1-001/control-001/solr.xml
   [junit4]   2> 492175 INFO  (TEST-HttpPartitionTest.test-seed#[B16B7B33D9E4BEA1]) [    ] o.a.s.c.CoresLocator Config-defined core root directory: /Users/jenkins/workspace/Lucene-Solr-trunk-MacOSX/solr/build/solr-core/test/J0/temp/solr.cloud.HttpPartitionTest_B16B7B33D9E4BEA1-001/control-001/cores
   [junit4]   2> 492175 INFO  (TEST-HttpPartitionTest.test-seed#[B16B7B33D9E4BEA1]) [    ] o.a.s.c.CoreContainer New CoreContainer 1439859647
   [junit4]   2> 492175 INFO  (TEST-HttpPartitionTest.test-seed#[B16B7B33D9E4BEA1]) [    ] o.a.s.c.CoreContainer Loading cores into CoreContainer [instanceDir=/Users/jenkins/workspace/Lucene-Solr-trunk-MacOSX/solr/build/solr-core/test/J0/temp/solr.cloud.HttpPartitionTest_B16B7B33D9E4BEA1-001/control-001/]
   [junit4]   2> 492175 INFO  (TEST-HttpPartitionTest.test-seed#[B16B7B33D9E4BEA1]) [    ] o.a.s.c.CoreContainer loading shared library: /Users/jenkins/workspace/Lucene-Solr-trunk-MacOSX/solr/build/solr-core/test/J0/temp/solr.cloud.HttpPartitionTest_B16B7B33D9E4BEA1-001/control-001/lib
   [junit4]   2> 492176 WARN  (TEST-HttpPartitionTest.test-seed#[B16B7B33D9E4BEA1]) [    ] o.a.s.c.SolrResourceLoader Can't find (or read) directory to add to classloader: lib (resolved as: /Users/jenkins/workspace/Lucene-Solr-trunk-MacOSX/solr/build/solr-core/test/J0/temp/solr.cloud.HttpPartitionTest_B16B7B33D9E4BEA1-001/control-001/lib).
   [junit4]   2> 492183 INFO  (TEST-HttpPartitionTest.test-seed#[B16B7B33D9E4BEA1]) [    ] o.a.s.h.c.HttpShardHandlerFactory created with socketTimeout : 90000,urlScheme : ,connTimeout : 15000,maxConnectionsPerHost : 20,maxConnections : 10000,corePoolSize : 0,maximumPoolSize : 2147483647,maxThreadIdleTime : 5,sizeOfQueue : -1,fairnessPolicy : false,useRetries : false,
   [junit4]   2> 492186 INFO  (TEST-HttpPartitionTest.test-seed#[B16B7B33D9E4BEA1]) [    ] o.a.s.u.UpdateShardHandler Creating UpdateShardHandler HTTP client with params: socketTimeout=340000&connTimeout=45000&retry=true
   [junit4]   2> 492186 INFO  (TEST-HttpPartitionTest.test-seed#[B16B7B33D9E4BEA1]) [    ] o.a.s.l.LogWatcher SLF4J impl is org.slf4j.impl.Log4jLoggerFactory
   [junit4]   2> 492186 INFO  (TEST-HttpPartitionTest.test-seed#[B16B7B33D9E4BEA1]) [    ] o.a.s.l.LogWatcher Registering Log Listener [Log4j (org.slf4j.impl.Log4jLoggerFactory)]
   [junit4]   2> 492187 INFO  (TEST-HttpPartitionTest.test-seed#[B16B7B33D9E4BEA1]) [    ] o.a.s.c.ZkContainer Zookeeper client=127.0.0.1:56442/solr
   [junit4]   2> 492187 INFO  (TEST-HttpPartitionTest.test-seed#[B16B7B33D9E4BEA1]) [    ] o.a.s.c.ZkController zkHost includes chroot
   [junit4]   2> 492187 INFO  (TEST-HttpPartitionTest.test-seed#[B16B7B33D9E4BEA1]) [    ] o.a.s.c.c.SolrZkClient Using default ZkCredentialsProvider
   [junit4]   2> 492188 INFO  (TEST-HttpPartitionTest.test-seed#[B16B7B33D9E4BEA1]) [    ] o.a.s.c.c.ConnectionManager Waiting for client to connect to ZooKeeper
   [junit4]   2> 492190 INFO  (zkCallback-522-thread-1) [    ] o.a.s.c.c.ConnectionManager Watcher org.apache.solr.common.cloud.ConnectionManager@40a22ad2 name:ZooKeeperConnection Watcher:127.0.0.1:56442 got event WatchedEvent state:SyncConnected type:None path:null path:null type:None
   [junit4]   2> 492190 INFO  (TEST-HttpPartitionTest.test-seed#[B16B7B33D9E4BEA1]) [    ] o.a.s.c.c.ConnectionManager Client is connected to ZooKeeper
   [junit4]   2> 492190 INFO  (TEST-HttpPartitionTest.test-seed#[B16B7B33D9E4BEA1]) [    ] o.a.s.c.c.SolrZkClient Using default ZkACLProvider
   [junit4]   2> 492200 INFO  (TEST-HttpPartitionTest.test-seed#[B16B7B33D9E4BEA1]) [n:127.0.0.1:56445_    ] o.a.s.c.c.ConnectionManager Waiting for client to connect to ZooKeeper
   [junit4]   2> 492203 INFO  (zkCallback-523-thread-1-processing-n:127.0.0.1:56445_) [n:127.0.0.1:56445_    ] o.a.s.c.c.ConnectionManager Watcher org.apache.solr.common.cloud.ConnectionManager@5257badd name:ZooKeeperConnection Watcher:127.0.0.1:56442/solr got event WatchedEvent state:SyncConnected type:None path:null path:null type:None
   [junit4]   2> 492203 INFO  (TEST-HttpPartitionTest.test-seed#[B16B7B33D9E4BEA1]) [n:127.0.0.1:56445_    ] o.a.s.c.c.ConnectionManager Client is connected to ZooKeeper
   [junit4]   2> 492208 INFO  (TEST-HttpPartitionTest.test-seed#[B16B7B33D9E4BEA1]) [n:127.0.0.1:56445_    ] o.a.s.c.c.SolrZkClient makePath: /overseer/queue
   [junit4]   2> 492214 INFO  (TEST-HttpPartitionTest.test-seed#[B16B7B33D9E4BEA1]) [n:127.0.0.1:56445_    ] o.a.s.c.c.SolrZkClient makePath: /overseer/collection-queue-work
   [junit4]   2> 492219 INFO  (TEST-HttpPartitionTest.test-seed#[B16B7B33D9E4BEA1]) [n:127.0.0.1:56445_    ] o.a.s.c.c.SolrZkClient makePath: /overseer/collection-map-running
   [junit4]   2> 492223 INFO  (TEST-HttpPartitionTest.test-seed#[B16B7B33D9E4BEA1]) [n:127.0.0.1:56445_    ] o.a.s.c.c.SolrZkClient makePath: /overseer/collection-map-completed
   [junit4]   2> 492227 INFO  (TEST-HttpPartitionTest.test-seed#[B16B7B33D9E4BEA1]) [n:127.0.0.1:56445_    ] o.a.s.c.c.SolrZkClient makePath: /overseer/collection-map-failure
   [junit4]   2> 492231 INFO  (TEST-HttpPartitionTest.test-seed#[B16B7B33D9E4BEA1]) [n:127.0.0.1:56445_    ] o.a.s.c.c.SolrZkClient makePath: /live_nodes
   [junit4]   2> 492233 INFO  (TEST-HttpPartitionTest.test-seed#[B16B7B33D9E4BEA1]) [n:127.0.0.1:56445_    ] o.a.s.c.c.SolrZkClient makePath: /aliases.json
   [junit4]   2> 492235 INFO  (TEST-HttpPartitionTest.test-seed#[B16B7B33D9E4BEA1]) [n:127.0.0.1:56445_    ] o.a.s.c.c.SolrZkClient makePath: /clusterstate.json
   [junit4]   2> 492238 INFO  (TEST-HttpPartitionTest.test-seed#[B16B7B33D9E4BEA1]) [n:127.0.0.1:56445_    ] o.a.s.c.c.SolrZkClient makePath: /security.json
   [junit4]   2> 492239 INFO  (TEST-HttpPartitionTest.test-seed#[B16B7B33D9E4BEA1]) [n:127.0.0.1:56445_    ] o.a.s.c.ZkController Register node as live in ZooKeeper:/live_nodes/127.0.0.1:56445_
   [junit4]   2> 492240 INFO  (TEST-HttpPartitionTest.test-seed#[B16B7B33D9E4BEA1]) [n:127.0.0.1:56445_    ] o.a.s.c.c.SolrZkClient makePath: /live_nodes/127.0.0.1:56445_
   [junit4]   2> 492243 INFO  (TEST-HttpPartitionTest.test-seed#[B16B7B33D9E4BEA1]) [n:127.0.0.1:56445_    ] o.a.s.c.c.SolrZkClient makePath: /overseer_elect
   [junit4]   2> 492244 INFO  (TEST-HttpPartitionTest.test-seed#[B16B7B33D9E4BEA1]) [n:127.0.0.1:56445_    ] o.a.s.c.c.SolrZkClient makePath: /overseer_elect/election
   [junit4]   2> 492246 INFO  (TEST-HttpPartitionTest.test-seed#[B16B7B33D9E4BEA1]) [n:127.0.0.1:56445_    ] o.a.s.c.Overseer Overseer (id=null) closing
   [junit4]   2> 492247 INFO  (TEST-HttpPartitionTest.test-seed#[B16B7B33D9E4BEA1]) [n:127.0.0.1:56445_    ] o.a.s.c.LeaderElector Joined leadership election with path: /overseer_elect/election/94361128508129284-127.0.0.1:56445_-n_0000000000
   [junit4]   2> 492248 INFO  (TEST-HttpPartitionTest.test-seed#[B16B7B33D9E4BEA1]) [n:127.0.0.1:56445_    ] o.a.s.c.OverseerElectionContext I am going to be the leader 127.0.0.1:56445_
   [junit4]   2> 492248 INFO  (TEST-HttpPartitionTest.test-seed#[B16B7B33D9E4BEA1]) [n:127.0.0.1:56445_    ] o.a.s.c.c.SolrZkClient makePath: /overseer_elect/leader
   [junit4]   2> 492250 INFO  (TEST-HttpPartitionTest.test-seed#[B16B7B33D9E4BEA1]) [n:127.0.0.1:56445_    ] o.a.s.c.Overseer Overseer (id=94361128508129284-127.0.0.1:56445_-n_0000000000) starting
   [junit4]   2> 492253 INFO  (TEST-HttpPartitionTest.test-seed#[B16B7B33D9E4BEA1]) [n:127.0.0.1:56445_    ] o.a.s.c.c.SolrZkClient makePath: /overseer/queue-work
   [junit4]   2> 492261 INFO  (TEST-HttpPartitionTest.test-seed#[B16B7B33D9E4BEA1]) [n:127.0.0.1:56445_    ] o.a.s.c.OverseerAutoReplicaFailoverThread Starting OverseerAutoReplicaFailoverThread autoReplicaFailoverWorkLoopDelay=10000 autoReplicaFailoverWaitAfterExpiration=30000 autoReplicaFailoverBadNodeExpiration=60000
   [junit4]   2> 492263 INFO  (OverseerCollectionProcessor-94361128508129284-127.0.0.1:56445_-n_0000000000) [n:127.0.0.1:56445_    ] o.a.s.c.OverseerProcessor Process current queue of overseer operations
   [junit4]   2> 492264 INFO  (TEST-HttpPartitionTest.test-seed#[B16B7B33D9E4BEA1]) [n:127.0.0.1:56445_    ] o.a.s.c.c.ZkStateReader Updating cluster state from ZooKeeper... 
   [junit4]   2> 492264 INFO  (OverseerStateUpdate-94361128508129284-127.0.0.1:56445_-n_0000000000) [n:127.0.0.1:56445_    ] o.a.s.c.Overseer Starting to work on the main queue
   [junit4]   2> 492281 INFO  (TEST-HttpPartitionTest.test-seed#[B16B7B33D9E4BEA1]) [n:127.0.0.1:56445_    ] o.a.s.c.CoreContainer Security conf doesn't exist. Skipping setup for authorization module.
   [junit4]   2> 492281 INFO  (TEST-HttpPartitionTest.test-seed#[B16B7B33D9E4BEA1]) [n:127.0.0.1:56445_    ] o.a.s.c.CoreContainer No authentication plugin used.
   [junit4]   2> 492281 INFO  (TEST-HttpPartitionTest.test-seed#[B16B7B33D9E4BEA1]) [n:127.0.0.1:56445_    ] o.a.s.c.CoresLocator Looking for core definitions underneath /Users/jenkins/workspace/Lucene-Solr-trunk-MacOSX/solr/build/solr-core/test/J0/temp/solr.cloud.HttpPartitionTest_B16B7B33D9E4BEA1-001/control-001/cores
   [junit4]   2> 492283 INFO  (TEST-HttpPartitionTest.test-seed#[B16B7B33D9E4BEA1]) [n:127.0.0.1:56445_    ] o.a.s.c.SolrCore Created CoreDescriptor: {name=collection1, config=solrconfig.xml, transient=false, schema=schema.xml, loadOnStartup=true, configSetProperties=configsetprops.json, instanceDir=/Users/jenkins/workspace/Lucene-Solr-trunk-MacOSX/solr/build/solr-core/test/J0/temp/solr.cloud.HttpPartitionTest_B16B7B33D9E4BEA1-001/control-001/cores/collection1, collection=control_collection, absoluteInstDir=/Users/jenkins/workspace/Lucene-Solr-trunk-MacOSX/solr/build/solr-core/test/J0/temp/solr.cloud.HttpPartitionTest_B16B7B33D9E4BEA1-001/control-001/cores/collection1/, coreNodeName=, dataDir=data/, shard=}
   [junit4]   2> 492283 INFO  (TEST-HttpPartitionTest.test-seed#[B16B7B33D9E4BEA1]) [n:127.0.0.1:56445_    ] o.a.s.c.CoresLocator Found core collection1 in /Users/jenkins/workspace/Lucene-Solr-trunk-MacOSX/solr/build/solr-core/test/J0/temp/solr.cloud.HttpPartitionTest_B16B7B33D9E4BEA1-001/control-001/cores/collection1/
   [junit4]   2> 492283 INFO  (TEST-HttpPartitionTest.test-seed#[B16B7B33D9E4BEA1]) [n:127.0.0.1:56445_    ] o.a.s.c.CoresLocator Found 1 core definitions
   [junit4]   2> 492286 INFO  (coreLoadExecutor-1805-thread-1-processing-n:127.0.0.1:56445_) [n:127.0.0.1:56445_ c:control_collection   x:collection1] o.a.s.c.ZkController publishing state=down
   [junit4]   2> 492286 INFO  (coreLoadExecutor-1805-thread-1-processing-n:127.0.0.1:56445_) [n:127.0.0.1:56445_ c:control_collection   x:collection1] o.a.s.c.ZkController numShards not found on descriptor - reading it from system property
   [junit4]   2> 492287 INFO  (coreLoadExecutor-1805-thread-1-processing-n:127.0.0.1:56445_) [n:127.0.0.1:56445_ c:control_collection   x:collection1] o.a.s.c.ZkController look for our core node name
   [junit4]   2> 492287 INFO  (TEST-HttpPartitionTest.test-seed#[B16B7B33D9E4BEA1]) [n:127.0.0.1:56445_    ] o.a.s.s.SolrDispatchFilter user.dir=/Users/jenkins/workspace/Lucene-Solr-trunk-MacOSX/solr/build/solr-core/test/J0
   [junit4]   2> 492287 INFO  (TEST-HttpPartitionTest.test-seed#[B16B7B33D9E4BEA1]) [n:127.0.0.1:56445_    ] o.a.s.s.SolrDispatchFilter SolrDispatchFilter.init() done
   [junit4]   2> 492290 INFO  (OverseerStateUpdate-94361128508129284-127.0.0.1:56445_-n_0000000000) [n:127.0.0.1:56445_    ] o.a.s.c.Overseer processMessage: queueSize: 1, message = {
   [junit4]   2>   "core":"collection1",
   [junit4]   2>   "roles":null,
   [junit4]   2>   "base_url":"http://127.0.0.1:56445",
   [junit4]   2>   "node_name":"127.0.0.1:56445_",
   [junit4]   2>   "numShards":"1",
   [junit4]   2>   "state":"down",
   [junit4]   2>   "shard":null,
   [junit4]   2>   "collection":"control_collection",
   [junit4]   2>   "operation":"state"} current state version: 0
   [junit4]   2> 492290 INFO  (OverseerStateUpdate-94361128508129284-127.0.0.1:56445_-n_0000000000) [n:127.0.0.1:56445_    ] o.a.s.c.o.ReplicaMutator Update state numShards=1 message={
   [junit4]   2>   "core":"collection1",
   [junit4]   2>   "roles":null,
   [junit4]   2>   "base_url":"http://127.0.0.1:56445",
   [junit4]   2>   "node_name":"127.0.0.1:56445_",
   [junit4]   2>   "numShards":"1",
   [junit4]   2>   "state":"down",
   [junit4]   2>   "shard":null,
   [junit4]   2>   "collection":"control_collection",
   [junit4]   2>   "operation":"state"}
   [junit4]   2> 492291 INFO  (OverseerStateUpdate-94361128508129284-127.0.0.1:56445_-n_0000000000) [n:127.0.0.1:56445_    ] o.a.s.c.o.ClusterStateMutator building a new cName: control_collection
   [junit4]   2> 492291 INFO  (OverseerStateUpdate-94361128508129284-127.0.0.1:56445_-n_0000000000) [n:127.0.0.1:56445_    ] o.a.s.c.o.ReplicaMutator Assigning new node to shard shard=shard1
   [junit4]   2> 492292 INFO  (zkCallback-523-thread-1-processing-n:127.0.0.1:56445_) [n:127.0.0.1:56445_    ] o.a.s.c.c.ZkStateReader A cluster state change: WatchedEvent state:SyncConnected type:NodeDataChanged path:/clusterstate.json, has occurred - updating... (live nodes size: 1)
   [junit4]   2> 492297 INFO  (zkCallback-523-thread-1-processing-n:127.0.0.1:56445_) [n:127.0.0.1:56445_    ] o.a.s.c.DistributedQueue NodeChildrenChanged fired on path /overseer/queue state SyncConnected
   [junit4]   2> 493288 INFO  (coreLoadExecutor-1805-thread-1-processing-n:127.0.0.1:56445_) [n:127.0.0.1:56445_ c:control_collection   x:collection1] o.a.s.c.ZkController waiting to find shard id in clusterstate for collection1
   [junit4]   2> 493289 INFO  (coreLoadExecutor-1805-thread-1-processing-n:127.0.0.1:56445_) [n:127.0.0.1:56445_ c:control_collection   x:collection1] o.a.s.c.ZkController Check for collection zkNode:control_collection
   [junit4]   2> 493289 INFO  (coreLoadExecutor-1805-thread-1-processing-n:127.0.0.1:56445_) [n:127.0.0.1:56445_ c:control_collection   x:collection1] o.a.s.c.ZkController Collection zkNode exists
   [junit4]   2> 493290 INFO  (coreLoadExecutor-1805-thread-1-processing-n:127.0.0.1:56445_) [n:127.0.0.1:56445_ c:control_collection   x:collection1] o.a.s.c.c.ZkStateReader Load collection config from:/collections/control_collection
   [junit4]   2> 493291 INFO  (coreLoadExecutor-1805-thread-1-processing-n:127.0.0.1:56445_) [n:127.0.0.1:56445_ c:control_collection   x:collection1] o.a.s.c.c.ZkStateReader path=/collections/control_collection configName=conf1 specified config exists in ZooKeeper
   [junit4]   2> 493291 INFO  (coreLoadExecutor-1805-thread-1-processing-n:127.0.0.1:56445_) [n:127.0.0.1:56445_ c:control_collection   x:collection1] o.a.s.c.SolrResourceLoader new SolrResourceLoader for directory: '/Users/jenkins/workspace/Lucene-Solr-trunk-MacOSX/solr/build/solr-core/test/J0/temp/solr.cloud.HttpPartitionTest_B16B7B33D9E4BEA1-001/control-001/cores/collection1/'
   [junit4]   2> 493305 INFO  (coreLoadExecutor-1805-thread-1-processing-n:127.0.0.1:56445_) [n:127.0.0.1:56445_ c:control_collection   x:collection1] o.a.s.c.Config loaded config solrconfig.xml with version 0 
   [junit4]   2> 493311 INFO  (coreLoadExecutor-1805-thread-1-processing-n:127.0.0.1:56445_) [n:127.0.0.1:56445_ c:control_collection   x:collection1] o.a.s.c.SolrConfig current version of requestparams : -1
   [junit4]   2> 493313 INFO  (coreLoadExecutor-1805-thread-1-processing-n:127.0.0.1:56445_) [n:127.0.0.1:56445_ c:control_collection   x:collection1] o.a.s.c.SolrConfig Using Lucene MatchVersion: 6.0.0
   [junit4]   2> 493327 INFO  (coreLoadExecutor-1805-thread-1-processing-n:127.0.0.1:56445_) [n:127.0.0.1:56445_ c:control_collection   x:collection1] o.a.s.c.Config Loaded SolrConfig: solrconfig.xml
   [junit4]   2> 493328 INFO  (coreLoadExecutor-1805-thread-1-processing-n:127.0.0.1:56445_) [n:127.0.0.1:56445_ c:control_collection   x:collection1] o.a.s.s.IndexSchema Reading Solr Schema from /configs/conf1/schema.xml
   [junit4]   2> 493332 INFO  (coreLoadExecutor-1805-thread-1-processing-n:127.0.0.1:56445_) [n:127.0.0.1:56445_ c:control_collection   x:collection1] o.a.s.s.IndexSchema [collection1] Schema name=test
   [junit4]   2> 493430 INFO  (coreLoadExecutor-1805-thread-1-processing-n:127.0.0.1:56445_) [n:127.0.0.1:56445_ c:control_collection   x:collection1] o.a.s.s.OpenExchangeRatesOrgProvider Initialized with rates=open-exchange-rates.json, refreshInterval=1440.
   [junit4]   2> 493437 INFO  (coreLoadExecutor-1805-thread-1-processing-n:127.0.0.1:56445_) [n:127.0.0.1:56445_ c:control_collection   x:collection1] o.a.s.s.IndexSchema default search field in schema is text
   [junit4]   2> 493438 INFO  (coreLoadExecutor-1805-thread-1-processing-n:127.0.0.1:56445_) [n:127.0.0.1:56445_ c:control_collection   x:collection1] o.a.s.s.IndexSchema unique key field: id
   [junit4]   2> 493482 INFO  (coreLoadExecutor-1805-thread-1-processing-n:127.0.0.1:56445_) [n:127.0.0.1:56445_ c:control_collection   x:collection1] o.a.s.s.FileExchangeRateProvider Reloading exchange rates from file currency.xml
   [junit4]   2> 493485 INFO  (coreLoadExecutor-1805-thread-1-processing-n:127.0.0.1:56445_) [n:127.0.0.1:56445_ c:control_collection   x:collection1] o.a.s.s.FileExchangeRateProvider Reloading exchange rates from file currency.xml
   [junit4]   2> 493488 INFO  (coreLoadExecutor-1805-thread-1-processing-n:127.0.0.1:56445_) [n:127.0.0.1:56445_ c:control_collection   x:collection1] o.a.s.s.OpenExchangeRatesOrgProvider Reloading exchange rates from open-exchange-rates.json
   [junit4]   2> 493490 WARN  (coreLoadExecutor-1805-thread-1-processing-n:127.0.0.1:56445_) [n:127.0.0.1:56445_ c:control_collection   x:collection1] o.a.s.s.OpenExchangeRatesOrgProvider Unknown key IMPORTANT NOTE
   [junit4]   2> 494265 WARN  (coreLoadExecutor-1805-thread-1-processing-n:127.0.0.1:56445_) [n:127.0.0.1:56445_ c:control_collection   x:collection1] o.a.s.s.OpenExchangeRatesOrgProvider Expected key, got STRING
   [junit4]   2> 494265 INFO  (coreLoadExecutor-1805-thread-1-processing-n:127.0.0.1:56445_) [n:127.0.0.1:56445_ c:control_collection   x:collection1] o.a.s.s.OpenExchangeRatesOrgProvider Reloading exchange rates from open-exchange-rates.json
   [junit4]   2> 494266 WARN  (coreLoadExecutor-1805-thread-1-processing-n:127.0.0.1:56445_) [n:127.0.0.1:56445_ c:control_collection   x:collection1] o.a.s.s.OpenExchangeRatesOrgProvider Unknown key IMPORTANT NOTE
   [junit4]   2> 494266 WARN  (coreLoadExecutor-1805-thread-1-processing-n:127.0.0.1:56445_) [n:127.0.0.1:56445_ c:control_collection   x:collection1] o.a.s.s.OpenExchangeRatesOrgProvider Expected key, got STRING
   [junit4]   2> 494269 INFO  (coreLoadExecutor-1805-thread-1-processing-n:127.0.0.1:56445_) [n:127.0.0.1:56445_ c:control_collection   x:collection1] o.a.s.c.ConfigSetProperties Did not find ConfigSet properties, assuming default properties: Can't find resource 'configsetprops.json' in classpath or '/configs/conf1', cwd=/Users/jenkins/workspace/Lucene-Solr-trunk-MacOSX/solr/build/solr-core/test/J0
   [junit4]   2> 494269 INFO  (coreLoadExecutor-1805-thread-1-processing-n:127.0.0.1:56445_) [n:127.0.0.1:56445_ c:control_collection   x:collection1] o.a.s.c.CoreContainer Creating SolrCore 'collection1' using configuration from collection control_collection
   [junit4]   2> 494269 INFO  (coreLoadExecutor-1805-thread-1-processing-n:127.0.0.1:56445_) [n:127.0.0.1:56445_ c:control_collection s:shard1 r:core_node1 x:collection1] o.a.s.c.SolrCore org.apache.solr.core.MockDirectoryFactory
   [junit4]   2> 494269 INFO  (coreLoadExecutor-1805-thread-1-processing-n:127.0.0.1:56445_) [n:127.0.0.1:56445_ c:control_collection s:shard1 r:core_node1 x:collection1] o.a.s.c.SolrCore [[collection1] ] Opening new SolrCore at [/Users/jenkins/workspace/Lucene-Solr-trunk-MacOSX/solr/build/solr-core/test/J0/temp/solr.cloud.HttpPartitionTest_B16B7B33D9E4BEA1-001/control-001/cores/collection1/], dataDir=[null]
   [junit4]   2> 494269 INFO  (coreLoadExecutor-1805-thread-1-processing-n:127.0.0.1:56445_) [n:127.0.0.1:56445_ c:control_collection s:shard1 r:core_node1 x:collection1] o.a.s.c.JmxMonitoredMap JMX monitoring is enabled. Adding Solr mbeans to JMX Server: com.sun.jmx.mbeanserver.JmxMBeanServer@3b09b5e2
   [junit4]   2> 494271 INFO  (coreLoadExecutor-1805-thread-1-processing-n:127.0.0.1:56445_) [n:127.0.0.1:56445_ c:control_collection s:shard1 r:core_node1 x:collection1] o.a.s.c.CachingDirectoryFactory return new directory for /Users/jenkins/workspace/Lucene-Solr-trunk-MacOSX/solr/build/solr-core/test/J0/temp/solr.cloud.HttpPartitionTest_B16B7B33D9E4BEA1-001/control-001/cores/collection1/data
   [junit4]   2> 494271 INFO  (coreLoadExecutor-1805-thread-1-processing-n:127.0.0.1:56445_) [n:127.0.0.1:56445_ c:control_collection s:shard1 r:core_node1 x:collection1] o.a.s.c.SolrCore New index directory detected: old=null new=/Users/jenkins/workspace/Lucene-Solr-trunk-MacOSX/solr/build/solr-core/test/J0/temp/solr.cloud.HttpPartitionTest_B16B7B33D9E4BEA1-001/control-001/cores/collection1/data/index/
   [junit4]   2> 494271 WARN  (coreLoadExecutor-1805-thread-1-processing-n:127.0.0.1:56445_) [n:127.0.0.1:56445_ c:control_collection s:shard1 r:core_node1 x:collection1] o.a.s.c.SolrCore [collection1] Solr index directory '/Users/jenkins/workspace/Lucene-Solr-trunk-MacOSX/solr/build/solr-core/test/J0/temp/solr.cloud.HttpPartitionTest_B16B7B33D9E4BEA1-001/control-001/cores/collection1/data/index' doesn't exist. Creating new index...
   [junit4]   2> 494272 INFO  (coreLoadExecutor-1805-thread-1-processing-n:127.0.0.1:56445_) [n:127.0.0.1:56445_ c:control_collection s:shard1 r:core_node1 x:collection1] o.a.s.c.CachingDirectoryFactory return new directory for /Users/jenkins/workspace/Lucene-Solr-trunk-MacOSX/solr/build/solr-core/test/J0/temp/solr.cloud.HttpPartitionTest_B16B7B33D9E4BEA1-001/control-001/cores/collection1/data/index
   [junit4]   2> 494272 INFO  (coreLoadExecutor-1805-thread-1-processing-n:127.0.0.1:56445_) [n:127.0.0.1:56445_ c:control_collection s:shard1 r:core_node1 x:collection1] o.a.s.u.RandomMergePolicy RandomMergePolicy wrapping class org.apache.lucene.index.LogByteSizeMergePolicy: [LogByteSizeMergePolicy: minMergeSize=1677721, mergeFactor=21, maxMergeSize=2147483648, maxMergeSizeForForcedMerge=9223372036854775807, calibrateSizeByDeletes=true, maxMergeDocs=2147483647, maxCFSSegmentSizeMB=8.796093022207999E12, noCFSRatio=0.7408167852810169]
   [junit4]   2> 494272 INFO  (coreLoadExecutor-1805-thread-1-processing-n:127.0.0.1:56445_) [n:127.0.0.1:56445_ c:control_collection s:shard1 r:core_node1 x:collection1] o.a.s.c.SolrCore SolrDeletionPolicy.onCommit: commits: num=1
   [junit4]   2> 	commit{dir=RawDirectoryWrapper(RAMDirectory@6cfed5ed lockFactory=org.apache.lucene.store.SingleInstanceLockFactory@75e0ef2c),segFN=segments_1,generation=1}
   [junit4]   2> 494272 INFO  (coreLoadExecutor-1805-thread-1-processing-n:127.0.0.1:56445_) [n:127.0.0.1:56445_ c:control_collection s:shard1 r:core_node1 x:collection1] o.a.s.c.SolrCore newest commit generation = 1
   [junit4]   2> 494273 INFO  (OldIndexDirectoryCleanupThreadForCore-collection1) [n:127.0.0.1:56445_ c:control_collection s:shard1 r:core_node1 x:collection1] o.a.s.c.SolrCore Looking for old index directories to cleanup for core collection1 in /Users/jenkins/workspace/Lucene-Solr-trunk-MacOSX/solr/build/solr-core/test/J0/temp/solr.cloud.HttpPartitionTest_B16B7B33D9E4BEA1-001/control-001/cores/collection1/data/
   [junit4]   2> 494274 WARN  (OldIndexDirectoryCleanupThreadForCore-collection1) [n:127.0.0.1:56445_ c:control_collection s:shard1 r:core_node1 x:collection1] o.a.s.c.DirectoryFactory /Users/jenkins/workspace/Lucene-Solr-trunk-MacOSX/solr/build/solr-core/test/J0/temp/solr.cloud.HttpPartitionTest_B16B7B33D9E4BEA1-001/control-001/cores/collection1/data/ does not point to a valid data directory; skipping clean-up of old index directories.
   [junit4]   2> 494276 INFO  (coreLoadExecutor-1805-thread-1-processing-n:127.0.0.1:56445_) [n:127.0.0.1:56445_ c:control_collection s:shard1 r:core_node1 x:collection1] o.a.s.u.p.UpdateRequestProcessorChain creating updateRequestProcessorChain "nodistrib"
   [junit4]   2> 494276 INFO  (coreLoadExecutor-1805-thread-1-processing-n:127.0.0.1:56445_) [n:127.0.0.1:56445_ c:control_collection s:shard1 r:core_node1 x:collection1] o.a.s.u.p.UpdateRequestProcessorChain creating updateRequestProcessorChain "dedupe"
   [junit4]   2> 494276 INFO  (coreLoadExecutor-1805-thread-1-processing-n:127.0.0.1:56445_) [n:127.0.0.1:56445_ c:control_collection s:shard1 r:core_node1 x:collection1] o.a.s.u.p.UpdateRequestProcessorChain inserting DistributedUpdateProcessorFactory into updateRequestProcessorChain "dedupe"
   [junit4]   2> 494276 INFO  (coreLoadExecutor-1805-thread-1-processing-n:127.0.0.1:56445_) [n:127.0.0.1:56445_ c:control_collection s:shard1 r:core_node1 x:collection1] o.a.s.u.p.UpdateRequestProcessorChain creating updateRequestProcessorChain "stored_sig"
   [junit4]   2> 494277 INFO  (coreLoadExecutor-1805-thread-1-processing-n:127.0.0.1:56445_) [n:127.0.0.1:56445_ c:control_collection s:shard1 r:core_node1 x:collection1] o.a.s.u.p.UpdateRequestProcessorChain inserting DistributedUpdateProcessorFactory into updateRequestProcessorChain "stored_sig"
   [junit4]   2> 494277 INFO  (coreLoadExecutor-1805-thread-1-processing-n:127.0.0.1:56445_) [n:127.0.0.1:56445_ c:control_collection s:shard1 r:core_node1 x:collection1] o.a.s.u.p.UpdateRequestProcessorChain creating updateRequestProcessorChain "distrib-dup-test-chain-explicit"
   [junit4]   2> 494277 INFO  (coreLoadExecutor-1805-thread-1-processing-n:127.0.0.1:56445_) [n:127.0.0.1:56445_ c:control_collection s:shard1 r:core_node1 x:collection1] o.a.s.u.p.UpdateRequestProcessorChain creating updateRequestProcessorChain "distrib-dup-test-chain-implicit"
   [junit4]   2> 494277 INFO  (coreLoadExecutor-1805-thread-1-processing-n:127.0.0.1:56445_) [n:127.0.0.1:56445_ c:control_collection s:shard1 r:core_node1 x:collection1] o.a.s.u.p.UpdateRequestProcessorChain inserting DistributedUpdateProcessorFactory into updateRequestProcessorChain "distrib-dup-test-chain-implicit"
   [junit4]   2> 494278 INFO  (coreLoadExecutor-1805-thread-1-processing-n:127.0.0.1:56445_) [n:127.0.0.1:56445_ c:control_collection s:shard1 r:core_node1 x:collection1] o.a.s.c.SolrCore no updateRequestProcessorChain defined as default, creating implicit default
   [junit4]   2> 494290 INFO  (coreLoadExecutor-1805-thread-1-processing-n:127.0.0.1:56445_) [n:127.0.0.1:56445_ c:control_collection s:shard1 r:core_node1 x:collection1] o.a.s.h.l.XMLLoader xsltCacheLifetimeSeconds=60
   [junit4]   2> 494292 INFO  (coreLoadExecutor-1805-thread-1-processing-n:127.0.0.1:56445_) [n:127.0.0.1:56445_ c:control_collection s:shard1 r:core_node1 x:collection1] o.a.s.h.l.XMLLoader xsltCacheLifetimeSeconds=60
   [junit4]   2> 494293 INFO  (coreLoadExecutor-1805-thread-1-processing-n:127.0.0.1:56445_) [n:127.0.0.1:56445_ c:control_collection s:shard1 r:core_node1 x:collection1] o.a.s.h.l.XMLLoader xsltCacheLifetimeSeconds=60
   [junit4]   2> 494293 INFO  (coreLoadExecutor-1805-thread-1-processing-n:127.0.0.1:56445_) [n:127.0.0.1:56445_ c:control_collection s:shard1 r:core_node1 x:collection1] o.a.s.h.l.XMLLoader xsltCacheLifetimeSeconds=60
   [junit4]   2> 494297 INFO  (coreLoadExecutor-1805-thread-1-processing-n:127.0.0.1:56445_) [n:127.0.0.1:56445_ c:control_collection s:shard1 r:core_node1 x:collection1] o.a.s.c.RequestHandlers Registered paths: /admin/mbeans,standard,/update/csv,/update/json/docs,/admin/luke,/admin/segments,/get,/admin/system,/replication,/admin/properties,/config,/schema,/admin/plugins,/admin/logging,/update/json,/admin/threads,/admin/ping,/update,/admin/file
   [junit4]   2> 494297 INFO  (coreLoadExecutor-1805-thread-1-processing-n:127.0.0.1:56445_) [n:127.0.0.1:56445_ c:control_collection s:shard1 r:core_node1 x:collection1] o.a.s.c.SolrCore Using default statsCache cache: org.apache.solr.search.stats.LocalStatsCache
   [junit4]   2> 494298 INFO  (coreLoadExecutor-1805-thread-1-processing-n:127.0.0.1:56445_) [n:127.0.0.1:56445_ c:control_collection s:shard1 r:core_node1 x:collection1] o.a.s.u.UpdateHandler Using UpdateLog implementation: org.apache.solr.update.UpdateLog
   [junit4]   2> 494298 INFO  (coreLoadExecutor-1805-thread-1-processing-n:127.0.0.1:56445_) [n:127.0.0.1:56445_ c:control_collection s:shard1 r:core_node1 x:collection1] o.a.s.u.UpdateLog Initializing UpdateLog: dataDir= defaultSyncLevel=FLUSH numRecordsToKeep=100 maxNumLogsToKeep=10 numVersionBuckets=65536
   [junit4]   2> 494299 INFO  (coreLoadExecutor-1805-thread-1-processing-n:127.0.0.1:56445_) [n:127.0.0.1:56445_ c:control_collection s:shard1 r:core_node1 x:collection1] o.a.s.c.SolrCore Hard AutoCommit: disabled
   [junit4]   2> 494299 INFO  (coreLoadExecutor-1805-thread-1-processing-n:127.0.0.1:56445_) [n:127.0.0.1:56445_ c:control_collection s:shard1 r:core_node1 x:collection1] o.a.s.c.SolrCore Soft AutoCommit: disabled
   [junit4]   2> 494300 INFO  (coreLoadExecutor-1805-thread-1-processing-n:127.0.0.1:56445_) [n:127.0.0.1:56445_ c:control_collection s:shard1 r:core_node1 x:collection1] o.a.s.u.RandomMergePolicy RandomMergePolicy wrapping class org.apache.lucene.index.TieredMergePolicy: [TieredMergePolicy: maxMergeAtOnce=20, maxMergeAtOnceExplicit=49, maxMergedSegmentMB=22.9833984375, floorSegmentMB=1.529296875, forceMergeDeletesPctAllowed=7.206196312192517, segmentsPerTier=30.0, maxCFSSegmentSizeMB=8.796093022207999E12, noCFSRatio=1.0
   [junit4]   2> 494300 INFO  (coreLoadExecutor-1805-thread-1-processing-n:127.0.0.1:56445_) [n:127.0.0.1:56445_ c:control_collection s:shard1 r:core_node1 x:collection1] o.a.s.c.SolrCore SolrDeletionPolicy.onInit: commits: num=1
   [junit4]   2> 	commit{dir=RawDirectoryWrapper(RAMDirectory@6cfed5ed lockFactory=org.apache.lucene.store.SingleInstanceLockFactory@75e0ef2c),segFN=segments_1,generation=1}
   [junit4]   2> 494300 INFO  (coreLoadExecutor-1805-thread-1-processing-n:127.0.0.1:56445_) [n:127.0.0.1:56445_ c:control_collection s:shard1 r:core_node1 x:collection1] o.a.s.c.SolrCore newest commit generation = 1
   [junit4]   2> 494300 INFO  (coreLoadExecutor-1805-thread-1-processing-n:127.0.0.1:56445_) [n:127.0.0.1:56445_ c:control_collection s:shard1 r:core_node1 x:collection1] o.a.s.s.SolrIndexSearcher Opening Searcher@449c475f[collection1] main
   [junit4]   2> 494301 INFO  (coreLoadExecutor-1805-thread-1-processing-n:127.0.0.1:56445_) [n:127.0.0.1:56445_ c:control_collection s:shard1 r:core_node1 x:collection1] o.a.s.c.c.ZkStateReader Load collection config from:/collections/control_collection
   [junit4]   2> 494302 INFO  (coreLoadExecutor-1805-thread-1-processing-n:127.0.0.1:56445_) [n:127.0.0.1:56445_ c:control_collection s:shard1 r:core_node1 x:collection1] o.a.s.c.c.ZkStateReader path=/collections/control_collection configName=conf1 specified config exists in ZooKeeper
   [junit4]   2> 494302 INFO  (coreLoadExecutor-1805-thread-1-processing-n:127.0.0.1:56445_) [n:127.0.0.1:56445_ c:control_collection s:shard1 r:core_node1 x:collection1] o.a.s.r.ManagedResourceStorage Setting up ZooKeeper-based storage for the RestManager with znodeBase: /configs/conf1
   [junit4]   2> 494303 INFO  (coreLoadExecutor-1805-thread-1-processing-n:127.0.0.1:56445_) [n:127.0.0.1:56445_ c:control_collection s:shard1 r:core_node1 x:collection1] o.a.s.r.ManagedResourceStorage Configured ZooKeeperStorageIO with znodeBase: /configs/conf1
   [junit4]   2> 494303 INFO  (coreLoadExecutor-1805-thread-1-processing-n:127.0.0.1:56445_) [n:127.0.0.1:56445_ c:control_collection s:shard1 r:core_node1 x:collection1] o.a.s.r.RestManager Initializing RestManager with initArgs: {}
   [junit4]   2> 494303 INFO  (coreLoadExecutor-1805-thread-1-processing-n:127.0.0.1:56445_) [n:127.0.0.1:56445_ c:control_collection s:shard1 r:core_node1 x:collection1] o.a.s.r.ManagedResourceStorage Reading _rest_managed.json using ZooKeeperStorageIO:path=/configs/conf1
   [junit4]   2> 494305 INFO  (coreLoadExecutor-1805-thread-1-processing-n:127.0.0.1:56445_) [n:127.0.0.1:56445_ c:control_collection s:shard1 r:core_node1 x:collection1] o.a.s.r.ManagedResourceStorage No data found for znode /configs/conf1/_rest_managed.json
   [junit4]   2> 494305 INFO  (coreLoadExecutor-1805-thread-1-processing-n:127.0.0.1:56445_) [n:127.0.0.1:56445_ c:control_collection s:shard1 r:core_node1 x:collection1] o.a.s.r.ManagedResourceStorage Loaded null at path _rest_managed.json using ZooKeeperStorageIO:path=/configs/conf1
   [junit4]   2> 494305 INFO  (coreLoadExecutor-1805-thread-1-processing-n:127.0.0.1:56445_) [n:127.0.0.1:56445_ c:control_collection s:shard1 r:core_node1 x:collection1] o.a.s.r.RestManager Initializing 0 registered ManagedResources
   [junit4]   2> 494305 INFO  (coreLoadExecutor-1805-thread-1-processing-n:127.0.0.1:56445_) [n:127.0.0.1:56445_ c:control_collection s:shard1 r:core_node1 x:collection1] o.a.s.h.ReplicationHandler Commits will be reserved for  10000
   [junit4]   2> 494307 INFO  (coreLoadExecutor-1805-thread-1-processing-n:127.0.0.1:56445_) [n:127.0.0.1:56445_ c:control_collection s:shard1 r:core_node1 x:collection1] o.a.s.u.UpdateLog Looking up max value of version field to seed version buckets
   [junit4]   2> 494307 INFO  (coreLoadExecutor-1805-thread-1-processing-n:127.0.0.1:56445_) [n:127.0.0.1:56445_ c:control_collection s:shard1 r:core_node1 x:collection1] o.a.s.u.VersionInfo Refreshing highest value of _version_ for 65536 version buckets from index
   [junit4]   2> 494307 INFO  (coreLoadExecutor-1805-thread-1-processing-n:127.0.0.1:56445_) [n:127.0.0.1:56445_ c:control_collection s:shard1 r:core_node1 x:collection1] o.a.s.u.VersionInfo No terms found for _version_, cannot seed version bucket highest value from index
   [junit4]   2> 494307 INFO  (coreLoadExecutor-1805-thread-1-processing-n:127.0.0.1:56445_) [n:127.0.0.1:56445_ c:control_collection s:shard1 r:core_node1 x:collection1] o.a.s.u.UpdateLog Could not find max version in index or recent updates, using new clock 1509778058894114816
   [junit4]   2> 494309 INFO  (coreLoadExecutor-1805-thread-1-processing-n:127.0.0.1:56445_) [n:127.0.0.1:56445_ c:control_collection s:shard1 r:core_node1 x:collection1] o.a.s.u.UpdateLog Took 1.0ms to seed version buckets with highest version 1509778058894114816
   [junit4]   2> 494309 INFO  (coreLoadExecutor-1805-thread-1-processing-n:127.0.0.1:56445_) [n:127.0.0.1:56445_ c:control_collection s:shard1 r:core_node1 x:collection1] o.a.s.c.ZkController watch zkdir /configs/conf1
   [junit4]   2> 494309 INFO  (searcherExecutor-1806-thread-1-processing-n:127.0.0.1:56445_ x:collection1 s:shard1 c:control_collection r:core_node1) [n:127.0.0.1:56445_ c:control_collection s:shard1 r:core_node1 x:collection1] o.a.s.c.SolrCore [collection1] Registered new searcher Searcher@449c475f[collection1] main{ExitableDirectoryReader(UninvertingDirectoryReader())}
   [junit4]   2> 494310 INFO  (coreLoadExecutor-1805-thread-1-processing-n:127.0.0.1:56445_) [n:127.0.0.1:56445_ c:control_collection s:shard1 r:core_node1 x:collection1] o.a.s.c.CoreContainer registering core: collection1
   [junit4]   2> 494313 INFO  (coreZkRegister-1799-thread-1-processing-n:127.0.0.1:56445_ x:collection1 s:shard1 c:control_collection r:core_node1) [n:127.0.0.1:56445_ c:control_collection s:shard1 r:core_node1 x:collection1] o.a.s.c.ZkController Register replica - core:collection1 address:http://127.0.0.1:56445 collection:control_collection shard:shard1
   [junit4]   2> 494314 INFO  (coreZkRegister-1799-thread-1-processing-n:127.0.0.1:56445_ x:collection1 s:shard1 c:control_collection r:core_node1) [n:127.0.0.1:56445_ c:control_collection s:shard1 r:core_node1 x:collection1] o.a.s.c.c.SolrZkClient makePath: /collections/control_collection/leader_elect/shard1/election
   [junit4]   2> 494326 INFO  (coreZkRegister-1799-thread-1-processing-n:127.0.0.1:56445_ x:collection1 s:shard1 c:control_collection r:core_node1) [n:127.0.0.1:56445_ c:control_collection s:shard1 r:core_node1 x:collection1] o.a.s.c.LeaderElector Joined leadership election with path: /collections/control_collection/leader_elect/shard1/election/94361128508129284-core_node1-n_0000000000
   [junit4]   2> 494328 INFO  (coreZkRegister-1799-thread-1-processing-n:127.0.0.1:56445_ x:collection1 s:shard1 c:control_collection r:core_node1) [n:127.0.0.1:56445_ c:control_collection s:shard1 r:core_node1 x:collection1] o.a.s.c.ShardLeaderElectionContext Running the leader process for shard shard1
   [junit4]   2> 494330 INFO  (zkCallback-523-thread-1-processing-n:127.0.0.1:56445_) [n:127.0.0.1:56445_    ] o.a.s.c.DistributedQueue NodeChildrenChanged fired on path /overseer/queue state SyncConnected
   [junit4]   2> 494331 INFO  (coreZkRegister-1799-thread-1-processing-n:127.0.0.1:56445_ x:collection1 s:shard1 c:control_collection r:core_node1) [n:127.0.0.1:56445_ c:control_collection s:shard1 r:core_node1 x:collection1] o.a.s.c.ShardLeaderElectionContext Enough replicas found to continue.
   [junit4]   2> 494331 INFO  (coreZkRegister-1799-thread-1-processing-n:127.0.0.1:56445_ x:collection1 s:shard1 c:control_collection r:core_node1) [n:127.0.0.1:56445_ c:control_collection s:shard1 r:core_node1 x:collection1] o.a.s.c.ShardLeaderElectionContext I may be the new leader - try and sync
   [junit4]   2> 494331 INFO  (coreZkRegister-1799-thread-1-processing-n:127.0.0.1:56445_ x:collection1 s:shard1 c:control_collection r:core_node1) [n:127.0.0.1:56445_ c:control_collection s:shard1 r:core_node1 x:collection1] o.a.s.c.SyncStrategy Sync replicas to http://127.0.0.1:56445/collection1/
   [junit4]   2> 494332 INFO  (coreZkRegister-1799-thread-1-processing-n:127.0.0.1:56445_ x:collection1 s:shard1 c:control_collection r:core_node1) [n:127.0.0.1:56445_ c:control_collection s:shard1 r:core_node1 x:collection1] o.a.s.c.SyncStrategy Sync Success - now sync replicas to me
   [junit4]   2> 494332 INFO  (coreZkRegister-1799-thread-1-processing-n:127.0.0.1:56445_ x:collection1 s:shard1 c:control_collection r:core_node1) [n:127.0.0.1:56445_ c:control_collection s:shard1 r:core_node1 x:collection1] o.a.s.c.SyncStrategy http://127.0.0.1:56445/collection1/ has no replicas
   [junit4]   2> 494332 INFO  (coreZkRegister-1799-thread-1-processing-n:127.0.0.1:56445_ x:collection1 s:shard1 c:control_collection r:core_node1) [n:127.0.0.1:56445_ c:control_collection s:shard1 r:core_node1 x:collection1] o.a.s.c.ShardLeaderElectionContext I am the new leader: http://127.0.0.1:56445/collection1/ shard1
   [junit4]   2> 494332 INFO  (coreZkRegister-1799-thread-1-processing-n:127.0.0.1:56445_ x:collection1 s:shard1 c:control_collection r:core_node1) [n:127.0.0.1:56445_ c:control_collection s:shard1 r:core_node1 x:collection1] o.a.s.c.c.SolrZkClient makePath: /collections/control_collection/leaders/shard1
   [junit4]   2> 494332 INFO  (OverseerStateUpdate-94361128508129284-127.0.0.1:56445_-n_0000000000) [n:127.0.0.1:56445_    ] o.a.s.c.Overseer processMessage: queueSize: 1, message = {
   [junit4]   2>   "operation":"leader",
   [junit4]   2>   "shard":"shard1",
   [junit4]   2>   "collection":"control_collection"} current state version: 1
   [junit4]   2> 494334 INFO  (zkCallback-523-thread-1-processing-n:127.0.0.1:56445_) [n:127.0.0.1:56445_    ] o.a.s.c.c.ZkStateReader A cluster state change: WatchedEvent state:SyncConnected type:NodeDataChanged path:/clusterstate.json, has occurred - updating... (live nodes size: 1)
   [junit4]   2> 494341 INFO  (OverseerStateUpdate-94361128508129284-127.0.0.1:56445_-n_0000000000) [n:127.0.0.1:56445_    ] o.a.s.c.Overseer processMessage: queueSize: 1, message = {
   [junit4]   2>   "operation":"leader",
   [junit4]   2>   "shard":"shard1",
   [junit4]   2>   "collection":"control_collection",
   [junit4]   2>   "base_url":"http://127.0.0.1:56445",
   [junit4]   2>   "core":"collection1",
   [junit4]   2>   "state":"active"} current state version: 2
   [junit4]   2> 494344 INFO  (zkCallback-523-thread-2-processing-n:127.0.0.1:56445_) [n:127.0.0.1:56445_    ] o.a.s.c.DistributedQueue NodeChildrenChanged fired on path /overseer/queue state SyncConnected
   [junit4]   2> 494347 INFO  (zkCallback-523-thread-2-processing-n:127.0.0.1:56445_) [n:127.0.0.1:56445_    ] o.a.s.c.c.ZkStateReader A cluster state change: WatchedEvent state:SyncConnected type:NodeDataChanged path:/clusterstate.json, has occurred - updating... (live nodes size: 1)
   [junit4]   2> 494392 INFO  (coreZkRegister-1799-thread-1-processing-n:127.0.0.1:56445_ x:collection1 s:shard1 c:control_collection r:core_node1) [n:127.0.0.1:56445_ c:control_collection s:shard1 r:core_node1 x:collection1] o.a.s.c.ZkController We are http://127.0.0.1:56445/collection1/ and leader is http://127.0.0.1:56445/collection1/
   [junit4]   2> 494393 INFO  (coreZkRegister-1799-thread-1-processing-n:127.0.0.1:56445_ x:collection1 s:shard1 c:control_collection r:core_node1) [n:127.0.0.1:56445_ c:control_collection s:shard1 r:core_node1 x:collection1] o.a.s.c.ZkController No LogReplay needed for core=collection1 baseURL=http://127.0.0.1:56445
   [junit4]   2> 494393 INFO  (coreZkRegister-1799-thread-1-processing-n:127.0.0.1:56445_ x:collection1 s:shard1 c:control_collection r:core_node1) [n:127.0.0.1:56445_ c:control_collection s:shard1 r:core_node1 x:collection1] o.a.s.c.ZkController I am the leader, no recovery necessary
   [junit4]   2> 494393 INFO  (coreZkRegister-1799-thread-1-processing-n:127.0.0.1:56445_ x:collection1 s:shard1 c:control_collection r:core_node1) [n:127.0.0.1:56445_ c:control_collection s:shard1 r:core_node1 x:collection1] o.a.s.c.ZkController publishing state=active
   [junit4]   2> 494393 INFO  (coreZkRegister-1799-thread-1-processing-n:127.0.0.1:56445_ x:collection1 s:shard1 c:control_collection r:core_node1) [n:127.0.0.1:56445_ c:control_collection s:shard1 r:core_node1 x:collection1] o.a.s.c.ZkController numShards not found on descriptor - reading it from system property
   [junit4]   2> 494395 INFO  (zkCallback-523-thread-2-processing-n:127.0.0.1:56445_) [n:127.0.0.1:56445_    ] o.a.s.c.DistributedQueue NodeChildrenChanged fired on path /overseer/queue state SyncConnected
   [junit4]   2> 494397 INFO  (OverseerStateUpdate-94361128508129284-127.0.0.1:56445_-n_0000000000) [n:127.0.0.1:56445_    ] o.a.s.c.Overseer processMessage: queueSize: 1, message = {
   [junit4]   2>   "core":"collection1",
   [junit4]   2>   "core_node_name":"core_node1",
   [junit4]   2>   "roles":null,
   [junit4]   2>   "base_url":"http://127.0.0.1:56445",
   [junit4]   2>   "node_name":"127.0.0.1:56445_",
   [junit4]   2>   "numShards":"1",
   [junit4]   2>   "state":"active",
   [junit4]   2>   "shard":"shard1",
   [junit4]   2>   "collection":"control_collection",
   [junit4]   2>   "operation":"state"} current state version: 3
   [junit4]   2> 494397 INFO  (OverseerStateUpdate-94361128508129284-127.0.0.1:56445_-n_0000000000) [n:127.0.0.1:56445_    ] o.a.s.c.o.ReplicaMutator Update state numShards=1 message={
   [junit4]   2>   "core":"collection1",
   [junit4]   2>   "core_node_name":"core_node1",
   [junit4]   2>   "roles":null,
   [junit4]   2>   "base_url":"http://127.0.0.1:56445",
   [junit4]   2>   "node_name":"127.0.0.1:56445_",
   [junit4]   2>   "numShards":"1",
   [junit4]   2>   "state":"active",
   [junit4]   2>   "shard":"shard1",
   [junit4]   2>   "collection":"control_collection",
   [junit4]   2>   "operation":"state"}
   [junit4]   2> 494504 INFO  (zkCallback-523-thread-2-processing-n:127.0.0.1:56445_) [n:127.0.0.1:56445_    ] o.a.s.c.c.ZkStateReader A cluster state change: WatchedEvent state:SyncConnected type:NodeDataChanged path:/clusterstate.json, has occurred - updating... (live nodes size: 1)
   [junit4]   2> 494802 INFO  (TEST-HttpPartitionTest.test-seed#[B16B7B33D9E4BEA1]) [    ] o.a.s.c.c.SolrZkClient Using default ZkCredentialsProvider
   [junit4]   2> 494803 INFO  (TEST-HttpPartitionTest.test-seed#[B16B7B33D9E4BEA1]) [    ] o.a.s.c.c.ConnectionManager Waiting for client to connect to ZooKeeper
   [junit4]   2> 494805 INFO  (zkCallback-525-thread-1) [    ] o.a.s.c.c.ConnectionManager Watcher org.apache.solr.common.cloud.ConnectionManager@32770a45 name:ZooKeeperConnection Watcher:127.0.0.1:56442/solr got event WatchedEvent state:SyncConnected type:None path:null path:null type:None
   [junit4]   2> 494805 INFO  (TEST-HttpPartitionTest.test-seed#[B16B7B33D9E4BEA1]) [    ] o.a.s.c.c.ConnectionManager Client is connected to ZooKeeper
   [junit4]   2> 494806 INFO  (TEST-HttpPartitionTest.test-seed#[B16B7B33D9E4BEA1]) [    ] o.a.s.c.c.SolrZkClient Using default ZkACLProvider
   [junit4]   2> 494806 INFO  (TEST-HttpPartitionTest.test-seed#[B16B7B33D9E4BEA1]) [    ] o.a.s.c.c.ZkStateReader Updating cluster state from ZooKeeper... 
   [junit4]   2> 494812 INFO  (TEST-HttpPartitionTest.test-seed#[B16B7B33D9E4BEA1]) [    ] o.a.s.c.ChaosMonkey monkey: init - expire sessions:false cause connection loss:false
   [junit4]   2> 495049 INFO  (TEST-HttpPartitionTest.test-seed#[B16B7B33D9E4BEA1]) [    ] o.a.s.SolrTestCaseJ4 Writing core.properties file to /Users/jenkins/workspace/Lucene-Solr-trunk-MacOSX/solr/build/solr-core/test/J0/temp/solr.cloud.HttpPartitionTest_B16B7B33D9E4BEA1-001/shard-1-001/cores/collection1
   [junit4]   2> 495051 INFO  (TEST-HttpPartitionTest.test-seed#[B16B7B33D9E4BEA1]) [    ] o.a.s.c.AbstractFullDistribZkTestBase create jetty 1 in directory /Users/jenkins/workspace/Lucene-Solr-trunk-MacOSX/solr/build/solr-core/test/J0/temp/solr.cloud.HttpPartitionTest_B16B7B33D9E4BEA1-001/shard-1-001
   [junit4]   2> 495053 INFO  (TEST-HttpPartitionTest.test-seed#[B16B7B33D9E4BEA1]) [    ] o.e.j.s.Server jetty-9.2.11.v20150529
   [junit4]   2> 495056 INFO  (TEST-HttpPartitionTest.test-seed#[B16B7B33D9E4BEA1]) [    ] o.e.j.s.h.ContextHandler Started o.e.j.s.ServletContextHandler@41ed761e{/,null,AVAILABLE}
   [junit4]   2> 495057 INFO  (TEST-HttpPartitionTest.test-seed#[B16B7B33D9E4BEA1]) [    ] o.e.j.s.ServerConnector Started ServerConnector@9521c6a{HTTP/1.1}{127.0.0.1:56453}
   [junit4]   2> 495057 INFO  (TEST-HttpPartitionTest.test-seed#[B16B7B33D9E4BEA1]) [    ] o.e.j.s.Server Started @499104ms
   [junit4]   2> 495057 INFO  (TEST-HttpPartitionTest.test-seed#[B16B7B33D9E4BEA1]) [    ] o.a.s.c.s.e.JettySolrRunner Jetty properties: {solr.data.dir=/Users/jenkins/workspace/Lucene-Solr-trunk-MacOSX/solr/build/solr-core/test/J0/temp/solr.cloud.HttpPartitionTest_B16B7B33D9E4BEA1-001/tempDir-001/jetty1, solrconfig=solrconfig.xml, hostContext=/, hostPort=56452, coreRootDirectory=/Users/jenkins/workspace/Lucene-Solr-trunk-MacOSX/solr/build/solr-core/test/J0/temp/solr.cloud.HttpPartitionTest_B16B7B33D9E4BEA1-001/shard-1-001/cores}
   [junit4]   2> 495057 INFO  (TEST-HttpPartitionTest.test-seed#[B16B7B33D9E4BEA1]) [    ] o.a.s.s.SolrDispatchFilter SolrDispatchFilter.init(): sun.misc.Launcher$AppClassLoader@74a14482
   [junit4]   2> 495057 INFO  (TEST-HttpPartitionTest.test-seed#[B16B7B33D9E4BEA1]) [    ] o.a.s.c.SolrResourceLoader new SolrResourceLoader for directory: '/Users/jenkins/workspace/Lucene-Solr-trunk-MacOSX/solr/build/solr-core/test/J0/temp/solr.cloud.HttpPartitionTest_B16B7B33D9E4BEA1-001/shard-1-001/'
   [junit4]   2> 495079 INFO  (TEST-HttpPartitionTest.test-seed#[B16B7B33D9E4BEA1]) [    ] o.a.s.c.c.SolrZkClient Using default ZkCredentialsProvider
   [junit4]   2> 495080 INFO  (TEST-HttpPartitionTest.test-seed#[B16B7B33D9E4BEA1]) [    ] o.a.s.c.c.ConnectionManager Waiting for client to connect to ZooKeeper
   [junit4]   2> 495082 INFO  (zkCallback-526-thread-1) [    ] o.a.s.c.c.ConnectionManager Watcher org.apache.solr.common.cloud.ConnectionManager@742f1880 name:ZooKeeperConnection Watcher:127.0.0.1:56442/solr got event WatchedEvent state:SyncConnected type:None path:null path:null type:None
   [junit4]   2> 495082 INFO  (TEST-HttpPartitionTest.test-seed#[B16B7B33D9E4BEA1]) [    ] o.a.s.c.c.ConnectionManager Client is connected to ZooKeeper
   [junit4]   2> 495083 INFO  (TEST-HttpPartitionTest.test-seed#[B16B7B33D9E4BEA1]) [    ] o.a.s.c.c.SolrZkClient Using default ZkACLProvider
   [junit4]   2> 495085 INFO  (TEST-HttpPartitionTest.test-seed#[B16B7B33D9E4BEA1]) [    ] o.a.s.s.SolrDispatchFilter Loading solr.xml from SolrHome (not found in ZooKeeper)
   [junit4]   2> 495085 INFO  (TEST-HttpPartitionTest.test-seed#[B16B7B33D9E4BEA1]) [    ] o.a.s.c.SolrXmlConfig Loading container configuration from /Users/jenkins/workspace/Lucene-Solr-trunk-MacOSX/solr/build/solr-core/test/J0/temp/solr.cloud.HttpPartitionTest_B16B7B33D9E4BEA1-001/shard-1-001/solr.xml
   [junit4]   2> 495095 INFO  (TEST-HttpPartitionTest.test-seed#[B16B7B33D9E4BEA1]) [    ] o.a.s.c.CoresLocator Config-defined core root directory: /Users/jenkins/workspace/Lucene-Solr-trunk-MacOSX/solr/build/solr-core/test/J0/temp/solr.cloud.HttpPartitionTest_B16B7B33D9E4BEA1-001/shard-1-001/cores
   [junit4]   2> 495095 INFO  (TEST-HttpPartitionTest.test-seed#[B16B7B33D9E4BEA1]) [    ] o.a.s.c.CoreContainer New CoreContainer 1654855157
   [junit4]   2> 495095 INFO  (TEST-HttpPartitionTest.test-seed#[B16B7B33D9E4BEA1]) [    ] o.a.s.c.CoreContainer Loading cores into CoreContainer [instanceDir=/Users/jenkins/workspace/Lucene-Solr-trunk-MacOSX/solr/build/solr-core/test/J0/temp/solr.cloud.HttpPartitionTest_B16B7B33D9E4BEA1-001/shard-1-001/]
   [junit4]   2> 495096 INFO  (TEST-HttpPartitionTest.test-seed#[B16B7B33D9E4BEA1]) [    ] o.a.s.c.CoreContainer loading shared library: /Users/jenkins/workspace/Lucene-Solr-trunk-MacOSX/solr/build/solr-core/test/J0/temp/solr.cloud.HttpPartitionTest_B16B7B33D9E4BEA1-001/shard-1-001/lib
   [junit4]   2> 495096 WARN  (TEST-HttpPartitionTest.test-seed#[B16B7B33D9E4BEA1]) [    ] o.a.s.c.SolrResourceLoader Can't find (or read) directory to add to classloader: lib (resolved as: /Users/jenkins/workspace/Lucene-Solr-trunk-MacOSX/solr/build/solr-core/test/J0/temp/solr.cloud.HttpPartitionTest_B16B7B33D9E4BEA1-001/shard-1-001/lib).
   [junit4]   2> 495108 INFO  (TEST-HttpPartitionTest.test-seed#[B16B7B33D9E4BEA1]) [    ] o.a.s.h.c.HttpShardHandlerFactory created with socketTimeout : 90000,urlScheme : ,connTimeout : 15000,maxConnectionsPerHost : 20,maxConnections : 10000,corePoolSize : 0,maximumPoolSize : 2147483647,maxThreadIdleTime : 5,sizeOfQueue : -1,fairnessPolicy : false,useRetries : false,
   [junit4]   2> 495112 INFO  (TEST-HttpPartitionTest.test-seed#[B16B7B33D9E4BEA1]) [    ] o.a.s.u.UpdateShardHandler Creating UpdateShardHandler HTTP client with params: socketTimeout=340000&connTimeout=45000&retry=true
   [junit4]   2> 495113 INFO  (TEST-HttpPartitionTest.test-seed#[B16B7B33D9E4BEA1]) [    ] o.a.s.l.LogWatcher SLF4J impl is org.slf4j.impl.Log4jLoggerFactory
   [junit4]   2> 495113 INFO  (TEST-HttpPartitionTest.test-seed#[B16B7B33D9E4BEA1]) [    ] o.a.s.l.LogWatcher Registering Log Listener [Log4j (org.slf4j.impl.Log4jLoggerFactory)]
   [junit4]   2> 495113 INFO  (TEST-HttpPartitionTest.test-seed#[B16B7B33D9E4BEA1]) [    ] o.a.s.c.ZkContainer Zookeeper client=127.0.0.1:56442/solr
   [junit4]   2> 495113 INFO  (TEST-HttpPartitionTest.test-seed#[B16B7B33D9E4BEA1]) [    ] o.a.s.c.ZkController zkHost includes chroot
   [junit4]   2> 495113 INFO  (TEST-HttpPartitionTest.test-seed#[B16B7B33D9E4BEA1]) [    ] o.a.s.c.c.SolrZkClient Using default ZkCredentialsProvider
   [junit4]   2> 495114 INFO  (TEST-HttpPartitionTest.test-seed#[B16B7B33D9E4BEA1]) [    ] o.a.s.c.c.ConnectionManager Waiting for client to connect to ZooKeeper
   [junit4]   2> 495117 INFO  (zkCallback-528-thread-1) [    ] o.a.s.c.c.ConnectionManager Watcher org.apache.solr.common.cloud.ConnectionManager@53193014 name:ZooKeeperConnection Watcher:127.0.0.1:56442 got event WatchedEvent state:SyncConnected type:None path:null path:null type:None
   [junit4]   2> 495117 INFO  (TEST-HttpPartitionTest.test-seed#[B16B7B33D9E4BEA1]) [    ] o.a.s.c.c.ConnectionManager Client is connected to ZooKeeper
   [junit4]   2> 495117 INFO  (TEST-HttpPartitionTest.test-seed#[B16B7B33D9E4BEA1]) [    ] o.a.s.c.c.SolrZkClient Using default ZkACLProvider
   [junit4]   2> 495121 INFO  (TEST-HttpPartitionTest.test-seed#[B16B7B33D9E4BEA1]) [n:127.0.0.1:56452_    ] o.a.s.c.c.ConnectionManager Waiting for client to connect to ZooKeeper
   [junit4]   2> 495123 INFO  (zkCallback-529-thread-1-processing-n:127.0.0.1:56452_) [n:127.0.0.1:56452_    ] o.a.s.c.c.ConnectionManager Watcher org.apache.solr.common.cloud.ConnectionManager@7e3fa824 name:ZooKeeperConnection Watcher:127.0.0.1:56442/solr got event WatchedEvent state:SyncConnected type:None path:null path:null type:None
   [junit4]   2> 495123 INFO  (TEST-HttpPartitionTest.test-seed#[B16B7B33D9E4BEA1]) [n:127.0.0.1:56452_    ] o.a.s.c.c.ConnectionManager Client is connected to ZooKeeper
   [junit4]   2> 495134 INFO  (TEST-HttpPartitionTest.test-seed#[B16B7B33D9E4BEA1]) [n:127.0.0.1:56452_    ] o.a.s.c.c.ZkStateReader Updating cluster state from ZooKeeper... 
   [junit4]   2> 496144 INFO  (TEST-HttpPartitionTest.test-seed#[B16B7B33D9E4BEA1]) [n:127.0.0.1:56452_    ] o.a.s.c.ZkController Register node as live in ZooKeeper:/live_nodes/127.0.0.1:56452_
   [junit4]   2> 496146 INFO  (TEST-HttpPartitionTest.test-seed#[B16B7B33D9E4BEA1]) [n:127.0.0.1:56452_    ] o.a.s.c.c.SolrZkClient makePath: /live_nodes/127.0.0.1:56452_
   [junit4]   2> 496148 INFO  (zkCallback-525-thread-1) [    ] o.a.s.c.c.ZkStateReader A live node change: WatchedEvent state:SyncConnected type:NodeChildrenChanged path:/live_nodes, has occurred - updating... (live nodes size: 1)
   [junit4]   2> 496148 INFO  (zkCallback-529-thread-1-processing-n:127.0.0.1:56452_) [n:127.0.0.1:56452_    ] o.a.s.c.c.ZkStateReader A live node change: WatchedEvent state:SyncConnected type:NodeChildrenChanged path:/live_nodes, has occurred - updating... (live nodes size: 1)
   [junit4]   2> 496148 INFO  (zkCallback-523-thread-2-processing-n:127.0.0.1:56445_) [n:127.0.0.1:56445_    ] o.a.s.c.c.ZkStateReader A live node change: WatchedEvent state:SyncConnected type:NodeChildrenChanged path:/live_nodes, has occurred - updating... (live nodes size: 1)
   [junit4]   2> 496152 INFO  (TEST-HttpPartitionTest.test-seed#[B16B7B33D9E4BEA1]) [n:127.0.0.1:56452_    ] o.a.s.c.Overseer Overseer (id=null) closing
   [junit4]   2> 496153 INFO  (TEST-HttpPartitionTest.test-seed#[B16B7B33D9E4BEA1]) [n:127.0.0.1:56452_    ] o.a.s.c.LeaderElector Joined leadership election with path: /overseer_elect/election/94361128508129288-127.0.0.1:56452_-n_0000000001
   [junit4]   2> 496154 INFO  (TEST-HttpPartitionTest.test-seed#[B16B7B33D9E4BEA1]) [n:127.0.0.1:56452_    ] o.a.s.c.LeaderElector Watching path /overseer_elect/election/94361128508129284-127.0.0.1:56445_-n_0000000000 to know if I could be the leader
   [junit4]   2> 496165 INFO  (TEST-HttpPartitionTest.test-seed#[B16B7B33D9E4BEA1]) [n:127.0.0.1:56452_    ] o.a.s.c.CoreContainer Security conf doesn't exist. Skipping setup for authorization module.
   [junit4]   2> 496165 INFO  (TEST-HttpPartitionTest.test-seed#[B16B7B33D9E4BEA1]) [n:127.0.0.1:56452_    ] o.a.s.c.CoreContainer No authentication plugin used.
   [junit4]   2> 496168 INFO  (TEST-HttpPartitionTest.test-seed#[B16B7B33D9E4BEA1]) [n:127.0.0.1:56452_    ] o.a.s.c.CoresLocator Looking for core definitions underneath /Users/jenkins/workspace/Lucene-Solr-trunk-MacOSX/solr/build/solr-core/test/J0/temp/solr.cloud.HttpPartitionTest_B16B7B33D9E4BEA1-001/shard-1-001/cores
   [junit4]   2> 496169 INFO  (TEST-HttpPartitionTest.test-seed#[B16B7B33D9E4BEA1]) [n:127.0.0.1:56452_    ] o.a.s.c.SolrCore Created CoreDescriptor: {name=collection1, config=solrconfig.xml, transient=false, schema=schema.xml, loadOnStartup=true, configSetProperties=configsetprops.json, instanceDir=/Users/jenkins/workspace/Lucene-Solr-trunk-MacOSX/solr/build/solr-core/test/J0/temp/solr.cloud.HttpPartitionTest_B16B7B33D9E4BEA1-001/shard-1-001/cores/collection1, collection=collection1, absoluteInstDir=/Users/jenkins/workspace/Lucene-Solr-trunk-MacOSX/solr/build/solr-core/test/J0/temp/solr.cloud.HttpPartitionTest_B16B7B33D9E4BEA1-001/shard-1-001/cores/collection1/, coreNodeName=, dataDir=data/, shard=}
   [junit4]   2> 496169 INFO  (TEST-HttpPartitionTest.test-seed#[B16B7B33D9E4BEA1]) [n:127.0.0.1:56452_    ] o.a.s.c.CoresLocator Found core collection1 in /Users/jenkins/workspace/Lucene-Solr-trunk-MacOSX/solr/build/solr-core/test/J0/temp/solr.cloud.HttpPartitionTest_B16B7B33D9E4BEA1-001/shard-1-001/cores/collection1/
   [junit4]   2> 496169 INFO  (TEST-HttpPartitionTest.test-seed#[B16B7B33D9E4BEA1]) [n:127.0.0.1:56452_    ] o.a.s.c.CoresLocator Found 1 core definitions
   [junit4]   2> 496172 INFO  (coreLoadExecutor-1816-thread-1-processing-n:127.0.0.1:56452_) [n:127.0.0.1:56452_ c:collection1   x:collection1] o.a.s.c.ZkController publishing state=down
   [junit4]   2> 496172 INFO  (coreLoadExecutor-1816-thread-1-processing-n:127.0.0.1:56452_) [n:127.0.0.1:56452_ c:collection1   x:collection1] o.a.s.c.ZkController numShards not found on descriptor - reading it from system property
   [junit4]   2> 496172 INFO  (TEST-HttpPartitionTest.test-seed#[B16B7B33D9E4BEA1]) [n:127.0.0.1:56452_    ] o.a.s.s.SolrDispatchFilter user.dir=/Users/jenkins/workspace/Lucene-Solr-trunk-MacOSX/solr/build/solr-core/test/J0
   [junit4]   2> 496172 INFO  (TEST-HttpPartitionTest.test-seed#[B16B7B33D9E4BEA1]) [n:127.0.0.1:56452_    ] o.a.s.s.SolrDispatchFilter SolrDispatchFilter.init() done
   [junit4]   2> 496173 INFO  (coreLoadExecutor-1816-thread-1-processing-n:127.0.0.1:56452_) [n:127.0.0.1:56452_ c:collection1   x:collection1] o.a.s.c.ZkController look for our core node name
   [junit4]   2> 496173 INFO  (zkCallback-523-thread-2-processing-n:127.0.0.1:56445_) [n:127.0.0.1:56445_    ] o.a.s.c.DistributedQueue NodeChildrenChanged fired on path /overseer/queue state SyncConnected
   [junit4]   2> 496175 INFO  (OverseerStateUpdate-94361128508129284-127.0.0.1:56445_-n_0000000000) [n:127.0.0.1:56445_    ] o.a.s.c.Overseer processMessage: queueSize: 1, message = {
   [junit4]   2>   "core":"collection1",
   [junit4]   2>   "roles":null,
   [junit4]   2>   "base_url":"http://127.0.0.1:56452",
   [junit4]   2>   "node_name":"127.0.0.1:56452_",
   [junit4]   2>   "numShards":"2",
   [junit4]   2>   "state":"down",
   [junit4]   2>   "shard":null,
   [junit4]   2>   "collection":"collection1",
   [junit4]   2>   "operation":"state"} current state version: 4
   [junit4]   2> 496176 INFO  (OverseerStateUpdate-94361128508129284-127.0.0.1:56445_-n_0000000000) [n:127.0.0.1:56445_    ] o.a.s.c.o.ReplicaMutator Update state numShards=2 message={
   [junit4]   2>   "core":"collection1",
   [junit4]   2>   "roles":null,
   [junit4]   2>   "base_url":"http://127.0.0.1:56452",
   [junit4]   2>   "node_name":"127.0.0.1:56452_",
   [junit4]   2>   "numShards":"2",
   [junit4]   2>   "state":"down",
   [junit4]   2>   "shard":null,
   [junit4]   2>   "collection":"collection1",
   [junit4]   2>   "operation":"state"}
   [junit4]   2> 496176 INFO  (OverseerStateUpdate-94361128508129284-127.0.0.1:56445_-n_0000000000) [n:127.0.0.1:56445_    ] o.a.s.c.o.ClusterStateMutator building a new cName: collection1
   [junit4]   2> 496177 INFO  (OverseerStateUpdate-94361128508129284-127.0.0.1:56445_-n_0000000000) [n:127.0.0.1:56445_    ] o.a.s.c.o.ReplicaMutator Assigning new node to shard shard=shard2
   [junit4]   2> 496179 INFO  (zkCallback-525-thread-1) [    ] o.a.s.c.c.ZkStateReader A cluster state change: WatchedEvent state:SyncConnected type:NodeDataChanged path:/clusterstate.json, has occurred - updating... (live nodes size: 2)
   [junit4]   2> 496179 INFO  (zkCallback-529-thread-1-processing-n:127.0.0.1:56452_) [n:127.0.0.1:56452_    ] o.a.s.c.c.ZkStateReader A cluster state change: WatchedEvent state:SyncConnected type:NodeDataChanged path:/clusterstate.json, has occurred - updating... (live nodes size: 2)
   [junit4]   2> 496180 INFO  (zkCallback-523-thread-2-processing-n:127.0.0.1:56445_) [n:127.0.0.1:56445_    ] o.a.s.c.c.ZkStateReader A cluster state change: WatchedEvent state:SyncConnected type:NodeDataChanged path:/clusterstate.json, has occurred - updating... (live nodes size: 2)
   [junit4]   2> 497175 INFO  (coreLoadExecutor-1816-thread-1-processing-n:127.0.0.1:56452_) [n:127.0.0.1:56452_ c:collection1   x:collection1] o.a.s.c.ZkController waiting to find shard id in clusterstate for collection1
   [junit4]   2> 497175 INFO  (coreLoadExecutor-1816-thread-1-processing-n:127.0.0.1:56452_) [n:127.0.0.1:56452_ c:collection1   x:collection1] o.a.s.c.ZkController Check for collection zkNode:collection1
   [junit4]   2> 497176 INFO  (coreLoadExecutor-1816-thread-1-processing-n:127.0.0.1:56452_) [n:127.0.0.1:56452_ c:collection1   x:collection1] o.a.s.c.ZkController Collection zkNode exists
   [junit4]   2> 497177 INFO  (coreLoadExecutor-1816-thread-1-processing-n:127.0.0.1:56452_) [n:127.0.0.1:56452_ c:collection1   x:collection1] o.a.s.c.c.ZkStateReader Load collection config from:/collections/collection1
   [junit4]   2> 497178 INFO  (coreLoadExecutor-1816-thread-1-processing-n:127.0.0.1:56452_) [n:127.0.0.1:56452_ c:collection1   x:collection1] o.a.s.c.c.ZkStateReader path=/collections/collection1 configName=conf1 specified config exists in ZooKeeper
   [junit4]   2> 497178 INFO  (coreLoadExecutor-1816-thread-1-processing-n:127.0.0.1:56452_) [n:127.0.0.1:56452_ c:collection1   x:collection1] o.a.s.c.SolrResourceLoader new SolrResourceLoader for directory: '/Users/jenkins/workspace/Lucene-Solr-trunk-MacOSX/solr/build/solr-core/test/J0/temp/solr.cloud.HttpPartitionTest_B16B7B33D9E4BEA1-001/shard-1-001/cores/collection1/'
   [junit4]   2> 497192 INFO  (coreLoadExecutor-1816-thread-1-processing-n:127.0.0.1:56452_) [n:127.0.0.1:56452_ c:collection1   x:collection1] o.a.s.c.Config loaded config solrconfig.xml with version 0 
   [junit4]   2> 497199 INFO  (coreLoadExecutor-1816-thread-1-processing-n:127.0.0.1:56452_) [n:127.0.0.1:56452_ c:collection1   x:collection1] o.a.s.c.SolrConfig current version of requestparams : -1
   [junit4]   2> 497202 INFO  (coreLoadExecutor-1816-thread-1-processing-n:127.0.0.1:56452_) [n:127.0.0.1:56452_ c:collection1   x:collection1] o.a.s.c.SolrConfig Using Lucene MatchVersion: 6.0.0
   [junit4]   2> 497208 INFO  (coreLoadExecutor-1816-thread-1-processing-n:127.0.0.1:56452_) [n:127.0.0.1:56452_ c:collection1   x:collection1] o.a.s.c.Config Loaded SolrConfig: solrconfig.xml
   [junit4]   2> 497210 INFO  (coreLoadExecutor-1816-thread-1-processing-n:127.0.0.1:56452_) [n:127.0.0.1:56452_ c:collection1   x:collection1] o.a.s.s.IndexSchema Reading Solr Schema from /configs/conf1/schema.xml
   [junit4]   2> 497214 INFO  (coreLoadExecutor-1816-thread-1-processing-n:127.0.0.1:56452_) [n:127.0.0.1:56452_ c:collection1   x:collection1] o.a.s.s.IndexSchema [collection1] Schema name=test
   [junit4]   2> 497299 INFO  (coreLoadExecutor-1816-thread-1-processing-n:127.0.0.1:56452_) [n:127.0.0.1:56452_ c:collection1   x:collection1] o.a.s.s.OpenExchangeRatesOrgProvider Initialized with rates=open-exchange-rates.json, refreshInterval=1440.
   [junit4]   2> 497305 INFO  (coreLoadExecutor-1816-thread-1-processing-n:127.0.0.1:56452_) [n:127.0.0.1:56452_ c:collection1   x:collection1] o.a.s.s.IndexSchema default search field in schema is text
   [junit4]   2> 497306 INFO  (coreLoadExecutor-1816-thread-1-processing-n:127.0.0.1:56452_) [n:127.0.0.1:56452_ c:collection1   x:collection1] o.a.s.s.IndexSchema unique key field: id
   [junit4]   2> 497321 INFO  (coreLoadExecutor-1816-thread-1-processing-n:127.0.0.1:56452_) [n:127.0.0.1:56452_ c:collection1   x:collection1] o.a.s.s.FileExchangeRateProvider Reloading exchange rates from file currency.xml
   [junit4]   2> 497324 INFO  (coreLoadExecutor-1816-thread-1-processing-n:127.0.0.1:56452_) [n:127.0.0.1:56452_ c:collection1   x:collection1] o.a.s.s.FileExchangeRateProvider Reloading exchange rates from file currency.xml
   [junit4]   2> 497326 INFO  (coreLoadExecutor-1816-thread-1-processing-n:127.0.0.1:56452_) [n:127.0.0.1:56452_ c:collection1   x:collection1] o.a.s.s.OpenExchangeRatesOrgProvider Reloading exchange rates from open-exchange-rates.json
   [junit4]   2> 497328 WARN  (coreLoadExecutor-1816-thread-1-processing-n:127.0.0.1:56452_) [n:127.0.0.1:56452_ c:collection1   x:collection1] o.a.s.s.OpenExchangeRatesOrgProvider Unknown key IMPORTANT NOTE
   [junit4]   2> 497329 WARN  (coreLoadExecutor-1816-thread-1-processing-n:127.0.0.1:56452_) [n:127.0.0.1:56452_ c:collection1   x:collection1] o.a.s.s.OpenExchangeRatesOrgProvider Expected key, got STRING
   [junit4]   2> 497329 INFO  (coreLoadExecutor-1816-thread-1-processing-n:127.0.0.1:56452_) [n:127.0.0.1:56452_ c:collection1   x:collection1] o.a.s.s.OpenExchangeRatesOrgProvider Reloading exchange rates from open-exchange-rates.json
   [junit4]   2> 497330 WARN  (coreLoadExecutor-1816-thread-1-processing-n:127.0.0.1:56452_) [n:127.0.0.1:56452_ c:collection1   x:collection1] o.a.s.s.OpenExchangeRatesOrgProvider Unknown key IMPORTANT NOTE
   [junit4]   2> 497330 WARN  (coreLoadExecutor-1816-thread-1-processing-n:127.0.0.1:56452_) [n:127.0.0.1:56452_ c:collection1   x:collection1] o.a.s.s.OpenExchangeRatesOrgProvider Expected key, got STRING
   [junit4]   2> 497332 INFO  (coreLoadExecutor-1816-thread-1-processing-n:127.0.0.1:56452_) [n:127.0.0.1:56452_ c:collection1   x:collection1] o.a.s.c.ConfigSetProperties Did not find ConfigSet properties, assuming default properties: Can't find resource 'configsetprops.json' in classpath or '/configs/conf1', cwd=/Users/jenkins/workspace/Lucene-Solr-trunk-MacOSX/solr/build/solr-core/test/J0
   [junit4]   2> 497332 INFO  (coreLoadExecutor-1816-thread-1-processing-n:127.0.0.1:56452_) [n:127.0.0.1:56452_ c:collection1   x:collection1] o.a.s.c.CoreContainer Creating SolrCore 'collection1' using configuration from collection collection1
   [junit4]   2> 497332 INFO  (coreLoadExecutor-1816-thread-1-processing-n:127.0.0.1:56452_) [n:127.0.0.1:56452_ c:collection1 s:shard2 r:core_node1 x:collection1] o.a.s.c.SolrCore org.apache.solr.core.MockDirectoryFactory
   [junit4]   2> 497333 INFO  (coreLoadExecutor-1816-thread-1-processing-n:127.0.0.1:56452_) [n:127.0.0.1:56452_ c:collection1 s:shard2 r:core_node1 x:collection1] o.a.s.c.SolrCore [[collection1] ] Opening new SolrCore at [/Users/jenkins/workspace/Lucene-Solr-trunk-MacOSX/solr/build/solr-core/test/J0/temp/solr.cloud.HttpPartitionTest_B16B7B33D9E4BEA1-001/shard-1-001/cores/collection1/], dataDir=[null]
   [junit4]   2> 497333 INFO  (coreLoadExecutor-1816-thread-1-processing-n:127.0.0.1:56452_) [n:127.0.0.1:56452_ c:collection1 s:shard2 r:core_node1 x:collection1] o.a.s.c.JmxMonitoredMap JMX monitoring is enabled. Adding Solr mbeans to JMX Server: com.sun.jmx.mbeanserver.JmxMBeanServer@3b09b5e2
   [junit4]   2> 497333 INFO  (coreLoadExecutor-1816-thread-1-processing-n:127.0.0.1:56452_) [n:127.0.0.1:56452_ c:collection1 s:shard2 r:core_node1 x:collection1] o.a.s.c.CachingDirectoryFactory return new directory for /Users/jenkins/workspace/Lucene-Solr-trunk-MacOSX/solr/build/solr-core/test/J0/temp/solr.cloud.HttpPartitionTest_B16B7B33D9E4BEA1-001/shard-1-001/cores/collection1/data
   [junit4]   2> 497333 INFO  (coreLoadExecutor-1816-thread-1-processing-n:127.0.0.1:56452_) [n:127.0.0.1:56452_ c:collection1 s:shard2 r:core_node1 x:collection1] o.a.s.c.SolrCore New index directory detected: old=null new=/Users/jenkins/workspace/Lucene-Solr-trunk-MacOSX/solr/build/solr-core/test/J0/temp/solr.cloud.HttpPartitionTest_B16B7B33D9E4BEA1-001/shard-1-001/cores/collection1/data/index/
   [junit4]   2> 497334 WARN  (coreLoadExecutor-1816-thread-1-processing-n:127.0.0.1:56452_) [n:127.0.0.1:56452_ c:collection1 s:shard2 r:core_node1 x:collection1] o.a.s.c.SolrCore [collection1] Solr index directory '/Users/jenkins/workspace/Lucene-Solr-trunk-MacOSX/solr/build/solr-core/test/J0/temp/solr.cloud.HttpPartitionTest_B16B7B33D9E4BEA1-001/shard-1-001/cores/collection1/data/index' doesn't exist. Creating new index...
   [junit4]   2> 497334 INFO  (coreLoadExecutor-1816-thread-1-processing-n:127.0.0.1:56452_) [n:127.0.0.1:56452_ c:collection1 s:shard2 r:core_node1 x:collection1] o.a.s.c.CachingDirectoryFactory return new directory for /Users/jenkins/workspace/Lucene-Solr-trunk-MacOSX/solr/build/solr-core/test/J0/temp/solr.cloud.HttpPartitionTest_B16B7B33D9E4BEA1-001/shard-1-001/cores/collection1/data/index
   [junit4]   2> 497334 INFO  (coreLoadExecutor-1816-thread-1-processing-n:127.0.0.1:56452_) [n:127.0.0.1:56452_ c:collection1 s:shard2 r:core_node1 x:collection1] o.a.s.u.RandomMergePolicy RandomMergePolicy wrapping class org.apache.lucene.index.LogByteSizeMergePolicy: [LogByteSizeMergePolicy: minMergeSize=1677721, mergeFactor=21, maxMergeSize=2147483648, maxMergeSizeForForcedMerge=9223372036854775807, calibrateSizeByDeletes=true, maxMergeDocs=2147483647, maxCFSSegmentSizeMB=8.796093022207999E12, noCFSRatio=0.7408167852810169]
   [junit4]   2> 497334 INFO  (coreLoadExecutor-1816-thread-1-processing-n:127.0.0.1:56452_) [n:127.0.0.1:56452_ c:collection1 s:shard2 r:core_node1 x:collection1] o.a.s.c.SolrCore SolrDeletionPolicy.onCommit: commits: num=1
   [junit4]   2> 	commit{dir=RawDirectoryWrapper(RAMDirectory@4e81ef42 lockFactory=org.apache.lucene.store.SingleInstanceLockFactory@3ae101f8),segFN=segments_1,generation=1}
   [junit4]   2> 497334 INFO  (coreLoadExecutor-1816-thread-1-processing-n:127.0.0.1:56452_) [n:127.0.0.1:56452_ c:collection1 s:shard2 r:core_node1 x:collection1] o.a.s.c.SolrCore newest commit generation = 1
   [junit4]   2> 497335 INFO  (OldIndexDirectoryCleanupThreadForCore-collection1) [n:127.0.0.1:56452_ c:collection1 s:shard2 r:core_node1 x:collection1] o.a.s.c.SolrCore Looking for old index directories to cleanup for core collection1 in /Users/jenkins/workspace/Lucene-Solr-trunk-MacOSX/solr/build/solr-core/test/J0/temp/solr.cloud.HttpPartitionTest_B16B7B33D9E4BEA1-001/shard-1-001/cores/collection1/data/
   [junit4]   2> 497335 WARN  (OldIndexDirectoryCleanupThreadForCore-collection1) [n:127.0.0.1:56452_ c:collection1 s:shard2 r:core_node1 x:collection1] o.a.s.c.DirectoryFactory /Users/jenkins/workspace/Lucene-Solr-trunk-MacOSX/solr/build/solr-core/test/J0/temp/solr.cloud.HttpPartitionTest_B16B7B33D9E4BEA1-001/shard-1-001/cores/collection1/data/ does not point to a valid data directory; skipping clean-up of old index directories.
   [junit4]   2> 497338 INFO  (coreLoadExecutor-1816-thread-1-processing-n:127.0.0.1:56452_) [n:127.0.0.1:56452_ c:collection1 s:shard2 r:core_node1 x:collection1] o.a.s.u.p.UpdateRequestProcessorChain creating updateRequest

[...truncated too long message...]

  [junit4]   2> 	4	/solr/collections/source_collection/leaders/shard1
   [junit4]   2> 	2	/solr/collections/tmp_collection/leaders/shard1
   [junit4]   2> 
   [junit4]   2> Maximum concurrent data watches above limit:
   [junit4]   2> 
   [junit4]   2> 	48	/solr/clusterstate.json
   [junit4]   2> 	10	/solr/collections/source_collection/cdcr/state/buffer
   [junit4]   2> 	10	/solr/collections/source_collection/cdcr/state/process
   [junit4]   2> 	7	/solr/collections/source_collection/state.json
   [junit4]   2> 	2	/solr/collections/source_collection/leader_elect/shard1/election/94361214674665477-core_node1-n_0000000000
   [junit4]   2> 	2	/solr/collections/tmp_collection/cdcr/state/buffer
   [junit4]   2> 	2	/solr/overseer_elect/election/94361214674665477-127.0.0.1:60759__y%2Ft-n_0000000000
   [junit4]   2> 	2	/solr/collections/source_collection/leader_elect/shard1/election/94361214674665504-core_node1-n_0000000000
   [junit4]   2> 	2	/solr/collections/tmp_collection/cdcr/state/process
   [junit4]   2> 
   [junit4]   2> Maximum concurrent children watches above limit:
   [junit4]   2> 
   [junit4]   2> 	46	/solr/live_nodes
   [junit4]   2> 	2	/solr/overseer/queue
   [junit4]   2> 	2	/solr/overseer/collection-queue-work
   [junit4]   2> 
   [junit4]   2> NOTE: reproduce with: ant test  -Dtestcase=CdcrReplicationHandlerTest -Dtests.method=doTest -Dtests.seed=B16B7B33D9E4BEA1 -Dtests.slow=true -Dtests.locale=es_BO -Dtests.timezone=Asia/Novokuznetsk -Dtests.asserts=true -Dtests.file.encoding=UTF-8
   [junit4] FAILURE  495s J1 | CdcrReplicationHandlerTest.doTest <<<
   [junit4]    > Throwable #1: java.lang.AssertionError: There are still nodes recoverying - waited for 330 seconds
   [junit4]    > 	at __randomizedtesting.SeedInfo.seed([B16B7B33D9E4BEA1:162FC397B45FAD18]:0)
   [junit4]    > 	at org.apache.solr.cloud.AbstractDistribZkTestBase.waitForRecoveriesToFinish(AbstractDistribZkTestBase.java:172)
   [junit4]    > 	at org.apache.solr.cloud.AbstractDistribZkTestBase.waitForRecoveriesToFinish(AbstractDistribZkTestBase.java:133)
   [junit4]    > 	at org.apache.solr.cloud.AbstractDistribZkTestBase.waitForRecoveriesToFinish(AbstractDistribZkTestBase.java:128)
   [junit4]    > 	at org.apache.solr.cloud.BaseCdcrDistributedZkTest.waitForRecoveriesToFinish(BaseCdcrDistributedZkTest.java:465)
   [junit4]    > 	at org.apache.solr.cloud.BaseCdcrDistributedZkTest.clearSourceCollection(BaseCdcrDistributedZkTest.java:319)
   [junit4]    > 	at org.apache.solr.cloud.CdcrReplicationHandlerTest.doTestPartialReplicationWithTruncatedTlog(CdcrReplicationHandlerTest.java:121)
   [junit4]    > 	at org.apache.solr.cloud.CdcrReplicationHandlerTest.doTest(CdcrReplicationHandlerTest.java:52)
   [junit4]    > 	at org.apache.solr.BaseDistributedSearchTestCase$ShardsRepeatRule$ShardsFixedStatement.callStatement(BaseDistributedSearchTestCase.java:963)
   [junit4]    > 	at org.apache.solr.BaseDistributedSearchTestCase$ShardsRepeatRule$ShardsStatement.evaluate(BaseDistributedSearchTestCase.java:938)
   [junit4]    > 	at java.lang.Thread.run(Thread.java:745)
   [junit4]   2> 2301335 INFO  (SUITE-CdcrReplicationHandlerTest-seed#[B16B7B33D9E4BEA1]-worker) [n:127.0.0.1:60767__y%2Ft c:source_collection s:shard1 r:core_node2 x:source_collection_shard1_replica1] o.a.s.SolrTestCaseJ4 ###deleteCore
   [junit4]   2> NOTE: leaving temporary files on disk at: /Users/jenkins/workspace/Lucene-Solr-trunk-MacOSX/solr/build/solr-core/test/J1/temp/solr.cloud.CdcrReplicationHandlerTest_B16B7B33D9E4BEA1-001
   [junit4]   2> NOTE: test params are: codec=Asserting(Lucene53): {_version_=FST50, id=PostingsFormat(name=MockRandom)}, docValues:{}, sim=RandomSimilarityProvider(queryNorm=false,coord=yes): {}, locale=es_BO, timezone=Asia/Novokuznetsk
   [junit4]   2> NOTE: Mac OS X 10.8.5 x86_64/Oracle Corporation 1.8.0_51 (64-bit)/cpus=3,threads=1,free=266147176,total=518979584
   [junit4]   2> NOTE: All tests run in this JVM: [TestDefaultSimilarityFactory, TestHdfsUpdateLog, HighlighterTest, TestObjectReleaseTracker, SolrRequestParserTest, TestSolrJ, AnalyticsQueryTest, TestFileDictionaryLookup, DistanceUnitsTest, TestInfoStreamLogging, QueryParsingTest, TestFastWriter, ExternalFileFieldSortTest, DocExpirationUpdateProcessorFactoryTest, TestSuggestSpellingConverter, TestManagedSchemaDynamicFieldResource, TestSolrCloudWithKerberosAlt, TestFiltering, TestChildDocTransformer, JsonLoaderTest, DistributedTermsComponentTest, PolyFieldTest, ResourceLoaderTest, DistributedFacetPivotLargeTest, OverseerCollectionProcessorTest, TestSolrXml, DeleteLastCustomShardedReplicaTest, TestAuthenticationFramework, SpatialFilterTest, TestAnalyzeInfixSuggestions, CdcrVersionReplicationTest, CurrencyFieldXmlFileTest, TestSolrQueryParser, SearchHandlerTest, TestReplicationHandlerBackup, TestRestoreCore, FileBasedSpellCheckerTest, HdfsThreadLeakTest, BaseCdcrDistributedZkTest, DistributedQueueTest, MigrateRouteKeyTest, TestAddFieldRealTimeGet, TestOverriddenPrefixQueryForCustomFieldType, TestJsonRequest, MoreLikeThisHandlerTest, DirectUpdateHandlerOptimizeTest, SimpleMLTQParserTest, ReplicationFactorTest, TestPseudoReturnFields, ZkSolrClientTest, TestSolrConfigHandlerConcurrent, SimplePostToolTest, BlockDirectoryTest, HdfsUnloadDistributedZkTest, CurrencyFieldOpenExchangeTest, TestMergePolicyConfig, TestRandomMergePolicy, TestRuleBasedAuthorizationPlugin, TestScoreJoinQPNoScore, XsltUpdateRequestHandlerTest, RankQueryTest, SegmentsInfoRequestHandlerTest, TestDFRSimilarityFactory, TestCoreDiscovery, TestSerializedLuceneMatchVersion, TestDocSet, StandardRequestHandlerTest, TestSolrCoreProperties, TestRestManager, OpenExchangeRatesOrgProviderTest, CollectionStateFormat2Test, StatsComponentTest, UpdateParamsTest, BadIndexSchemaTest, TestConfig, TestRTGBase, BitVectorTest, PluginInfoTest, TestRandomFaceting, RegexBoostProcessorTest, TestStressUserVersions, TestSystemIdResolver, TestReload, TestReloadAndDeleteDocs, TestRandomRequestDistribution, TestRawResponseWriter, WordBreakSolrSpellCheckerTest, TestReqParamsAPI, TestDynamicLoading, LeaderFailoverAfterPartitionTest, TestFieldResource, CdcrRequestHandlerTest, TestDistributedGrouping, SignatureUpdateProcessorFactoryTest, TestCrossCoreJoin, EchoParamsTest, AliasIntegrationTest, TestClassNameShortening, TestDocBasedVersionConstraints, CollectionsAPIDistributedZkTest, SchemaVersionSpecificBehaviorTest, IndexBasedSpellCheckerTest, LeaderInitiatedRecoveryOnCommitTest, TestFuzzyAnalyzedSuggestions, BasicDistributedZk2Test, PrimitiveFieldTypeTest, TestCustomDocTransformer, SpatialHeatmapFacetsTest, QueryEqualityTest, DebugComponentTest, HdfsWriteToMultipleCollectionsTest, TestLeaderElectionZkExpiry, ExitableDirectoryReaderTest, DistributedFacetPivotSmallAdvancedTest, TestLMJelinekMercerSimilarityFactory, TestFieldTypeResource, ZkStateWriterTest, DistribJoinFromCollectionTest, FastVectorHighlighterTest, TestNoOpRegenerator, CloudMLTQParserTest, MinimalSchemaTest, RAMDirectoryFactoryTest, TestSolr4Spatial, ConnectionManagerTest, AutoCommitTest, DistributedMLTComponentTest, FullHLLTest, TestSolrDeletionPolicy2, TestDynamicFieldCollectionResource, CopyFieldTest, BasicDistributedZkTest, ChaosMonkeySafeLeaderTest, UnloadDistributedZkTest, OpenCloseCoreStressTest, OverseerTest, ShardRoutingTest, LeaderElectionTest, TestZkChroot, TestRandomDVFaceting, ShardRoutingCustomTest, TestFaceting, TestRecovery, TestHashPartitioner, TestRealTimeGet, HardAutoCommitTest, TestRangeQuery, SolrCoreTest, TestGroupingSearch, QueryElevationComponentTest, ConvertedLegacyTest, BasicFunctionalityTest, DirectUpdateHandlerTest, TestBadConfig, DistributedQueryElevationComponentTest, DocValuesTest, SuggesterTest, SolrCoreCheckLockOnStartupTest, DefaultValueUpdateProcessorTest, SortByFunctionTest, TestRemoteStreaming, TestSolrDeletionPolicy1, DisMaxRequestHandlerTest, DirectSolrSpellCheckerTest, TestReversedWildcardFilterFactory, TermsComponentTest, TestValueSourceCache, TestIndexingPerformance, IndexSchemaRuntimeFieldTest, SolrPluginUtilsTest, TestCollationField, UpdateRequestProcessorFactoryTest, MBeansHandlerTest, TestPartialUpdateDeduplication, TestPHPSerializedResponseWriter, CSVRequestHandlerTest, TestBinaryResponseWriter, TestQuerySenderListener, TestSolrIndexConfig, SolrIndexConfigTest, TestElisionMultitermQuery, DirectSolrConnectionTest, TestLuceneMatchVersion, TestPhraseSuggestions, SynonymTokenizerTest, TestLMDirichletSimilarityFactory, TestBM25SimilarityFactory, TestFastOutputStream, TestFastLRUCache, ChaosMonkeyNothingIsSafeTest, TestSimpleTrackingShardHandler, AssignTest, AsyncCallRequestStatusResponseTest, CdcrReplicationDistributedZkTest, CdcrReplicationHandlerTest]
   [junit4] Completed [417/540] on J1 in 495.02s, 1 test, 1 failure <<< FAILURES!

[...truncated 395 lines...]
BUILD FAILED
/Users/jenkins/workspace/Lucene-Solr-trunk-MacOSX/build.xml:775: The following error occurred while executing this line:
/Users/jenkins/workspace/Lucene-Solr-trunk-MacOSX/build.xml:719: The following error occurred while executing this line:
/Users/jenkins/workspace/Lucene-Solr-trunk-MacOSX/build.xml:59: The following error occurred while executing this line:
/Users/jenkins/workspace/Lucene-Solr-trunk-MacOSX/solr/build.xml:233: The following error occurred while executing this line:
/Users/jenkins/workspace/Lucene-Solr-trunk-MacOSX/solr/common-build.xml:514: The following error occurred while executing this line:
/Users/jenkins/workspace/Lucene-Solr-trunk-MacOSX/lucene/common-build.xml:1429: The following error occurred while executing this line:
/Users/jenkins/workspace/Lucene-Solr-trunk-MacOSX/lucene/common-build.xml:984: There were test failures: 540 suites, 2131 tests, 1 suite-level error, 1 failure, 73 ignored (31 assumptions)

Total time: 68 minutes 20 seconds
Build step 'Invoke Ant' marked build as failure
Archiving artifacts
[WARNINGS] Skipping publisher since build result is FAILURE
Recording test results
Email was triggered for: Failure - Any
Sending email for trigger: Failure - Any



Mime
View raw message