lucene-dev mailing list archives

Site index · List index
Message view « Date » · « Thread »
Top « Date » · « Thread »
From Policeman Jenkins Server <jenk...@thetaphi.de>
Subject [JENKINS] Lucene-Solr-5.x-MacOSX (64bit/jdk1.7.0) - Build # 2578 - Still Failing!
Date Sat, 15 Aug 2015 00:35:41 GMT
Build: http://jenkins.thetaphi.de/job/Lucene-Solr-5.x-MacOSX/2578/
Java: 64bit/jdk1.7.0 -XX:-UseCompressedOops -XX:+UseG1GC

3 tests failed.
FAILED:  org.apache.solr.cloud.CollectionsAPIDistributedZkTest.test

Error Message:
Error from server at http://127.0.0.1:52262/_ybs/qf: Could not fully remove collection: awholynewcollection_0

Stack Trace:
org.apache.solr.client.solrj.impl.HttpSolrClient$RemoteSolrException: Error from server at http://127.0.0.1:52262/_ybs/qf: Could not fully remove collection: awholynewcollection_0
	at __randomizedtesting.SeedInfo.seed([78F6B51827F7DDBC:F0A28AC2890BB044]:0)
	at org.apache.solr.client.solrj.impl.HttpSolrClient.executeMethod(HttpSolrClient.java:560)
	at org.apache.solr.client.solrj.impl.HttpSolrClient.request(HttpSolrClient.java:234)
	at org.apache.solr.client.solrj.impl.HttpSolrClient.request(HttpSolrClient.java:226)
	at org.apache.solr.client.solrj.SolrClient.request(SolrClient.java:1220)
	at org.apache.solr.cloud.CollectionsAPIDistributedZkTest.makeRequest(CollectionsAPIDistributedZkTest.java:301)
	at org.apache.solr.cloud.CollectionsAPIDistributedZkTest.testCollectionsAPI(CollectionsAPIDistributedZkTest.java:761)
	at org.apache.solr.cloud.CollectionsAPIDistributedZkTest.test(CollectionsAPIDistributedZkTest.java:166)
	at sun.reflect.NativeMethodAccessorImpl.invoke0(Native Method)
	at sun.reflect.NativeMethodAccessorImpl.invoke(NativeMethodAccessorImpl.java:57)
	at sun.reflect.DelegatingMethodAccessorImpl.invoke(DelegatingMethodAccessorImpl.java:43)
	at java.lang.reflect.Method.invoke(Method.java:606)
	at com.carrotsearch.randomizedtesting.RandomizedRunner.invoke(RandomizedRunner.java:1627)
	at com.carrotsearch.randomizedtesting.RandomizedRunner$6.evaluate(RandomizedRunner.java:836)
	at com.carrotsearch.randomizedtesting.RandomizedRunner$7.evaluate(RandomizedRunner.java:872)
	at com.carrotsearch.randomizedtesting.RandomizedRunner$8.evaluate(RandomizedRunner.java:886)
	at org.apache.solr.BaseDistributedSearchTestCase$ShardsRepeatRule$ShardsFixedStatement.callStatement(BaseDistributedSearchTestCase.java:963)
	at org.apache.solr.BaseDistributedSearchTestCase$ShardsRepeatRule$ShardsStatement.evaluate(BaseDistributedSearchTestCase.java:938)
	at com.carrotsearch.randomizedtesting.rules.SystemPropertiesRestoreRule$1.evaluate(SystemPropertiesRestoreRule.java:57)
	at org.apache.lucene.util.TestRuleSetupTeardownChained$1.evaluate(TestRuleSetupTeardownChained.java:50)
	at org.apache.lucene.util.AbstractBeforeAfterRule$1.evaluate(AbstractBeforeAfterRule.java:46)
	at org.apache.lucene.util.TestRuleThreadAndTestName$1.evaluate(TestRuleThreadAndTestName.java:49)
	at org.apache.lucene.util.TestRuleIgnoreAfterMaxFailures$1.evaluate(TestRuleIgnoreAfterMaxFailures.java:65)
	at org.apache.lucene.util.TestRuleMarkFailure$1.evaluate(TestRuleMarkFailure.java:48)
	at com.carrotsearch.randomizedtesting.rules.StatementAdapter.evaluate(StatementAdapter.java:36)
	at com.carrotsearch.randomizedtesting.ThreadLeakControl$StatementRunner.run(ThreadLeakControl.java:365)
	at com.carrotsearch.randomizedtesting.ThreadLeakControl.forkTimeoutingTask(ThreadLeakControl.java:798)
	at com.carrotsearch.randomizedtesting.ThreadLeakControl$3.evaluate(ThreadLeakControl.java:458)
	at com.carrotsearch.randomizedtesting.RandomizedRunner.runSingleTest(RandomizedRunner.java:845)
	at com.carrotsearch.randomizedtesting.RandomizedRunner$3.evaluate(RandomizedRunner.java:747)
	at com.carrotsearch.randomizedtesting.RandomizedRunner$4.evaluate(RandomizedRunner.java:781)
	at com.carrotsearch.randomizedtesting.RandomizedRunner$5.evaluate(RandomizedRunner.java:792)
	at com.carrotsearch.randomizedtesting.rules.StatementAdapter.evaluate(StatementAdapter.java:36)
	at com.carrotsearch.randomizedtesting.rules.SystemPropertiesRestoreRule$1.evaluate(SystemPropertiesRestoreRule.java:57)
	at org.apache.lucene.util.AbstractBeforeAfterRule$1.evaluate(AbstractBeforeAfterRule.java:46)
	at com.carrotsearch.randomizedtesting.rules.StatementAdapter.evaluate(StatementAdapter.java:36)
	at org.apache.lucene.util.TestRuleStoreClassName$1.evaluate(TestRuleStoreClassName.java:42)
	at com.carrotsearch.randomizedtesting.rules.NoShadowingOrOverridesOnMethodsRule$1.evaluate(NoShadowingOrOverridesOnMethodsRule.java:39)
	at com.carrotsearch.randomizedtesting.rules.NoShadowingOrOverridesOnMethodsRule$1.evaluate(NoShadowingOrOverridesOnMethodsRule.java:39)
	at com.carrotsearch.randomizedtesting.rules.StatementAdapter.evaluate(StatementAdapter.java:36)
	at com.carrotsearch.randomizedtesting.rules.StatementAdapter.evaluate(StatementAdapter.java:36)
	at com.carrotsearch.randomizedtesting.rules.StatementAdapter.evaluate(StatementAdapter.java:36)
	at org.apache.lucene.util.TestRuleAssertionsRequired$1.evaluate(TestRuleAssertionsRequired.java:54)
	at org.apache.lucene.util.TestRuleMarkFailure$1.evaluate(TestRuleMarkFailure.java:48)
	at org.apache.lucene.util.TestRuleIgnoreAfterMaxFailures$1.evaluate(TestRuleIgnoreAfterMaxFailures.java:65)
	at org.apache.lucene.util.TestRuleIgnoreTestSuites$1.evaluate(TestRuleIgnoreTestSuites.java:55)
	at com.carrotsearch.randomizedtesting.rules.StatementAdapter.evaluate(StatementAdapter.java:36)
	at com.carrotsearch.randomizedtesting.ThreadLeakControl$StatementRunner.run(ThreadLeakControl.java:365)
	at java.lang.Thread.run(Thread.java:745)


FAILED:  junit.framework.TestSuite.org.apache.solr.cloud.CollectionsAPIDistributedZkTest

Error Message:
6 threads leaked from SUITE scope at org.apache.solr.cloud.CollectionsAPIDistributedZkTest:     1) Thread[id=9722, name=zkCallback-1357-thread-3, state=TIMED_WAITING, group=TGRP-CollectionsAPIDistributedZkTest]         at sun.misc.Unsafe.park(Native Method)         at java.util.concurrent.locks.LockSupport.parkNanos(LockSupport.java:226)         at java.util.concurrent.SynchronousQueue$TransferStack.awaitFulfill(SynchronousQueue.java:460)         at java.util.concurrent.SynchronousQueue$TransferStack.transfer(SynchronousQueue.java:359)         at java.util.concurrent.SynchronousQueue.poll(SynchronousQueue.java:942)         at java.util.concurrent.ThreadPoolExecutor.getTask(ThreadPoolExecutor.java:1068)         at java.util.concurrent.ThreadPoolExecutor.runWorker(ThreadPoolExecutor.java:1130)         at java.util.concurrent.ThreadPoolExecutor$Worker.run(ThreadPoolExecutor.java:615)         at java.lang.Thread.run(Thread.java:745)    2) Thread[id=9746, name=zkCallback-1357-thread-4, state=TIMED_WAITING, group=TGRP-CollectionsAPIDistributedZkTest]         at sun.misc.Unsafe.park(Native Method)         at java.util.concurrent.locks.LockSupport.parkNanos(LockSupport.java:226)         at java.util.concurrent.SynchronousQueue$TransferStack.awaitFulfill(SynchronousQueue.java:460)         at java.util.concurrent.SynchronousQueue$TransferStack.transfer(SynchronousQueue.java:359)         at java.util.concurrent.SynchronousQueue.poll(SynchronousQueue.java:942)         at java.util.concurrent.ThreadPoolExecutor.getTask(ThreadPoolExecutor.java:1068)         at java.util.concurrent.ThreadPoolExecutor.runWorker(ThreadPoolExecutor.java:1130)         at java.util.concurrent.ThreadPoolExecutor$Worker.run(ThreadPoolExecutor.java:615)         at java.lang.Thread.run(Thread.java:745)    3) Thread[id=9671, name=TEST-CollectionsAPIDistributedZkTest.test-seed#[78F6B51827F7DDBC]-EventThread, state=WAITING, group=TGRP-CollectionsAPIDistributedZkTest]         at sun.misc.Unsafe.park(Native Method)         at java.util.concurrent.locks.LockSupport.park(LockSupport.java:186)         at java.util.concurrent.locks.AbstractQueuedSynchronizer$ConditionObject.await(AbstractQueuedSynchronizer.java:2043)         at java.util.concurrent.LinkedBlockingQueue.take(LinkedBlockingQueue.java:442)         at org.apache.zookeeper.ClientCnxn$EventThread.run(ClientCnxn.java:494)    4) Thread[id=9670, name=TEST-CollectionsAPIDistributedZkTest.test-seed#[78F6B51827F7DDBC]-SendThread(127.0.0.1:52253), state=TIMED_WAITING, group=TGRP-CollectionsAPIDistributedZkTest]         at java.lang.Thread.sleep(Native Method)         at org.apache.zookeeper.client.StaticHostProvider.next(StaticHostProvider.java:101)         at org.apache.zookeeper.ClientCnxn$SendThread.startConnect(ClientCnxn.java:940)         at org.apache.zookeeper.ClientCnxn$SendThread.run(ClientCnxn.java:1003)    5) Thread[id=9672, name=zkCallback-1357-thread-1, state=TIMED_WAITING, group=TGRP-CollectionsAPIDistributedZkTest]         at sun.misc.Unsafe.park(Native Method)         at java.util.concurrent.locks.LockSupport.parkNanos(LockSupport.java:226)         at java.util.concurrent.SynchronousQueue$TransferStack.awaitFulfill(SynchronousQueue.java:460)         at java.util.concurrent.SynchronousQueue$TransferStack.transfer(SynchronousQueue.java:359)         at java.util.concurrent.SynchronousQueue.poll(SynchronousQueue.java:942)         at java.util.concurrent.ThreadPoolExecutor.getTask(ThreadPoolExecutor.java:1068)         at java.util.concurrent.ThreadPoolExecutor.runWorker(ThreadPoolExecutor.java:1130)         at java.util.concurrent.ThreadPoolExecutor$Worker.run(ThreadPoolExecutor.java:615)         at java.lang.Thread.run(Thread.java:745)    6) Thread[id=9714, name=zkCallback-1357-thread-2, state=TIMED_WAITING, group=TGRP-CollectionsAPIDistributedZkTest]         at sun.misc.Unsafe.park(Native Method)         at java.util.concurrent.locks.LockSupport.parkNanos(LockSupport.java:226)         at java.util.concurrent.SynchronousQueue$TransferStack.awaitFulfill(SynchronousQueue.java:460)         at java.util.concurrent.SynchronousQueue$TransferStack.transfer(SynchronousQueue.java:359)         at java.util.concurrent.SynchronousQueue.poll(SynchronousQueue.java:942)         at java.util.concurrent.ThreadPoolExecutor.getTask(ThreadPoolExecutor.java:1068)         at java.util.concurrent.ThreadPoolExecutor.runWorker(ThreadPoolExecutor.java:1130)         at java.util.concurrent.ThreadPoolExecutor$Worker.run(ThreadPoolExecutor.java:615)         at java.lang.Thread.run(Thread.java:745)

Stack Trace:
com.carrotsearch.randomizedtesting.ThreadLeakError: 6 threads leaked from SUITE scope at org.apache.solr.cloud.CollectionsAPIDistributedZkTest: 
   1) Thread[id=9722, name=zkCallback-1357-thread-3, state=TIMED_WAITING, group=TGRP-CollectionsAPIDistributedZkTest]
        at sun.misc.Unsafe.park(Native Method)
        at java.util.concurrent.locks.LockSupport.parkNanos(LockSupport.java:226)
        at java.util.concurrent.SynchronousQueue$TransferStack.awaitFulfill(SynchronousQueue.java:460)
        at java.util.concurrent.SynchronousQueue$TransferStack.transfer(SynchronousQueue.java:359)
        at java.util.concurrent.SynchronousQueue.poll(SynchronousQueue.java:942)
        at java.util.concurrent.ThreadPoolExecutor.getTask(ThreadPoolExecutor.java:1068)
        at java.util.concurrent.ThreadPoolExecutor.runWorker(ThreadPoolExecutor.java:1130)
        at java.util.concurrent.ThreadPoolExecutor$Worker.run(ThreadPoolExecutor.java:615)
        at java.lang.Thread.run(Thread.java:745)
   2) Thread[id=9746, name=zkCallback-1357-thread-4, state=TIMED_WAITING, group=TGRP-CollectionsAPIDistributedZkTest]
        at sun.misc.Unsafe.park(Native Method)
        at java.util.concurrent.locks.LockSupport.parkNanos(LockSupport.java:226)
        at java.util.concurrent.SynchronousQueue$TransferStack.awaitFulfill(SynchronousQueue.java:460)
        at java.util.concurrent.SynchronousQueue$TransferStack.transfer(SynchronousQueue.java:359)
        at java.util.concurrent.SynchronousQueue.poll(SynchronousQueue.java:942)
        at java.util.concurrent.ThreadPoolExecutor.getTask(ThreadPoolExecutor.java:1068)
        at java.util.concurrent.ThreadPoolExecutor.runWorker(ThreadPoolExecutor.java:1130)
        at java.util.concurrent.ThreadPoolExecutor$Worker.run(ThreadPoolExecutor.java:615)
        at java.lang.Thread.run(Thread.java:745)
   3) Thread[id=9671, name=TEST-CollectionsAPIDistributedZkTest.test-seed#[78F6B51827F7DDBC]-EventThread, state=WAITING, group=TGRP-CollectionsAPIDistributedZkTest]
        at sun.misc.Unsafe.park(Native Method)
        at java.util.concurrent.locks.LockSupport.park(LockSupport.java:186)
        at java.util.concurrent.locks.AbstractQueuedSynchronizer$ConditionObject.await(AbstractQueuedSynchronizer.java:2043)
        at java.util.concurrent.LinkedBlockingQueue.take(LinkedBlockingQueue.java:442)
        at org.apache.zookeeper.ClientCnxn$EventThread.run(ClientCnxn.java:494)
   4) Thread[id=9670, name=TEST-CollectionsAPIDistributedZkTest.test-seed#[78F6B51827F7DDBC]-SendThread(127.0.0.1:52253), state=TIMED_WAITING, group=TGRP-CollectionsAPIDistributedZkTest]
        at java.lang.Thread.sleep(Native Method)
        at org.apache.zookeeper.client.StaticHostProvider.next(StaticHostProvider.java:101)
        at org.apache.zookeeper.ClientCnxn$SendThread.startConnect(ClientCnxn.java:940)
        at org.apache.zookeeper.ClientCnxn$SendThread.run(ClientCnxn.java:1003)
   5) Thread[id=9672, name=zkCallback-1357-thread-1, state=TIMED_WAITING, group=TGRP-CollectionsAPIDistributedZkTest]
        at sun.misc.Unsafe.park(Native Method)
        at java.util.concurrent.locks.LockSupport.parkNanos(LockSupport.java:226)
        at java.util.concurrent.SynchronousQueue$TransferStack.awaitFulfill(SynchronousQueue.java:460)
        at java.util.concurrent.SynchronousQueue$TransferStack.transfer(SynchronousQueue.java:359)
        at java.util.concurrent.SynchronousQueue.poll(SynchronousQueue.java:942)
        at java.util.concurrent.ThreadPoolExecutor.getTask(ThreadPoolExecutor.java:1068)
        at java.util.concurrent.ThreadPoolExecutor.runWorker(ThreadPoolExecutor.java:1130)
        at java.util.concurrent.ThreadPoolExecutor$Worker.run(ThreadPoolExecutor.java:615)
        at java.lang.Thread.run(Thread.java:745)
   6) Thread[id=9714, name=zkCallback-1357-thread-2, state=TIMED_WAITING, group=TGRP-CollectionsAPIDistributedZkTest]
        at sun.misc.Unsafe.park(Native Method)
        at java.util.concurrent.locks.LockSupport.parkNanos(LockSupport.java:226)
        at java.util.concurrent.SynchronousQueue$TransferStack.awaitFulfill(SynchronousQueue.java:460)
        at java.util.concurrent.SynchronousQueue$TransferStack.transfer(SynchronousQueue.java:359)
        at java.util.concurrent.SynchronousQueue.poll(SynchronousQueue.java:942)
        at java.util.concurrent.ThreadPoolExecutor.getTask(ThreadPoolExecutor.java:1068)
        at java.util.concurrent.ThreadPoolExecutor.runWorker(ThreadPoolExecutor.java:1130)
        at java.util.concurrent.ThreadPoolExecutor$Worker.run(ThreadPoolExecutor.java:615)
        at java.lang.Thread.run(Thread.java:745)
	at __randomizedtesting.SeedInfo.seed([78F6B51827F7DDBC]:0)


FAILED:  junit.framework.TestSuite.org.apache.solr.cloud.CollectionsAPIDistributedZkTest

Error Message:
There are still zombie threads that couldn't be terminated:    1) Thread[id=9722, name=zkCallback-1357-thread-3, state=TIMED_WAITING, group=TGRP-CollectionsAPIDistributedZkTest]         at sun.misc.Unsafe.park(Native Method)         at java.util.concurrent.locks.LockSupport.parkNanos(LockSupport.java:226)         at java.util.concurrent.SynchronousQueue$TransferStack.awaitFulfill(SynchronousQueue.java:460)         at java.util.concurrent.SynchronousQueue$TransferStack.transfer(SynchronousQueue.java:359)         at java.util.concurrent.SynchronousQueue.poll(SynchronousQueue.java:942)         at java.util.concurrent.ThreadPoolExecutor.getTask(ThreadPoolExecutor.java:1068)         at java.util.concurrent.ThreadPoolExecutor.runWorker(ThreadPoolExecutor.java:1130)         at java.util.concurrent.ThreadPoolExecutor$Worker.run(ThreadPoolExecutor.java:615)         at java.lang.Thread.run(Thread.java:745)    2) Thread[id=9746, name=zkCallback-1357-thread-4, state=TIMED_WAITING, group=TGRP-CollectionsAPIDistributedZkTest]         at sun.misc.Unsafe.park(Native Method)         at java.util.concurrent.locks.LockSupport.parkNanos(LockSupport.java:226)         at java.util.concurrent.SynchronousQueue$TransferStack.awaitFulfill(SynchronousQueue.java:460)         at java.util.concurrent.SynchronousQueue$TransferStack.transfer(SynchronousQueue.java:359)         at java.util.concurrent.SynchronousQueue.poll(SynchronousQueue.java:942)         at java.util.concurrent.ThreadPoolExecutor.getTask(ThreadPoolExecutor.java:1068)         at java.util.concurrent.ThreadPoolExecutor.runWorker(ThreadPoolExecutor.java:1130)         at java.util.concurrent.ThreadPoolExecutor$Worker.run(ThreadPoolExecutor.java:615)         at java.lang.Thread.run(Thread.java:745)    3) Thread[id=9670, name=TEST-CollectionsAPIDistributedZkTest.test-seed#[78F6B51827F7DDBC]-SendThread(127.0.0.1:52253), state=TIMED_WAITING, group=TGRP-CollectionsAPIDistributedZkTest]         at java.lang.Thread.sleep(Native Method)         at org.apache.zookeeper.client.StaticHostProvider.next(StaticHostProvider.java:101)         at org.apache.zookeeper.ClientCnxn$SendThread.startConnect(ClientCnxn.java:940)         at org.apache.zookeeper.ClientCnxn$SendThread.run(ClientCnxn.java:1003)    4) Thread[id=9672, name=zkCallback-1357-thread-1, state=TIMED_WAITING, group=TGRP-CollectionsAPIDistributedZkTest]         at sun.misc.Unsafe.park(Native Method)         at java.util.concurrent.locks.LockSupport.parkNanos(LockSupport.java:226)         at java.util.concurrent.SynchronousQueue$TransferStack.awaitFulfill(SynchronousQueue.java:460)         at java.util.concurrent.SynchronousQueue$TransferStack.transfer(SynchronousQueue.java:359)         at java.util.concurrent.SynchronousQueue.poll(SynchronousQueue.java:942)         at java.util.concurrent.ThreadPoolExecutor.getTask(ThreadPoolExecutor.java:1068)         at java.util.concurrent.ThreadPoolExecutor.runWorker(ThreadPoolExecutor.java:1130)         at java.util.concurrent.ThreadPoolExecutor$Worker.run(ThreadPoolExecutor.java:615)         at java.lang.Thread.run(Thread.java:745)    5) Thread[id=9714, name=zkCallback-1357-thread-2, state=TIMED_WAITING, group=TGRP-CollectionsAPIDistributedZkTest]         at sun.misc.Unsafe.park(Native Method)         at java.util.concurrent.locks.LockSupport.parkNanos(LockSupport.java:226)         at java.util.concurrent.SynchronousQueue$TransferStack.awaitFulfill(SynchronousQueue.java:460)         at java.util.concurrent.SynchronousQueue$TransferStack.transfer(SynchronousQueue.java:359)         at java.util.concurrent.SynchronousQueue.poll(SynchronousQueue.java:942)         at java.util.concurrent.ThreadPoolExecutor.getTask(ThreadPoolExecutor.java:1068)         at java.util.concurrent.ThreadPoolExecutor.runWorker(ThreadPoolExecutor.java:1130)         at java.util.concurrent.ThreadPoolExecutor$Worker.run(ThreadPoolExecutor.java:615)         at java.lang.Thread.run(Thread.java:745)

Stack Trace:
com.carrotsearch.randomizedtesting.ThreadLeakError: There are still zombie threads that couldn't be terminated:
   1) Thread[id=9722, name=zkCallback-1357-thread-3, state=TIMED_WAITING, group=TGRP-CollectionsAPIDistributedZkTest]
        at sun.misc.Unsafe.park(Native Method)
        at java.util.concurrent.locks.LockSupport.parkNanos(LockSupport.java:226)
        at java.util.concurrent.SynchronousQueue$TransferStack.awaitFulfill(SynchronousQueue.java:460)
        at java.util.concurrent.SynchronousQueue$TransferStack.transfer(SynchronousQueue.java:359)
        at java.util.concurrent.SynchronousQueue.poll(SynchronousQueue.java:942)
        at java.util.concurrent.ThreadPoolExecutor.getTask(ThreadPoolExecutor.java:1068)
        at java.util.concurrent.ThreadPoolExecutor.runWorker(ThreadPoolExecutor.java:1130)
        at java.util.concurrent.ThreadPoolExecutor$Worker.run(ThreadPoolExecutor.java:615)
        at java.lang.Thread.run(Thread.java:745)
   2) Thread[id=9746, name=zkCallback-1357-thread-4, state=TIMED_WAITING, group=TGRP-CollectionsAPIDistributedZkTest]
        at sun.misc.Unsafe.park(Native Method)
        at java.util.concurrent.locks.LockSupport.parkNanos(LockSupport.java:226)
        at java.util.concurrent.SynchronousQueue$TransferStack.awaitFulfill(SynchronousQueue.java:460)
        at java.util.concurrent.SynchronousQueue$TransferStack.transfer(SynchronousQueue.java:359)
        at java.util.concurrent.SynchronousQueue.poll(SynchronousQueue.java:942)
        at java.util.concurrent.ThreadPoolExecutor.getTask(ThreadPoolExecutor.java:1068)
        at java.util.concurrent.ThreadPoolExecutor.runWorker(ThreadPoolExecutor.java:1130)
        at java.util.concurrent.ThreadPoolExecutor$Worker.run(ThreadPoolExecutor.java:615)
        at java.lang.Thread.run(Thread.java:745)
   3) Thread[id=9670, name=TEST-CollectionsAPIDistributedZkTest.test-seed#[78F6B51827F7DDBC]-SendThread(127.0.0.1:52253), state=TIMED_WAITING, group=TGRP-CollectionsAPIDistributedZkTest]
        at java.lang.Thread.sleep(Native Method)
        at org.apache.zookeeper.client.StaticHostProvider.next(StaticHostProvider.java:101)
        at org.apache.zookeeper.ClientCnxn$SendThread.startConnect(ClientCnxn.java:940)
        at org.apache.zookeeper.ClientCnxn$SendThread.run(ClientCnxn.java:1003)
   4) Thread[id=9672, name=zkCallback-1357-thread-1, state=TIMED_WAITING, group=TGRP-CollectionsAPIDistributedZkTest]
        at sun.misc.Unsafe.park(Native Method)
        at java.util.concurrent.locks.LockSupport.parkNanos(LockSupport.java:226)
        at java.util.concurrent.SynchronousQueue$TransferStack.awaitFulfill(SynchronousQueue.java:460)
        at java.util.concurrent.SynchronousQueue$TransferStack.transfer(SynchronousQueue.java:359)
        at java.util.concurrent.SynchronousQueue.poll(SynchronousQueue.java:942)
        at java.util.concurrent.ThreadPoolExecutor.getTask(ThreadPoolExecutor.java:1068)
        at java.util.concurrent.ThreadPoolExecutor.runWorker(ThreadPoolExecutor.java:1130)
        at java.util.concurrent.ThreadPoolExecutor$Worker.run(ThreadPoolExecutor.java:615)
        at java.lang.Thread.run(Thread.java:745)
   5) Thread[id=9714, name=zkCallback-1357-thread-2, state=TIMED_WAITING, group=TGRP-CollectionsAPIDistributedZkTest]
        at sun.misc.Unsafe.park(Native Method)
        at java.util.concurrent.locks.LockSupport.parkNanos(LockSupport.java:226)
        at java.util.concurrent.SynchronousQueue$TransferStack.awaitFulfill(SynchronousQueue.java:460)
        at java.util.concurrent.SynchronousQueue$TransferStack.transfer(SynchronousQueue.java:359)
        at java.util.concurrent.SynchronousQueue.poll(SynchronousQueue.java:942)
        at java.util.concurrent.ThreadPoolExecutor.getTask(ThreadPoolExecutor.java:1068)
        at java.util.concurrent.ThreadPoolExecutor.runWorker(ThreadPoolExecutor.java:1130)
        at java.util.concurrent.ThreadPoolExecutor$Worker.run(ThreadPoolExecutor.java:615)
        at java.lang.Thread.run(Thread.java:745)
	at __randomizedtesting.SeedInfo.seed([78F6B51827F7DDBC]:0)




Build Log:
[...truncated 10546 lines...]
   [junit4] Suite: org.apache.solr.cloud.CollectionsAPIDistributedZkTest
   [junit4]   2> Creating dataDir: /Users/jenkins/workspace/Lucene-Solr-5.x-MacOSX/solr/build/solr-core/test/J1/temp/solr.cloud.CollectionsAPIDistributedZkTest_78F6B51827F7DDBC-001/init-core-data-001
   [junit4]   2> 1331102 INFO  (SUITE-CollectionsAPIDistributedZkTest-seed#[78F6B51827F7DDBC]-worker) [    ] o.a.s.SolrTestCaseJ4 Randomized ssl (false) and clientAuth (false)
   [junit4]   2> 1331102 INFO  (SUITE-CollectionsAPIDistributedZkTest-seed#[78F6B51827F7DDBC]-worker) [    ] o.a.s.BaseDistributedSearchTestCase Setting hostContext system property: /_ybs/qf
   [junit4]   2> 1331188 INFO  (TEST-CollectionsAPIDistributedZkTest.test-seed#[78F6B51827F7DDBC]) [    ] o.a.s.c.ZkTestServer STARTING ZK TEST SERVER
   [junit4]   2> 1331189 INFO  (Thread-3575) [    ] o.a.s.c.ZkTestServer client port:0.0.0.0/0.0.0.0:0
   [junit4]   2> 1331189 INFO  (Thread-3575) [    ] o.a.s.c.ZkTestServer Starting server
   [junit4]   2> 1331289 INFO  (TEST-CollectionsAPIDistributedZkTest.test-seed#[78F6B51827F7DDBC]) [    ] o.a.s.c.ZkTestServer start zk server on port:52253
   [junit4]   2> 1331289 INFO  (TEST-CollectionsAPIDistributedZkTest.test-seed#[78F6B51827F7DDBC]) [    ] o.a.s.c.c.SolrZkClient Using default ZkCredentialsProvider
   [junit4]   2> 1331290 INFO  (TEST-CollectionsAPIDistributedZkTest.test-seed#[78F6B51827F7DDBC]) [    ] o.a.s.c.c.ConnectionManager Waiting for client to connect to ZooKeeper
   [junit4]   2> 1331299 INFO  (zkCallback-1325-thread-1) [    ] o.a.s.c.c.ConnectionManager Watcher org.apache.solr.common.cloud.ConnectionManager@58c4caa8 name:ZooKeeperConnection Watcher:127.0.0.1:52253 got event WatchedEvent state:SyncConnected type:None path:null path:null type:None
   [junit4]   2> 1331300 INFO  (TEST-CollectionsAPIDistributedZkTest.test-seed#[78F6B51827F7DDBC]) [    ] o.a.s.c.c.ConnectionManager Client is connected to ZooKeeper
   [junit4]   2> 1331300 INFO  (TEST-CollectionsAPIDistributedZkTest.test-seed#[78F6B51827F7DDBC]) [    ] o.a.s.c.c.SolrZkClient Using default ZkACLProvider
   [junit4]   2> 1331300 INFO  (TEST-CollectionsAPIDistributedZkTest.test-seed#[78F6B51827F7DDBC]) [    ] o.a.s.c.c.SolrZkClient makePath: /solr
   [junit4]   2> 1331305 INFO  (TEST-CollectionsAPIDistributedZkTest.test-seed#[78F6B51827F7DDBC]) [    ] o.a.s.c.c.SolrZkClient Using default ZkCredentialsProvider
   [junit4]   2> 1331306 INFO  (TEST-CollectionsAPIDistributedZkTest.test-seed#[78F6B51827F7DDBC]) [    ] o.a.s.c.c.ConnectionManager Waiting for client to connect to ZooKeeper
   [junit4]   2> 1331309 INFO  (zkCallback-1326-thread-1) [    ] o.a.s.c.c.ConnectionManager Watcher org.apache.solr.common.cloud.ConnectionManager@76a157f2 name:ZooKeeperConnection Watcher:127.0.0.1:52253/solr got event WatchedEvent state:SyncConnected type:None path:null path:null type:None
   [junit4]   2> 1331309 INFO  (TEST-CollectionsAPIDistributedZkTest.test-seed#[78F6B51827F7DDBC]) [    ] o.a.s.c.c.ConnectionManager Client is connected to ZooKeeper
   [junit4]   2> 1331309 INFO  (TEST-CollectionsAPIDistributedZkTest.test-seed#[78F6B51827F7DDBC]) [    ] o.a.s.c.c.SolrZkClient Using default ZkACLProvider
   [junit4]   2> 1331309 INFO  (TEST-CollectionsAPIDistributedZkTest.test-seed#[78F6B51827F7DDBC]) [    ] o.a.s.c.c.SolrZkClient makePath: /collections/collection1
   [junit4]   2> 1331313 INFO  (TEST-CollectionsAPIDistributedZkTest.test-seed#[78F6B51827F7DDBC]) [    ] o.a.s.c.c.SolrZkClient makePath: /collections/collection1/shards
   [junit4]   2> 1331317 INFO  (TEST-CollectionsAPIDistributedZkTest.test-seed#[78F6B51827F7DDBC]) [    ] o.a.s.c.c.SolrZkClient makePath: /collections/control_collection
   [junit4]   2> 1331322 INFO  (TEST-CollectionsAPIDistributedZkTest.test-seed#[78F6B51827F7DDBC]) [    ] o.a.s.c.c.SolrZkClient makePath: /collections/control_collection/shards
   [junit4]   2> 1331326 INFO  (TEST-CollectionsAPIDistributedZkTest.test-seed#[78F6B51827F7DDBC]) [    ] o.a.s.c.AbstractZkTestCase put /Users/jenkins/workspace/Lucene-Solr-5.x-MacOSX/solr/core/src/test-files/solr/collection1/conf/solrconfig-tlog.xml to /configs/conf1/solrconfig.xml
   [junit4]   2> 1331327 INFO  (TEST-CollectionsAPIDistributedZkTest.test-seed#[78F6B51827F7DDBC]) [    ] o.a.s.c.c.SolrZkClient makePath: /configs/conf1/solrconfig.xml
   [junit4]   2> 1331334 INFO  (TEST-CollectionsAPIDistributedZkTest.test-seed#[78F6B51827F7DDBC]) [    ] o.a.s.c.AbstractZkTestCase put /Users/jenkins/workspace/Lucene-Solr-5.x-MacOSX/solr/core/src/test-files/solr/collection1/conf/schema.xml to /configs/conf1/schema.xml
   [junit4]   2> 1331334 INFO  (TEST-CollectionsAPIDistributedZkTest.test-seed#[78F6B51827F7DDBC]) [    ] o.a.s.c.c.SolrZkClient makePath: /configs/conf1/schema.xml
   [junit4]   2> 1331338 INFO  (TEST-CollectionsAPIDistributedZkTest.test-seed#[78F6B51827F7DDBC]) [    ] o.a.s.c.AbstractZkTestCase put /Users/jenkins/workspace/Lucene-Solr-5.x-MacOSX/solr/core/src/test-files/solr/collection1/conf/solrconfig.snippet.randomindexconfig.xml to /configs/conf1/solrconfig.snippet.randomindexconfig.xml
   [junit4]   2> 1331338 INFO  (TEST-CollectionsAPIDistributedZkTest.test-seed#[78F6B51827F7DDBC]) [    ] o.a.s.c.c.SolrZkClient makePath: /configs/conf1/solrconfig.snippet.randomindexconfig.xml
   [junit4]   2> 1331343 INFO  (TEST-CollectionsAPIDistributedZkTest.test-seed#[78F6B51827F7DDBC]) [    ] o.a.s.c.AbstractZkTestCase put /Users/jenkins/workspace/Lucene-Solr-5.x-MacOSX/solr/core/src/test-files/solr/collection1/conf/stopwords.txt to /configs/conf1/stopwords.txt
   [junit4]   2> 1331344 INFO  (TEST-CollectionsAPIDistributedZkTest.test-seed#[78F6B51827F7DDBC]) [    ] o.a.s.c.c.SolrZkClient makePath: /configs/conf1/stopwords.txt
   [junit4]   2> 1331350 INFO  (TEST-CollectionsAPIDistributedZkTest.test-seed#[78F6B51827F7DDBC]) [    ] o.a.s.c.AbstractZkTestCase put /Users/jenkins/workspace/Lucene-Solr-5.x-MacOSX/solr/core/src/test-files/solr/collection1/conf/protwords.txt to /configs/conf1/protwords.txt
   [junit4]   2> 1331350 INFO  (TEST-CollectionsAPIDistributedZkTest.test-seed#[78F6B51827F7DDBC]) [    ] o.a.s.c.c.SolrZkClient makePath: /configs/conf1/protwords.txt
   [junit4]   2> 1331354 INFO  (TEST-CollectionsAPIDistributedZkTest.test-seed#[78F6B51827F7DDBC]) [    ] o.a.s.c.AbstractZkTestCase put /Users/jenkins/workspace/Lucene-Solr-5.x-MacOSX/solr/core/src/test-files/solr/collection1/conf/currency.xml to /configs/conf1/currency.xml
   [junit4]   2> 1331354 INFO  (TEST-CollectionsAPIDistributedZkTest.test-seed#[78F6B51827F7DDBC]) [    ] o.a.s.c.c.SolrZkClient makePath: /configs/conf1/currency.xml
   [junit4]   2> 1331358 INFO  (TEST-CollectionsAPIDistributedZkTest.test-seed#[78F6B51827F7DDBC]) [    ] o.a.s.c.AbstractZkTestCase put /Users/jenkins/workspace/Lucene-Solr-5.x-MacOSX/solr/core/src/test-files/solr/collection1/conf/enumsConfig.xml to /configs/conf1/enumsConfig.xml
   [junit4]   2> 1331358 INFO  (TEST-CollectionsAPIDistributedZkTest.test-seed#[78F6B51827F7DDBC]) [    ] o.a.s.c.c.SolrZkClient makePath: /configs/conf1/enumsConfig.xml
   [junit4]   2> 1331362 INFO  (TEST-CollectionsAPIDistributedZkTest.test-seed#[78F6B51827F7DDBC]) [    ] o.a.s.c.AbstractZkTestCase put /Users/jenkins/workspace/Lucene-Solr-5.x-MacOSX/solr/core/src/test-files/solr/collection1/conf/open-exchange-rates.json to /configs/conf1/open-exchange-rates.json
   [junit4]   2> 1331362 INFO  (TEST-CollectionsAPIDistributedZkTest.test-seed#[78F6B51827F7DDBC]) [    ] o.a.s.c.c.SolrZkClient makePath: /configs/conf1/open-exchange-rates.json
   [junit4]   2> 1331365 INFO  (TEST-CollectionsAPIDistributedZkTest.test-seed#[78F6B51827F7DDBC]) [    ] o.a.s.c.AbstractZkTestCase put /Users/jenkins/workspace/Lucene-Solr-5.x-MacOSX/solr/core/src/test-files/solr/collection1/conf/mapping-ISOLatin1Accent.txt to /configs/conf1/mapping-ISOLatin1Accent.txt
   [junit4]   2> 1331366 INFO  (TEST-CollectionsAPIDistributedZkTest.test-seed#[78F6B51827F7DDBC]) [    ] o.a.s.c.c.SolrZkClient makePath: /configs/conf1/mapping-ISOLatin1Accent.txt
   [junit4]   2> 1331369 INFO  (TEST-CollectionsAPIDistributedZkTest.test-seed#[78F6B51827F7DDBC]) [    ] o.a.s.c.AbstractZkTestCase put /Users/jenkins/workspace/Lucene-Solr-5.x-MacOSX/solr/core/src/test-files/solr/collection1/conf/old_synonyms.txt to /configs/conf1/old_synonyms.txt
   [junit4]   2> 1331369 INFO  (TEST-CollectionsAPIDistributedZkTest.test-seed#[78F6B51827F7DDBC]) [    ] o.a.s.c.c.SolrZkClient makePath: /configs/conf1/old_synonyms.txt
   [junit4]   2> 1331373 INFO  (TEST-CollectionsAPIDistributedZkTest.test-seed#[78F6B51827F7DDBC]) [    ] o.a.s.c.AbstractZkTestCase put /Users/jenkins/workspace/Lucene-Solr-5.x-MacOSX/solr/core/src/test-files/solr/collection1/conf/synonyms.txt to /configs/conf1/synonyms.txt
   [junit4]   2> 1331373 INFO  (TEST-CollectionsAPIDistributedZkTest.test-seed#[78F6B51827F7DDBC]) [    ] o.a.s.c.c.SolrZkClient makePath: /configs/conf1/synonyms.txt
   [junit4]   2> 1331699 INFO  (TEST-CollectionsAPIDistributedZkTest.test-seed#[78F6B51827F7DDBC]) [    ] o.a.s.SolrTestCaseJ4 Writing core.properties file to /Users/jenkins/workspace/Lucene-Solr-5.x-MacOSX/solr/build/solr-core/test/J1/temp/solr.cloud.CollectionsAPIDistributedZkTest_78F6B51827F7DDBC-001/control-001/cores/collection1
   [junit4]   2> 1331701 INFO  (TEST-CollectionsAPIDistributedZkTest.test-seed#[78F6B51827F7DDBC]) [    ] o.e.j.s.Server jetty-9.2.11.v20150529
   [junit4]   2> 1331704 INFO  (TEST-CollectionsAPIDistributedZkTest.test-seed#[78F6B51827F7DDBC]) [    ] o.e.j.s.h.ContextHandler Started o.e.j.s.ServletContextHandler@fba11c1{/_ybs/qf,null,AVAILABLE}
   [junit4]   2> 1331707 INFO  (TEST-CollectionsAPIDistributedZkTest.test-seed#[78F6B51827F7DDBC]) [    ] o.e.j.s.ServerConnector Started ServerConnector@e39df8{HTTP/1.1}{127.0.0.1:52256}
   [junit4]   2> 1331707 INFO  (TEST-CollectionsAPIDistributedZkTest.test-seed#[78F6B51827F7DDBC]) [    ] o.e.j.s.Server Started @1336171ms
   [junit4]   2> 1331707 INFO  (TEST-CollectionsAPIDistributedZkTest.test-seed#[78F6B51827F7DDBC]) [    ] o.a.s.c.s.e.JettySolrRunner Jetty properties: {coreRootDirectory=/Users/jenkins/workspace/Lucene-Solr-5.x-MacOSX/solr/build/solr-core/test/J1/temp/solr.cloud.CollectionsAPIDistributedZkTest_78F6B51827F7DDBC-001/control-001/cores, solr.data.dir=/Users/jenkins/workspace/Lucene-Solr-5.x-MacOSX/solr/build/solr-core/test/J1/temp/solr.cloud.CollectionsAPIDistributedZkTest_78F6B51827F7DDBC-001/tempDir-001/control/data, hostContext=/_ybs/qf, hostPort=52256}
   [junit4]   2> 1331708 INFO  (TEST-CollectionsAPIDistributedZkTest.test-seed#[78F6B51827F7DDBC]) [    ] o.a.s.s.SolrDispatchFilter SolrDispatchFilter.init(): sun.misc.Launcher$AppClassLoader@a2c6f70
   [junit4]   2> 1331708 INFO  (TEST-CollectionsAPIDistributedZkTest.test-seed#[78F6B51827F7DDBC]) [    ] o.a.s.c.SolrResourceLoader new SolrResourceLoader for directory: '/Users/jenkins/workspace/Lucene-Solr-5.x-MacOSX/solr/build/solr-core/test/J1/temp/solr.cloud.CollectionsAPIDistributedZkTest_78F6B51827F7DDBC-001/control-001/'
   [junit4]   2> 1331745 INFO  (TEST-CollectionsAPIDistributedZkTest.test-seed#[78F6B51827F7DDBC]) [    ] o.a.s.c.c.SolrZkClient Using default ZkCredentialsProvider
   [junit4]   2> 1331746 INFO  (TEST-CollectionsAPIDistributedZkTest.test-seed#[78F6B51827F7DDBC]) [    ] o.a.s.c.c.ConnectionManager Waiting for client to connect to ZooKeeper
   [junit4]   2> 1331748 INFO  (zkCallback-1327-thread-1) [    ] o.a.s.c.c.ConnectionManager Watcher org.apache.solr.common.cloud.ConnectionManager@4483ffd9 name:ZooKeeperConnection Watcher:127.0.0.1:52253/solr got event WatchedEvent state:SyncConnected type:None path:null path:null type:None
   [junit4]   2> 1331749 INFO  (TEST-CollectionsAPIDistributedZkTest.test-seed#[78F6B51827F7DDBC]) [    ] o.a.s.c.c.ConnectionManager Client is connected to ZooKeeper
   [junit4]   2> 1331749 INFO  (TEST-CollectionsAPIDistributedZkTest.test-seed#[78F6B51827F7DDBC]) [    ] o.a.s.c.c.SolrZkClient Using default ZkACLProvider
   [junit4]   2> 1331751 INFO  (TEST-CollectionsAPIDistributedZkTest.test-seed#[78F6B51827F7DDBC]) [    ] o.a.s.s.SolrDispatchFilter Loading solr.xml from SolrHome (not found in ZooKeeper)
   [junit4]   2> 1331751 INFO  (TEST-CollectionsAPIDistributedZkTest.test-seed#[78F6B51827F7DDBC]) [    ] o.a.s.c.SolrXmlConfig Loading container configuration from /Users/jenkins/workspace/Lucene-Solr-5.x-MacOSX/solr/build/solr-core/test/J1/temp/solr.cloud.CollectionsAPIDistributedZkTest_78F6B51827F7DDBC-001/control-001/solr.xml
   [junit4]   2> 1331777 INFO  (TEST-CollectionsAPIDistributedZkTest.test-seed#[78F6B51827F7DDBC]) [    ] o.a.s.c.CoresLocator Config-defined core root directory: /Users/jenkins/workspace/Lucene-Solr-5.x-MacOSX/solr/build/solr-core/test/J1/temp/solr.cloud.CollectionsAPIDistributedZkTest_78F6B51827F7DDBC-001/control-001/cores
   [junit4]   2> 1331777 INFO  (TEST-CollectionsAPIDistributedZkTest.test-seed#[78F6B51827F7DDBC]) [    ] o.a.s.c.CoreContainer New CoreContainer 847077156
   [junit4]   2> 1331778 INFO  (TEST-CollectionsAPIDistributedZkTest.test-seed#[78F6B51827F7DDBC]) [    ] o.a.s.c.CoreContainer Loading cores into CoreContainer [instanceDir=/Users/jenkins/workspace/Lucene-Solr-5.x-MacOSX/solr/build/solr-core/test/J1/temp/solr.cloud.CollectionsAPIDistributedZkTest_78F6B51827F7DDBC-001/control-001/]
   [junit4]   2> 1331778 INFO  (TEST-CollectionsAPIDistributedZkTest.test-seed#[78F6B51827F7DDBC]) [    ] o.a.s.c.CoreContainer loading shared library: /Users/jenkins/workspace/Lucene-Solr-5.x-MacOSX/solr/build/solr-core/test/J1/temp/solr.cloud.CollectionsAPIDistributedZkTest_78F6B51827F7DDBC-001/control-001/lib
   [junit4]   2> 1331778 WARN  (TEST-CollectionsAPIDistributedZkTest.test-seed#[78F6B51827F7DDBC]) [    ] o.a.s.c.SolrResourceLoader Can't find (or read) directory to add to classloader: lib (resolved as: /Users/jenkins/workspace/Lucene-Solr-5.x-MacOSX/solr/build/solr-core/test/J1/temp/solr.cloud.CollectionsAPIDistributedZkTest_78F6B51827F7DDBC-001/control-001/lib).
   [junit4]   2> 1331787 INFO  (TEST-CollectionsAPIDistributedZkTest.test-seed#[78F6B51827F7DDBC]) [    ] o.a.s.h.c.HttpShardHandlerFactory created with socketTimeout : 90000,urlScheme : ,connTimeout : 15000,maxConnectionsPerHost : 20,maxConnections : 10000,corePoolSize : 0,maximumPoolSize : 2147483647,maxThreadIdleTime : 5,sizeOfQueue : -1,fairnessPolicy : false,useRetries : false,
   [junit4]   2> 1331790 INFO  (TEST-CollectionsAPIDistributedZkTest.test-seed#[78F6B51827F7DDBC]) [    ] o.a.s.u.UpdateShardHandler Creating UpdateShardHandler HTTP client with params: socketTimeout=340000&connTimeout=45000&retry=true
   [junit4]   2> 1331790 INFO  (TEST-CollectionsAPIDistributedZkTest.test-seed#[78F6B51827F7DDBC]) [    ] o.a.s.l.LogWatcher SLF4J impl is org.slf4j.impl.Log4jLoggerFactory
   [junit4]   2> 1331790 INFO  (TEST-CollectionsAPIDistributedZkTest.test-seed#[78F6B51827F7DDBC]) [    ] o.a.s.l.LogWatcher Registering Log Listener [Log4j (org.slf4j.impl.Log4jLoggerFactory)]
   [junit4]   2> 1331790 INFO  (TEST-CollectionsAPIDistributedZkTest.test-seed#[78F6B51827F7DDBC]) [    ] o.a.s.c.ZkContainer Zookeeper client=127.0.0.1:52253/solr
   [junit4]   2> 1331791 INFO  (TEST-CollectionsAPIDistributedZkTest.test-seed#[78F6B51827F7DDBC]) [    ] o.a.s.c.ZkController zkHost includes chroot
   [junit4]   2> 1331791 INFO  (TEST-CollectionsAPIDistributedZkTest.test-seed#[78F6B51827F7DDBC]) [    ] o.a.s.c.c.SolrZkClient Using default ZkCredentialsProvider
   [junit4]   2> 1331791 INFO  (TEST-CollectionsAPIDistributedZkTest.test-seed#[78F6B51827F7DDBC]) [    ] o.a.s.c.c.ConnectionManager Waiting for client to connect to ZooKeeper
   [junit4]   2> 1331793 INFO  (zkCallback-1329-thread-1) [    ] o.a.s.c.c.ConnectionManager Watcher org.apache.solr.common.cloud.ConnectionManager@75e844f4 name:ZooKeeperConnection Watcher:127.0.0.1:52253 got event WatchedEvent state:SyncConnected type:None path:null path:null type:None
   [junit4]   2> 1331794 INFO  (TEST-CollectionsAPIDistributedZkTest.test-seed#[78F6B51827F7DDBC]) [    ] o.a.s.c.c.ConnectionManager Client is connected to ZooKeeper
   [junit4]   2> 1331794 INFO  (TEST-CollectionsAPIDistributedZkTest.test-seed#[78F6B51827F7DDBC]) [    ] o.a.s.c.c.SolrZkClient Using default ZkACLProvider
   [junit4]   2> 1331797 INFO  (TEST-CollectionsAPIDistributedZkTest.test-seed#[78F6B51827F7DDBC]) [n:127.0.0.1:52256__ybs%2Fqf    ] o.a.s.c.c.ConnectionManager Waiting for client to connect to ZooKeeper
   [junit4]   2> 1331799 INFO  (zkCallback-1330-thread-1-processing-n:127.0.0.1:52256__ybs%2Fqf) [n:127.0.0.1:52256__ybs%2Fqf    ] o.a.s.c.c.ConnectionManager Watcher org.apache.solr.common.cloud.ConnectionManager@467cf262 name:ZooKeeperConnection Watcher:127.0.0.1:52253/solr got event WatchedEvent state:SyncConnected type:None path:null path:null type:None
   [junit4]   2> 1331799 INFO  (TEST-CollectionsAPIDistributedZkTest.test-seed#[78F6B51827F7DDBC]) [n:127.0.0.1:52256__ybs%2Fqf    ] o.a.s.c.c.ConnectionManager Client is connected to ZooKeeper
   [junit4]   2> 1331801 INFO  (TEST-CollectionsAPIDistributedZkTest.test-seed#[78F6B51827F7DDBC]) [n:127.0.0.1:52256__ybs%2Fqf    ] o.a.s.c.c.SolrZkClient makePath: /overseer/queue
   [junit4]   2> 1331805 INFO  (TEST-CollectionsAPIDistributedZkTest.test-seed#[78F6B51827F7DDBC]) [n:127.0.0.1:52256__ybs%2Fqf    ] o.a.s.c.c.SolrZkClient makePath: /overseer/collection-queue-work
   [junit4]   2> 1331810 INFO  (TEST-CollectionsAPIDistributedZkTest.test-seed#[78F6B51827F7DDBC]) [n:127.0.0.1:52256__ybs%2Fqf    ] o.a.s.c.c.SolrZkClient makePath: /overseer/collection-map-running
   [junit4]   2> 1331815 INFO  (TEST-CollectionsAPIDistributedZkTest.test-seed#[78F6B51827F7DDBC]) [n:127.0.0.1:52256__ybs%2Fqf    ] o.a.s.c.c.SolrZkClient makePath: /overseer/collection-map-completed
   [junit4]   2> 1331819 INFO  (TEST-CollectionsAPIDistributedZkTest.test-seed#[78F6B51827F7DDBC]) [n:127.0.0.1:52256__ybs%2Fqf    ] o.a.s.c.c.SolrZkClient makePath: /overseer/collection-map-failure
   [junit4]   2> 1331824 INFO  (TEST-CollectionsAPIDistributedZkTest.test-seed#[78F6B51827F7DDBC]) [n:127.0.0.1:52256__ybs%2Fqf    ] o.a.s.c.c.SolrZkClient makePath: /live_nodes
   [junit4]   2> 1331827 INFO  (TEST-CollectionsAPIDistributedZkTest.test-seed#[78F6B51827F7DDBC]) [n:127.0.0.1:52256__ybs%2Fqf    ] o.a.s.c.c.SolrZkClient makePath: /aliases.json
   [junit4]   2> 1331830 INFO  (TEST-CollectionsAPIDistributedZkTest.test-seed#[78F6B51827F7DDBC]) [n:127.0.0.1:52256__ybs%2Fqf    ] o.a.s.c.c.SolrZkClient makePath: /clusterstate.json
   [junit4]   2> 1331834 INFO  (TEST-CollectionsAPIDistributedZkTest.test-seed#[78F6B51827F7DDBC]) [n:127.0.0.1:52256__ybs%2Fqf    ] o.a.s.c.c.SolrZkClient makePath: /security.json
   [junit4]   2> 1331836 INFO  (TEST-CollectionsAPIDistributedZkTest.test-seed#[78F6B51827F7DDBC]) [n:127.0.0.1:52256__ybs%2Fqf    ] o.a.s.c.ZkController Register node as live in ZooKeeper:/live_nodes/127.0.0.1:52256__ybs%2Fqf
   [junit4]   2> 1331837 INFO  (TEST-CollectionsAPIDistributedZkTest.test-seed#[78F6B51827F7DDBC]) [n:127.0.0.1:52256__ybs%2Fqf    ] o.a.s.c.c.SolrZkClient makePath: /live_nodes/127.0.0.1:52256__ybs%2Fqf
   [junit4]   2> 1331840 INFO  (TEST-CollectionsAPIDistributedZkTest.test-seed#[78F6B51827F7DDBC]) [n:127.0.0.1:52256__ybs%2Fqf    ] o.a.s.c.c.SolrZkClient makePath: /overseer_elect
   [junit4]   2> 1331843 INFO  (TEST-CollectionsAPIDistributedZkTest.test-seed#[78F6B51827F7DDBC]) [n:127.0.0.1:52256__ybs%2Fqf    ] o.a.s.c.c.SolrZkClient makePath: /overseer_elect/election
   [junit4]   2> 1331846 INFO  (TEST-CollectionsAPIDistributedZkTest.test-seed#[78F6B51827F7DDBC]) [n:127.0.0.1:52256__ybs%2Fqf    ] o.a.s.c.Overseer Overseer (id=null) closing
   [junit4]   2> 1331847 INFO  (TEST-CollectionsAPIDistributedZkTest.test-seed#[78F6B51827F7DDBC]) [n:127.0.0.1:52256__ybs%2Fqf    ] o.a.s.c.LeaderElector Joined leadership election with path: /overseer_elect/election/94345531470053380-127.0.0.1:52256__ybs%2Fqf-n_0000000000
   [junit4]   2> 1331849 INFO  (TEST-CollectionsAPIDistributedZkTest.test-seed#[78F6B51827F7DDBC]) [n:127.0.0.1:52256__ybs%2Fqf    ] o.a.s.c.OverseerElectionContext I am going to be the leader 127.0.0.1:52256__ybs%2Fqf
   [junit4]   2> 1331849 INFO  (TEST-CollectionsAPIDistributedZkTest.test-seed#[78F6B51827F7DDBC]) [n:127.0.0.1:52256__ybs%2Fqf    ] o.a.s.c.c.SolrZkClient makePath: /overseer_elect/leader
   [junit4]   2> 1331852 INFO  (TEST-CollectionsAPIDistributedZkTest.test-seed#[78F6B51827F7DDBC]) [n:127.0.0.1:52256__ybs%2Fqf    ] o.a.s.c.Overseer Overseer (id=94345531470053380-127.0.0.1:52256__ybs%2Fqf-n_0000000000) starting
   [junit4]   2> 1331855 INFO  (TEST-CollectionsAPIDistributedZkTest.test-seed#[78F6B51827F7DDBC]) [n:127.0.0.1:52256__ybs%2Fqf    ] o.a.s.c.c.SolrZkClient makePath: /overseer/queue-work
   [junit4]   2> 1331869 INFO  (TEST-CollectionsAPIDistributedZkTest.test-seed#[78F6B51827F7DDBC]) [n:127.0.0.1:52256__ybs%2Fqf    ] o.a.s.c.OverseerAutoReplicaFailoverThread Starting OverseerAutoReplicaFailoverThread autoReplicaFailoverWorkLoopDelay=10000 autoReplicaFailoverWaitAfterExpiration=10000 autoReplicaFailoverBadNodeExpiration=60000
   [junit4]   2> 1331870 INFO  (OverseerCollectionProcessor-94345531470053380-127.0.0.1:52256__ybs%2Fqf-n_0000000000) [n:127.0.0.1:52256__ybs%2Fqf    ] o.a.s.c.OverseerProcessor Process current queue of overseer operations
   [junit4]   2> 1331870 INFO  (TEST-CollectionsAPIDistributedZkTest.test-seed#[78F6B51827F7DDBC]) [n:127.0.0.1:52256__ybs%2Fqf    ] o.a.s.c.c.ZkStateReader Updating cluster state from ZooKeeper... 
   [junit4]   2> 1331870 INFO  (OverseerStateUpdate-94345531470053380-127.0.0.1:52256__ybs%2Fqf-n_0000000000) [n:127.0.0.1:52256__ybs%2Fqf    ] o.a.s.c.Overseer Starting to work on the main queue
   [junit4]   2> 1331888 INFO  (TEST-CollectionsAPIDistributedZkTest.test-seed#[78F6B51827F7DDBC]) [n:127.0.0.1:52256__ybs%2Fqf    ] o.a.s.c.CoreContainer Security conf doesn't exist. Skipping setup for authorization module.
   [junit4]   2> 1331889 INFO  (TEST-CollectionsAPIDistributedZkTest.test-seed#[78F6B51827F7DDBC]) [n:127.0.0.1:52256__ybs%2Fqf    ] o.a.s.c.CoreContainer No authentication plugin used.
   [junit4]   2> 1331891 INFO  (TEST-CollectionsAPIDistributedZkTest.test-seed#[78F6B51827F7DDBC]) [n:127.0.0.1:52256__ybs%2Fqf    ] o.a.s.c.CoresLocator Looking for core definitions underneath /Users/jenkins/workspace/Lucene-Solr-5.x-MacOSX/solr/build/solr-core/test/J1/temp/solr.cloud.CollectionsAPIDistributedZkTest_78F6B51827F7DDBC-001/control-001/cores
   [junit4]   2> 1331892 INFO  (TEST-CollectionsAPIDistributedZkTest.test-seed#[78F6B51827F7DDBC]) [n:127.0.0.1:52256__ybs%2Fqf    ] o.a.s.c.SolrCore Created CoreDescriptor: {shard=, config=solrconfig.xml, configSetProperties=configsetprops.json, dataDir=data/, absoluteInstDir=/Users/jenkins/workspace/Lucene-Solr-5.x-MacOSX/solr/build/solr-core/test/J1/temp/solr.cloud.CollectionsAPIDistributedZkTest_78F6B51827F7DDBC-001/control-001/cores/collection1/, schema=schema.xml, collection=control_collection, coreNodeName=, name=collection1, loadOnStartup=true, transient=false, instanceDir=/Users/jenkins/workspace/Lucene-Solr-5.x-MacOSX/solr/build/solr-core/test/J1/temp/solr.cloud.CollectionsAPIDistributedZkTest_78F6B51827F7DDBC-001/control-001/cores/collection1}
   [junit4]   2> 1331893 INFO  (TEST-CollectionsAPIDistributedZkTest.test-seed#[78F6B51827F7DDBC]) [n:127.0.0.1:52256__ybs%2Fqf    ] o.a.s.c.CoresLocator Found core collection1 in /Users/jenkins/workspace/Lucene-Solr-5.x-MacOSX/solr/build/solr-core/test/J1/temp/solr.cloud.CollectionsAPIDistributedZkTest_78F6B51827F7DDBC-001/control-001/cores/collection1/
   [junit4]   2> 1331893 INFO  (TEST-CollectionsAPIDistributedZkTest.test-seed#[78F6B51827F7DDBC]) [n:127.0.0.1:52256__ybs%2Fqf    ] o.a.s.c.CoresLocator Found 1 core definitions
   [junit4]   2> 1331894 INFO  (coreLoadExecutor-3687-thread-1-processing-n:127.0.0.1:52256__ybs%2Fqf) [n:127.0.0.1:52256__ybs%2Fqf c:control_collection   x:collection1] o.a.s.c.ZkController publishing state=down
   [junit4]   2> 1331894 INFO  (TEST-CollectionsAPIDistributedZkTest.test-seed#[78F6B51827F7DDBC]) [n:127.0.0.1:52256__ybs%2Fqf    ] o.a.s.s.SolrDispatchFilter user.dir=/Users/jenkins/workspace/Lucene-Solr-5.x-MacOSX/solr/build/solr-core/test/J1
   [junit4]   2> 1331894 INFO  (TEST-CollectionsAPIDistributedZkTest.test-seed#[78F6B51827F7DDBC]) [n:127.0.0.1:52256__ybs%2Fqf    ] o.a.s.s.SolrDispatchFilter SolrDispatchFilter.init() done
   [junit4]   2> 1331894 INFO  (coreLoadExecutor-3687-thread-1-processing-n:127.0.0.1:52256__ybs%2Fqf) [n:127.0.0.1:52256__ybs%2Fqf c:control_collection   x:collection1] o.a.s.c.ZkController numShards not found on descriptor - reading it from system property
   [junit4]   2> 1331896 INFO  (coreLoadExecutor-3687-thread-1-processing-n:127.0.0.1:52256__ybs%2Fqf) [n:127.0.0.1:52256__ybs%2Fqf c:control_collection   x:collection1] o.a.s.c.ZkController look for our core node name
   [junit4]   2> 1331896 INFO  (zkCallback-1330-thread-1-processing-n:127.0.0.1:52256__ybs%2Fqf) [n:127.0.0.1:52256__ybs%2Fqf    ] o.a.s.c.DistributedQueue NodeChildrenChanged fired on path /overseer/queue state SyncConnected
   [junit4]   2> 1331898 INFO  (OverseerStateUpdate-94345531470053380-127.0.0.1:52256__ybs%2Fqf-n_0000000000) [n:127.0.0.1:52256__ybs%2Fqf    ] o.a.s.c.Overseer processMessage: queueSize: 1, message = {
   [junit4]   2>   "core":"collection1",
   [junit4]   2>   "operation":"state",
   [junit4]   2>   "base_url":"http://127.0.0.1:52256/_ybs/qf",
   [junit4]   2>   "numShards":"1",
   [junit4]   2>   "roles":null,
   [junit4]   2>   "shard":null,
   [junit4]   2>   "state":"down",
   [junit4]   2>   "collection":"control_collection",
   [junit4]   2>   "node_name":"127.0.0.1:52256__ybs%2Fqf"} current state version: 0
   [junit4]   2> 1331898 INFO  (OverseerStateUpdate-94345531470053380-127.0.0.1:52256__ybs%2Fqf-n_0000000000) [n:127.0.0.1:52256__ybs%2Fqf    ] o.a.s.c.o.ReplicaMutator Update state numShards=1 message={
   [junit4]   2>   "core":"collection1",
   [junit4]   2>   "operation":"state",
   [junit4]   2>   "base_url":"http://127.0.0.1:52256/_ybs/qf",
   [junit4]   2>   "numShards":"1",
   [junit4]   2>   "roles":null,
   [junit4]   2>   "shard":null,
   [junit4]   2>   "state":"down",
   [junit4]   2>   "collection":"control_collection",
   [junit4]   2>   "node_name":"127.0.0.1:52256__ybs%2Fqf"}
   [junit4]   2> 1331899 INFO  (OverseerStateUpdate-94345531470053380-127.0.0.1:52256__ybs%2Fqf-n_0000000000) [n:127.0.0.1:52256__ybs%2Fqf    ] o.a.s.c.o.ClusterStateMutator building a new cName: control_collection
   [junit4]   2> 1331899 INFO  (OverseerStateUpdate-94345531470053380-127.0.0.1:52256__ybs%2Fqf-n_0000000000) [n:127.0.0.1:52256__ybs%2Fqf    ] o.a.s.c.o.ReplicaMutator Assigning new node to shard shard=shard1
   [junit4]   2> 1331901 INFO  (zkCallback-1330-thread-1-processing-n:127.0.0.1:52256__ybs%2Fqf) [n:127.0.0.1:52256__ybs%2Fqf    ] o.a.s.c.c.ZkStateReader A cluster state change: WatchedEvent state:SyncConnected type:NodeDataChanged path:/clusterstate.json, has occurred - updating... (live nodes size: 1)
   [junit4]   2> 1332897 INFO  (coreLoadExecutor-3687-thread-1-processing-n:127.0.0.1:52256__ybs%2Fqf) [n:127.0.0.1:52256__ybs%2Fqf c:control_collection   x:collection1] o.a.s.c.ZkController waiting to find shard id in clusterstate for collection1
   [junit4]   2> 1332897 INFO  (coreLoadExecutor-3687-thread-1-processing-n:127.0.0.1:52256__ybs%2Fqf) [n:127.0.0.1:52256__ybs%2Fqf c:control_collection   x:collection1] o.a.s.c.ZkController Check for collection zkNode:control_collection
   [junit4]   2> 1332898 INFO  (coreLoadExecutor-3687-thread-1-processing-n:127.0.0.1:52256__ybs%2Fqf) [n:127.0.0.1:52256__ybs%2Fqf c:control_collection   x:collection1] o.a.s.c.ZkController Collection zkNode exists
   [junit4]   2> 1332899 INFO  (coreLoadExecutor-3687-thread-1-processing-n:127.0.0.1:52256__ybs%2Fqf) [n:127.0.0.1:52256__ybs%2Fqf c:control_collection   x:collection1] o.a.s.c.c.ZkStateReader Load collection config from:/collections/control_collection
   [junit4]   2> 1332900 INFO  (coreLoadExecutor-3687-thread-1-processing-n:127.0.0.1:52256__ybs%2Fqf) [n:127.0.0.1:52256__ybs%2Fqf c:control_collection   x:collection1] o.a.s.c.c.ZkStateReader path=/collections/control_collection configName=conf1 specified config exists in ZooKeeper
   [junit4]   2> 1332901 INFO  (coreLoadExecutor-3687-thread-1-processing-n:127.0.0.1:52256__ybs%2Fqf) [n:127.0.0.1:52256__ybs%2Fqf c:control_collection   x:collection1] o.a.s.c.SolrResourceLoader new SolrResourceLoader for directory: '/Users/jenkins/workspace/Lucene-Solr-5.x-MacOSX/solr/build/solr-core/test/J1/temp/solr.cloud.CollectionsAPIDistributedZkTest_78F6B51827F7DDBC-001/control-001/cores/collection1/'
   [junit4]   2> 1332926 INFO  (coreLoadExecutor-3687-thread-1-processing-n:127.0.0.1:52256__ybs%2Fqf) [n:127.0.0.1:52256__ybs%2Fqf c:control_collection   x:collection1] o.a.s.c.Config loaded config solrconfig.xml with version 0 
   [junit4]   2> 1332937 INFO  (coreLoadExecutor-3687-thread-1-processing-n:127.0.0.1:52256__ybs%2Fqf) [n:127.0.0.1:52256__ybs%2Fqf c:control_collection   x:collection1] o.a.s.c.SolrConfig current version of requestparams : -1
   [junit4]   2> 1332956 INFO  (coreLoadExecutor-3687-thread-1-processing-n:127.0.0.1:52256__ybs%2Fqf) [n:127.0.0.1:52256__ybs%2Fqf c:control_collection   x:collection1] o.a.s.c.SolrConfig Using Lucene MatchVersion: 5.4.0
   [junit4]   2> 1332996 INFO  (coreLoadExecutor-3687-thread-1-processing-n:127.0.0.1:52256__ybs%2Fqf) [n:127.0.0.1:52256__ybs%2Fqf c:control_collection   x:collection1] o.a.s.c.Config Loaded SolrConfig: solrconfig.xml
   [junit4]   2> 1333006 INFO  (coreLoadExecutor-3687-thread-1-processing-n:127.0.0.1:52256__ybs%2Fqf) [n:127.0.0.1:52256__ybs%2Fqf c:control_collection   x:collection1] o.a.s.s.IndexSchema Reading Solr Schema from /configs/conf1/schema.xml
   [junit4]   2> 1333012 INFO  (coreLoadExecutor-3687-thread-1-processing-n:127.0.0.1:52256__ybs%2Fqf) [n:127.0.0.1:52256__ybs%2Fqf c:control_collection   x:collection1] o.a.s.s.IndexSchema [collection1] Schema name=test
   [junit4]   2> 1333376 INFO  (coreLoadExecutor-3687-thread-1-processing-n:127.0.0.1:52256__ybs%2Fqf) [n:127.0.0.1:52256__ybs%2Fqf c:control_collection   x:collection1] o.a.s.s.OpenExchangeRatesOrgProvider Initialized with rates=open-exchange-rates.json, refreshInterval=1440.
   [junit4]   2> 1333386 INFO  (coreLoadExecutor-3687-thread-1-processing-n:127.0.0.1:52256__ybs%2Fqf) [n:127.0.0.1:52256__ybs%2Fqf c:control_collection   x:collection1] o.a.s.s.IndexSchema default search field in schema is text
   [junit4]   2> 1333388 INFO  (coreLoadExecutor-3687-thread-1-processing-n:127.0.0.1:52256__ybs%2Fqf) [n:127.0.0.1:52256__ybs%2Fqf c:control_collection   x:collection1] o.a.s.s.IndexSchema unique key field: id
   [junit4]   2> 1333406 INFO  (coreLoadExecutor-3687-thread-1-processing-n:127.0.0.1:52256__ybs%2Fqf) [n:127.0.0.1:52256__ybs%2Fqf c:control_collection   x:collection1] o.a.s.s.FileExchangeRateProvider Reloading exchange rates from file currency.xml
   [junit4]   2> 1333411 INFO  (coreLoadExecutor-3687-thread-1-processing-n:127.0.0.1:52256__ybs%2Fqf) [n:127.0.0.1:52256__ybs%2Fqf c:control_collection   x:collection1] o.a.s.s.FileExchangeRateProvider Reloading exchange rates from file currency.xml
   [junit4]   2> 1333416 INFO  (coreLoadExecutor-3687-thread-1-processing-n:127.0.0.1:52256__ybs%2Fqf) [n:127.0.0.1:52256__ybs%2Fqf c:control_collection   x:collection1] o.a.s.s.OpenExchangeRatesOrgProvider Reloading exchange rates from open-exchange-rates.json
   [junit4]   2> 1333418 WARN  (coreLoadExecutor-3687-thread-1-processing-n:127.0.0.1:52256__ybs%2Fqf) [n:127.0.0.1:52256__ybs%2Fqf c:control_collection   x:collection1] o.a.s.s.OpenExchangeRatesOrgProvider Unknown key IMPORTANT NOTE
   [junit4]   2> 1333418 WARN  (coreLoadExecutor-3687-thread-1-processing-n:127.0.0.1:52256__ybs%2Fqf) [n:127.0.0.1:52256__ybs%2Fqf c:control_collection   x:collection1] o.a.s.s.OpenExchangeRatesOrgProvider Expected key, got STRING
   [junit4]   2> 1333419 INFO  (coreLoadExecutor-3687-thread-1-processing-n:127.0.0.1:52256__ybs%2Fqf) [n:127.0.0.1:52256__ybs%2Fqf c:control_collection   x:collection1] o.a.s.s.OpenExchangeRatesOrgProvider Reloading exchange rates from open-exchange-rates.json
   [junit4]   2> 1333420 WARN  (coreLoadExecutor-3687-thread-1-processing-n:127.0.0.1:52256__ybs%2Fqf) [n:127.0.0.1:52256__ybs%2Fqf c:control_collection   x:collection1] o.a.s.s.OpenExchangeRatesOrgProvider Unknown key IMPORTANT NOTE
   [junit4]   2> 1333420 WARN  (coreLoadExecutor-3687-thread-1-processing-n:127.0.0.1:52256__ybs%2Fqf) [n:127.0.0.1:52256__ybs%2Fqf c:control_collection   x:collection1] o.a.s.s.OpenExchangeRatesOrgProvider Expected key, got STRING
   [junit4]   2> 1333423 INFO  (coreLoadExecutor-3687-thread-1-processing-n:127.0.0.1:52256__ybs%2Fqf) [n:127.0.0.1:52256__ybs%2Fqf c:control_collection   x:collection1] o.a.s.c.ConfigSetProperties Did not find ConfigSet properties, assuming default properties: Can't find resource 'configsetprops.json' in classpath or '/configs/conf1', cwd=/Users/jenkins/workspace/Lucene-Solr-5.x-MacOSX/solr/build/solr-core/test/J1
   [junit4]   2> 1333424 INFO  (coreLoadExecutor-3687-thread-1-processing-n:127.0.0.1:52256__ybs%2Fqf) [n:127.0.0.1:52256__ybs%2Fqf c:control_collection   x:collection1] o.a.s.c.CoreContainer Creating SolrCore 'collection1' using configuration from collection control_collection
   [junit4]   2> 1333424 INFO  (coreLoadExecutor-3687-thread-1-processing-n:127.0.0.1:52256__ybs%2Fqf) [n:127.0.0.1:52256__ybs%2Fqf c:control_collection s:shard1 r:core_node1 x:collection1] o.a.s.c.SolrCore org.apache.solr.core.MockDirectoryFactory
   [junit4]   2> 1333424 INFO  (coreLoadExecutor-3687-thread-1-processing-n:127.0.0.1:52256__ybs%2Fqf) [n:127.0.0.1:52256__ybs%2Fqf c:control_collection s:shard1 r:core_node1 x:collection1] o.a.s.c.SolrCore [[collection1] ] Opening new SolrCore at [/Users/jenkins/workspace/Lucene-Solr-5.x-MacOSX/solr/build/solr-core/test/J1/temp/solr.cloud.CollectionsAPIDistributedZkTest_78F6B51827F7DDBC-001/control-001/cores/collection1/], dataDir=[null]
   [junit4]   2> 1333424 INFO  (coreLoadExecutor-3687-thread-1-processing-n:127.0.0.1:52256__ybs%2Fqf) [n:127.0.0.1:52256__ybs%2Fqf c:control_collection s:shard1 r:core_node1 x:collection1] o.a.s.c.JmxMonitoredMap JMX monitoring is enabled. Adding Solr mbeans to JMX Server: com.sun.jmx.mbeanserver.JmxMBeanServer@56a7505
   [junit4]   2> 1333425 INFO  (coreLoadExecutor-3687-thread-1-processing-n:127.0.0.1:52256__ybs%2Fqf) [n:127.0.0.1:52256__ybs%2Fqf c:control_collection s:shard1 r:core_node1 x:collection1] o.a.s.c.CachingDirectoryFactory return new directory for /Users/jenkins/workspace/Lucene-Solr-5.x-MacOSX/solr/build/solr-core/test/J1/temp/solr.cloud.CollectionsAPIDistributedZkTest_78F6B51827F7DDBC-001/control-001/cores/collection1/data
   [junit4]   2> 1333425 INFO  (coreLoadExecutor-3687-thread-1-processing-n:127.0.0.1:52256__ybs%2Fqf) [n:127.0.0.1:52256__ybs%2Fqf c:control_collection s:shard1 r:core_node1 x:collection1] o.a.s.c.SolrCore New index directory detected: old=null new=/Users/jenkins/workspace/Lucene-Solr-5.x-MacOSX/solr/build/solr-core/test/J1/temp/solr.cloud.CollectionsAPIDistributedZkTest_78F6B51827F7DDBC-001/control-001/cores/collection1/data/index/
   [junit4]   2> 1333426 WARN  (coreLoadExecutor-3687-thread-1-processing-n:127.0.0.1:52256__ybs%2Fqf) [n:127.0.0.1:52256__ybs%2Fqf c:control_collection s:shard1 r:core_node1 x:collection1] o.a.s.c.SolrCore [collection1] Solr index directory '/Users/jenkins/workspace/Lucene-Solr-5.x-MacOSX/solr/build/solr-core/test/J1/temp/solr.cloud.CollectionsAPIDistributedZkTest_78F6B51827F7DDBC-001/control-001/cores/collection1/data/index' doesn't exist. Creating new index...
   [junit4]   2> 1333426 INFO  (coreLoadExecutor-3687-thread-1-processing-n:127.0.0.1:52256__ybs%2Fqf) [n:127.0.0.1:52256__ybs%2Fqf c:control_collection s:shard1 r:core_node1 x:collection1] o.a.s.c.CachingDirectoryFactory return new directory for /Users/jenkins/workspace/Lucene-Solr-5.x-MacOSX/solr/build/solr-core/test/J1/temp/solr.cloud.CollectionsAPIDistributedZkTest_78F6B51827F7DDBC-001/control-001/cores/collection1/data/index
   [junit4]   2> 1333426 INFO  (coreLoadExecutor-3687-thread-1-processing-n:127.0.0.1:52256__ybs%2Fqf) [n:127.0.0.1:52256__ybs%2Fqf c:control_collection s:shard1 r:core_node1 x:collection1] o.a.s.u.RandomMergePolicy RandomMergePolicy wrapping class org.apache.lucene.index.LogDocMergePolicy: [LogDocMergePolicy: minMergeSize=1000, mergeFactor=49, maxMergeSize=9223372036854775807, maxMergeSizeForForcedMerge=9223372036854775807, calibrateSizeByDeletes=true, maxMergeDocs=2147483647, maxCFSSegmentSizeMB=8.796093022207999E12, noCFSRatio=0.0]
   [junit4]   2> 1333428 INFO  (coreLoadExecutor-3687-thread-1-processing-n:127.0.0.1:52256__ybs%2Fqf) [n:127.0.0.1:52256__ybs%2Fqf c:control_collection s:shard1 r:core_node1 x:collection1] o.a.s.c.SolrCore SolrDeletionPolicy.onCommit: commits: num=1
   [junit4]   2> 	commit{dir=MockDirectoryWrapper(RAMDirectory@669826c4 lockFactory=org.apache.lucene.store.SingleInstanceLockFactory@f19427b),segFN=segments_1,generation=1}
   [junit4]   2> 1333428 INFO  (coreLoadExecutor-3687-thread-1-processing-n:127.0.0.1:52256__ybs%2Fqf) [n:127.0.0.1:52256__ybs%2Fqf c:control_collection s:shard1 r:core_node1 x:collection1] o.a.s.c.SolrCore newest commit generation = 1
   [junit4]   2> 1333428 INFO  (OldIndexDirectoryCleanupThreadForCore-collection1) [n:127.0.0.1:52256__ybs%2Fqf c:control_collection s:shard1 r:core_node1 x:collection1] o.a.s.c.SolrCore Looking for old index directories to cleanup for core collection1 in /Users/jenkins/workspace/Lucene-Solr-5.x-MacOSX/solr/build/solr-core/test/J1/temp/solr.cloud.CollectionsAPIDistributedZkTest_78F6B51827F7DDBC-001/control-001/cores/collection1/data/
   [junit4]   2> 1333429 WARN  (OldIndexDirectoryCleanupThreadForCore-collection1) [n:127.0.0.1:52256__ybs%2Fqf c:control_collection s:shard1 r:core_node1 x:collection1] o.a.s.c.DirectoryFactory /Users/jenkins/workspace/Lucene-Solr-5.x-MacOSX/solr/build/solr-core/test/J1/temp/solr.cloud.CollectionsAPIDistributedZkTest_78F6B51827F7DDBC-001/control-001/cores/collection1/data/ does not point to a valid data directory; skipping clean-up of old index directories.
   [junit4]   2> 1333436 INFO  (coreLoadExecutor-3687-thread-1-processing-n:127.0.0.1:52256__ybs%2Fqf) [n:127.0.0.1:52256__ybs%2Fqf c:control_collection s:shard1 r:core_node1 x:collection1] o.a.s.u.p.UpdateRequestProcessorChain creating updateRequestProcessorChain "nodistrib"
   [junit4]   2> 1333437 INFO  (coreLoadExecutor-3687-thread-1-processing-n:127.0.0.1:52256__ybs%2Fqf) [n:127.0.0.1:52256__ybs%2Fqf c:control_collection s:shard1 r:core_node1 x:collection1] o.a.s.u.p.UpdateRequestProcessorChain creating updateRequestProcessorChain "dedupe"
   [junit4]   2> 1333437 INFO  (coreLoadExecutor-3687-thread-1-processing-n:127.0.0.1:52256__ybs%2Fqf) [n:127.0.0.1:52256__ybs%2Fqf c:control_collection s:shard1 r:core_node1 x:collection1] o.a.s.u.p.UpdateRequestProcessorChain inserting DistributedUpdateProcessorFactory into updateRequestProcessorChain "dedupe"
   [junit4]   2> 1333437 INFO  (coreLoadExecutor-3687-thread-1-processing-n:127.0.0.1:52256__ybs%2Fqf) [n:127.0.0.1:52256__ybs%2Fqf c:control_collection s:shard1 r:core_node1 x:collection1] o.a.s.u.p.UpdateRequestProcessorChain creating updateRequestProcessorChain "stored_sig"
   [junit4]   2> 1333437 INFO  (coreLoadExecutor-3687-thread-1-processing-n:127.0.0.1:52256__ybs%2Fqf) [n:127.0.0.1:52256__ybs%2Fqf c:control_collection s:shard1 r:core_node1 x:collection1] o.a.s.u.p.UpdateRequestProcessorChain inserting DistributedUpdateProcessorFactory into updateRequestProcessorChain "stored_sig"
   [junit4]   2> 1333437 INFO  (coreLoadExecutor-3687-thread-1-processing-n:127.0.0.1:52256__ybs%2Fqf) [n:127.0.0.1:52256__ybs%2Fqf c:control_collection s:shard1 r:core_node1 x:collection1] o.a.s.u.p.UpdateRequestProcessorChain creating updateRequestProcessorChain "distrib-dup-test-chain-explicit"
   [junit4]   2> 1333438 INFO  (coreLoadExecutor-3687-thread-1-processing-n:127.0.0.1:52256__ybs%2Fqf) [n:127.0.0.1:52256__ybs%2Fqf c:control_collection s:shard1 r:core_node1 x:collection1] o.a.s.u.p.UpdateRequestProcessorChain creating updateRequestProcessorChain "distrib-dup-test-chain-implicit"
   [junit4]   2> 1333438 INFO  (coreLoadExecutor-3687-thread-1-processing-n:127.0.0.1:52256__ybs%2Fqf) [n:127.0.0.1:52256__ybs%2Fqf c:control_collection s:shard1 r:core_node1 x:collection1] o.a.s.u.p.UpdateRequestProcessorChain inserting DistributedUpdateProcessorFactory into updateRequestProcessorChain "distrib-dup-test-chain-implicit"
   [junit4]   2> 1333438 INFO  (coreLoadExecutor-3687-thread-1-processing-n:127.0.0.1:52256__ybs%2Fqf) [n:127.0.0.1:52256__ybs%2Fqf c:control_collection s:shard1 r:core_node1 x:collection1] o.a.s.c.SolrCore no updateRequestProcessorChain defined as default, creating implicit default
   [junit4]   2> 1333449 INFO  (coreLoadExecutor-3687-thread-1-processing-n:127.0.0.1:52256__ybs%2Fqf) [n:127.0.0.1:52256__ybs%2Fqf c:control_collection s:shard1 r:core_node1 x:collection1] o.a.s.h.l.XMLLoader xsltCacheLifetimeSeconds=60
   [junit4]   2> 1333452 INFO  (coreLoadExecutor-3687-thread-1-processing-n:127.0.0.1:52256__ybs%2Fqf) [n:127.0.0.1:52256__ybs%2Fqf c:control_collection s:shard1 r:core_node1 x:collection1] o.a.s.h.l.XMLLoader xsltCacheLifetimeSeconds=60
   [junit4]   2> 1333453 INFO  (coreLoadExecutor-3687-thread-1-processing-n:127.0.0.1:52256__ybs%2Fqf) [n:127.0.0.1:52256__ybs%2Fqf c:control_collection s:shard1 r:core_node1 x:collection1] o.a.s.h.l.XMLLoader xsltCacheLifetimeSeconds=60
   [junit4]   2> 1333455 INFO  (coreLoadExecutor-3687-thread-1-processing-n:127.0.0.1:52256__ybs%2Fqf) [n:127.0.0.1:52256__ybs%2Fqf c:control_collection s:shard1 r:core_node1 x:collection1] o.a.s.h.l.XMLLoader xsltCacheLifetimeSeconds=60
   [junit4]   2> 1333462 INFO  (coreLoadExecutor-3687-thread-1-processing-n:127.0.0.1:52256__ybs%2Fqf) [n:127.0.0.1:52256__ybs%2Fqf c:control_collection s:shard1 r:core_node1 x:collection1] o.a.s.c.RequestHandlers Registered paths: /update/json/docs,/admin/mbeans,/admin/file,/config,/admin/threads,/get,/admin/segments,/admin/system,/admin/logging,/update/json,/admin/luke,/schema,/admin/plugins,/update,/update/csv,/admin/properties,/replication,/admin/ping,standard
   [junit4]   2> 1333464 INFO  (coreLoadExecutor-3687-thread-1-processing-n:127.0.0.1:52256__ybs%2Fqf) [n:127.0.0.1:52256__ybs%2Fqf c:control_collection s:shard1 r:core_node1 x:collection1] o.a.s.c.SolrCore Using default statsCache cache: org.apache.solr.search.stats.LocalStatsCache
   [junit4]   2> 1333465 INFO  (coreLoadExecutor-3687-thread-1-processing-n:127.0.0.1:52256__ybs%2Fqf) [n:127.0.0.1:52256__ybs%2Fqf c:control_collection s:shard1 r:core_node1 x:collection1] o.a.s.u.UpdateHandler Using UpdateLog implementation: org.apache.solr.update.UpdateLog
   [junit4]   2> 1333465 INFO  (coreLoadExecutor-3687-thread-1-processing-n:127.0.0.1:52256__ybs%2Fqf) [n:127.0.0.1:52256__ybs%2Fqf c:control_collection s:shard1 r:core_node1 x:collection1] o.a.s.u.UpdateLog Initializing UpdateLog: dataDir= defaultSyncLevel=FLUSH numRecordsToKeep=100 maxNumLogsToKeep=10 numVersionBuckets=65536
   [junit4]   2> 1333468 INFO  (coreLoadExecutor-3687-thread-1-processing-n:127.0.0.1:52256__ybs%2Fqf) [n:127.0.0.1:52256__ybs%2Fqf c:control_collection s:shard1 r:core_node1 x:collection1] o.a.s.c.SolrCore Hard AutoCommit: disabled
   [junit4]   2> 1333468 INFO  (coreLoadExecutor-3687-thread-1-processing-n:127.0.0.1:52256__ybs%2Fqf) [n:127.0.0.1:52256__ybs%2Fqf c:control_collection s:shard1 r:core_node1 x:collection1] o.a.s.c.SolrCore Soft AutoCommit: disabled
   [junit4]   2> 1333469 INFO  (coreLoadExecutor-3687-thread-1-processing-n:127.0.0.1:52256__ybs%2Fqf) [n:127.0.0.1:52256__ybs%2Fqf c:control_collection s:shard1 r:core_node1 x:collection1] o.a.s.u.RandomMergePolicy RandomMergePolicy wrapping class org.apache.lucene.index.LogDocMergePolicy: [LogDocMergePolicy: minMergeSize=1000, mergeFactor=36, maxMergeSize=9223372036854775807, maxMergeSizeForForcedMerge=9223372036854775807, calibrateSizeByDeletes=true, maxMergeDocs=2147483647, maxCFSSegmentSizeMB=8.796093022207999E12, noCFSRatio=1.0]
   [junit4]   2> 1333469 INFO  (coreLoadExecutor-3687-thread-1-processing-n:127.0.0.1:52256__ybs%2Fqf) [n:127.0.0.1:52256__ybs%2Fqf c:control_collection s:shard1 r:core_node1 x:collection1] o.a.s.c.SolrCore SolrDeletionPolicy.onInit: commits: num=1
   [junit4]   2> 	commit{dir=MockDirectoryWrapper(RAMDirectory@669826c4 lockFactory=org.apache.lucene.store.SingleInstanceLockFactory@f19427b),segFN=segments_1,generation=1}
   [junit4]   2> 1333470 INFO  (coreLoadExecutor-3687-thread-1-processing-n:127.0.0.1:52256__ybs%2Fqf) [n:127.0.0.1:52256__ybs%2Fqf c:control_collection s:shard1 r:core_node1 x:collection1] o.a.s.c.SolrCore newest commit generation = 1
   [junit4]   2> 1333470 INFO  (coreLoadExecutor-3687-thread-1-processing-n:127.0.0.1:52256__ybs%2Fqf) [n:127.0.0.1:52256__ybs%2Fqf c:control_collection s:shard1 r:core_node1 x:collection1] o.a.s.s.SolrIndexSearcher Opening Searcher@617b402f[collection1] main
   [junit4]   2> 1333470 INFO  (coreLoadExecutor-3687-thread-1-processing-n:127.0.0.1:52256__ybs%2Fqf) [n:127.0.0.1:52256__ybs%2Fqf c:control_collection s:shard1 r:core_node1 x:collection1] o.a.s.c.c.ZkStateReader Load collection config from:/collections/control_collection
   [junit4]   2> 1333472 INFO  (coreLoadExecutor-3687-thread-1-processing-n:127.0.0.1:52256__ybs%2Fqf) [n:127.0.0.1:52256__ybs%2Fqf c:control_collection s:shard1 r:core_node1 x:collection1] o.a.s.c.c.ZkStateReader path=/collections/control_collection configName=conf1 specified config exists in ZooKeeper
   [junit4]   2> 1333472 INFO  (coreLoadExecutor-3687-thread-1-processing-n:127.0.0.1:52256__ybs%2Fqf) [n:127.0.0.1:52256__ybs%2Fqf c:control_collection s:shard1 r:core_node1 x:collection1] o.a.s.r.ManagedResourceStorage Setting up ZooKeeper-based storage for the RestManager with znodeBase: /configs/conf1
   [junit4]   2> 1333473 INFO  (coreLoadExecutor-3687-thread-1-processing-n:127.0.0.1:52256__ybs%2Fqf) [n:127.0.0.1:52256__ybs%2Fqf c:control_collection s:shard1 r:core_node1 x:collection1] o.a.s.r.ManagedResourceStorage Configured ZooKeeperStorageIO with znodeBase: /configs/conf1
   [junit4]   2> 1333473 INFO  (coreLoadExecutor-3687-thread-1-processing-n:127.0.0.1:52256__ybs%2Fqf) [n:127.0.0.1:52256__ybs%2Fqf c:control_collection s:shard1 r:core_node1 x:collection1] o.a.s.r.RestManager Initializing RestManager with initArgs: {}
   [junit4]   2> 1333473 INFO  (coreLoadExecutor-3687-thread-1-processing-n:127.0.0.1:52256__ybs%2Fqf) [n:127.0.0.1:52256__ybs%2Fqf c:control_collection s:shard1 r:core_node1 x:collection1] o.a.s.r.ManagedResourceStorage Reading _rest_managed.json using ZooKeeperStorageIO:path=/configs/conf1
   [junit4]   2> 1333474 INFO  (coreLoadExecutor-3687-thread-1-processing-n:127.0.0.1:52256__ybs%2Fqf) [n:127.0.0.1:52256__ybs%2Fqf c:control_collection s:shard1 r:core_node1 x:collection1] o.a.s.r.ManagedResourceStorage No data found for znode /configs/conf1/_rest_managed.json
   [junit4]   2> 1333475 INFO  (coreLoadExecutor-3687-thread-1-processing-n:127.0.0.1:52256__ybs%2Fqf) [n:127.0.0.1:52256__ybs%2Fqf c:control_collection s:shard1 r:core_node1 x:collection1] o.a.s.r.ManagedResourceStorage Loaded null at path _rest_managed.json using ZooKeeperStorageIO:path=/configs/conf1
   [junit4]   2> 1333475 INFO  (coreLoadExecutor-3687-thread-1-processing-n:127.0.0.1:52256__ybs%2Fqf) [n:127.0.0.1:52256__ybs%2Fqf c:control_collection s:shard1 r:core_node1 x:collection1] o.a.s.r.RestManager Initializing 0 registered ManagedResources
   [junit4]   2> 1333475 INFO  (coreLoadExecutor-3687-thread-1-processing-n:127.0.0.1:52256__ybs%2Fqf) [n:127.0.0.1:52256__ybs%2Fqf c:control_collection s:shard1 r:core_node1 x:collection1] o.a.s.h.ReplicationHandler Commits will be reserved for  10000
   [junit4]   2> 1333476 INFO  (searcherExecutor-3688-thread-1-processing-x:collection1 r:core_node1 s:shard1 c:control_collection n:127.0.0.1:52256__ybs%2Fqf) [n:127.0.0.1:52256__ybs%2Fqf c:control_collection s:shard1 r:core_node1 x:collection1] o.a.s.c.SolrCore [collection1] Registered new searcher Searcher@617b402f[collection1] main{ExitableDirectoryReader(UninvertingDirectoryReader())}
   [junit4]   2> 1333476 INFO  (coreLoadExecutor-3687-thread-1-processing-n:127.0.0.1:52256__ybs%2Fqf) [n:127.0.0.1:52256__ybs%2Fqf c:control_collection s:shard1 r:core_node1 x:collection1] o.a.s.u.UpdateLog Looking up max value of version field to seed version buckets
   [junit4]   2> 1333476 INFO  (coreLoadExecutor-3687-thread-1-processing-n:127.0.0.1:52256__ybs%2Fqf) [n:127.0.0.1:52256__ybs%2Fqf c:control_collection s:shard1 r:core_node1 x:collection1] o.a.s.u.VersionInfo Refreshing highest value of _version_ for 65536 version buckets from index
   [junit4]   2> 1333476 INFO  (coreLoadExecutor-3687-thread-1-processing-n:127.0.0.1:52256__ybs%2Fqf) [n:127.0.0.1:52256__ybs%2Fqf c:control_collection s:shard1 r:core_node1 x:collection1] o.a.s.u.VersionInfo No terms found for _version_, cannot seed version bucket highest value from index
   [junit4]   2> 1333476 INFO  (coreLoadExecutor-3687-thread-1-processing-n:127.0.0.1:52256__ybs%2Fqf) [n:127.0.0.1:52256__ybs%2Fqf c:control_collection s:shard1 r:core_node1 x:collection1] o.a.s.u.UpdateLog Could not find max version in index or recent updates, using new clock 1509528505915801600
   [junit4]   2> 1333478 INFO  (coreLoadExecutor-3687-thread-1-processing-n:127.0.0.1:52256__ybs%2Fqf) [n:127.0.0.1:52256__ybs%2Fqf c:control_collection s:shard1 r:core_node1 x:collection1] o.a.s.u.UpdateLog Took 2 ms to seed version buckets with highest version 1509528505915801600
   [junit4]   2> 1333478 INFO  (coreLoadExecutor-3687-thread-1-processing-n:127.0.0.1:52256__ybs%2Fqf) [n:127.0.0.1:52256__ybs%2Fqf c:control_collection s:shard1 r:core_node1 x:collection1] o.a.s.c.ZkController watch zkdir /configs/conf1
   [junit4]   2> 1333479 INFO  (coreLoadExecutor-3687-thread-1-processing-n:127.0.0.1:52256__ybs%2Fqf) [n:127.0.0.1:52256__ybs%2Fqf c:control_collection s:shard1 r:core_node1 x:collection1] o.a.s.c.CoreContainer registering core: collection1
   [junit4]   2> 1333480 INFO  (coreZkRegister-3681-thread-1-processing-x:collection1 r:core_node1 s:shard1 c:control_collection n:127.0.0.1:52256__ybs%2Fqf) [n:127.0.0.1:52256__ybs%2Fqf c:control_collection s:shard1 r:core_node1 x:collection1] o.a.s.c.ZkController Register replica - core:collection1 address:http://127.0.0.1:52256/_ybs/qf collection:control_collection shard:shard1
   [junit4]   2> 1333481 INFO  (coreZkRegister-3681-thread-1-processing-x:collection1 r:core_node1 s:shard1 c:control_collection n:127.0.0.1:52256__ybs%2Fqf) [n:127.0.0.1:52256__ybs%2Fqf c:control_collection s:shard1 r:core_node1 x:collection1] o.a.s.c.c.SolrZkClient makePath: /collections/control_collection/leader_elect/shard1/election
   [junit4]   2> 1333489 INFO  (coreZkRegister-3681-thread-1-processing-x:collection1 r:core_node1 s:shard1 c:control_collection n:127.0.0.1:52256__ybs%2Fqf) [n:127.0.0.1:52256__ybs%2Fqf c:control_collection s:shard1 r:core_node1 x:collection1] o.a.s.c.LeaderElector Joined leadership election with path: /collections/control_collection/leader_elect/shard1/election/94345531470053380-core_node1-n_0000000000
   [junit4]   2> 1333490 INFO  (coreZkRegister-3681-thread-1-processing-x:collection1 r:core_node1 s:shard1 c:control_collection n:127.0.0.1:52256__ybs%2Fqf) [n:127.0.0.1:52256__ybs%2Fqf c:control_collection s:shard1 r:core_node1 x:collection1] o.a.s.c.ShardLeaderElectionContext Running the leader process for shard shard1
   [junit4]   2> 1333493 INFO  (zkCallback-1330-thread-1-processing-n:127.0.0.1:52256__ybs%2Fqf) [n:127.0.0.1:52256__ybs%2Fqf    ] o.a.s.c.DistributedQueue NodeChildrenChanged fired on path /overseer/queue state SyncConnected
   [junit4]   2> 1333493 INFO  (coreZkRegister-3681-thread-1-processing-x:collection1 r:core_node1 s:shard1 c:control_collection n:127.0.0.1:52256__ybs%2Fqf) [n:127.0.0.1:52256__ybs%2Fqf c:control_collection s:shard1 r:core_node1 x:collection1] o.a.s.c.ShardLeaderElectionContext Enough replicas found to continue.
   [junit4]   2> 1333493 INFO  (coreZkRegister-3681-thread-1-processing-x:collection1 r:core_node1 s:shard1 c:control_collection n:127.0.0.1:52256__ybs%2Fqf) [n:127.0.0.1:52256__ybs%2Fqf c:control_collection s:shard1 r:core_node1 x:collection1] o.a.s.c.ShardLeaderElectionContext I may be the new leader - try and sync
   [junit4]   2> 1333493 INFO  (coreZkRegister-3681-thread-1-processing-x:collection1 r:core_node1 s:shard1 c:control_collection n:127.0.0.1:52256__ybs%2Fqf) [n:127.0.0.1:52256__ybs%2Fqf c:control_collection s:shard1 r:core_node1 x:collection1] o.a.s.c.SyncStrategy Sync replicas to http://127.0.0.1:52256/_ybs/qf/collection1/
   [junit4]   2> 1333493 INFO  (coreZkRegister-3681-thread-1-processing-x:collection1 r:core_node1 s:shard1 c:control_collection n:127.0.0.1:52256__ybs%2Fqf) [n:127.0.0.1:52256__ybs%2Fqf c:control_collection s:shard1 r:core_node1 x:collection1] o.a.s.c.SyncStrategy Sync Success - now sync replicas to me
   [junit4]   2> 1333493 INFO  (coreZkRegister-3681-thread-1-processing-x:collection1 r:core_node1 s:shard1 c:control_collection n:127.0.0.1:52256__ybs%2Fqf) [n:127.0.0.1:52256__ybs%2Fqf c:control_collection s:shard1 r:core_node1 x:collection1] o.a.s.c.SyncStrategy http://127.0.0.1:52256/_ybs/qf/collection1/ has no replicas
   [junit4]   2> 1333494 INFO  (coreZkRegister-3681-thread-1-processing-x:collection1 r:core_node1 s:shard1 c:control_collection n:127.0.0.1:52256__ybs%2Fqf) [n:127.0.0.1:52256__ybs%2Fqf c:control_collection s:shard1 r:core_node1 x:collection1] o.a.s.c.ShardLeaderElectionContext I am the new leader: http://127.0.0.1:52256/_ybs/qf/collection1/ shard1
   [junit4]   2> 1333494 INFO  (coreZkRegister-3681-thread-1-processing-x:collection1 r:core_node1 s:shard1 c:control_collection n:127.0.0.1:52256__ybs%2Fqf) [n:127.0.0.1:52256__ybs%2Fqf c:control_collection s:shard1 r:core_node1 x:collection1] o.a.s.c.c.SolrZkClient makePath: /collections/control_collection/leaders/shard1
   [junit4]   2> 1333494 INFO  (OverseerStateUpdate-94345531470053380-127.0.0.1:52256__ybs%2Fqf-n_0000000000) [n:127.0.0.1:52256__ybs%2Fqf    ] o.a.s.c.Overseer processMessage: queueSize: 1, message = {
   [junit4]   2>   "operation":"leader",
   [junit4]   2>   "shard":"shard1",
   [junit4]   2>   "collection":"control_collection"} current state version: 1
   [junit4]   2> 1333496 INFO  (zkCallback-1330-thread-1-processing-n:127.0.0.1:52256__ybs%2Fqf) [n:127.0.0.1:52256__ybs%2Fqf    ] o.a.s.c.c.ZkStateReader A cluster state change: WatchedEvent state:SyncConnected type:NodeDataChanged path:/clusterstate.json, has occurred - updating... (live nodes size: 1)
   [junit4]   2> 1333502 INFO  (OverseerStateUpdate-94345531470053380-127.0.0.1:52256__ybs%2Fqf-n_0000000000) [n:127.0.0.1:52256__ybs%2Fqf    ] o.a.s.c.Overseer processMessage: queueSize: 1, message = {
   [junit4]   2>   "operation":"leader",
   [junit4]   2>   "shard":"shard1",
   [junit4]   2>   "collection":"control_collection",
   [junit4]   2>   "base_url":"http://127.0.0.1:52256/_ybs/qf",
   [junit4]   2>   "core":"collection1",
   [junit4]   2>   "state":"active"} current state version: 2
   [junit4]   2> 1333506 INFO  (zkCallback-1330-thread-1-processing-n:127.0.0.1:52256__ybs%2Fqf) [n:127.0.0.1:52256__ybs%2Fqf    ] o.a.s.c.DistributedQueue NodeChildrenChanged fired on path /overseer/queue state SyncConnected
   [junit4]   2> 1333508 INFO  (zkCallback-1330-thread-1-processing-n:127.0.0.1:52256__ybs%2Fqf) [n:127.0.0.1:52256__ybs%2Fqf    ] o.a.s.c.c.ZkStateReader A cluster state change: WatchedEvent state:SyncConnected type:NodeDataChanged path:/clusterstate.json, has occurred - updating... (live nodes size: 1)
   [junit4]   2> 1333553 INFO  (coreZkRegister-3681-thread-1-processing-x:collection1 r:core_node1 s:shard1 c:control_collection n:127.0.0.1:52256__ybs%2Fqf) [n:127.0.0.1:52256__ybs%2Fqf c:control_collection s:shard1 r:core_node1 x:collection1] o.a.s.c.ZkController We are http://127.0.0.1:52256/_ybs/qf/collection1/ and leader is http://127.0.0.1:52256/_ybs/qf/collection1/
   [junit4]   2> 1333554 INFO  (coreZkRegister-3681-thread-1-processing-x:collection1 r:core_node1 s:shard1 c:control_collection n:127.0.0.1:52256__ybs%2Fqf) [n:127.0.0.1:52256__ybs%2Fqf c:control_collection s:shard1 r:core_node1 x:collection1] o.a.s.c.ZkController No LogReplay needed for core=collection1 baseURL=http://127.0.0.1:52256/_ybs/qf
   [junit4]   2> 1333554 INFO  (coreZkRegister-3681-thread-1-processing-x:collection1 r:core_node1 s:shard1 c:control_collection n:127.0.0.1:52256__ybs%2Fqf) [n:127.0.0.1:52256__ybs%2Fqf c:control_collection s:shard1 r:core_node1 x:collection1] o.a.s.c.ZkController I am the leader, no recovery necessary
   [junit4]   2> 1333554 INFO  (coreZkRegister-3681-thread-1-processing-x:collection1 r:core_node1 s:shard1 c:control_collection n:127.0.0.1:52256__ybs%2Fqf) [n:127.0.0.1:52256__ybs%2Fqf c:control_collection s:shard1 r:core_node1 x:collection1] o.a.s.c.ZkController publishing state=active
   [junit4]   2> 1333554 INFO  (coreZkRegister-3681-thread-1-processing-x:collection1 r:core_node1 s:shard1 c:control_collection n:127.0.0.1:52256__ybs%2Fqf) [n:127.0.0.1:52256__ybs%2Fqf c:control_collection s:shard1 r:core_node1 x:collection1] o.a.s.c.ZkController numShards not found on descriptor - reading it from system property
   [junit4]   2> 1333562 INFO  (zkCallback-1330-thread-1-processing-n:127.0.0.1:52256__ybs%2Fqf) [n:127.0.0.1:52256__ybs%2Fqf    ] o.a.s.c.DistributedQueue NodeChildrenChanged fired on path /overseer/queue state SyncConnected
   [junit4]   2> 1333572 INFO  (OverseerStateUpdate-94345531470053380-127.0.0.1:52256__ybs%2Fqf-n_0000000000) [n:127.0.0.1:52256__ybs%2Fqf    ] o.a.s.c.Overseer processMessage: queueSize: 1, message = {
   [junit4]   2>   "core":"collection1",
   [junit4]   2>   "operation":"state",
   [junit4]   2>   "base_url":"http://127.0.0.1:52256/_ybs/qf",
   [junit4]   2>   "numShards":"1",
   [junit4]   2>   "roles":null,
   [junit4]   2>   "shard":"shard1",
   [junit4]   2>   "state":"active",
   [junit4]   2>   "core_node_name":"core_node1",
   [junit4]   2>   "collection":"control_collection",
   [junit4]   2>   "node_name":"127.0.0.1:52256__ybs%2Fqf"} current state version: 3
   [junit4]   2> 1333574 INFO  (OverseerStateUpdate-94345531470053380-127.0.0.1:52256__ybs%2Fqf-n_0000000000) [n:127.0.0.1:52256__ybs%2Fqf    ] o.a.s.c.o.ReplicaMutator Update state numShards=1 message={
   [junit4]   2>   "core":"collection1",
   [junit4]   2>   "operation":"state",
   [junit4]   2>   "base_url":"http://127.0.0.1:52256/_ybs/qf",
   [junit4]   2>   "numShards":"1",
   [junit4]   2>   "roles":null,
   [junit4]   2>   "shard":"shard1",
   [junit4]   2>   "state":"active",
   [junit4]   2>   "core_node_name":"core_node1",
   [junit4]   2>   "collection":"control_collection",
   [junit4]   2>   "node_name":"127.0.0.1:52256__ybs%2Fqf"}
   [junit4]   2> 1333681 INFO  (zkCallback-1330-thread-1-processing-n:127.0.0.1:52256__ybs%2Fqf) [n:127.0.0.1:52256__ybs%2Fqf    ] o.a.s.c.c.ZkStateReader A cluster state change: WatchedEvent state:SyncConnected type:NodeDataChanged path:/clusterstate.json, has occurred - updating... (live nodes size: 1)
   [junit4]   2> 1333900 INFO  (TEST-CollectionsAPIDistributedZkTest.test-seed#[78F6B51827F7DDBC]) [    ] o.a.s.c.c.SolrZkClient Using default ZkCredentialsProvider
   [junit4]   2> 1333901 INFO  (TEST-CollectionsAPIDistributedZkTest.test-seed#[78F6B51827F7DDBC]) [    ] o.a.s.c.c.ConnectionManager Waiting for client to connect to ZooKeeper
   [junit4]   2> 1333903 INFO  (zkCallback-1332-thread-1) [    ] o.a.s.c.c.ConnectionManager Watcher org.apache.solr.common.cloud.ConnectionManager@9e48cb9 name:ZooKeeperConnection Watcher:127.0.0.1:52253/solr got event WatchedEvent state:SyncConnected type:None path:null path:null type:None
   [junit4]   2> 1333903 INFO  (TEST-CollectionsAPIDistributedZkTest.test-seed#[78F6B51827F7DDBC]) [    ] o.a.s.c.c.ConnectionManager Client is connected to ZooKeeper
   [junit4]   2> 1333903 INFO  (TEST-CollectionsAPIDistributedZkTest.test-seed#[78F6B51827F7DDBC]) [    ] o.a.s.c.c.SolrZkClient Using default ZkACLProvider
   [junit4]   2> 1333904 INFO  (TEST-CollectionsAPIDistributedZkTest.test-seed#[78F6B51827F7DDBC]) [    ] o.a.s.c.c.ZkStateReader Updating cluster state from ZooKeeper... 
   [junit4]   2> 1333909 INFO  (TEST-CollectionsAPIDistributedZkTest.test-seed#[78F6B51827F7DDBC]) [    ] o.a.s.c.ChaosMonkey monkey: init - expire sessions:false cause connection loss:false
   [junit4]   2> 1333909 INFO  (TEST-CollectionsAPIDistributedZkTest.test-seed#[78F6B51827F7DDBC]) [    ] o.a.s.c.AbstractFullDistribZkTestBase Creating collection1 with stateFormat=2
   [junit4]   2> 1333909 INFO  (TEST-CollectionsAPIDistributedZkTest.test-seed#[78F6B51827F7DDBC]) [    ] o.a.s.c.c.SolrZkClient Using default ZkCredentialsProvider
   [junit4]   2> 1333910 INFO  (TEST-CollectionsAPIDistributedZkTest.test-seed#[78F6B51827F7DDBC]) [    ] o.a.s.c.c.ConnectionManager Waiting for client to connect to ZooKeeper
   [junit4]   2> 1333912 INFO  (zkCallback-1333-thread-1) [    ] o.a.s.c.c.ConnectionManager Watcher org.apache.solr.common.cloud.ConnectionManager@79014446 name:ZooKeeperConnection Watcher:127.0.0.1:52253/solr got event WatchedEvent state:SyncConnected type:None path:null path:null type:None
   [junit4]   2> 1333912 INFO  (TEST-CollectionsAPIDistributedZkTest.test-seed#[78F6B51827F7DDBC]) [    ] o.a.s.c.c.ConnectionManager Client is connected to ZooKeeper
   [junit4]   2> 1333912 INFO  (TEST-CollectionsAPIDistributedZkTest.test-seed#[78F6B51827F7DDBC]) [    ] o.a.s.c.c.SolrZkClient Using default ZkACLProvider
   [junit4]   2> 1333915 INFO  (zkCallback-1330-thread-1-processing-n:127.0.0.1:52256__ybs%2Fqf) [n:127.0.0.1:52256__ybs%2Fqf    ] o.a.s.c.DistributedQueue NodeChildrenChanged fired on path /overseer/queue state SyncConnected
   [junit4]   2> 1333916 INFO  (OverseerStateUpdate-94345531470053380-127.0.0.1:52256__ybs%2Fqf-n_0000000000) [n:127.0.0.1:52256__ybs%2Fqf    ] o.a.s.c.Overseer processMessage: queueSize: 1, message = {
   [junit4]   2>   "operation":"create",
   [junit4]   2>   "name":"collection1",
   [junit4]   2>   "numShards":"2",
   [junit4]   2>   "stateFormat":"2"} current state version: 4
   [junit4]   2> 1333916 INFO  (OverseerStateUpdate-94345531470053380-127.0.0.1:52256__ybs%2Fqf-n_0000000000) [n:127.0.0.1:52256__ybs%2Fqf    ] o.a.s.c.o.ClusterStateMutator building a new cName: collection1
   [junit4]   2> 1334025 INFO  (OverseerStateUpdate-94345531470053380-127.0.0.1:52256__ybs%2Fqf-n_0000000000) [n:127.0.0.1:52256__ybs%2Fqf    ] o.a.s.c.o.ZkStateWriter going to create_collection /collections/collection1/state.json
   [junit4]   2> 1334032 INFO  (zkCallback-1330-thread-1-processing-n:127.0.0.1:52256__ybs%2Fqf) [n:127.0.0.1:52256__ybs%2Fqf    ] o.a.s.c.c.ZkStateReader A cluster state change: WatchedEvent state:SyncConnected type:NodeDataChanged path:/clusterstate.json, has occurred - updating... (live nodes size: 1)
   [junit4]   2> 1334032 INFO  (zkCallback-1332-thread-1) [    ] o.a.s.c.c.ZkStateReader A cluster state change: WatchedEvent state:SyncConnected type:NodeDataChanged path:/clusterstate.json, has occurred - updating... (live nodes size: 1)
   [junit4]   2> 1334162 INFO  (TEST-CollectionsAPIDistributedZkTest.test-seed#[78F6B51827F7DDBC]) [    ] o.a.s.SolrTestCaseJ4 Writing core.properties file to /Users/jenkins/workspace/Lucene-Solr-5.x-MacOSX/solr/build/solr-core/test/J1/temp/solr.cloud.CollectionsAPIDistributedZkTest_78F6B51827F7DDBC-001/shard-1-001/cores/collection1
   [junit4]   2> 1334163 INFO  (TEST-CollectionsAPIDistributedZkTest.test-seed#[78F6B51827F7DDBC]) [    ] o.a.s.c.AbstractFullDistribZkTestBase create jetty 1 in directory /Users/jenkins/workspace/Lucene-Solr-5.x-MacOSX/solr/build/solr-core/test/J1/temp/solr.cloud.CollectionsAPIDistributedZkTest_78F6B51827F7DDBC-001/shard-1-001
   [junit4]   2> 1334164 INFO  (TEST-CollectionsAPIDistributedZkTest.test-seed#[78F6B51827F7DDBC]) [    ] o.e.j.s.Server jetty-9.2.11.v20150529
   [junit4]   2> 1334167 INFO  (TEST-CollectionsAPIDistributedZkTest.test-seed#[78F6B51827F7DDBC]) [    ] o.e.j.s.h.ContextHandler Started o.e.j.s.ServletContextHandler@7540c3bb{/_ybs/qf,null,AVAILABLE}
   [junit4]   2> 1334168 INFO  (TEST-CollectionsAPIDistributedZkTest.test-seed#[78F6B51827F7DDBC]) [    ] o.e.j.s.ServerConnector Started ServerConnector@6ef26620{HTTP/1.1}{127.0.0.1:52262}
   [junit4]   2> 1334168 INFO  (TEST-CollectionsAPIDistributedZkTest.test-seed#[78F6B51827F7DDBC]) [    ] o.e.j.s.Server Started @1338632ms
   [junit4]   2> 1334168 INFO  (TEST-CollectionsAPIDistributedZkTest.test-seed#[78F6B51827F7DDBC]) [    ] o.a.s.c.s.e.JettySolrRunner Jetty properties: {solrconfig=solrconfig.xml, hostPort=52262, solr.data.dir=/Users/jenkins/workspace/Lucene-Solr-5.x-MacOSX/solr/build/solr-core/test/J1/temp/solr.cloud.CollectionsAPIDistributedZkTest_78F6B51827F7DDBC-001/tempDir-001/jetty1, coreRootDirectory=/Users/jenkins/workspace/Lucene-Solr-5.x-MacOSX/solr/build/solr-core/test/J1/../../../../../../../../../Users/jenkins/workspace/Lucene-Solr-5.x-MacOSX/solr/build/solr-core/test/J1/temp/solr.cloud.CollectionsAPIDistributedZkTest_78F6B51827F7DDBC-001/shard-1-001/cores, hostContext=/_ybs/qf}
   [junit4]   2> 1334169 INFO  (TEST-CollectionsAPIDistributedZkTest.test-seed#[78F6B51827F7DDBC]) [    ] o.a.s.s.SolrDispatchFilter SolrDispatchFilter.init(): sun.misc.Launcher$AppClassLoader@a2c6f70
   [junit4]   2> 1334169 INFO  (TEST-CollectionsAPIDistributedZkTest.test-seed#[78F6B51827F7DDBC]) [    ] o.a.s.c.SolrResourceLoader new SolrResourceLoader for directory: '/Users/jenkins/workspace/Lucene-Solr-5.x-MacOSX/solr/build/solr-core/test/J1/../../../../../../../../../Users/jenkins/workspace/Lucene-Solr-5.x-MacOSX/solr/build/solr-core/test/J1/temp/solr.cloud.CollectionsAPIDistributedZkTest_78F6B51827F7DDBC-001/shard-1-001/'
   [junit4]   2> 1334201 INFO  (TEST-CollectionsAPIDistributedZkTest.test-seed#[78F6B51827F7DDBC]) [    ] o.a.s.c.c.SolrZkClient Using default ZkCredentialsProvider
   [junit4]   2> 1334202 INFO  (TEST-CollectionsAPIDistributedZkTest.test-seed#[78F6B51827F7DDBC]) [    ] o.a.s.c.c.ConnectionManager Waiting for client to connect to ZooKeeper
   [junit4]   2> 1334203 INFO  (zkCallback-1334-thread-1) [    ] o.a.s.c.c.ConnectionManager Watcher org.apache.solr.common.cloud.ConnectionManager@62a33474 name:ZooKeeperConnection Watcher:127.0.0.1:52253/solr got event WatchedEvent state:SyncConnected type:None path:null path:null type:None
   [junit4]   2> 1334204 INFO  (TEST-CollectionsAPIDistributedZkTest.test-seed#[78F6B51827F7DDBC]) [    ] o

[...truncated too long message...]

hronousQueue.poll(SynchronousQueue.java:942)
   [junit4]    >         at java.util.concurrent.ThreadPoolExecutor.getTask(ThreadPoolExecutor.java:1068)
   [junit4]    >         at java.util.concurrent.ThreadPoolExecutor.runWorker(ThreadPoolExecutor.java:1130)
   [junit4]    >         at java.util.concurrent.ThreadPoolExecutor$Worker.run(ThreadPoolExecutor.java:615)
   [junit4]    >         at java.lang.Thread.run(Thread.java:745)
   [junit4]    >    3) Thread[id=9671, name=TEST-CollectionsAPIDistributedZkTest.test-seed#[78F6B51827F7DDBC]-EventThread, state=WAITING, group=TGRP-CollectionsAPIDistributedZkTest]
   [junit4]    >         at sun.misc.Unsafe.park(Native Method)
   [junit4]    >         at java.util.concurrent.locks.LockSupport.park(LockSupport.java:186)
   [junit4]    >         at java.util.concurrent.locks.AbstractQueuedSynchronizer$ConditionObject.await(AbstractQueuedSynchronizer.java:2043)
   [junit4]    >         at java.util.concurrent.LinkedBlockingQueue.take(LinkedBlockingQueue.java:442)
   [junit4]    >         at org.apache.zookeeper.ClientCnxn$EventThread.run(ClientCnxn.java:494)
   [junit4]    >    4) Thread[id=9670, name=TEST-CollectionsAPIDistributedZkTest.test-seed#[78F6B51827F7DDBC]-SendThread(127.0.0.1:52253), state=TIMED_WAITING, group=TGRP-CollectionsAPIDistributedZkTest]
   [junit4]    >         at java.lang.Thread.sleep(Native Method)
   [junit4]    >         at org.apache.zookeeper.client.StaticHostProvider.next(StaticHostProvider.java:101)
   [junit4]    >         at org.apache.zookeeper.ClientCnxn$SendThread.startConnect(ClientCnxn.java:940)
   [junit4]    >         at org.apache.zookeeper.ClientCnxn$SendThread.run(ClientCnxn.java:1003)
   [junit4]    >    5) Thread[id=9672, name=zkCallback-1357-thread-1, state=TIMED_WAITING, group=TGRP-CollectionsAPIDistributedZkTest]
   [junit4]    >         at sun.misc.Unsafe.park(Native Method)
   [junit4]    >         at java.util.concurrent.locks.LockSupport.parkNanos(LockSupport.java:226)
   [junit4]    >         at java.util.concurrent.SynchronousQueue$TransferStack.awaitFulfill(SynchronousQueue.java:460)
   [junit4]    >         at java.util.concurrent.SynchronousQueue$TransferStack.transfer(SynchronousQueue.java:359)
   [junit4]    >         at java.util.concurrent.SynchronousQueue.poll(SynchronousQueue.java:942)
   [junit4]    >         at java.util.concurrent.ThreadPoolExecutor.getTask(ThreadPoolExecutor.java:1068)
   [junit4]    >         at java.util.concurrent.ThreadPoolExecutor.runWorker(ThreadPoolExecutor.java:1130)
   [junit4]    >         at java.util.concurrent.ThreadPoolExecutor$Worker.run(ThreadPoolExecutor.java:615)
   [junit4]    >         at java.lang.Thread.run(Thread.java:745)
   [junit4]    >    6) Thread[id=9714, name=zkCallback-1357-thread-2, state=TIMED_WAITING, group=TGRP-CollectionsAPIDistributedZkTest]
   [junit4]    >         at sun.misc.Unsafe.park(Native Method)
   [junit4]    >         at java.util.concurrent.locks.LockSupport.parkNanos(LockSupport.java:226)
   [junit4]    >         at java.util.concurrent.SynchronousQueue$TransferStack.awaitFulfill(SynchronousQueue.java:460)
   [junit4]    >         at java.util.concurrent.SynchronousQueue$TransferStack.transfer(SynchronousQueue.java:359)
   [junit4]    >         at java.util.concurrent.SynchronousQueue.poll(SynchronousQueue.java:942)
   [junit4]    >         at java.util.concurrent.ThreadPoolExecutor.getTask(ThreadPoolExecutor.java:1068)
   [junit4]    >         at java.util.concurrent.ThreadPoolExecutor.runWorker(ThreadPoolExecutor.java:1130)
   [junit4]    >         at java.util.concurrent.ThreadPoolExecutor$Worker.run(ThreadPoolExecutor.java:615)
   [junit4]    >         at java.lang.Thread.run(Thread.java:745)
   [junit4]    > 	at __randomizedtesting.SeedInfo.seed([78F6B51827F7DDBC]:0)Throwable #2: com.carrotsearch.randomizedtesting.ThreadLeakError: There are still zombie threads that couldn't be terminated:
   [junit4]    >    1) Thread[id=9722, name=zkCallback-1357-thread-3, state=TIMED_WAITING, group=TGRP-CollectionsAPIDistributedZkTest]
   [junit4]    >         at sun.misc.Unsafe.park(Native Method)
   [junit4]    >         at java.util.concurrent.locks.LockSupport.parkNanos(LockSupport.java:226)
   [junit4]    >         at java.util.concurrent.SynchronousQueue$TransferStack.awaitFulfill(SynchronousQueue.java:460)
   [junit4]    >         at java.util.concurrent.SynchronousQueue$TransferStack.transfer(SynchronousQueue.java:359)
   [junit4]    >         at java.util.concurrent.SynchronousQueue.poll(SynchronousQueue.java:942)
   [junit4]    >         at java.util.concurrent.ThreadPoolExecutor.getTask(ThreadPoolExecutor.java:1068)
   [junit4]    >         at java.util.concurrent.ThreadPoolExecutor.runWorker(ThreadPoolExecutor.java:1130)
   [junit4]    >         at java.util.concurrent.ThreadPoolExecutor$Worker.run(ThreadPoolExecutor.java:615)
   [junit4]    >         at java.lang.Thread.run(Thread.java:745)
   [junit4]    >    2) Thread[id=9746, name=zkCallback-1357-thread-4, state=TIMED_WAITING, group=TGRP-CollectionsAPIDistributedZkTest]
   [junit4]    >         at sun.misc.Unsafe.park(Native Method)
   [junit4]    >         at java.util.concurrent.locks.LockSupport.parkNanos(LockSupport.java:226)
   [junit4]    >         at java.util.concurrent.SynchronousQueue$TransferStack.awaitFulfill(SynchronousQueue.java:460)
   [junit4]    >         at java.util.concurrent.SynchronousQueue$TransferStack.transfer(SynchronousQueue.java:359)
   [junit4]    >         at java.util.concurrent.SynchronousQueue.poll(SynchronousQueue.java:942)
   [junit4]    >         at java.util.concurrent.ThreadPoolExecutor.getTask(ThreadPoolExecutor.java:1068)
   [junit4]    >         at java.util.concurrent.ThreadPoolExecutor.runWorker(ThreadPoolExecutor.java:1130)
   [junit4]    >         at java.util.concurrent.ThreadPoolExecutor$Worker.run(ThreadPoolExecutor.java:615)
   [junit4]    >         at java.lang.Thread.run(Thread.java:745)
   [junit4]    >    3) Thread[id=9670, name=TEST-CollectionsAPIDistributedZkTest.test-seed#[78F6B51827F7DDBC]-SendThread(127.0.0.1:52253), state=TIMED_WAITING, group=TGRP-CollectionsAPIDistributedZkTest]
   [junit4]    >         at java.lang.Thread.sleep(Native Method)
   [junit4]    >         at org.apache.zookeeper.client.StaticHostProvider.next(StaticHostProvider.java:101)
   [junit4]    >         at org.apache.zookeeper.ClientCnxn$SendThread.startConnect(ClientCnxn.java:940)
   [junit4]    >         at org.apache.zookeeper.ClientCnxn$SendThread.run(ClientCnxn.java:1003)
   [junit4]    >    4) Thread[id=9672, name=zkCallback-1357-thread-1, state=TIMED_WAITING, group=TGRP-CollectionsAPIDistributedZkTest]
   [junit4]    >         at sun.misc.Unsafe.park(Native Method)
   [junit4]    >         at java.util.concurrent.locks.LockSupport.parkNanos(LockSupport.java:226)
   [junit4]    >         at java.util.concurrent.SynchronousQueue$TransferStack.awaitFulfill(SynchronousQueue.java:460)
   [junit4]    >         at java.util.concurrent.SynchronousQueue$TransferStack.transfer(SynchronousQueue.java:359)
   [junit4]    >         at java.util.concurrent.SynchronousQueue.poll(SynchronousQueue.java:942)
   [junit4]    >         at java.util.concurrent.ThreadPoolExecutor.getTask(ThreadPoolExecutor.java:1068)
   [junit4]    >         at java.util.concurrent.ThreadPoolExecutor.runWorker(ThreadPoolExecutor.java:1130)
   [junit4]    >         at java.util.concurrent.ThreadPoolExecutor$Worker.run(ThreadPoolExecutor.java:615)
   [junit4]    >         at java.lang.Thread.run(Thread.java:745)
   [junit4]    >    5) Thread[id=9714, name=zkCallback-1357-thread-2, state=TIMED_WAITING, group=TGRP-CollectionsAPIDistributedZkTest]
   [junit4]    >         at sun.misc.Unsafe.park(Native Method)
   [junit4]    >         at java.util.concurrent.locks.LockSupport.parkNanos(LockSupport.java:226)
   [junit4]    >         at java.util.concurrent.SynchronousQueue$TransferStack.awaitFulfill(SynchronousQueue.java:460)
   [junit4]    >         at java.util.concurrent.SynchronousQueue$TransferStack.transfer(SynchronousQueue.java:359)
   [junit4]    >         at java.util.concurrent.SynchronousQueue.poll(SynchronousQueue.java:942)
   [junit4]    >         at java.util.concurrent.ThreadPoolExecutor.getTask(ThreadPoolExecutor.java:1068)
   [junit4]    >         at java.util.concurrent.ThreadPoolExecutor.runWorker(ThreadPoolExecutor.java:1130)
   [junit4]    >         at java.util.concurrent.ThreadPoolExecutor$Worker.run(ThreadPoolExecutor.java:615)
   [junit4]    >         at java.lang.Thread.run(Thread.java:745)
   [junit4]    > 	at __randomizedtesting.SeedInfo.seed([78F6B51827F7DDBC]:0)
   [junit4] Completed [234/533] on J1 in 99.21s, 1 test, 3 errors <<< FAILURES!

[...truncated 914 lines...]
BUILD FAILED
/Users/jenkins/workspace/Lucene-Solr-5.x-MacOSX/build.xml:785: The following error occurred while executing this line:
/Users/jenkins/workspace/Lucene-Solr-5.x-MacOSX/build.xml:729: The following error occurred while executing this line:
/Users/jenkins/workspace/Lucene-Solr-5.x-MacOSX/build.xml:59: The following error occurred while executing this line:
/Users/jenkins/workspace/Lucene-Solr-5.x-MacOSX/solr/build.xml:230: The following error occurred while executing this line:
/Users/jenkins/workspace/Lucene-Solr-5.x-MacOSX/solr/common-build.xml:524: The following error occurred while executing this line:
/Users/jenkins/workspace/Lucene-Solr-5.x-MacOSX/lucene/common-build.xml:1449: The following error occurred while executing this line:
/Users/jenkins/workspace/Lucene-Solr-5.x-MacOSX/lucene/common-build.xml:1003: There were test failures: 533 suites, 2114 tests, 2 suite-level errors, 1 error, 1232 ignored (29 assumptions)

Total time: 53 minutes 42 seconds
Build step 'Invoke Ant' marked build as failure
Archiving artifacts
[WARNINGS] Skipping publisher since build result is FAILURE
Recording test results
Email was triggered for: Failure - Any
Sending email for trigger: Failure - Any



Mime
View raw message