lucene-dev mailing list archives

Site index · List index
Message view « Date » · « Thread »
Top « Date » · « Thread »
From Policeman Jenkins Server <jenk...@thetaphi.de>
Subject [JENKINS-EA] Lucene-Solr-5.x-Linux (64bit/jdk1.8.0_60-ea-b24) - Build # 13572 - Failure!
Date Fri, 07 Aug 2015 12:27:42 GMT
Build: http://jenkins.thetaphi.de/job/Lucene-Solr-5.x-Linux/13572/
Java: 64bit/jdk1.8.0_60-ea-b24 -XX:-UseCompressedOops -XX:+UseG1GC

1 tests failed.
FAILED:  org.apache.solr.security.PKIAuthenticationIntegrationTest.testPkiAuth

Error Message:


Stack Trace:
java.lang.AssertionError
	at __randomizedtesting.SeedInfo.seed([BD24EEE43B4C716C:8D9A77B5DBFAF6CD]:0)
	at org.junit.Assert.fail(Assert.java:92)
	at org.junit.Assert.assertTrue(Assert.java:43)
	at org.junit.Assert.assertTrue(Assert.java:54)
	at org.apache.solr.security.PKIAuthenticationIntegrationTest.testPkiAuth(PKIAuthenticationIntegrationTest.java:96)
	at sun.reflect.NativeMethodAccessorImpl.invoke0(Native Method)
	at sun.reflect.NativeMethodAccessorImpl.invoke(NativeMethodAccessorImpl.java:62)
	at sun.reflect.DelegatingMethodAccessorImpl.invoke(DelegatingMethodAccessorImpl.java:43)
	at java.lang.reflect.Method.invoke(Method.java:497)
	at com.carrotsearch.randomizedtesting.RandomizedRunner.invoke(RandomizedRunner.java:1627)
	at com.carrotsearch.randomizedtesting.RandomizedRunner$6.evaluate(RandomizedRunner.java:836)
	at com.carrotsearch.randomizedtesting.RandomizedRunner$7.evaluate(RandomizedRunner.java:872)
	at com.carrotsearch.randomizedtesting.RandomizedRunner$8.evaluate(RandomizedRunner.java:886)
	at org.apache.solr.BaseDistributedSearchTestCase$ShardsRepeatRule$ShardsFixedStatement.callStatement(BaseDistributedSearchTestCase.java:963)
	at org.apache.solr.BaseDistributedSearchTestCase$ShardsRepeatRule$ShardsStatement.evaluate(BaseDistributedSearchTestCase.java:938)
	at com.carrotsearch.randomizedtesting.rules.SystemPropertiesRestoreRule$1.evaluate(SystemPropertiesRestoreRule.java:57)
	at org.apache.lucene.util.TestRuleSetupTeardownChained$1.evaluate(TestRuleSetupTeardownChained.java:50)
	at org.apache.lucene.util.AbstractBeforeAfterRule$1.evaluate(AbstractBeforeAfterRule.java:46)
	at org.apache.lucene.util.TestRuleThreadAndTestName$1.evaluate(TestRuleThreadAndTestName.java:49)
	at org.apache.lucene.util.TestRuleIgnoreAfterMaxFailures$1.evaluate(TestRuleIgnoreAfterMaxFailures.java:65)
	at org.apache.lucene.util.TestRuleMarkFailure$1.evaluate(TestRuleMarkFailure.java:48)
	at com.carrotsearch.randomizedtesting.rules.StatementAdapter.evaluate(StatementAdapter.java:36)
	at com.carrotsearch.randomizedtesting.ThreadLeakControl$StatementRunner.run(ThreadLeakControl.java:365)
	at com.carrotsearch.randomizedtesting.ThreadLeakControl.forkTimeoutingTask(ThreadLeakControl.java:798)
	at com.carrotsearch.randomizedtesting.ThreadLeakControl$3.evaluate(ThreadLeakControl.java:458)
	at com.carrotsearch.randomizedtesting.RandomizedRunner.runSingleTest(RandomizedRunner.java:845)
	at com.carrotsearch.randomizedtesting.RandomizedRunner$3.evaluate(RandomizedRunner.java:747)
	at com.carrotsearch.randomizedtesting.RandomizedRunner$4.evaluate(RandomizedRunner.java:781)
	at com.carrotsearch.randomizedtesting.RandomizedRunner$5.evaluate(RandomizedRunner.java:792)
	at com.carrotsearch.randomizedtesting.rules.StatementAdapter.evaluate(StatementAdapter.java:36)
	at com.carrotsearch.randomizedtesting.rules.SystemPropertiesRestoreRule$1.evaluate(SystemPropertiesRestoreRule.java:57)
	at org.apache.lucene.util.AbstractBeforeAfterRule$1.evaluate(AbstractBeforeAfterRule.java:46)
	at com.carrotsearch.randomizedtesting.rules.StatementAdapter.evaluate(StatementAdapter.java:36)
	at org.apache.lucene.util.TestRuleStoreClassName$1.evaluate(TestRuleStoreClassName.java:42)
	at com.carrotsearch.randomizedtesting.rules.NoShadowingOrOverridesOnMethodsRule$1.evaluate(NoShadowingOrOverridesOnMethodsRule.java:39)
	at com.carrotsearch.randomizedtesting.rules.NoShadowingOrOverridesOnMethodsRule$1.evaluate(NoShadowingOrOverridesOnMethodsRule.java:39)
	at com.carrotsearch.randomizedtesting.rules.StatementAdapter.evaluate(StatementAdapter.java:36)
	at com.carrotsearch.randomizedtesting.rules.StatementAdapter.evaluate(StatementAdapter.java:36)
	at com.carrotsearch.randomizedtesting.rules.StatementAdapter.evaluate(StatementAdapter.java:36)
	at org.apache.lucene.util.TestRuleAssertionsRequired$1.evaluate(TestRuleAssertionsRequired.java:54)
	at org.apache.lucene.util.TestRuleMarkFailure$1.evaluate(TestRuleMarkFailure.java:48)
	at org.apache.lucene.util.TestRuleIgnoreAfterMaxFailures$1.evaluate(TestRuleIgnoreAfterMaxFailures.java:65)
	at org.apache.lucene.util.TestRuleIgnoreTestSuites$1.evaluate(TestRuleIgnoreTestSuites.java:55)
	at com.carrotsearch.randomizedtesting.rules.StatementAdapter.evaluate(StatementAdapter.java:36)
	at com.carrotsearch.randomizedtesting.ThreadLeakControl$StatementRunner.run(ThreadLeakControl.java:365)
	at java.lang.Thread.run(Thread.java:745)




Build Log:
[...truncated 11695 lines...]
   [junit4] Suite: org.apache.solr.security.PKIAuthenticationIntegrationTest
   [junit4]   2> Creating dataDir: /home/jenkins/workspace/Lucene-Solr-5.x-Linux/solr/build/solr-core/test/J2/temp/solr.security.PKIAuthenticationIntegrationTest_BD24EEE43B4C716C-001/init-core-data-001
   [junit4]   2> 1584407 INFO  (SUITE-PKIAuthenticationIntegrationTest-seed#[BD24EEE43B4C716C]-worker) [    ] o.a.s.BaseDistributedSearchTestCase Setting hostContext system property: /
   [junit4]   2> 1584409 INFO  (TEST-PKIAuthenticationIntegrationTest.testPkiAuth-seed#[BD24EEE43B4C716C]) [    ] o.a.s.c.ZkTestServer STARTING ZK TEST SERVER
   [junit4]   2> 1584409 INFO  (Thread-4589) [    ] o.a.s.c.ZkTestServer client port:0.0.0.0/0.0.0.0:0
   [junit4]   2> 1584409 INFO  (Thread-4589) [    ] o.a.s.c.ZkTestServer Starting server
   [junit4]   2> 1584509 INFO  (TEST-PKIAuthenticationIntegrationTest.testPkiAuth-seed#[BD24EEE43B4C716C]) [    ] o.a.s.c.ZkTestServer start zk server on port:42857
   [junit4]   2> 1584510 INFO  (TEST-PKIAuthenticationIntegrationTest.testPkiAuth-seed#[BD24EEE43B4C716C]) [    ] o.a.s.c.c.SolrZkClient Using default ZkCredentialsProvider
   [junit4]   2> 1584510 INFO  (TEST-PKIAuthenticationIntegrationTest.testPkiAuth-seed#[BD24EEE43B4C716C]) [    ] o.a.s.c.c.ConnectionManager Waiting for client to connect to ZooKeeper
   [junit4]   2> 1584512 INFO  (zkCallback-2072-thread-1) [    ] o.a.s.c.c.ConnectionManager Watcher org.apache.solr.common.cloud.ConnectionManager@1a546983 name:ZooKeeperConnection Watcher:127.0.0.1:42857 got event WatchedEvent state:SyncConnected type:None path:null path:null type:None
   [junit4]   2> 1584512 INFO  (TEST-PKIAuthenticationIntegrationTest.testPkiAuth-seed#[BD24EEE43B4C716C]) [    ] o.a.s.c.c.ConnectionManager Client is connected to ZooKeeper
   [junit4]   2> 1584512 INFO  (TEST-PKIAuthenticationIntegrationTest.testPkiAuth-seed#[BD24EEE43B4C716C]) [    ] o.a.s.c.c.SolrZkClient Using default ZkACLProvider
   [junit4]   2> 1584512 INFO  (TEST-PKIAuthenticationIntegrationTest.testPkiAuth-seed#[BD24EEE43B4C716C]) [    ] o.a.s.c.c.SolrZkClient makePath: /solr
   [junit4]   2> 1584514 INFO  (TEST-PKIAuthenticationIntegrationTest.testPkiAuth-seed#[BD24EEE43B4C716C]) [    ] o.a.s.c.c.SolrZkClient Using default ZkCredentialsProvider
   [junit4]   2> 1584514 INFO  (TEST-PKIAuthenticationIntegrationTest.testPkiAuth-seed#[BD24EEE43B4C716C]) [    ] o.a.s.c.c.ConnectionManager Waiting for client to connect to ZooKeeper
   [junit4]   2> 1584515 INFO  (zkCallback-2073-thread-1) [    ] o.a.s.c.c.ConnectionManager Watcher org.apache.solr.common.cloud.ConnectionManager@ff9d673 name:ZooKeeperConnection Watcher:127.0.0.1:42857/solr got event WatchedEvent state:SyncConnected type:None path:null path:null type:None
   [junit4]   2> 1584515 INFO  (TEST-PKIAuthenticationIntegrationTest.testPkiAuth-seed#[BD24EEE43B4C716C]) [    ] o.a.s.c.c.ConnectionManager Client is connected to ZooKeeper
   [junit4]   2> 1584515 INFO  (TEST-PKIAuthenticationIntegrationTest.testPkiAuth-seed#[BD24EEE43B4C716C]) [    ] o.a.s.c.c.SolrZkClient Using default ZkACLProvider
   [junit4]   2> 1584515 INFO  (TEST-PKIAuthenticationIntegrationTest.testPkiAuth-seed#[BD24EEE43B4C716C]) [    ] o.a.s.c.c.SolrZkClient makePath: /collections/collection1
   [junit4]   2> 1584516 INFO  (TEST-PKIAuthenticationIntegrationTest.testPkiAuth-seed#[BD24EEE43B4C716C]) [    ] o.a.s.c.c.SolrZkClient makePath: /collections/collection1/shards
   [junit4]   2> 1584516 INFO  (TEST-PKIAuthenticationIntegrationTest.testPkiAuth-seed#[BD24EEE43B4C716C]) [    ] o.a.s.c.c.SolrZkClient makePath: /collections/control_collection
   [junit4]   2> 1584517 INFO  (TEST-PKIAuthenticationIntegrationTest.testPkiAuth-seed#[BD24EEE43B4C716C]) [    ] o.a.s.c.c.SolrZkClient makePath: /collections/control_collection/shards
   [junit4]   2> 1584517 INFO  (TEST-PKIAuthenticationIntegrationTest.testPkiAuth-seed#[BD24EEE43B4C716C]) [    ] o.a.s.c.AbstractZkTestCase put /home/jenkins/workspace/Lucene-Solr-5.x-Linux/solr/core/src/test-files/solr/collection1/conf/solrconfig-tlog.xml to /configs/conf1/solrconfig.xml
   [junit4]   2> 1584518 INFO  (TEST-PKIAuthenticationIntegrationTest.testPkiAuth-seed#[BD24EEE43B4C716C]) [    ] o.a.s.c.c.SolrZkClient makePath: /configs/conf1/solrconfig.xml
   [junit4]   2> 1584518 INFO  (TEST-PKIAuthenticationIntegrationTest.testPkiAuth-seed#[BD24EEE43B4C716C]) [    ] o.a.s.c.AbstractZkTestCase put /home/jenkins/workspace/Lucene-Solr-5.x-Linux/solr/core/src/test-files/solr/collection1/conf/schema.xml to /configs/conf1/schema.xml
   [junit4]   2> 1584519 INFO  (TEST-PKIAuthenticationIntegrationTest.testPkiAuth-seed#[BD24EEE43B4C716C]) [    ] o.a.s.c.c.SolrZkClient makePath: /configs/conf1/schema.xml
   [junit4]   2> 1584519 INFO  (TEST-PKIAuthenticationIntegrationTest.testPkiAuth-seed#[BD24EEE43B4C716C]) [    ] o.a.s.c.AbstractZkTestCase put /home/jenkins/workspace/Lucene-Solr-5.x-Linux/solr/core/src/test-files/solr/collection1/conf/solrconfig.snippet.randomindexconfig.xml to /configs/conf1/solrconfig.snippet.randomindexconfig.xml
   [junit4]   2> 1584520 INFO  (TEST-PKIAuthenticationIntegrationTest.testPkiAuth-seed#[BD24EEE43B4C716C]) [    ] o.a.s.c.c.SolrZkClient makePath: /configs/conf1/solrconfig.snippet.randomindexconfig.xml
   [junit4]   2> 1584520 INFO  (TEST-PKIAuthenticationIntegrationTest.testPkiAuth-seed#[BD24EEE43B4C716C]) [    ] o.a.s.c.AbstractZkTestCase put /home/jenkins/workspace/Lucene-Solr-5.x-Linux/solr/core/src/test-files/solr/collection1/conf/stopwords.txt to /configs/conf1/stopwords.txt
   [junit4]   2> 1584520 INFO  (TEST-PKIAuthenticationIntegrationTest.testPkiAuth-seed#[BD24EEE43B4C716C]) [    ] o.a.s.c.c.SolrZkClient makePath: /configs/conf1/stopwords.txt
   [junit4]   2> 1584521 INFO  (TEST-PKIAuthenticationIntegrationTest.testPkiAuth-seed#[BD24EEE43B4C716C]) [    ] o.a.s.c.AbstractZkTestCase put /home/jenkins/workspace/Lucene-Solr-5.x-Linux/solr/core/src/test-files/solr/collection1/conf/protwords.txt to /configs/conf1/protwords.txt
   [junit4]   2> 1584521 INFO  (TEST-PKIAuthenticationIntegrationTest.testPkiAuth-seed#[BD24EEE43B4C716C]) [    ] o.a.s.c.c.SolrZkClient makePath: /configs/conf1/protwords.txt
   [junit4]   2> 1584522 INFO  (TEST-PKIAuthenticationIntegrationTest.testPkiAuth-seed#[BD24EEE43B4C716C]) [    ] o.a.s.c.AbstractZkTestCase put /home/jenkins/workspace/Lucene-Solr-5.x-Linux/solr/core/src/test-files/solr/collection1/conf/currency.xml to /configs/conf1/currency.xml
   [junit4]   2> 1584522 INFO  (TEST-PKIAuthenticationIntegrationTest.testPkiAuth-seed#[BD24EEE43B4C716C]) [    ] o.a.s.c.c.SolrZkClient makePath: /configs/conf1/currency.xml
   [junit4]   2> 1584523 INFO  (TEST-PKIAuthenticationIntegrationTest.testPkiAuth-seed#[BD24EEE43B4C716C]) [    ] o.a.s.c.AbstractZkTestCase put /home/jenkins/workspace/Lucene-Solr-5.x-Linux/solr/core/src/test-files/solr/collection1/conf/enumsConfig.xml to /configs/conf1/enumsConfig.xml
   [junit4]   2> 1584523 INFO  (TEST-PKIAuthenticationIntegrationTest.testPkiAuth-seed#[BD24EEE43B4C716C]) [    ] o.a.s.c.c.SolrZkClient makePath: /configs/conf1/enumsConfig.xml
   [junit4]   2> 1584523 INFO  (TEST-PKIAuthenticationIntegrationTest.testPkiAuth-seed#[BD24EEE43B4C716C]) [    ] o.a.s.c.AbstractZkTestCase put /home/jenkins/workspace/Lucene-Solr-5.x-Linux/solr/core/src/test-files/solr/collection1/conf/open-exchange-rates.json to /configs/conf1/open-exchange-rates.json
   [junit4]   2> 1584524 INFO  (TEST-PKIAuthenticationIntegrationTest.testPkiAuth-seed#[BD24EEE43B4C716C]) [    ] o.a.s.c.c.SolrZkClient makePath: /configs/conf1/open-exchange-rates.json
   [junit4]   2> 1584524 INFO  (TEST-PKIAuthenticationIntegrationTest.testPkiAuth-seed#[BD24EEE43B4C716C]) [    ] o.a.s.c.AbstractZkTestCase put /home/jenkins/workspace/Lucene-Solr-5.x-Linux/solr/core/src/test-files/solr/collection1/conf/mapping-ISOLatin1Accent.txt to /configs/conf1/mapping-ISOLatin1Accent.txt
   [junit4]   2> 1584524 INFO  (TEST-PKIAuthenticationIntegrationTest.testPkiAuth-seed#[BD24EEE43B4C716C]) [    ] o.a.s.c.c.SolrZkClient makePath: /configs/conf1/mapping-ISOLatin1Accent.txt
   [junit4]   2> 1584525 INFO  (TEST-PKIAuthenticationIntegrationTest.testPkiAuth-seed#[BD24EEE43B4C716C]) [    ] o.a.s.c.AbstractZkTestCase put /home/jenkins/workspace/Lucene-Solr-5.x-Linux/solr/core/src/test-files/solr/collection1/conf/old_synonyms.txt to /configs/conf1/old_synonyms.txt
   [junit4]   2> 1584525 INFO  (TEST-PKIAuthenticationIntegrationTest.testPkiAuth-seed#[BD24EEE43B4C716C]) [    ] o.a.s.c.c.SolrZkClient makePath: /configs/conf1/old_synonyms.txt
   [junit4]   2> 1584526 INFO  (TEST-PKIAuthenticationIntegrationTest.testPkiAuth-seed#[BD24EEE43B4C716C]) [    ] o.a.s.c.AbstractZkTestCase put /home/jenkins/workspace/Lucene-Solr-5.x-Linux/solr/core/src/test-files/solr/collection1/conf/synonyms.txt to /configs/conf1/synonyms.txt
   [junit4]   2> 1584526 INFO  (TEST-PKIAuthenticationIntegrationTest.testPkiAuth-seed#[BD24EEE43B4C716C]) [    ] o.a.s.c.c.SolrZkClient makePath: /configs/conf1/synonyms.txt
   [junit4]   2> 1584592 INFO  (TEST-PKIAuthenticationIntegrationTest.testPkiAuth-seed#[BD24EEE43B4C716C]) [    ] o.a.s.SolrTestCaseJ4 Writing core.properties file to /home/jenkins/workspace/Lucene-Solr-5.x-Linux/solr/build/solr-core/test/J2/temp/solr.security.PKIAuthenticationIntegrationTest_BD24EEE43B4C716C-001/control-001/cores/collection1
   [junit4]   2> 1584593 INFO  (TEST-PKIAuthenticationIntegrationTest.testPkiAuth-seed#[BD24EEE43B4C716C]) [    ] o.e.j.s.Server jetty-9.2.11.v20150529
   [junit4]   2> 1584594 INFO  (TEST-PKIAuthenticationIntegrationTest.testPkiAuth-seed#[BD24EEE43B4C716C]) [    ] o.e.j.s.h.ContextHandler Started o.e.j.s.ServletContextHandler@3e64420b{/,null,AVAILABLE}
   [junit4]   2> 1584595 INFO  (TEST-PKIAuthenticationIntegrationTest.testPkiAuth-seed#[BD24EEE43B4C716C]) [    ] o.e.j.s.ServerConnector Started ServerConnector@32637243{HTTP/1.1}{127.0.0.1:52771}
   [junit4]   2> 1584595 INFO  (TEST-PKIAuthenticationIntegrationTest.testPkiAuth-seed#[BD24EEE43B4C716C]) [    ] o.e.j.s.Server Started @1586630ms
   [junit4]   2> 1584595 INFO  (TEST-PKIAuthenticationIntegrationTest.testPkiAuth-seed#[BD24EEE43B4C716C]) [    ] o.a.s.c.s.e.JettySolrRunner Jetty properties: {solr.data.dir=/home/jenkins/workspace/Lucene-Solr-5.x-Linux/solr/build/solr-core/test/J2/temp/solr.security.PKIAuthenticationIntegrationTest_BD24EEE43B4C716C-001/tempDir-001/control/data, hostContext=/, hostPort=52771, coreRootDirectory=/home/jenkins/workspace/Lucene-Solr-5.x-Linux/solr/build/solr-core/test/J2/temp/solr.security.PKIAuthenticationIntegrationTest_BD24EEE43B4C716C-001/control-001/cores}
   [junit4]   2> 1584595 INFO  (TEST-PKIAuthenticationIntegrationTest.testPkiAuth-seed#[BD24EEE43B4C716C]) [    ] o.a.s.s.SolrDispatchFilter SolrDispatchFilter.init(): sun.misc.Launcher$AppClassLoader@4e0e2f2a
   [junit4]   2> 1584595 INFO  (TEST-PKIAuthenticationIntegrationTest.testPkiAuth-seed#[BD24EEE43B4C716C]) [    ] o.a.s.c.SolrResourceLoader new SolrResourceLoader for directory: '/home/jenkins/workspace/Lucene-Solr-5.x-Linux/solr/build/solr-core/test/J2/temp/solr.security.PKIAuthenticationIntegrationTest_BD24EEE43B4C716C-001/control-001/'
   [junit4]   2> 1584608 INFO  (TEST-PKIAuthenticationIntegrationTest.testPkiAuth-seed#[BD24EEE43B4C716C]) [    ] o.a.s.c.c.SolrZkClient Using default ZkCredentialsProvider
   [junit4]   2> 1584609 INFO  (TEST-PKIAuthenticationIntegrationTest.testPkiAuth-seed#[BD24EEE43B4C716C]) [    ] o.a.s.c.c.ConnectionManager Waiting for client to connect to ZooKeeper
   [junit4]   2> 1584610 INFO  (zkCallback-2074-thread-1) [    ] o.a.s.c.c.ConnectionManager Watcher org.apache.solr.common.cloud.ConnectionManager@5df7d099 name:ZooKeeperConnection Watcher:127.0.0.1:42857/solr got event WatchedEvent state:SyncConnected type:None path:null path:null type:None
   [junit4]   2> 1584610 INFO  (TEST-PKIAuthenticationIntegrationTest.testPkiAuth-seed#[BD24EEE43B4C716C]) [    ] o.a.s.c.c.ConnectionManager Client is connected to ZooKeeper
   [junit4]   2> 1584610 INFO  (TEST-PKIAuthenticationIntegrationTest.testPkiAuth-seed#[BD24EEE43B4C716C]) [    ] o.a.s.c.c.SolrZkClient Using default ZkACLProvider
   [junit4]   2> 1584611 INFO  (TEST-PKIAuthenticationIntegrationTest.testPkiAuth-seed#[BD24EEE43B4C716C]) [    ] o.a.s.s.SolrDispatchFilter Loading solr.xml from SolrHome (not found in ZooKeeper)
   [junit4]   2> 1584611 INFO  (TEST-PKIAuthenticationIntegrationTest.testPkiAuth-seed#[BD24EEE43B4C716C]) [    ] o.a.s.c.SolrXmlConfig Loading container configuration from /home/jenkins/workspace/Lucene-Solr-5.x-Linux/solr/build/solr-core/test/J2/temp/solr.security.PKIAuthenticationIntegrationTest_BD24EEE43B4C716C-001/control-001/solr.xml
   [junit4]   2> 1584614 INFO  (TEST-PKIAuthenticationIntegrationTest.testPkiAuth-seed#[BD24EEE43B4C716C]) [    ] o.a.s.c.CoresLocator Config-defined core root directory: /home/jenkins/workspace/Lucene-Solr-5.x-Linux/solr/build/solr-core/test/J2/temp/solr.security.PKIAuthenticationIntegrationTest_BD24EEE43B4C716C-001/control-001/cores
   [junit4]   2> 1584615 INFO  (TEST-PKIAuthenticationIntegrationTest.testPkiAuth-seed#[BD24EEE43B4C716C]) [    ] o.a.s.c.CoreContainer New CoreContainer 985574960
   [junit4]   2> 1584615 INFO  (TEST-PKIAuthenticationIntegrationTest.testPkiAuth-seed#[BD24EEE43B4C716C]) [    ] o.a.s.c.CoreContainer Loading cores into CoreContainer [instanceDir=/home/jenkins/workspace/Lucene-Solr-5.x-Linux/solr/build/solr-core/test/J2/temp/solr.security.PKIAuthenticationIntegrationTest_BD24EEE43B4C716C-001/control-001/]
   [junit4]   2> 1584615 INFO  (TEST-PKIAuthenticationIntegrationTest.testPkiAuth-seed#[BD24EEE43B4C716C]) [    ] o.a.s.c.CoreContainer loading shared library: /home/jenkins/workspace/Lucene-Solr-5.x-Linux/solr/build/solr-core/test/J2/temp/solr.security.PKIAuthenticationIntegrationTest_BD24EEE43B4C716C-001/control-001/lib
   [junit4]   2> 1584615 WARN  (TEST-PKIAuthenticationIntegrationTest.testPkiAuth-seed#[BD24EEE43B4C716C]) [    ] o.a.s.c.SolrResourceLoader Can't find (or read) directory to add to classloader: lib (resolved as: /home/jenkins/workspace/Lucene-Solr-5.x-Linux/solr/build/solr-core/test/J2/temp/solr.security.PKIAuthenticationIntegrationTest_BD24EEE43B4C716C-001/control-001/lib).
   [junit4]   2> 1584621 INFO  (TEST-PKIAuthenticationIntegrationTest.testPkiAuth-seed#[BD24EEE43B4C716C]) [    ] o.a.s.h.c.HttpShardHandlerFactory created with socketTimeout : 90000,urlScheme : ,connTimeout : 15000,maxConnectionsPerHost : 20,maxConnections : 10000,corePoolSize : 0,maximumPoolSize : 2147483647,maxThreadIdleTime : 5,sizeOfQueue : -1,fairnessPolicy : false,useRetries : false,
   [junit4]   2> 1584622 INFO  (TEST-PKIAuthenticationIntegrationTest.testPkiAuth-seed#[BD24EEE43B4C716C]) [    ] o.a.s.u.UpdateShardHandler Creating UpdateShardHandler HTTP client with params: socketTimeout=340000&connTimeout=45000&retry=true
   [junit4]   2> 1584623 INFO  (TEST-PKIAuthenticationIntegrationTest.testPkiAuth-seed#[BD24EEE43B4C716C]) [    ] o.a.s.l.LogWatcher SLF4J impl is org.slf4j.impl.Log4jLoggerFactory
   [junit4]   2> 1584623 INFO  (TEST-PKIAuthenticationIntegrationTest.testPkiAuth-seed#[BD24EEE43B4C716C]) [    ] o.a.s.l.LogWatcher Registering Log Listener [Log4j (org.slf4j.impl.Log4jLoggerFactory)]
   [junit4]   2> 1584623 INFO  (TEST-PKIAuthenticationIntegrationTest.testPkiAuth-seed#[BD24EEE43B4C716C]) [    ] o.a.s.c.ZkContainer Zookeeper client=127.0.0.1:42857/solr
   [junit4]   2> 1584623 INFO  (TEST-PKIAuthenticationIntegrationTest.testPkiAuth-seed#[BD24EEE43B4C716C]) [    ] o.a.s.c.ZkController zkHost includes chroot
   [junit4]   2> 1584624 INFO  (TEST-PKIAuthenticationIntegrationTest.testPkiAuth-seed#[BD24EEE43B4C716C]) [    ] o.a.s.c.c.SolrZkClient Using default ZkCredentialsProvider
   [junit4]   2> 1584624 INFO  (TEST-PKIAuthenticationIntegrationTest.testPkiAuth-seed#[BD24EEE43B4C716C]) [    ] o.a.s.c.c.ConnectionManager Waiting for client to connect to ZooKeeper
   [junit4]   2> 1584625 INFO  (zkCallback-2076-thread-1) [    ] o.a.s.c.c.ConnectionManager Watcher org.apache.solr.common.cloud.ConnectionManager@9cf2087 name:ZooKeeperConnection Watcher:127.0.0.1:42857 got event WatchedEvent state:SyncConnected type:None path:null path:null type:None
   [junit4]   2> 1584625 INFO  (TEST-PKIAuthenticationIntegrationTest.testPkiAuth-seed#[BD24EEE43B4C716C]) [    ] o.a.s.c.c.ConnectionManager Client is connected to ZooKeeper
   [junit4]   2> 1584625 INFO  (TEST-PKIAuthenticationIntegrationTest.testPkiAuth-seed#[BD24EEE43B4C716C]) [    ] o.a.s.c.c.SolrZkClient Using default ZkACLProvider
   [junit4]   2> 1584626 INFO  (TEST-PKIAuthenticationIntegrationTest.testPkiAuth-seed#[BD24EEE43B4C716C]) [n:127.0.0.1:52771_    ] o.a.s.c.c.ConnectionManager Waiting for client to connect to ZooKeeper
   [junit4]   2> 1584627 INFO  (zkCallback-2077-thread-1-processing-n:127.0.0.1:52771_) [n:127.0.0.1:52771_    ] o.a.s.c.c.ConnectionManager Watcher org.apache.solr.common.cloud.ConnectionManager@51bf2785 name:ZooKeeperConnection Watcher:127.0.0.1:42857/solr got event WatchedEvent state:SyncConnected type:None path:null path:null type:None
   [junit4]   2> 1584627 INFO  (TEST-PKIAuthenticationIntegrationTest.testPkiAuth-seed#[BD24EEE43B4C716C]) [n:127.0.0.1:52771_    ] o.a.s.c.c.ConnectionManager Client is connected to ZooKeeper
   [junit4]   2> 1584627 INFO  (TEST-PKIAuthenticationIntegrationTest.testPkiAuth-seed#[BD24EEE43B4C716C]) [n:127.0.0.1:52771_    ] o.a.s.c.c.SolrZkClient makePath: /overseer/queue
   [junit4]   2> 1584628 INFO  (TEST-PKIAuthenticationIntegrationTest.testPkiAuth-seed#[BD24EEE43B4C716C]) [n:127.0.0.1:52771_    ] o.a.s.c.c.SolrZkClient makePath: /overseer/collection-queue-work
   [junit4]   2> 1584629 INFO  (TEST-PKIAuthenticationIntegrationTest.testPkiAuth-seed#[BD24EEE43B4C716C]) [n:127.0.0.1:52771_    ] o.a.s.c.c.SolrZkClient makePath: /overseer/collection-map-running
   [junit4]   2> 1584630 INFO  (TEST-PKIAuthenticationIntegrationTest.testPkiAuth-seed#[BD24EEE43B4C716C]) [n:127.0.0.1:52771_    ] o.a.s.c.c.SolrZkClient makePath: /overseer/collection-map-completed
   [junit4]   2> 1584630 INFO  (TEST-PKIAuthenticationIntegrationTest.testPkiAuth-seed#[BD24EEE43B4C716C]) [n:127.0.0.1:52771_    ] o.a.s.c.c.SolrZkClient makePath: /overseer/collection-map-failure
   [junit4]   2> 1584631 INFO  (TEST-PKIAuthenticationIntegrationTest.testPkiAuth-seed#[BD24EEE43B4C716C]) [n:127.0.0.1:52771_    ] o.a.s.c.c.SolrZkClient makePath: /live_nodes
   [junit4]   2> 1584631 INFO  (TEST-PKIAuthenticationIntegrationTest.testPkiAuth-seed#[BD24EEE43B4C716C]) [n:127.0.0.1:52771_    ] o.a.s.c.c.SolrZkClient makePath: /aliases.json
   [junit4]   2> 1584632 INFO  (TEST-PKIAuthenticationIntegrationTest.testPkiAuth-seed#[BD24EEE43B4C716C]) [n:127.0.0.1:52771_    ] o.a.s.c.c.SolrZkClient makePath: /clusterstate.json
   [junit4]   2> 1584632 INFO  (TEST-PKIAuthenticationIntegrationTest.testPkiAuth-seed#[BD24EEE43B4C716C]) [n:127.0.0.1:52771_    ] o.a.s.c.c.SolrZkClient makePath: /security.json
   [junit4]   2> 1584632 INFO  (TEST-PKIAuthenticationIntegrationTest.testPkiAuth-seed#[BD24EEE43B4C716C]) [n:127.0.0.1:52771_    ] o.a.s.c.ZkController Register node as live in ZooKeeper:/live_nodes/127.0.0.1:52771_
   [junit4]   2> 1584632 INFO  (TEST-PKIAuthenticationIntegrationTest.testPkiAuth-seed#[BD24EEE43B4C716C]) [n:127.0.0.1:52771_    ] o.a.s.c.c.SolrZkClient makePath: /live_nodes/127.0.0.1:52771_
   [junit4]   2> 1584633 INFO  (TEST-PKIAuthenticationIntegrationTest.testPkiAuth-seed#[BD24EEE43B4C716C]) [n:127.0.0.1:52771_    ] o.a.s.c.c.SolrZkClient makePath: /overseer_elect
   [junit4]   2> 1584633 INFO  (TEST-PKIAuthenticationIntegrationTest.testPkiAuth-seed#[BD24EEE43B4C716C]) [n:127.0.0.1:52771_    ] o.a.s.c.c.SolrZkClient makePath: /overseer_elect/election
   [junit4]   2> 1584634 INFO  (TEST-PKIAuthenticationIntegrationTest.testPkiAuth-seed#[BD24EEE43B4C716C]) [n:127.0.0.1:52771_    ] o.a.s.c.Overseer Overseer (id=null) closing
   [junit4]   2> 1584634 INFO  (TEST-PKIAuthenticationIntegrationTest.testPkiAuth-seed#[BD24EEE43B4C716C]) [n:127.0.0.1:52771_    ] o.a.s.c.LeaderElector Joined leadership election with path: /overseer_elect/election/94303051914084356-127.0.0.1:52771_-n_0000000000
   [junit4]   2> 1584634 INFO  (TEST-PKIAuthenticationIntegrationTest.testPkiAuth-seed#[BD24EEE43B4C716C]) [n:127.0.0.1:52771_    ] o.a.s.c.OverseerElectionContext I am going to be the leader 127.0.0.1:52771_
   [junit4]   2> 1584635 INFO  (TEST-PKIAuthenticationIntegrationTest.testPkiAuth-seed#[BD24EEE43B4C716C]) [n:127.0.0.1:52771_    ] o.a.s.c.c.SolrZkClient makePath: /overseer_elect/leader
   [junit4]   2> 1584635 INFO  (TEST-PKIAuthenticationIntegrationTest.testPkiAuth-seed#[BD24EEE43B4C716C]) [n:127.0.0.1:52771_    ] o.a.s.c.Overseer Overseer (id=94303051914084356-127.0.0.1:52771_-n_0000000000) starting
   [junit4]   2> 1584636 INFO  (TEST-PKIAuthenticationIntegrationTest.testPkiAuth-seed#[BD24EEE43B4C716C]) [n:127.0.0.1:52771_    ] o.a.s.c.c.SolrZkClient makePath: /overseer/queue-work
   [junit4]   2> 1584638 INFO  (TEST-PKIAuthenticationIntegrationTest.testPkiAuth-seed#[BD24EEE43B4C716C]) [n:127.0.0.1:52771_    ] o.a.s.c.OverseerAutoReplicaFailoverThread Starting OverseerAutoReplicaFailoverThread autoReplicaFailoverWorkLoopDelay=10000 autoReplicaFailoverWaitAfterExpiration=30000 autoReplicaFailoverBadNodeExpiration=60000
   [junit4]   2> 1584638 INFO  (OverseerCollectionProcessor-94303051914084356-127.0.0.1:52771_-n_0000000000) [n:127.0.0.1:52771_    ] o.a.s.c.OverseerCollectionProcessor Process current queue of collection creations
   [junit4]   2> 1584638 INFO  (OverseerStateUpdate-94303051914084356-127.0.0.1:52771_-n_0000000000) [n:127.0.0.1:52771_    ] o.a.s.c.Overseer Starting to work on the main queue
   [junit4]   2> 1584638 INFO  (TEST-PKIAuthenticationIntegrationTest.testPkiAuth-seed#[BD24EEE43B4C716C]) [n:127.0.0.1:52771_    ] o.a.s.c.c.ZkStateReader Updating cluster state from ZooKeeper... 
   [junit4]   2> 1584653 INFO  (TEST-PKIAuthenticationIntegrationTest.testPkiAuth-seed#[BD24EEE43B4C716C]) [n:127.0.0.1:52771_    ] o.a.s.c.CoreContainer Security conf doesn't exist. Skipping setup for authorization module.
   [junit4]   2> 1584653 INFO  (TEST-PKIAuthenticationIntegrationTest.testPkiAuth-seed#[BD24EEE43B4C716C]) [n:127.0.0.1:52771_    ] o.a.s.c.CoreContainer No authentication plugin used.
   [junit4]   2> 1584654 INFO  (TEST-PKIAuthenticationIntegrationTest.testPkiAuth-seed#[BD24EEE43B4C716C]) [n:127.0.0.1:52771_    ] o.a.s.c.CoresLocator Looking for core definitions underneath /home/jenkins/workspace/Lucene-Solr-5.x-Linux/solr/build/solr-core/test/J2/temp/solr.security.PKIAuthenticationIntegrationTest_BD24EEE43B4C716C-001/control-001/cores
   [junit4]   2> 1584654 INFO  (TEST-PKIAuthenticationIntegrationTest.testPkiAuth-seed#[BD24EEE43B4C716C]) [n:127.0.0.1:52771_    ] o.a.s.c.SolrCore Created CoreDescriptor: {name=collection1, config=solrconfig.xml, transient=false, schema=schema.xml, loadOnStartup=true, configSetProperties=configsetprops.json, instanceDir=/home/jenkins/workspace/Lucene-Solr-5.x-Linux/solr/build/solr-core/test/J2/temp/solr.security.PKIAuthenticationIntegrationTest_BD24EEE43B4C716C-001/control-001/cores/collection1, collection=control_collection, absoluteInstDir=/home/jenkins/workspace/Lucene-Solr-5.x-Linux/solr/build/solr-core/test/J2/temp/solr.security.PKIAuthenticationIntegrationTest_BD24EEE43B4C716C-001/control-001/cores/collection1/, coreNodeName=, dataDir=data/, shard=}
   [junit4]   2> 1584655 INFO  (TEST-PKIAuthenticationIntegrationTest.testPkiAuth-seed#[BD24EEE43B4C716C]) [n:127.0.0.1:52771_    ] o.a.s.c.CoresLocator Found core collection1 in /home/jenkins/workspace/Lucene-Solr-5.x-Linux/solr/build/solr-core/test/J2/temp/solr.security.PKIAuthenticationIntegrationTest_BD24EEE43B4C716C-001/control-001/cores/collection1/
   [junit4]   2> 1584655 INFO  (TEST-PKIAuthenticationIntegrationTest.testPkiAuth-seed#[BD24EEE43B4C716C]) [n:127.0.0.1:52771_    ] o.a.s.c.CoresLocator Found 1 core definitions
   [junit4]   2> 1584655 INFO  (coreLoadExecutor-5512-thread-1-processing-n:127.0.0.1:52771_) [n:127.0.0.1:52771_ c:control_collection   x:collection1] o.a.s.c.ZkController publishing state=down
   [junit4]   2> 1584655 INFO  (coreLoadExecutor-5512-thread-1-processing-n:127.0.0.1:52771_) [n:127.0.0.1:52771_ c:control_collection   x:collection1] o.a.s.c.ZkController numShards not found on descriptor - reading it from system property
   [junit4]   2> 1584655 INFO  (TEST-PKIAuthenticationIntegrationTest.testPkiAuth-seed#[BD24EEE43B4C716C]) [n:127.0.0.1:52771_    ] o.a.s.s.SolrDispatchFilter user.dir=/home/jenkins/workspace/Lucene-Solr-5.x-Linux/solr/build/solr-core/test/J2
   [junit4]   2> 1584655 INFO  (TEST-PKIAuthenticationIntegrationTest.testPkiAuth-seed#[BD24EEE43B4C716C]) [n:127.0.0.1:52771_    ] o.a.s.s.SolrDispatchFilter SolrDispatchFilter.init() done
   [junit4]   2> 1584656 INFO  (zkCallback-2077-thread-1-processing-n:127.0.0.1:52771_) [n:127.0.0.1:52771_    ] o.a.s.c.DistributedQueue NodeChildrenChanged fired on path /overseer/queue state SyncConnected
   [junit4]   2> 1584656 INFO  (coreLoadExecutor-5512-thread-1-processing-n:127.0.0.1:52771_) [n:127.0.0.1:52771_ c:control_collection   x:collection1] o.a.s.c.ZkController look for our core node name
   [junit4]   2> 1584656 INFO  (OverseerStateUpdate-94303051914084356-127.0.0.1:52771_-n_0000000000) [n:127.0.0.1:52771_    ] o.a.s.c.Overseer processMessage: queueSize: 1, message = {
   [junit4]   2>   "core":"collection1",
   [junit4]   2>   "roles":null,
   [junit4]   2>   "base_url":"http://127.0.0.1:52771",
   [junit4]   2>   "node_name":"127.0.0.1:52771_",
   [junit4]   2>   "numShards":"1",
   [junit4]   2>   "state":"down",
   [junit4]   2>   "shard":null,
   [junit4]   2>   "collection":"control_collection",
   [junit4]   2>   "operation":"state"} current state version: 0
   [junit4]   2> 1584656 INFO  (OverseerStateUpdate-94303051914084356-127.0.0.1:52771_-n_0000000000) [n:127.0.0.1:52771_    ] o.a.s.c.o.ReplicaMutator Update state numShards=1 message={
   [junit4]   2>   "core":"collection1",
   [junit4]   2>   "roles":null,
   [junit4]   2>   "base_url":"http://127.0.0.1:52771",
   [junit4]   2>   "node_name":"127.0.0.1:52771_",
   [junit4]   2>   "numShards":"1",
   [junit4]   2>   "state":"down",
   [junit4]   2>   "shard":null,
   [junit4]   2>   "collection":"control_collection",
   [junit4]   2>   "operation":"state"}
   [junit4]   2> 1584656 INFO  (OverseerStateUpdate-94303051914084356-127.0.0.1:52771_-n_0000000000) [n:127.0.0.1:52771_    ] o.a.s.c.o.ClusterStateMutator building a new cName: control_collection
   [junit4]   2> 1584656 INFO  (OverseerStateUpdate-94303051914084356-127.0.0.1:52771_-n_0000000000) [n:127.0.0.1:52771_    ] o.a.s.c.o.ReplicaMutator Assigning new node to shard shard=shard1
   [junit4]   2> 1584657 INFO  (zkCallback-2077-thread-1-processing-n:127.0.0.1:52771_) [n:127.0.0.1:52771_    ] o.a.s.c.c.ZkStateReader A cluster state change: WatchedEvent state:SyncConnected type:NodeDataChanged path:/clusterstate.json, has occurred - updating... (live nodes size: 1)
   [junit4]   2> 1584657 INFO  (zkCallback-2077-thread-1-processing-n:127.0.0.1:52771_) [n:127.0.0.1:52771_    ] o.a.s.c.c.ZkStateReader Updated cluster state version to 1
   [junit4]   2> 1585656 INFO  (coreLoadExecutor-5512-thread-1-processing-n:127.0.0.1:52771_) [n:127.0.0.1:52771_ c:control_collection   x:collection1] o.a.s.c.ZkController waiting to find shard id in clusterstate for collection1
   [junit4]   2> 1585656 INFO  (coreLoadExecutor-5512-thread-1-processing-n:127.0.0.1:52771_) [n:127.0.0.1:52771_ c:control_collection   x:collection1] o.a.s.c.ZkController Check for collection zkNode:control_collection
   [junit4]   2> 1585657 INFO  (coreLoadExecutor-5512-thread-1-processing-n:127.0.0.1:52771_) [n:127.0.0.1:52771_ c:control_collection   x:collection1] o.a.s.c.ZkController Collection zkNode exists
   [junit4]   2> 1585657 INFO  (coreLoadExecutor-5512-thread-1-processing-n:127.0.0.1:52771_) [n:127.0.0.1:52771_ c:control_collection   x:collection1] o.a.s.c.c.ZkStateReader Load collection config from:/collections/control_collection
   [junit4]   2> 1585657 INFO  (coreLoadExecutor-5512-thread-1-processing-n:127.0.0.1:52771_) [n:127.0.0.1:52771_ c:control_collection   x:collection1] o.a.s.c.c.ZkStateReader path=/collections/control_collection configName=conf1 specified config exists in ZooKeeper
   [junit4]   2> 1585657 INFO  (coreLoadExecutor-5512-thread-1-processing-n:127.0.0.1:52771_) [n:127.0.0.1:52771_ c:control_collection   x:collection1] o.a.s.c.SolrResourceLoader new SolrResourceLoader for directory: '/home/jenkins/workspace/Lucene-Solr-5.x-Linux/solr/build/solr-core/test/J2/temp/solr.security.PKIAuthenticationIntegrationTest_BD24EEE43B4C716C-001/control-001/cores/collection1/'
   [junit4]   2> 1585666 INFO  (coreLoadExecutor-5512-thread-1-processing-n:127.0.0.1:52771_) [n:127.0.0.1:52771_ c:control_collection   x:collection1] o.a.s.c.Config loaded config solrconfig.xml with version 0 
   [junit4]   2> 1585669 INFO  (coreLoadExecutor-5512-thread-1-processing-n:127.0.0.1:52771_) [n:127.0.0.1:52771_ c:control_collection   x:collection1] o.a.s.c.SolrConfig current version of requestparams : -1
   [junit4]   2> 1585673 INFO  (coreLoadExecutor-5512-thread-1-processing-n:127.0.0.1:52771_) [n:127.0.0.1:52771_ c:control_collection   x:collection1] o.a.s.c.SolrConfig Using Lucene MatchVersion: 5.4.0
   [junit4]   2> 1585681 INFO  (coreLoadExecutor-5512-thread-1-processing-n:127.0.0.1:52771_) [n:127.0.0.1:52771_ c:control_collection   x:collection1] o.a.s.c.Config Loaded SolrConfig: solrconfig.xml
   [junit4]   2> 1585682 INFO  (coreLoadExecutor-5512-thread-1-processing-n:127.0.0.1:52771_) [n:127.0.0.1:52771_ c:control_collection   x:collection1] o.a.s.s.IndexSchema Reading Solr Schema from /configs/conf1/schema.xml
   [junit4]   2> 1585687 INFO  (coreLoadExecutor-5512-thread-1-processing-n:127.0.0.1:52771_) [n:127.0.0.1:52771_ c:control_collection   x:collection1] o.a.s.s.IndexSchema [collection1] Schema name=test
   [junit4]   2> 1585805 INFO  (coreLoadExecutor-5512-thread-1-processing-n:127.0.0.1:52771_) [n:127.0.0.1:52771_ c:control_collection   x:collection1] o.a.s.s.OpenExchangeRatesOrgProvider Initialized with rates=open-exchange-rates.json, refreshInterval=1440.
   [junit4]   2> 1585809 INFO  (coreLoadExecutor-5512-thread-1-processing-n:127.0.0.1:52771_) [n:127.0.0.1:52771_ c:control_collection   x:collection1] o.a.s.s.IndexSchema default search field in schema is text
   [junit4]   2> 1585810 INFO  (coreLoadExecutor-5512-thread-1-processing-n:127.0.0.1:52771_) [n:127.0.0.1:52771_ c:control_collection   x:collection1] o.a.s.s.IndexSchema unique key field: id
   [junit4]   2> 1585814 INFO  (coreLoadExecutor-5512-thread-1-processing-n:127.0.0.1:52771_) [n:127.0.0.1:52771_ c:control_collection   x:collection1] o.a.s.s.FileExchangeRateProvider Reloading exchange rates from file currency.xml
   [junit4]   2> 1585815 INFO  (coreLoadExecutor-5512-thread-1-processing-n:127.0.0.1:52771_) [n:127.0.0.1:52771_ c:control_collection   x:collection1] o.a.s.s.FileExchangeRateProvider Reloading exchange rates from file currency.xml
   [junit4]   2> 1585816 INFO  (coreLoadExecutor-5512-thread-1-processing-n:127.0.0.1:52771_) [n:127.0.0.1:52771_ c:control_collection   x:collection1] o.a.s.s.OpenExchangeRatesOrgProvider Reloading exchange rates from open-exchange-rates.json
   [junit4]   2> 1585816 WARN  (coreLoadExecutor-5512-thread-1-processing-n:127.0.0.1:52771_) [n:127.0.0.1:52771_ c:control_collection   x:collection1] o.a.s.s.OpenExchangeRatesOrgProvider Unknown key IMPORTANT NOTE
   [junit4]   2> 1585817 WARN  (coreLoadExecutor-5512-thread-1-processing-n:127.0.0.1:52771_) [n:127.0.0.1:52771_ c:control_collection   x:collection1] o.a.s.s.OpenExchangeRatesOrgProvider Expected key, got STRING
   [junit4]   2> 1585817 INFO  (coreLoadExecutor-5512-thread-1-processing-n:127.0.0.1:52771_) [n:127.0.0.1:52771_ c:control_collection   x:collection1] o.a.s.s.OpenExchangeRatesOrgProvider Reloading exchange rates from open-exchange-rates.json
   [junit4]   2> 1585817 WARN  (coreLoadExecutor-5512-thread-1-processing-n:127.0.0.1:52771_) [n:127.0.0.1:52771_ c:control_collection   x:collection1] o.a.s.s.OpenExchangeRatesOrgProvider Unknown key IMPORTANT NOTE
   [junit4]   2> 1585817 WARN  (coreLoadExecutor-5512-thread-1-processing-n:127.0.0.1:52771_) [n:127.0.0.1:52771_ c:control_collection   x:collection1] o.a.s.s.OpenExchangeRatesOrgProvider Expected key, got STRING
   [junit4]   2> 1585818 INFO  (coreLoadExecutor-5512-thread-1-processing-n:127.0.0.1:52771_) [n:127.0.0.1:52771_ c:control_collection   x:collection1] o.a.s.c.ConfigSetProperties Did not find ConfigSet properties, assuming default properties: Can't find resource 'configsetprops.json' in classpath or '/configs/conf1', cwd=/home/jenkins/workspace/Lucene-Solr-5.x-Linux/solr/build/solr-core/test/J2
   [junit4]   2> 1585818 INFO  (coreLoadExecutor-5512-thread-1-processing-n:127.0.0.1:52771_) [n:127.0.0.1:52771_ c:control_collection   x:collection1] o.a.s.c.CoreContainer Creating SolrCore 'collection1' using configuration from collection control_collection
   [junit4]   2> 1585818 INFO  (coreLoadExecutor-5512-thread-1-processing-n:127.0.0.1:52771_) [n:127.0.0.1:52771_ c:control_collection s:shard1 r:core_node1 x:collection1] o.a.s.c.SolrCore org.apache.solr.core.MockDirectoryFactory
   [junit4]   2> 1585818 INFO  (coreLoadExecutor-5512-thread-1-processing-n:127.0.0.1:52771_) [n:127.0.0.1:52771_ c:control_collection s:shard1 r:core_node1 x:collection1] o.a.s.c.SolrCore [[collection1] ] Opening new SolrCore at [/home/jenkins/workspace/Lucene-Solr-5.x-Linux/solr/build/solr-core/test/J2/temp/solr.security.PKIAuthenticationIntegrationTest_BD24EEE43B4C716C-001/control-001/cores/collection1/], dataDir=[null]
   [junit4]   2> 1585818 INFO  (coreLoadExecutor-5512-thread-1-processing-n:127.0.0.1:52771_) [n:127.0.0.1:52771_ c:control_collection s:shard1 r:core_node1 x:collection1] o.a.s.c.JmxMonitoredMap JMX monitoring is enabled. Adding Solr mbeans to JMX Server: com.sun.jmx.mbeanserver.JmxMBeanServer@638cc2e7
   [junit4]   2> 1585819 INFO  (coreLoadExecutor-5512-thread-1-processing-n:127.0.0.1:52771_) [n:127.0.0.1:52771_ c:control_collection s:shard1 r:core_node1 x:collection1] o.a.s.c.CachingDirectoryFactory return new directory for /home/jenkins/workspace/Lucene-Solr-5.x-Linux/solr/build/solr-core/test/J2/temp/solr.security.PKIAuthenticationIntegrationTest_BD24EEE43B4C716C-001/control-001/cores/collection1/data
   [junit4]   2> 1585819 INFO  (coreLoadExecutor-5512-thread-1-processing-n:127.0.0.1:52771_) [n:127.0.0.1:52771_ c:control_collection s:shard1 r:core_node1 x:collection1] o.a.s.c.SolrCore New index directory detected: old=null new=/home/jenkins/workspace/Lucene-Solr-5.x-Linux/solr/build/solr-core/test/J2/temp/solr.security.PKIAuthenticationIntegrationTest_BD24EEE43B4C716C-001/control-001/cores/collection1/data/index/
   [junit4]   2> 1585819 WARN  (coreLoadExecutor-5512-thread-1-processing-n:127.0.0.1:52771_) [n:127.0.0.1:52771_ c:control_collection s:shard1 r:core_node1 x:collection1] o.a.s.c.SolrCore [collection1] Solr index directory '/home/jenkins/workspace/Lucene-Solr-5.x-Linux/solr/build/solr-core/test/J2/temp/solr.security.PKIAuthenticationIntegrationTest_BD24EEE43B4C716C-001/control-001/cores/collection1/data/index' doesn't exist. Creating new index...
   [junit4]   2> 1585819 INFO  (coreLoadExecutor-5512-thread-1-processing-n:127.0.0.1:52771_) [n:127.0.0.1:52771_ c:control_collection s:shard1 r:core_node1 x:collection1] o.a.s.c.CachingDirectoryFactory return new directory for /home/jenkins/workspace/Lucene-Solr-5.x-Linux/solr/build/solr-core/test/J2/temp/solr.security.PKIAuthenticationIntegrationTest_BD24EEE43B4C716C-001/control-001/cores/collection1/data/index
   [junit4]   2> 1585819 INFO  (coreLoadExecutor-5512-thread-1-processing-n:127.0.0.1:52771_) [n:127.0.0.1:52771_ c:control_collection s:shard1 r:core_node1 x:collection1] o.a.s.u.RandomMergePolicy RandomMergePolicy wrapping class org.apache.lucene.index.LogByteSizeMergePolicy: [LogByteSizeMergePolicy: minMergeSize=1677721, mergeFactor=22, maxMergeSize=2147483648, maxMergeSizeForForcedMerge=9223372036854775807, calibrateSizeByDeletes=false, maxMergeDocs=2147483647, maxCFSSegmentSizeMB=8.796093022207999E12, noCFSRatio=0.4790590922250021]
   [junit4]   2> 1585820 INFO  (coreLoadExecutor-5512-thread-1-processing-n:127.0.0.1:52771_) [n:127.0.0.1:52771_ c:control_collection s:shard1 r:core_node1 x:collection1] o.a.s.c.SolrCore SolrDeletionPolicy.onCommit: commits: num=1
   [junit4]   2> 	commit{dir=MockDirectoryWrapper(RAMDirectory@16c1d4d4 lockFactory=org.apache.lucene.store.SingleInstanceLockFactory@7b37c86a),segFN=segments_1,generation=1}
   [junit4]   2> 1585820 INFO  (coreLoadExecutor-5512-thread-1-processing-n:127.0.0.1:52771_) [n:127.0.0.1:52771_ c:control_collection s:shard1 r:core_node1 x:collection1] o.a.s.c.SolrCore newest commit generation = 1
   [junit4]   2> 1585820 INFO  (OldIndexDirectoryCleanupThreadForCore-collection1) [n:127.0.0.1:52771_ c:control_collection s:shard1 r:core_node1 x:collection1] o.a.s.c.SolrCore Looking for old index directories to cleanup for core collection1 in /home/jenkins/workspace/Lucene-Solr-5.x-Linux/solr/build/solr-core/test/J2/temp/solr.security.PKIAuthenticationIntegrationTest_BD24EEE43B4C716C-001/control-001/cores/collection1/data/
   [junit4]   2> 1585820 WARN  (OldIndexDirectoryCleanupThreadForCore-collection1) [n:127.0.0.1:52771_ c:control_collection s:shard1 r:core_node1 x:collection1] o.a.s.c.DirectoryFactory /home/jenkins/workspace/Lucene-Solr-5.x-Linux/solr/build/solr-core/test/J2/temp/solr.security.PKIAuthenticationIntegrationTest_BD24EEE43B4C716C-001/control-001/cores/collection1/data/ does not point to a valid data directory; skipping clean-up of old index directories.
   [junit4]   2> 1585822 INFO  (coreLoadExecutor-5512-thread-1-processing-n:127.0.0.1:52771_) [n:127.0.0.1:52771_ c:control_collection s:shard1 r:core_node1 x:collection1] o.a.s.u.p.UpdateRequestProcessorChain creating updateRequestProcessorChain "nodistrib"
   [junit4]   2> 1585822 INFO  (coreLoadExecutor-5512-thread-1-processing-n:127.0.0.1:52771_) [n:127.0.0.1:52771_ c:control_collection s:shard1 r:core_node1 x:collection1] o.a.s.u.p.UpdateRequestProcessorChain creating updateRequestProcessorChain "dedupe"
   [junit4]   2> 1585822 INFO  (coreLoadExecutor-5512-thread-1-processing-n:127.0.0.1:52771_) [n:127.0.0.1:52771_ c:control_collection s:shard1 r:core_node1 x:collection1] o.a.s.u.p.UpdateRequestProcessorChain inserting DistributedUpdateProcessorFactory into updateRequestProcessorChain "dedupe"
   [junit4]   2> 1585822 INFO  (coreLoadExecutor-5512-thread-1-processing-n:127.0.0.1:52771_) [n:127.0.0.1:52771_ c:control_collection s:shard1 r:core_node1 x:collection1] o.a.s.u.p.UpdateRequestProcessorChain creating updateRequestProcessorChain "stored_sig"
   [junit4]   2> 1585822 INFO  (coreLoadExecutor-5512-thread-1-processing-n:127.0.0.1:52771_) [n:127.0.0.1:52771_ c:control_collection s:shard1 r:core_node1 x:collection1] o.a.s.u.p.UpdateRequestProcessorChain inserting DistributedUpdateProcessorFactory into updateRequestProcessorChain "stored_sig"
   [junit4]   2> 1585822 INFO  (coreLoadExecutor-5512-thread-1-processing-n:127.0.0.1:52771_) [n:127.0.0.1:52771_ c:control_collection s:shard1 r:core_node1 x:collection1] o.a.s.u.p.UpdateRequestProcessorChain creating updateRequestProcessorChain "distrib-dup-test-chain-explicit"
   [junit4]   2> 1585823 INFO  (coreLoadExecutor-5512-thread-1-processing-n:127.0.0.1:52771_) [n:127.0.0.1:52771_ c:control_collection s:shard1 r:core_node1 x:collection1] o.a.s.u.p.UpdateRequestProcessorChain creating updateRequestProcessorChain "distrib-dup-test-chain-implicit"
   [junit4]   2> 1585823 INFO  (coreLoadExecutor-5512-thread-1-processing-n:127.0.0.1:52771_) [n:127.0.0.1:52771_ c:control_collection s:shard1 r:core_node1 x:collection1] o.a.s.u.p.UpdateRequestProcessorChain inserting DistributedUpdateProcessorFactory into updateRequestProcessorChain "distrib-dup-test-chain-implicit"
   [junit4]   2> 1585823 INFO  (coreLoadExecutor-5512-thread-1-processing-n:127.0.0.1:52771_) [n:127.0.0.1:52771_ c:control_collection s:shard1 r:core_node1 x:collection1] o.a.s.c.SolrCore no updateRequestProcessorChain defined as default, creating implicit default
   [junit4]   2> 1585824 INFO  (coreLoadExecutor-5512-thread-1-processing-n:127.0.0.1:52771_) [n:127.0.0.1:52771_ c:control_collection s:shard1 r:core_node1 x:collection1] o.a.s.h.l.XMLLoader xsltCacheLifetimeSeconds=60
   [junit4]   2> 1585824 INFO  (coreLoadExecutor-5512-thread-1-processing-n:127.0.0.1:52771_) [n:127.0.0.1:52771_ c:control_collection s:shard1 r:core_node1 x:collection1] o.a.s.h.l.XMLLoader xsltCacheLifetimeSeconds=60
   [junit4]   2> 1585825 INFO  (coreLoadExecutor-5512-thread-1-processing-n:127.0.0.1:52771_) [n:127.0.0.1:52771_ c:control_collection s:shard1 r:core_node1 x:collection1] o.a.s.h.l.XMLLoader xsltCacheLifetimeSeconds=60
   [junit4]   2> 1585826 INFO  (coreLoadExecutor-5512-thread-1-processing-n:127.0.0.1:52771_) [n:127.0.0.1:52771_ c:control_collection s:shard1 r:core_node1 x:collection1] o.a.s.h.l.XMLLoader xsltCacheLifetimeSeconds=60
   [junit4]   2> 1585827 INFO  (coreLoadExecutor-5512-thread-1-processing-n:127.0.0.1:52771_) [n:127.0.0.1:52771_ c:control_collection s:shard1 r:core_node1 x:collection1] o.a.s.c.RequestHandlers Registered paths: /admin/mbeans,standard,/update/csv,/update/json/docs,/admin/luke,/admin/segments,/get,/admin/system,/replication,/admin/properties,/config,/schema,/admin/plugins,/admin/logging,/update/json,/admin/threads,/admin/ping,/update,/admin/file
   [junit4]   2> 1585828 INFO  (coreLoadExecutor-5512-thread-1-processing-n:127.0.0.1:52771_) [n:127.0.0.1:52771_ c:control_collection s:shard1 r:core_node1 x:collection1] o.a.s.c.SolrCore Using default statsCache cache: org.apache.solr.search.stats.LocalStatsCache
   [junit4]   2> 1585828 INFO  (coreLoadExecutor-5512-thread-1-processing-n:127.0.0.1:52771_) [n:127.0.0.1:52771_ c:control_collection s:shard1 r:core_node1 x:collection1] o.a.s.u.UpdateHandler Using UpdateLog implementation: org.apache.solr.update.UpdateLog
   [junit4]   2> 1585828 INFO  (coreLoadExecutor-5512-thread-1-processing-n:127.0.0.1:52771_) [n:127.0.0.1:52771_ c:control_collection s:shard1 r:core_node1 x:collection1] o.a.s.u.UpdateLog Initializing UpdateLog: dataDir= defaultSyncLevel=FLUSH numRecordsToKeep=100 maxNumLogsToKeep=10 numVersionBuckets=65536
   [junit4]   2> 1585830 INFO  (coreLoadExecutor-5512-thread-1-processing-n:127.0.0.1:52771_) [n:127.0.0.1:52771_ c:control_collection s:shard1 r:core_node1 x:collection1] o.a.s.c.SolrCore Hard AutoCommit: disabled
   [junit4]   2> 1585830 INFO  (coreLoadExecutor-5512-thread-1-processing-n:127.0.0.1:52771_) [n:127.0.0.1:52771_ c:control_collection s:shard1 r:core_node1 x:collection1] o.a.s.c.SolrCore Soft AutoCommit: disabled
   [junit4]   2> 1585830 INFO  (coreLoadExecutor-5512-thread-1-processing-n:127.0.0.1:52771_) [n:127.0.0.1:52771_ c:control_collection s:shard1 r:core_node1 x:collection1] o.a.s.u.RandomMergePolicy RandomMergePolicy wrapping class org.apache.lucene.index.LogByteSizeMergePolicy: [LogByteSizeMergePolicy: minMergeSize=1677721, mergeFactor=26, maxMergeSize=2147483648, maxMergeSizeForForcedMerge=9223372036854775807, calibrateSizeByDeletes=false, maxMergeDocs=2147483647, maxCFSSegmentSizeMB=8.796093022207999E12, noCFSRatio=0.22443588375303547]
   [junit4]   2> 1585831 INFO  (coreLoadExecutor-5512-thread-1-processing-n:127.0.0.1:52771_) [n:127.0.0.1:52771_ c:control_collection s:shard1 r:core_node1 x:collection1] o.a.s.c.SolrCore SolrDeletionPolicy.onInit: commits: num=1
   [junit4]   2> 	commit{dir=MockDirectoryWrapper(RAMDirectory@16c1d4d4 lockFactory=org.apache.lucene.store.SingleInstanceLockFactory@7b37c86a),segFN=segments_1,generation=1}
   [junit4]   2> 1585831 INFO  (coreLoadExecutor-5512-thread-1-processing-n:127.0.0.1:52771_) [n:127.0.0.1:52771_ c:control_collection s:shard1 r:core_node1 x:collection1] o.a.s.c.SolrCore newest commit generation = 1
   [junit4]   2> 1585831 INFO  (coreLoadExecutor-5512-thread-1-processing-n:127.0.0.1:52771_) [n:127.0.0.1:52771_ c:control_collection s:shard1 r:core_node1 x:collection1] o.a.s.s.SolrIndexSearcher Opening Searcher@775fb552[collection1] main
   [junit4]   2> 1585831 INFO  (coreLoadExecutor-5512-thread-1-processing-n:127.0.0.1:52771_) [n:127.0.0.1:52771_ c:control_collection s:shard1 r:core_node1 x:collection1] o.a.s.c.c.ZkStateReader Load collection config from:/collections/control_collection
   [junit4]   2> 1585831 INFO  (coreLoadExecutor-5512-thread-1-processing-n:127.0.0.1:52771_) [n:127.0.0.1:52771_ c:control_collection s:shard1 r:core_node1 x:collection1] o.a.s.c.c.ZkStateReader path=/collections/control_collection configName=conf1 specified config exists in ZooKeeper
   [junit4]   2> 1585832 INFO  (coreLoadExecutor-5512-thread-1-processing-n:127.0.0.1:52771_) [n:127.0.0.1:52771_ c:control_collection s:shard1 r:core_node1 x:collection1] o.a.s.r.ManagedResourceStorage Setting up ZooKeeper-based storage for the RestManager with znodeBase: /configs/conf1
   [junit4]   2> 1585832 INFO  (coreLoadExecutor-5512-thread-1-processing-n:127.0.0.1:52771_) [n:127.0.0.1:52771_ c:control_collection s:shard1 r:core_node1 x:collection1] o.a.s.r.ManagedResourceStorage Configured ZooKeeperStorageIO with znodeBase: /configs/conf1
   [junit4]   2> 1585832 INFO  (coreLoadExecutor-5512-thread-1-processing-n:127.0.0.1:52771_) [n:127.0.0.1:52771_ c:control_collection s:shard1 r:core_node1 x:collection1] o.a.s.r.RestManager Initializing RestManager with initArgs: {}
   [junit4]   2> 1585832 INFO  (coreLoadExecutor-5512-thread-1-processing-n:127.0.0.1:52771_) [n:127.0.0.1:52771_ c:control_collection s:shard1 r:core_node1 x:collection1] o.a.s.r.ManagedResourceStorage Reading _rest_managed.json using ZooKeeperStorageIO:path=/configs/conf1
   [junit4]   2> 1585832 INFO  (coreLoadExecutor-5512-thread-1-processing-n:127.0.0.1:52771_) [n:127.0.0.1:52771_ c:control_collection s:shard1 r:core_node1 x:collection1] o.a.s.r.ManagedResourceStorage No data found for znode /configs/conf1/_rest_managed.json
   [junit4]   2> 1585832 INFO  (coreLoadExecutor-5512-thread-1-processing-n:127.0.0.1:52771_) [n:127.0.0.1:52771_ c:control_collection s:shard1 r:core_node1 x:collection1] o.a.s.r.ManagedResourceStorage Loaded null at path _rest_managed.json using ZooKeeperStorageIO:path=/configs/conf1
   [junit4]   2> 1585832 INFO  (coreLoadExecutor-5512-thread-1-processing-n:127.0.0.1:52771_) [n:127.0.0.1:52771_ c:control_collection s:shard1 r:core_node1 x:collection1] o.a.s.r.RestManager Initializing 0 registered ManagedResources
   [junit4]   2> 1585832 INFO  (coreLoadExecutor-5512-thread-1-processing-n:127.0.0.1:52771_) [n:127.0.0.1:52771_ c:control_collection s:shard1 r:core_node1 x:collection1] o.a.s.h.ReplicationHandler Commits will be reserved for  10000
   [junit4]   2> 1585833 INFO  (searcherExecutor-5513-thread-1-processing-n:127.0.0.1:52771_ x:collection1 s:shard1 c:control_collection r:core_node1) [n:127.0.0.1:52771_ c:control_collection s:shard1 r:core_node1 x:collection1] o.a.s.c.SolrCore [collection1] Registered new searcher Searcher@775fb552[collection1] main{ExitableDirectoryReader(UninvertingDirectoryReader())}
   [junit4]   2> 1585833 INFO  (coreLoadExecutor-5512-thread-1-processing-n:127.0.0.1:52771_) [n:127.0.0.1:52771_ c:control_collection s:shard1 r:core_node1 x:collection1] o.a.s.u.UpdateLog Looking up max value of version field to seed version buckets
   [junit4]   2> 1585833 INFO  (coreLoadExecutor-5512-thread-1-processing-n:127.0.0.1:52771_) [n:127.0.0.1:52771_ c:control_collection s:shard1 r:core_node1 x:collection1] o.a.s.u.VersionInfo Refreshing highest value of _version_ for 65536 version buckets from index
   [junit4]   2> 1585833 INFO  (coreLoadExecutor-5512-thread-1-processing-n:127.0.0.1:52771_) [n:127.0.0.1:52771_ c:control_collection s:shard1 r:core_node1 x:collection1] o.a.s.u.VersionInfo No terms found for _version_, cannot seed version bucket highest value from index
   [junit4]   2> 1585833 INFO  (coreLoadExecutor-5512-thread-1-processing-n:127.0.0.1:52771_) [n:127.0.0.1:52771_ c:control_collection s:shard1 r:core_node1 x:collection1] o.a.s.u.UpdateLog Could not find max version in index or recent updates, using new clock 1508848832117473280
   [junit4]   2> 1585835 INFO  (coreLoadExecutor-5512-thread-1-processing-n:127.0.0.1:52771_) [n:127.0.0.1:52771_ c:control_collection s:shard1 r:core_node1 x:collection1] o.a.s.u.UpdateLog Took 2 ms to seed version buckets with highest version 1508848832117473280
   [junit4]   2> 1585835 INFO  (coreLoadExecutor-5512-thread-1-processing-n:127.0.0.1:52771_) [n:127.0.0.1:52771_ c:control_collection s:shard1 r:core_node1 x:collection1] o.a.s.c.ZkController watch zkdir /configs/conf1
   [junit4]   2> 1585835 INFO  (coreLoadExecutor-5512-thread-1-processing-n:127.0.0.1:52771_) [n:127.0.0.1:52771_ c:control_collection s:shard1 r:core_node1 x:collection1] o.a.s.c.CoreContainer registering core: collection1
   [junit4]   2> 1585836 INFO  (coreZkRegister-5506-thread-1-processing-n:127.0.0.1:52771_ x:collection1 s:shard1 c:control_collection r:core_node1) [n:127.0.0.1:52771_ c:control_collection s:shard1 r:core_node1 x:collection1] o.a.s.c.ZkController Register replica - core:collection1 address:http://127.0.0.1:52771 collection:control_collection shard:shard1
   [junit4]   2> 1585836 INFO  (coreZkRegister-5506-thread-1-processing-n:127.0.0.1:52771_ x:collection1 s:shard1 c:control_collection r:core_node1) [n:127.0.0.1:52771_ c:control_collection s:shard1 r:core_node1 x:collection1] o.a.s.c.c.SolrZkClient makePath: /collections/control_collection/leader_elect/shard1/election
   [junit4]   2> 1585838 INFO  (coreZkRegister-5506-thread-1-processing-n:127.0.0.1:52771_ x:collection1 s:shard1 c:control_collection r:core_node1) [n:127.0.0.1:52771_ c:control_collection s:shard1 r:core_node1 x:collection1] o.a.s.c.LeaderElector Joined leadership election with path: /collections/control_collection/leader_elect/shard1/election/94303051914084356-core_node1-n_0000000000
   [junit4]   2> 1585838 INFO  (coreZkRegister-5506-thread-1-processing-n:127.0.0.1:52771_ x:collection1 s:shard1 c:control_collection r:core_node1) [n:127.0.0.1:52771_ c:control_collection s:shard1 r:core_node1 x:collection1] o.a.s.c.ShardLeaderElectionContext Running the leader process for shard shard1
   [junit4]   2> 1585839 INFO  (zkCallback-2077-thread-1-processing-n:127.0.0.1:52771_) [n:127.0.0.1:52771_    ] o.a.s.c.DistributedQueue NodeChildrenChanged fired on path /overseer/queue state SyncConnected
   [junit4]   2> 1585839 INFO  (coreZkRegister-5506-thread-1-processing-n:127.0.0.1:52771_ x:collection1 s:shard1 c:control_collection r:core_node1) [n:127.0.0.1:52771_ c:control_collection s:shard1 r:core_node1 x:collection1] o.a.s.c.ShardLeaderElectionContext Enough replicas found to continue.
   [junit4]   2> 1585839 INFO  (coreZkRegister-5506-thread-1-processing-n:127.0.0.1:52771_ x:collection1 s:shard1 c:control_collection r:core_node1) [n:127.0.0.1:52771_ c:control_collection s:shard1 r:core_node1 x:collection1] o.a.s.c.ShardLeaderElectionContext I may be the new leader - try and sync
   [junit4]   2> 1585839 INFO  (OverseerStateUpdate-94303051914084356-127.0.0.1:52771_-n_0000000000) [n:127.0.0.1:52771_    ] o.a.s.c.Overseer processMessage: queueSize: 1, message = {
   [junit4]   2>   "operation":"leader",
   [junit4]   2>   "shard":"shard1",
   [junit4]   2>   "collection":"control_collection"} current state version: 1
   [junit4]   2> 1585839 INFO  (coreZkRegister-5506-thread-1-processing-n:127.0.0.1:52771_ x:collection1 s:shard1 c:control_collection r:core_node1) [n:127.0.0.1:52771_ c:control_collection s:shard1 r:core_node1 x:collection1] o.a.s.c.SyncStrategy Sync replicas to http://127.0.0.1:52771/collection1/
   [junit4]   2> 1585839 INFO  (coreZkRegister-5506-thread-1-processing-n:127.0.0.1:52771_ x:collection1 s:shard1 c:control_collection r:core_node1) [n:127.0.0.1:52771_ c:control_collection s:shard1 r:core_node1 x:collection1] o.a.s.c.SyncStrategy Sync Success - now sync replicas to me
   [junit4]   2> 1585839 INFO  (coreZkRegister-5506-thread-1-processing-n:127.0.0.1:52771_ x:collection1 s:shard1 c:control_collection r:core_node1) [n:127.0.0.1:52771_ c:control_collection s:shard1 r:core_node1 x:collection1] o.a.s.c.SyncStrategy http://127.0.0.1:52771/collection1/ has no replicas
   [junit4]   2> 1585839 INFO  (coreZkRegister-5506-thread-1-processing-n:127.0.0.1:52771_ x:collection1 s:shard1 c:control_collection r:core_node1) [n:127.0.0.1:52771_ c:control_collection s:shard1 r:core_node1 x:collection1] o.a.s.c.ShardLeaderElectionContext I am the new leader: http://127.0.0.1:52771/collection1/ shard1
   [junit4]   2> 1585840 INFO  (coreZkRegister-5506-thread-1-processing-n:127.0.0.1:52771_ x:collection1 s:shard1 c:control_collection r:core_node1) [n:127.0.0.1:52771_ c:control_collection s:shard1 r:core_node1 x:collection1] o.a.s.c.c.SolrZkClient makePath: /collections/control_collection/leaders/shard1
   [junit4]   2> 1585841 INFO  (zkCallback-2077-thread-1-processing-n:127.0.0.1:52771_) [n:127.0.0.1:52771_    ] o.a.s.c.DistributedQueue NodeChildrenChanged fired on path /overseer/queue state SyncConnected
   [junit4]   2> 1585842 INFO  (OverseerStateUpdate-94303051914084356-127.0.0.1:52771_-n_0000000000) [n:127.0.0.1:52771_    ] o.a.s.c.Overseer processMessage: queueSize: 1, message = {
   [junit4]   2>   "operation":"leader",
   [junit4]   2>   "shard":"shard1",
   [junit4]   2>   "collection":"control_collection",
   [junit4]   2>   "base_url":"http://127.0.0.1:52771",
   [junit4]   2>   "core":"collection1",
   [junit4]   2>   "state":"active"} current state version: 1
   [junit4]   2> 1585943 INFO  (zkCallback-2077-thread-1-processing-n:127.0.0.1:52771_) [n:127.0.0.1:52771_    ] o.a.s.c.c.ZkStateReader A cluster state change: WatchedEvent state:SyncConnected type:NodeDataChanged path:/clusterstate.json, has occurred - updating... (live nodes size: 1)
   [junit4]   2> 1585944 INFO  (zkCallback-2077-thread-1-processing-n:127.0.0.1:52771_) [n:127.0.0.1:52771_    ] o.a.s.c.c.ZkStateReader Updated cluster state version to 2
   [junit4]   2> 1585992 INFO  (coreZkRegister-5506-thread-1-processing-n:127.0.0.1:52771_ x:collection1 s:shard1 c:control_collection r:core_node1) [n:127.0.0.1:52771_ c:control_collection s:shard1 r:core_node1 x:collection1] o.a.s.c.ZkController We are http://127.0.0.1:52771/collection1/ and leader is http://127.0.0.1:52771/collection1/
   [junit4]   2> 1585992 INFO  (coreZkRegister-5506-thread-1-processing-n:127.0.0.1:52771_ x:collection1 s:shard1 c:control_collection r:core_node1) [n:127.0.0.1:52771_ c:control_collection s:shard1 r:core_node1 x:collection1] o.a.s.c.ZkController No LogReplay needed for core=collection1 baseURL=http://127.0.0.1:52771
   [junit4]   2> 1585992 INFO  (coreZkRegister-5506-thread-1-processing-n:127.0.0.1:52771_ x:collection1 s:shard1 c:control_collection r:core_node1) [n:127.0.0.1:52771_ c:control_collection s:shard1 r:core_node1 x:collection1] o.a.s.c.ZkController I am the leader, no recovery necessary
   [junit4]   2> 1585992 INFO  (coreZkRegister-5506-thread-1-processing-n:127.0.0.1:52771_ x:collection1 s:shard1 c:control_collection r:core_node1) [n:127.0.0.1:52771_ c:control_collection s:shard1 r:core_node1 x:collection1] o.a.s.c.ZkController publishing state=active
   [junit4]   2> 1585992 INFO  (coreZkRegister-5506-thread-1-processing-n:127.0.0.1:52771_ x:collection1 s:shard1 c:control_collection r:core_node1) [n:127.0.0.1:52771_ c:control_collection s:shard1 r:core_node1 x:collection1] o.a.s.c.ZkController numShards not found on descriptor - reading it from system property
   [junit4]   2> 1585993 INFO  (zkCallback-2077-thread-1-processing-n:127.0.0.1:52771_) [n:127.0.0.1:52771_    ] o.a.s.c.DistributedQueue NodeChildrenChanged fired on path /overseer/queue state SyncConnected
   [junit4]   2> 1585993 INFO  (OverseerStateUpdate-94303051914084356-127.0.0.1:52771_-n_0000000000) [n:127.0.0.1:52771_    ] o.a.s.c.Overseer processMessage: queueSize: 1, message = {
   [junit4]   2>   "core":"collection1",
   [junit4]   2>   "core_node_name":"core_node1",
   [junit4]   2>   "roles":null,
   [junit4]   2>   "base_url":"http://127.0.0.1:52771",
   [junit4]   2>   "node_name":"127.0.0.1:52771_",
   [junit4]   2>   "numShards":"1",
   [junit4]   2>   "state":"active",
   [junit4]   2>   "shard":"shard1",
   [junit4]   2>   "collection":"control_collection",
   [junit4]   2>   "operation":"state"} current state version: 2
   [junit4]   2> 1585994 INFO  (OverseerStateUpdate-94303051914084356-127.0.0.1:52771_-n_0000000000) [n:127.0.0.1:52771_    ] o.a.s.c.o.ReplicaMutator Update state numShards=1 message={
   [junit4]   2>   "core":"collection1",
   [junit4]   2>   "core_node_name":"core_node1",
   [junit4]   2>   "roles":null,
   [junit4]   2>   "base_url":"http://127.0.0.1:52771",
   [junit4]   2>   "node_name":"127.0.0.1:52771_",
   [junit4]   2>   "numShards":"1",
   [junit4]   2>   "state":"active",
   [junit4]   2>   "shard":"shard1",
   [junit4]   2>   "collection":"control_collection",
   [junit4]   2>   "operation":"state"}
   [junit4]   2> 1586095 INFO  (zkCallback-2077-thread-1-processing-n:127.0.0.1:52771_) [n:127.0.0.1:52771_    ] o.a.s.c.c.ZkStateReader A cluster state change: WatchedEvent state:SyncConnected type:NodeDataChanged path:/clusterstate.json, has occurred - updating... (live nodes size: 1)
   [junit4]   2> 1586096 INFO  (zkCallback-2077-thread-1-processing-n:127.0.0.1:52771_) [n:127.0.0.1:52771_    ] o.a.s.c.c.ZkStateReader Updated cluster state version to 3
   [junit4]   2> 1586157 INFO  (TEST-PKIAuthenticationIntegrationTest.testPkiAuth-seed#[BD24EEE43B4C716C]) [    ] o.a.s.c.c.SolrZkClient Using default ZkCredentialsProvider
   [junit4]   2> 1586157 INFO  (TEST-PKIAuthenticationIntegrationTest.testPkiAuth-seed#[BD24EEE43B4C716C]) [    ] o.a.s.c.c.ConnectionManager Waiting for client to connect to ZooKeeper
   [junit4]   2> 1586158 INFO  (zkCallback-2079-thread-1) [    ] o.a.s.c.c.ConnectionManager Watcher org.apache.solr.common.cloud.ConnectionManager@45f1734e name:ZooKeeperConnection Watcher:127.0.0.1:42857/solr got event WatchedEvent state:SyncConnected type:None path:null path:null type:None
   [junit4]   2> 1586158 INFO  (TEST-PKIAuthenticationIntegrationTest.testPkiAuth-seed#[BD24EEE43B4C716C]) [    ] o.a.s.c.c.ConnectionManager Client is connected to ZooKeeper
   [junit4]   2> 1586158 INFO  (TEST-PKIAuthenticationIntegrationTest.testPkiAuth-seed#[BD24EEE43B4C716C]) [    ] o.a.s.c.c.SolrZkClient Using default ZkACLProvider
   [junit4]   2> 1586158 INFO  (TEST-PKIAuthenticationIntegrationTest.testPkiAuth-seed#[BD24EEE43B4C716C]) [    ] o.a.s.c.c.ZkStateReader Updating cluster state from ZooKeeper... 
   [junit4]   2> 1586159 INFO  (TEST-PKIAuthenticationIntegrationTest.testPkiAuth-seed#[BD24EEE43B4C716C]) [    ] o.a.s.c.ChaosMonkey monkey: init - expire sessions:false cause connection loss:false
   [junit4]   2> 1586206 INFO  (TEST-PKIAuthenticationIntegrationTest.testPkiAuth-seed#[BD24EEE43B4C716C]) [    ] o.a.s.SolrTestCaseJ4 Writing core.properties file to /home/jenkins/workspace/Lucene-Solr-5.x-Linux/solr/build/solr-core/test/J2/temp/solr.security.PKIAuthenticationIntegrationTest_BD24EEE43B4C716C-001/shard-1-001/cores/collection1
   [junit4]   2> 1586207 INFO  (TEST-PKIAuthenticationIntegrationTest.testPkiAuth-seed#[BD24EEE43B4C716C]) [    ] o.a.s.c.AbstractFullDistribZkTestBase create jetty 1 in directory /home/jenkins/workspace/Lucene-Solr-5.x-Linux/solr/build/solr-core/test/J2/temp/solr.security.PKIAuthenticationIntegrationTest_BD24EEE43B4C716C-001/shard-1-001
   [junit4]   2> 1586208 INFO  (TEST-PKIAuthenticationIntegrationTest.testPkiAuth-seed#[BD24EEE43B4C716C]) [    ] o.e.j.s.Server jetty-9.2.11.v20150529
   [junit4]   2> 1586208 INFO  (TEST-PKIAuthenticationIntegrationTest.testPkiAuth-seed#[BD24EEE43B4C716C]) [    ] o.e.j.s.h.ContextHandler Started o.e.j.s.ServletContextHandler@67509b60{/,null,AVAILABLE}
   [junit4]   2> 1586209 INFO  (TEST-PKIAuthenticationIntegrationTest.testPkiAuth-seed#[BD24EEE43B4C716C]) [    ] o.e.j.s.ServerConnector Started ServerConnector@3ea2c220{HTTP/1.1}{127.0.0.1:49304}
   [junit4]   2> 1586209 INFO  (TEST-PKIAuthenticationIntegrationTest.testPkiAuth-seed#[BD24EEE43B4C716C]) [    ] o.e.j.s.Server Started @1588244ms
   [junit4]   2> 1586209 INFO  (TEST-PKIAuthenticationIntegrationTest.testPkiAuth-seed#[BD24EEE43B4C716C]) [    ] o.a.s.c.s.e.JettySolrRunner Jetty properties: {solr.data.dir=/home/jenkins/workspace/Lucene-Solr-5.x-Linux/solr/build/solr-core/test/J2/temp/solr.security.PKIAuthenticationIntegrationTest_BD24EEE43B4C716C-001/tempDir-001/jetty1, solrconfig=solrconfig.xml, hostContext=/, hostPort=49304, coreRootDirectory=/home/jenkins/workspace/Lucene-Solr-5.x-Linux/solr/build/solr-core/test/J2/../../../../../../../../../home/jenkins/workspace/Lucene-Solr-5.x-Linux/solr/build/solr-core/test/J2/temp/solr.security.PKIAuthenticationIntegrationTest_BD24EEE43B4C716C-001/shard-1-001/cores}
   [junit4]   2> 1586209 INFO  (TEST-PKIAuthenticationIntegrationTest.testPkiAuth-seed#[BD24EEE43B4C716C]) [    ] o.a.s.s.SolrDispatchFilter SolrDispatchFilter.init(): sun.misc.Launcher$AppClassLoader@4e0e2f2a
   [junit4]   2> 1586209 INFO  (TEST-PKIAuthenticationIntegrationTest.testPkiAuth-seed#[BD24EEE43B4C716C]) [    ] o.a.s.c.SolrResourceLoader new SolrResourceLoader for directory: '/home/jenkins/workspace/Lucene-Solr-5.x-Linux/solr/build/solr-core/test/J2/../../../../../../../../../home/jenkins/workspace/Lucene-Solr-5.x-Linux/solr/build/solr-core/test/J2/temp/solr.security.PKIAuthenticationIntegrationTest_BD24EEE43B4C716C-001/shard-1-001/'
   [junit4]   2> 1586219 INFO  (TEST-PKIAuthenticationIntegrationTest.testPkiAuth-seed#[BD24EEE43B4C716C]) [    ] o.a.s.c.c.SolrZkClient Using default ZkCredentialsProvider
   [junit4]   2> 1586219 INFO  (TEST-PKIAuthenticationIntegrationTest.testPkiAuth-seed#[BD24EEE43B4C716C]) [    ] o.a.s.c.c.ConnectionManager Waiting for client to connect to ZooKeeper
   [junit4]   2> 1586220 INFO  (zkCallback-2080-thread-1) [    ] o.a.s.c.c.ConnectionManager Watcher org.apache.solr.common.cloud.ConnectionManager@1795390d name:ZooKeeperConnection Watcher:127.0.0.1:42857/solr got event WatchedEvent state:SyncConnected type:None path:null path:null type:None
   [junit4]   2> 1586220 INFO  (TEST-PKIAuthenticationIntegrationTest.testPkiAuth-seed#[BD24EEE43B4C716C]) [    ] o.a.s.c.c.ConnectionManager Client is connected to ZooKeeper
   [junit4]   2> 1586220 INFO  (TEST-PKIAuthenticationIntegrationTest.testPkiAuth-seed#[BD24EEE43B4C716C]) [    ] o.a.s.c.c.SolrZkClient Using default ZkACLProvider
   [junit4]   2> 1586221 INFO  (TEST-PKIAuthenticationIntegrationTest.testPkiAuth-seed#[BD24EEE43B4C716C]) [    ] o.a.s.s.SolrDispatchFilter Loading solr.xml from SolrHome (not found in ZooKeeper)
   [junit4]   2> 1586221 INFO  (TEST-PKIAuthenticationIntegrationTest.testPkiAuth-seed#[BD24EEE43B4C716C]) [    ] o.a.s.c.SolrXmlConfig Loading container configuration from /home/jenkins/workspace/Lucene-Solr-5.x-Linux/solr/build/solr-core/test/J2/../../../../../../../../../home/jenkins/workspace/Lucene-Solr-5.x-Linux/solr/build/solr-core/test/J2/temp/solr.security.PKIAuthenticationIntegrationTest_BD24EEE43B4C716C-001/shard-1-001/solr.xml
   [junit4]   2> 1586225 INFO  (TEST-PKIAuthenticationIntegrationTest.testPkiAuth-seed#[BD24EEE43B4C716C]) [    ] o.a.s.c.CoresLocator Config-defined core root directory: /home/jenkins/workspace/Lucene-Solr-5.x-Linux/solr/build/solr-core/test/J2/../../../../../../../../../home/jenkins/workspace/Lucene-Solr-5.x-Linux/solr/build/solr-core/test/J2/temp/solr.security.PKIAuthenticationIntegrationTest_BD24EEE43B4C716C-001/shard-1-001/cores
   [junit4]   2> 1586225 INFO  (TEST-PKIAuthenticationIntegrationTest.testPkiAuth-seed#[BD24EEE43B4C716C]) [    ] o.a.s.c.CoreContainer New CoreContainer 274799606
   [junit4]   2> 1586225 INFO  (TEST-PKIAuthenticationIntegrationTest.testPkiAuth-seed#[BD24EEE43B4C716C]) [    ] o.a.s.c.CoreContainer Loading cores into CoreContainer [instanceDir=/home/jenkins/workspace/Lucene-Solr-5.x-Linux/solr/build/solr-core/test/J2/../../../../../../../../../home/jenkins/workspace/Lucene-Solr-5.x-Linux/solr/build/solr-core/test/J2/temp/solr.security.PKIAuthenticationIntegrationTest_BD24EEE43B4C716C-001/shard-1-001/]
   [junit4]   2> 1586225 INFO  (TEST-PKIAuthenticationIntegrationTest.testPkiAuth-seed#[BD24EEE43B4C716C]) [    ] o.a.s.c.CoreContainer loading shared library: /home/jenkins/workspace/Lucene-Solr-5.x-Linux/solr/build/solr-core/test/J2/../../../../../../../../../home/jenkins/workspace/Lucene-Solr-5.x-Linux/solr/build/solr-core/test/J2/temp/solr.security.PKIAuthenticationIntegrationTest_BD24EEE43B4C716C-001/shard-1-001/lib
   [junit4]   2> 1586225 WARN  (TEST-PKIAuthenticationIntegrationTest.testPkiAuth-seed#[BD24EEE43B4C716C]) [    ] o.a.s.c.SolrResourceLoader Can't find (or read) directory to add to classloader: lib (resolved as: /home/jenkins/workspace/Lucene-Solr-5.x-Linux/solr/build/solr-core/test/J2/../../../../../../../../../home/jenkins/workspace/Lucene-Solr-5.x-Linux/solr/build/solr-core/test/J2/temp/solr.security.PKIAuthenticationIntegrationTest_BD24EEE43B4C716C-001/shard-1-001/lib).
   [junit4]   2> 1586230 INFO  (TEST-PKIAuthenticationIntegrationTest.testPkiAuth-seed#[BD24EEE43B4C716C]) [    ] o.a.s.h.c.HttpShardHandlerFactory created with socketTimeout : 90000,urlScheme : ,connTimeout : 15000,maxConnectionsPerHost : 20,maxConnections : 10000,corePoolSize : 0,maximumPoolSize : 2147483647,maxThreadIdleTime : 5,sizeOfQueue : -1,fairnessPolicy : false,useRetries : false,
   [junit4]   2> 1586231 INFO  (TEST-PKIAuthenticationIntegrationTest.testPkiAuth-seed#[BD24EEE43B4C716C]) [    ] o.a.s.u.UpdateShardHandler Creating UpdateShardHandler HTTP client with params: socketTimeout=340000&connTimeout=45000&retry=true
   [junit4]   2> 1586231 INFO  (TEST-PKIAuthenticationIntegrationTest.testPkiAuth-seed#[BD24EEE43B4C716C]) [    ] o.a.s.l.LogWatcher SLF4J impl is org.slf4j.impl.Log4jLoggerFactory
   [junit4]   2> 1586231 INFO  (TEST-PKIAuthenticationIntegrationTest.testPkiAuth-seed#[BD24EEE43B4C716C]) [    ] o.a.s.l.LogWatcher Registering Log Listener [Log4j (org.slf4j.impl.Log4jLoggerFactory)]
   [junit4]   2> 1586231 INFO  (TEST-PKIAuthenticationIntegrationTest.testPkiAuth-seed#[BD24EEE43B4C716C]) [    ] o.a.s.c.ZkContainer Zookeeper client=127.0.0.1:42857/solr
   [junit4]   2> 1586231 INFO  (TEST-PKIAuthenticationIntegrationTest.testPkiAuth-seed#[BD24EEE43B4C716C]) [    ] o.a.s.c.ZkController zkHost includes chroot
   [junit4]   2> 1586231 INFO  (TEST-PKIAuthenticationIntegrationTest.testPkiAuth-seed#[BD24EEE43B4C716C]) [    ] o.a.s.c.c.SolrZkClient Using default ZkCredentialsProvider
   [junit4]   2> 1586232 INFO  (TEST-PKIAuthenticationIntegrationTest.testPkiAuth-seed#[BD24EEE43B4C716C]) [    ] o.a.s.c.c.ConnectionManager Waiting for client to connect to ZooKeeper
   [junit4]   2> 1586232 INFO  (zkCallback-2082-thread-1) [    ] o.a.s.c.c.ConnectionManager Watcher org.apache.solr.common.cloud.ConnectionManager@154979e8 name:ZooKeeperConnection Watcher:127.0.0.1:42857 got event WatchedEvent state:SyncConnected type:None path:null path:null type:None
   [junit4]   2> 1586232 INFO  (TEST-PKIAuthenticationIntegrationTest.testPkiAuth-seed#[BD24EEE43B4C716C]) [    ] o.a.s.c.c.ConnectionManager Client is connected to ZooKeeper
   [junit4]   2> 1586233 INFO  (TEST-PKIAuthenticationIntegrationTest.testPkiAuth-seed#[BD24EEE43B4C716C]) [    ] o.a.s.c.c.SolrZkClient Using default ZkACLProvider
   [junit4]   2> 1586234 INFO  (TEST-PKIAuthenticationIntegrationTest.testPkiAuth-seed#[BD24EEE43B4C716C]) [n:127.0.0.1:49304_    ] o.a.s.c.c.ConnectionManager Waiting for client to connect to ZooKeeper
   [junit4]   2> 1586234 INFO  (zkCallback-2083-thread-1-processing-n:127.0.0.1:49304_) [n:127.0.0.1:49304_    ] o.a.s.c.c.ConnectionManager Watcher org.apache.solr.common.cloud.ConnectionManager@68350d50 name:ZooKeeperConnection Watcher:127.0.0.1:42857/solr got event WatchedEvent state:SyncConnected type:None path:null path:null type:None
   [junit4]   2> 1586234 INFO  (TEST-PKIAuthenticationIntegrationTest.testPkiAuth-seed#[BD24EEE43B4C716C]) [n:127.0.0.1:49304_    ] o.a.s.c.c.ConnectionManager Client is connected to ZooKeeper
   [junit4]   2> 1586236 INFO  (TEST-PKIAuthenticationIntegrationTest.testPkiAuth-seed#[BD24EEE43B4C716C]) [n:127.0.0.1:49304_    ] o.a.s.c.c.ZkStateReader Updating cluster state from ZooKeeper... 
   [junit4]   2> 1587237 INFO  (TEST-PKIAuthenticationIntegrationTest.testPkiAuth-seed#[BD24EEE43B4C716C]) [n:127.0.0.1:49304_    ] o.a.s.c.ZkController Register node as live in ZooKeeper:/live_nodes/127.0.0.1:49304_
   [junit4]   2> 1587238 INFO  (TEST-PKIAuthenticationIntegrationTest.testPkiAuth-seed#[BD24EEE43B4C716C]) [n:127.0.0.1:49304_    ] o.a.s.c.c.SolrZkClient makePath: /live_nodes/127.0.0.1:49304_
   [junit4]   2> 1587238 INFO  (TEST-PKIAuthenticationIntegrationTest.testPkiAuth-seed#[BD24EEE43B4C716C]) [n:127.0.0.1:49304_    ] o.a.s.c.Overseer Overseer (id=null) closing
   [junit4]   2> 1587239 INFO  (TEST-PKIAuthenticationIntegrationTest.testPkiAuth-seed#[BD24EEE43B4C716C]) [n:127.0.0.1:49304_    ] o.a.s.c.LeaderElector Joined leadership election with path: /overseer_elect/election/94303051914084360-127.0.0.1:49304_-n_0000000001
   [junit4]   2> 1587239 INFO  (TEST-PKIAuthenticationIntegrationTest.testPkiAuth-seed#[BD24EEE43B4C716C]) [n:127.0.0.1:49304_    ] o.a.s.c.LeaderElector Watching path /overseer_elect/election/94303051914084356-127.0.0.1:52771_-n_0000000000 to know if I could be the leader
   [junit4]   2> 1587246 INFO  (TEST-PKIAuthenticationIntegrationTest.testPkiAuth-seed#[BD24EEE43B4C716C]) [n:127.0.0.1:49304_    ] o.a.s.c.CoreContainer Security conf doesn't exist. Skipping setup for authorization module.
   [junit4]   2> 1587246 INFO  (TEST-PKIAuthenticationIntegrationTest.testPkiAuth-seed#[BD24EEE43B4C716C]) [n:127.0.0.1:49304_    ] o.a.s.c.CoreContainer No authentication plugin used.
   [junit4]   2> 1587246 INFO  (TEST-PKIAuthenticationIntegrationTest.testPkiAuth-seed#[BD24EEE43B4C716C]) [n:127.0.0.1:49304_    ] o.a.s.c.CoresLocator Looking for core definitions underneath /home/jenkins/workspace/Lucene-Solr-5.x-Linux/solr/build/solr-core/test/J2/../../../../../../../../../home/jenkins/workspace/Lucene-Solr-5.x-Linux/solr/build/solr-core/test/J2/temp/solr.security.PKIAuthenticationIntegrationTest_BD24EEE43B4C716C-001/shard-1-001/cores
   [junit4]   2> 1587247 INFO  (TEST-PKIAuthenticationIntegrationTest.testPkiAuth-seed#[BD24EEE43B4C716C]) [n:127.0.0.1:49304_    ] o.a.s.c.SolrCore Created CoreDescriptor: {name=collection1, config=solrconfig.xml, transient=false, schema=schema.xml, loadOnStartup=true, configSetProperties=configsetprops.json, instanceDir=/home/jenkins/workspace/Lucene-Solr-5.x-Linux/solr/build/solr-core/test/J2/../../../../../../../../../home/jenkins/workspace/Lucene-Solr-5.x-Linux/solr/build/solr-core/test/J2/temp/solr.security.PKIAuthenticationIntegrationTest_BD24EEE43B4C716C-001/shard-1-001/cores/collection1, collection=collection1, absoluteInstDir=/home/jenkins/workspace/Lucene-Solr-5.x-Linux/solr/build/solr-core/test/J2/../../../../../../../../../home/jenkins/workspace/Lucene-Solr-5.x-Linux/solr/build/solr-core/test/J2/temp/solr.security.PKIAuthenticationIntegrationTest_BD24EEE43B4C716C-001/shard-1-001/cores/collection1/, coreNodeName=, dataDir=data/, shard=}
   [junit4]   2> 1587247 INFO  (TEST-PKIAuthenticationIntegrationTest.testPkiAuth-seed#[BD24EEE43B4C716C]) [n:127.0.0.1:49304_    ] o.a.s.c.CoresLocator Found core collection1 in /home/jenkins/workspace/Lucene-Solr-5.x-Linux/solr/build/solr-core/test/J2/../../../../../../../../../home/jenkins/workspace/Lucene-Solr-5.x-Linux/solr/build/solr-core/test/J2/temp/solr.security.PKIAuthenticationIntegrationTest_BD24EEE43B4C716C-001/shard-1-001/cores/collection1/
   [junit4]   2> 1587247 INFO  (TEST-PKIAuthenticationIntegrationTest.testPkiAuth-seed#[BD24EEE43B4C716C]) [n:127.0.0.1:49304_    ] o.a.s.c.CoresLocator Found 1 core definitions
   [junit4]   2> 1587248 INFO  (coreLoadExecutor-5523-thread-1-processing-n:127.0.0.1:49304_) [n:127.0.0.1:49304_ c:collection1   x:collection1] o.a.s.c.ZkController publishing state=down
   [junit4]   2> 1587248 INFO  (TEST-PKIAuthenticationIntegrationTest.testPkiAuth-seed#[BD24EEE43B4C716C]) [n:127.0.0.1:49304_    ] o.a.s.s.SolrDispatchFilter user.dir=/home/jenkins/workspace/Lucene-Solr-5.x-Linux/solr/build/solr-core/test/J2
   [junit4]   2> 1587248 INFO  (TEST-PKIAuthenticationIntegrationTest.testPkiAuth-seed#[BD24EEE43B4C716C]) [n:127.0.0.1:49304_    ] o.a.s.s.SolrDispatchFilter SolrDispatchFilter.init() done
   [junit4]   2> 1587248 INFO  (coreLoadExecutor-5523-thread-1-processing-n:127.0.0.1:49304_) [n:127.0.0.1:49304_ c:collection1   x:collection1] o.a.s.c.ZkController numShards not found on descriptor - reading it from system property
   [junit4]   2> 1587248 INFO  (coreLoadExecutor-5523-thread-1-processing-n:127.0.0.1:49304_) [n:127.0.0.1:49304_ c:collection1   x:collection1] o.a.s.c.ZkController look for our core node name
   [junit4]   2> 1587248 INFO  (zkCallback-2077-thread-1-processing-n:127.0.0.1:52771_) [n:127.0.0.1:52771_    ] o.a.s.c.DistributedQueue NodeChildrenChanged fired on path /overseer/queue state SyncConnected
   [junit4]   2> 1587249 INFO  (OverseerStateUpdate-94303051914084356-127.0.0.1:52771_-n_0000000000) [n:127.0.0.1:52771_    ] o.a.s.c.Overseer processMessage: queueSize: 1, message = {
   [junit4]   2>   "core":"collection1",
   [junit4]   2>   "roles":null,
   [junit4]   2>   "base_url":"http://127.0.0.1:49304",
   [junit4]   2>   "node_name":"127.0.0.1:49304_",
   [junit4]   2>   "numShards":"2",
   [junit4]   2>   "state":"down",
   [junit4]   2>   "shard":null,
   [junit4]   2>   "collection":"collection1",
   [junit4]   2>   "operation":"state"} current state version: 3
   [junit4]   2> 1587249 INFO  (OverseerStateUpdate-94303051914084356-127.0.0.1:52771_-n_0000000000) [n:127.0.0.1:52771_    ] o.a.s.c.o.ReplicaMutator Update state numShards=2 message={
   [junit4]   2>   "core":"collection1",
   [junit4]   2>   "roles":null,
   [junit4]   2>   "base_url":"http://127.0.0.1:49304",
   [junit4]   2>   "node_name":"127.0.0.1:49304_",
   [junit4]   2>   "numShards":"2",
   [junit4]   2>   "state":"down",
   [junit4]   2>   "shard":null,
   [junit4]   2>   "collection":"collection1",
   [junit4]   2>   "operation":"state"}
   [junit4]   2> 1587249 INFO  (OverseerStateUpdate-94303051914084356-127.0.0.1:52771_-n_0000000000) [n:127.0.0.1:52771_    ] o.a.s.c.o.ClusterStateMutator building a new cName: collection1
   [junit4]   2> 1587249 INFO  (OverseerStateUpdate-94303051914084356-127.0.0.1:52771_-n_0000000000) [n:127.0.0.1:52771_    ] o.a.s.c.o.ReplicaMutator Assigning new node to shard shard=shard2
   [junit4]   2> 1587350 INFO  (zkCallback-2079-thread-1) [    ] o.a.s.c.c.ZkStateReader A cluster state change: WatchedEvent state:SyncConnected type:NodeDataChanged path:/clusterstate.json, has occurred - updating... (live nodes size: 2)
   [junit4]   2> 1587350 INFO  (zkCallback-2083-thread-1-processing-n:127.0.0.1:49304_) [n:127.0.0.1:49304_    ] o.a.s.c.c.ZkStateReader A cluster state change: WatchedEvent state:SyncConnected type:NodeDataChanged path:/clusterstate.json, has occurred - updating... (live nodes size: 2)
   [junit4]   2> 1587351 INFO  (zkCallback-2077-thread-1-processing-n:127.0.0.1:52771_) [n:127.0.0.1:52771_    ] o.a.s.c.c.ZkStateReader A cluster state change: WatchedEvent state:SyncConnected type:NodeDataChanged path:/clusterstate.json, has occurred - updating... (live nodes size: 2)
   [junit4]   2> 1587351 INFO  (zkCallback-2079-thread-1) [    ] o.a.s.c.c.ZkStateReader Updated cluster state version to 4
   [junit4]   2> 1587351 INFO  (zkCallback-2083-thread-1-processing-n:127.0.0.1:49304_) [n:127.0.0.1:49304_    ] o.a.s.c.c.ZkStateReader Updated cluster state version to 4
   [junit4]   2> 1587351 INFO  (zkCallback-2077-thread-1-processing-n:127.0.0.1:52771_) [n:127.0.0.1:52771_    ] o.a.s.c.c.ZkStateReader Updated cluster state version to 4
   [junit4]   2> 1588249 INFO  (coreLoadExecutor-5523-thread-1-processing-n:127.0.0.1:49304_) [n:127.0.0.1:49304_ c:collection1   x:collection1] o.a.s.c.ZkController waiting to find shard id in clusterstate for collection1
   [junit4]   2> 1588249 INFO  (coreLoadExecutor-5523-thread-1-processing-n:127.0.0.1:49304_) [n:127.0.0.1:49304_ c:collection1   x:collection1] o.a.s.c.ZkController Check for collection zkNode:collection1
   [junit4]   2> 1588249 INFO  (coreLoadExecutor-5523-thread-1-processing-n:127.0.0.1:49304_) [n:127.0.0.1:49304_ c:collection1   x:collection1] o.a.s.c.ZkController Collection zkNode exists
   [junit4]   2> 1588249 INFO  (coreLoadExecutor-5523-thread-1-processing-n:127.0.0.1:49304_) [n:127.0.0.1:49304_ c:collection1   x:collection1] o.a.s.c.c.ZkStateReader Load collection config from:/collections/collection1
   [junit4]   2> 1588249 INFO  (coreLoadExecutor-5523-thread-1-processing-n:127.0.0.1:49304_) [n:127.0.0.1:49304_ c:collection1   x:collection1] o.a.s.c.c.ZkStateReader path=/collections/collection1 configName=conf1 specified config exists in ZooKeeper
   [junit4]   2> 1588250 INFO  (coreLoadExecutor-5523-thread-1-processing-n:127.0.0.1:49304_) [n:127.0.0.1:49304_ c:collection1   x:collection1] o.a.s.c.SolrResourceLoader new SolrResourceLoader for directory: '/home/jenkins/workspace/Lucene-Solr-5.x-Linux/solr/build/solr-core/test/J2/../../../../../../../../../home/jenkins/workspace/Lucene-Solr-5.x-Linux/solr/build/solr-core/test/J2/temp/solr.security.PKIAuthenticationIntegrationTest_BD24EEE43B4C716C-001/shard-1-001/cores/collection1/'
   [junit4]   2> 1588257 INFO  (coreLoadExecutor-5523-thread-1-processing-n:127.0.0.1:49304_) [n:127.0.0.1:49304_ c:collection1   x:collection1] o.a.s.c.Config loaded config solrconfig.xml with version 0 
   [junit4]   2> 1588260 INFO  (coreLoadExecutor-5523-thread-1-processing-n:127.0.0.1:49304_) [n:127.0.0.1:49304_ c:collection1   x:collection1] o.a.s.c.SolrConfig current version of requestparams : -1
   [junit4]   2> 1588264 INFO  (coreLoadExecutor-5523-thread-1-processing-n:127.0.0.1:49304_) [n:127.0.0.1:49304_ c:collection1   x:collection1] o.a.s.c.SolrConfig Using Lucene MatchVersion: 5.4.0
   [junit4]   2> 1588292 INFO  (coreLoadExecutor-5523-thread-1-processing-n:127.0.0.1:49304_) [n:127.0.0.1:49304_ c:collection1   x:collection1] o.a.s.c.Config Loaded SolrConfig: solrconfig.xml
   [junit4]   2> 1588293 INFO  (coreLoadExecutor-5523-thread-1-processing-n:127.0.0.1:49304_) [n:127.0.0.1:49304_ c:collection1   x:collection1] o.a.s.s.IndexSchema Reading Solr Schema from /configs/conf1/schema.xml
   [junit4]   2> 1588296 INFO  (coreLoadExecutor-5523-thread-1-processing-n:127.0.0.1:49304_) [n:127.0.0.1:49304_ c:collection1   x:collection1] o.a.s.s.IndexSchema [collection1] Schema name=test
   [junit4]   2> 1588368 INFO  (coreLoadExecutor-5523-thread-1-processing-n:127.0.0.1:49304_) [n:127.0.0.1:49304_ c:collection1   x:collection1] o.a.s.s.OpenExchangeRatesOrgProvider Initialized with rates=open-exchange-rates.json, refreshInterval=1440.
   [junit4]   2> 1588372 INFO  (coreLoadExecutor-5523-thread-1-processing-n:127.0.0.1:49304_) [n:127.0.0.1:49304_ c:collection1   x:collection1] o.a.s.s.IndexSchema default search field in schema is text
   [junit4]   2> 1588373 INFO  (coreLoadExecutor-5523-thread-1-processing-n:127.0.0.1:49304_) [n:127.0.0.1:49304_ c:collection1   x:collection1] o.a.s.s.IndexSchema unique key field: id
   [junit4]   2> 1588376 INFO  (coreLoadExecutor-5523-thread-1-processing-n:127.0.0.1:49304_) [n:127.0.0.1:49304_ c:collection1   x:collection1] o.a.s.s.FileExchangeRateProvider Reloading exchange rates from file currency.xml
   [junit4]   2> 1588377 INFO  (coreLoadExecutor-5523-thread-1-processing-n:127.0.0.1:49304_) [n:127.0.0.1:49304_ c:collection1   x:collection1] o.a.s.s.FileExchangeRateProvider Reloading exchange rates from file currency.xml
   [junit4]   2> 1588378 INFO  (coreLoadExecutor-5523-thread-1-processing-n:127.0.0.1:49304_) [n:127.0.0.1:49304_ c:collection1   x:collection1] o.a.s.s.OpenExchangeRatesOrgProvider Reloading exchange rates from open-exchange-rates.json
   [junit4]   2> 1588379 WARN  (coreLoadExecutor-5523-thread-1-processing-n:127.0.0.1:49304_) [n:127.0.0.1:49304_ c:collection1   x:collection1] o.a.s.s.OpenExchangeRatesOrgProvider Unknown key IMPORTANT NOTE
   [junit4]   2> 1588379 WARN  (coreLoadExecutor-5523-thread-1-processing-n:127.0.0.1:49304_) [n:127.0.0.1:49304_ c:collection1   x:collection1] o.a.s.s.OpenExchangeRatesOrgProvider Expected key, got STRING
   [junit4]   2> 1588379 INFO  (coreLoadExecutor-5523-thread-1-processing-n:127.0.0.1:49304_) [n:127.0.0.1:49304_ c:collection1   x:collection1] o.a.s.s.OpenExchangeRatesOrgProvider Reloading exchange rates from open-exchange-rates.json
   [junit4]   2> 1588379 WARN  (coreLoadExecutor-5523-thread-1-processing-n:127.0.0.1:49304_) [n:127.0.0.1:49304_ c:collection1   x:collection1] o.a.s.s.OpenExchangeRatesOrgProvider Unknown key IMPORTANT NOTE
   [junit4]   2> 1588379 WARN  (coreLoadExecutor-5523-thread-1-processing-n:127.0.0.1:49304_) [n:127.0.0.1:49304_ c:collection1   x:collection1] o.a.s.s.OpenExchangeRatesOrgProvider Expected key, got STRING
   [junit4]   2> 1588380 INFO  (coreLoadExecutor-5523-thread-1-processing-n:127.0.0.1:49304_) [n:127.0.0.1:49304_ c:collection1   x:collection1] o.a.s.c.ConfigSetProperties Did not find ConfigSet properties, assuming default properties: Can't find resource 'configsetprops.json' in classpath or '/configs/conf1', cwd=/home/jenkins/workspace/Lucene-Solr-5.x-Linux/solr/build/solr-core/test/J2
   [junit4]   2> 1588380 INFO  (coreLoadExecutor-5523-thread-1-processing-n:127.0.0.1:49304_) [n:127.0.0.1:49304_ c:collection1   x:collection1] o.a.s.c.CoreContainer Creating SolrCore 'collection1' using configuration from collection collection1
   [junit4]   2> 1588380 INFO  (coreLoadExecutor-5523-thread-1-processing-n:127.0.0.1:49304_) [n:127.0.0.1:49304_ c:collection1 s:shard2 r:core_node1 x:collection1] o.a.s.c.SolrCore org.apache.solr.core.MockDirectoryFactory
   [junit4]   2> 1588380 INFO  (coreLoadExecutor-5523-thread-1-processing-n:127.0.0.1:49304_) [n:127.0.0.1:49304_ c:collection1 s:shard2 r:core_node1 x:collection1] o.a.s.c.SolrCore [[collection1] ] Opening new SolrCore at [/home/jenkins/workspace/Lucene-Solr-5.x-Linux/solr/build/solr-core/test/J2/../../../../../../../../../home/jenkins/workspace/Lucene-Solr-5.x-Linux/solr/build/solr-core/test/J2/temp/solr.security.PKIAuthenticationIntegrationTest_BD24EEE43B4C716C-001/shard-1-001/cores/collection1/], dataDir=[null]
   [junit4]   2> 1588380 INFO  (coreLoadExecutor-5523-thread-1-processing-n:127.0.0.1:49304_) [n:127.0.0.1:49304_ c:collection1 s:shard2 r:core_node1 x:collection1] o.a.s.c.JmxMonitoredMap JMX monitoring is enabled. Adding Solr mbeans to JMX Server: com.sun.jmx.mbeanserver.JmxMBeanServer@638cc2e7
   [junit4]   2> 1588381 INFO  (coreLoadExecutor-5523-thread-1-processing-n:127.0.0.1:49304_) [n:127.0.0.1:49304_ c:collection1 s:shard2 r:core_node1 x:collection1] o.a.s.c.CachingDirectoryFactory return new directory for /home/jenkins/workspace/Lucene-Solr-5.x-Linux/solr/build/solr-core/test/J2/../../../../../../../../../home/jenkins/workspace/Lucene-Solr-5.x-Linux/solr/build/solr-core/test/J2/temp/solr.security.PKIAuthenticationIntegrationTest_BD24EEE43B4C716C-001/shard-1-001/cores/collection1/data
   [junit4]   2> 1588381 INFO  (coreLoadExecutor-5523-thread-1-processing-n:127.0.0.1:49304_) [n:127.0.0.1:49304_ c:collection1 s:shard2 r:core_node1 x:collection1] o.a.s.c.SolrCore New index directory detected: old=null new=/home/jenkins/workspace/Lucene-Solr-5.x-Linux/solr/build/solr-core/test/J2/../../../../../../../../../home/jenkins/workspace/Lucene-Solr-5.x-Linux/solr/build/solr-core/test/J2/temp/solr.security.PKIAuthenticationIntegrationTest_BD24EEE43B4C716C-001/shard-1-001/cores/collection1/data/index/
   [junit4]   2> 1588381 WARN  (coreLoadExecutor-5523-thread-1-processing-n:127.0.0.1:49304_) [n:127.0.0.1:49304_ c:collection1 s:shard2 r:core_node1 x:collection1] o.a.s.c.SolrCore [collection1] Solr index directory '/home/jenkins/workspace/Lucene-Solr-5.x-Linux/solr/build/solr-core/test/J2/../../../../../../../../../home/jenkins/workspace/Lucene-Solr-5.x-Linux/solr/build/solr-core/test/J2/temp/solr.security.PKIAuthenticationIntegrationTest_BD24EEE43B4C716C-001/shard-1-001/cores/collection1/data/index' doesn't exist. Creating new index...
   [junit4]   2> 1588382 INFO  (coreLoadExecutor-5523-thread-1-processing-n:127.0.0.1:49304_) [n:127.0.0.1:49304_ c:collection1 s:shard2 r:core_node1 x:collection1] o.a.s.c.CachingDirectoryFactory return new directory for /h

[...truncated too long message...]

reate(KeeperException.java:127)
   [junit4]   2> 	at org.apache.zookeeper.KeeperException.create(KeeperException.java:51)
   [junit4]   2> 	at org.apache.zookeeper.ZooKeeper.exists(ZooKeeper.java:1045)
   [junit4]   2> 	at org.apache.solr.common.cloud.SolrZkClient$4.execute(SolrZkClient.java:294)
   [junit4]   2> 	at org.apache.solr.common.cloud.SolrZkClient$4.execute(SolrZkClient.java:291)
   [junit4]   2> 	at org.apache.solr.common.cloud.ZkCmdExecutor.retryOperation(ZkCmdExecutor.java:61)
   [junit4]   2> 	at org.apache.solr.common.cloud.SolrZkClient.exists(SolrZkClient.java:291)
   [junit4]   2> 	at org.apache.solr.common.cloud.SolrZkClient.makePath(SolrZkClient.java:486)
   [junit4]   2> 	at org.apache.solr.common.cloud.SolrZkClient.makePath(SolrZkClient.java:455)
   [junit4]   2> 	at org.apache.solr.common.cloud.SolrZkClient.makePath(SolrZkClient.java:442)
   [junit4]   2> 	at org.apache.solr.cloud.ShardLeaderElectionContextBase$1.execute(ElectionContext.java:141)
   [junit4]   2> 	at org.apache.solr.common.util.RetryUtil.retryOnThrowable(RetryUtil.java:31)
   [junit4]   2> 	at org.apache.solr.cloud.ShardLeaderElectionContextBase.runLeaderProcess(ElectionContext.java:137)
   [junit4]   2> 	... 12 more
   [junit4]   2> 
   [junit4]   2> 1612229 INFO  (TEST-PKIAuthenticationIntegrationTest.testPkiAuth-seed#[BD24EEE43B4C716C]) [    ] o.e.j.s.ServerConnector Stopped ServerConnector@1d8bb209{HTTP/1.1}{127.0.0.1:0}
   [junit4]   2> 1612229 INFO  (TEST-PKIAuthenticationIntegrationTest.testPkiAuth-seed#[BD24EEE43B4C716C]) [    ] o.e.j.s.h.ContextHandler Stopped o.e.j.s.ServletContextHandler@3768b1bf{/,null,UNAVAILABLE}
   [junit4]   2> 1612230 INFO  (TEST-PKIAuthenticationIntegrationTest.testPkiAuth-seed#[BD24EEE43B4C716C]) [n:127.0.0.1:58256_ c:collection1 s:shard1 r:core_node4 x:collection1] o.a.s.c.ZkTestServer connecting to 127.0.0.1:42857 42857
   [junit4]   2> 1612264 INFO  (Thread-4589) [    ] o.a.s.c.ZkTestServer connecting to 127.0.0.1:42857 42857
   [junit4]   2> 1612265 WARN  (Thread-4589) [    ] o.a.s.c.ZkTestServer Watch limit violations: 
   [junit4]   2> Maximum concurrent create/delete watches above limit:
   [junit4]   2> 
   [junit4]   2> 	6	/solr/aliases.json
   [junit4]   2> 	6	/solr/clusterstate.json
   [junit4]   2> 	5	/solr/security.json
   [junit4]   2> 	5	/solr/configs/conf1
   [junit4]   2> 
   [junit4]   2> Maximum concurrent children watches above limit:
   [junit4]   2> 
   [junit4]   2> 	6	/solr/live_nodes
   [junit4]   2> 	4	/solr/overseer/queue
   [junit4]   2> 	4	/solr/overseer/collection-queue-work
   [junit4]   2> 
   [junit4]   2> NOTE: reproduce with: ant test  -Dtestcase=PKIAuthenticationIntegrationTest -Dtests.method=testPkiAuth -Dtests.seed=BD24EEE43B4C716C -Dtests.multiplier=3 -Dtests.slow=true -Dtests.locale=el_CY -Dtests.timezone=Eire -Dtests.asserts=true -Dtests.file.encoding=UTF-8
   [junit4] FAILURE 27.9s J2 | PKIAuthenticationIntegrationTest.testPkiAuth <<<
   [junit4]    > Throwable #1: java.lang.AssertionError
   [junit4]    > 	at __randomizedtesting.SeedInfo.seed([BD24EEE43B4C716C:8D9A77B5DBFAF6CD]:0)
   [junit4]    > 	at org.apache.solr.security.PKIAuthenticationIntegrationTest.testPkiAuth(PKIAuthenticationIntegrationTest.java:96)
   [junit4]    > 	at org.apache.solr.BaseDistributedSearchTestCase$ShardsRepeatRule$ShardsFixedStatement.callStatement(BaseDistributedSearchTestCase.java:963)
   [junit4]    > 	at org.apache.solr.BaseDistributedSearchTestCase$ShardsRepeatRule$ShardsStatement.evaluate(BaseDistributedSearchTestCase.java:938)
   [junit4]    > 	at java.lang.Thread.run(Thread.java:745)
   [junit4]   2> 1612270 INFO  (SUITE-PKIAuthenticationIntegrationTest-seed#[BD24EEE43B4C716C]-worker) [n:127.0.0.1:58256_ c:collection1 s:shard1 r:core_node4 x:collection1] o.a.s.SolrTestCaseJ4 ###deleteCore
   [junit4]   2> NOTE: leaving temporary files on disk at: /home/jenkins/workspace/Lucene-Solr-5.x-Linux/solr/build/solr-core/test/J2/temp/solr.security.PKIAuthenticationIntegrationTest_BD24EEE43B4C716C-001
   [junit4]   2> Aug 07, 2015 12:26:44 PM com.carrotsearch.randomizedtesting.ThreadLeakControl checkThreadLeaks
   [junit4]   2> WARNING: Will linger awaiting termination of 1 leaked thread(s).
   [junit4]   2> NOTE: test params are: codec=FastCompressingStoredFields(storedFieldsFormat=CompressingStoredFieldsFormat(compressionMode=FAST, chunkSize=2427, maxDocsPerChunk=527, blockSize=14), termVectorsFormat=CompressingTermVectorsFormat(compressionMode=FAST, chunkSize=2427, blockSize=14)), sim=RandomSimilarityProvider(queryNorm=false,coord=yes): {}, locale=el_CY, timezone=Eire
   [junit4]   2> NOTE: Linux 3.16.0-44-generic amd64/Oracle Corporation 1.8.0_60-ea (64-bit)/cpus=12,threads=1,free=268279120,total=536870912
   [junit4]   2> NOTE: All tests run in this JVM: [HdfsUnloadDistributedZkTest, TestQueryUtils, LeaderInitiatedRecoveryOnCommitTest, SimpleFacetsTest, TestCloudManagedSchemaConcurrent, RankQueryTest, TestSmileRequest, TestStressReorder, TestRuleBasedAuthorizationPlugin, TestSolrJ, DistributedFacetPivotLargeTest, TestManagedSchemaDynamicFieldResource, TestBlobHandler, CoreAdminRequestStatusTest, OverseerCollectionProcessorTest, TestQueryTypes, CircularListTest, DistributedQueryElevationComponentTest, TestSystemIdResolver, TestJsonRequest, DocValuesTest, SynonymTokenizerTest, AutoCommitTest, TestMissingGroups, TestMiniSolrCloudClusterSSL, HdfsCollectionsAPIDistributedZkTest, TestHighFrequencyDictionaryFactory, RuleEngineTest, AtomicUpdatesTest, SolrXmlInZkTest, BasicDistributedZk2Test, CachingDirectoryFactoryTest, HdfsDirectoryTest, TestBinaryResponseWriter, TestRecoveryHdfs, NumericFieldsTest, TestReloadAndDeleteDocs, CloudExitableDirectoryReaderTest, TestObjectReleaseTracker, TestCopyFieldCollectionResource, TestRawResponseWriter, FacetPivotSmallTest, TestXIncludeConfig, SecurityConfHandlerTest, TestUtils, OverseerTest, TestSortingResponseWriter, TestSortByMinMaxFunction, TestDownShardTolerantSearch, TestCSVResponseWriter, RemoteQueryErrorTest, TestTrie, SpellCheckCollatorTest, TestFastOutputStream, AnalyticsQueryTest, TestDistribDocBasedVersion, LoggingHandlerTest, QueryParsingTest, CollectionStateFormat2Test, ReplicationFactorTest, CoreMergeIndexesAdminHandlerTest, RegexBoostProcessorTest, MoreLikeThisHandlerTest, NotRequiredUniqueKeyTest, DocValuesMissingTest, TestAuthorizationFramework, RecoveryZkTest, ActionThrottleTest, SearchHandlerTest, TestPerFieldSimilarity, SampleTest, TestTolerantSearch, StatsComponentTest, CloudMLTQParserTest, TermVectorComponentDistributedTest, TestManagedResourceStorage, TestInitParams, SSLMigrationTest, SolrCoreCheckLockOnStartupTest, TestSolrQueryParserDefaultOperatorResource, TestConfigSetImmutable, TestExactStatsCache, TestStressRecovery, ChaosMonkeySafeLeaderTest, UnloadDistributedZkTest, BasicZkTest, FullSolrCloudDistribCmdsTest, ZkCLITest, ShardRoutingCustomTest, TestHashPartitioner, TestReload, HardAutoCommitTest, TestRangeQuery, SolrCoreTest, SpellCheckComponentTest, SolrCmdDistributorTest, TestFunctionQuery, BasicFunctionalityTest, TestLazyCores, TestIndexSearcher, SoftAutoCommitTest, TestStressLucene, SpatialFilterTest, PolyFieldTest, TestUpdate, QueryEqualityTest, DefaultValueUpdateProcessorTest, SortByFunctionTest, TestRemoteStreaming, SolrInfoMBeanTest, DebugComponentTest, IndexBasedSpellCheckerTest, LukeRequestHandlerTest, TestWriterPerf, TestReversedWildcardFilterFactory, FileBasedSpellCheckerTest, XmlUpdateRequestHandlerTest, FieldAnalysisRequestHandlerTest, IndexSchemaRuntimeFieldTest, TestJmxIntegration, JSONWriterTest, BinaryUpdateRequestHandlerTest, TestPartialUpdateDeduplication, CSVRequestHandlerTest, TestLFUCache, TestEmbeddedSolrServerConstructors, TestJettySolrRunner, AsyncCallRequestStatusResponseTest, CollectionsAPIAsyncDistributedZkTest, ConcurrentDeleteAndCreateCollectionTest, ConnectionManagerTest, CustomCollectionTest, DistribJoinFromCollectionTest, MigrateRouteKeyTest, OutOfBoxZkACLAndCredentialsProvidersTest, OverriddenZkACLAndCredentialsProvidersTest, RollingRestartTest, ShardSplitTest, TestExpandComponent, TestChildDocTransformer, TestBulkSchemaAPI, TestFieldTypeCollectionResource, TestManagedSchemaFieldResource, TestBulkSchemaConcurrent, TestManagedSchema, AnalyticsMergeStrategyTest, CursorMarkTest, MergeStrategyTest, TestCollapseQParserPlugin, TestComplexPhraseQParserPlugin, TestCustomSort, TestFieldSortValues, TestInitQParser, TestNoOpRegenerator, TestOverriddenPrefixQueryForCustomFieldType, TestSearcherReuse, TestSimpleQParserPlugin, TestSolr4Spatial2, TestStandardQParsers, TestTrieFacet, TestMinMaxOnMultiValuedField, TestOrdValues, TestScoreJoinQPScore, TestNonDefinedSimilarityFactory, TestDefaultStatsCache, TestDistribIDF, TestExactSharedStatsCache, PKIAuthenticationIntegrationTest]
   [junit4] Completed [530/531] on J2 in 28.14s, 1 test, 1 failure <<< FAILURES!

[...truncated 15 lines...]
BUILD FAILED
/home/jenkins/workspace/Lucene-Solr-5.x-Linux/build.xml:726: The following error occurred while executing this line:
/home/jenkins/workspace/Lucene-Solr-5.x-Linux/build.xml:670: The following error occurred while executing this line:
/home/jenkins/workspace/Lucene-Solr-5.x-Linux/build.xml:59: The following error occurred while executing this line:
/home/jenkins/workspace/Lucene-Solr-5.x-Linux/solr/build.xml:230: The following error occurred while executing this line:
/home/jenkins/workspace/Lucene-Solr-5.x-Linux/solr/common-build.xml:524: The following error occurred while executing this line:
/home/jenkins/workspace/Lucene-Solr-5.x-Linux/lucene/common-build.xml:1449: The following error occurred while executing this line:
/home/jenkins/workspace/Lucene-Solr-5.x-Linux/lucene/common-build.xml:1003: There were test failures: 531 suites, 2104 tests, 1 failure, 66 ignored (30 assumptions)

Total time: 48 minutes 59 seconds
Build step 'Invoke Ant' marked build as failure
Archiving artifacts
Recording test results
Email was triggered for: Failure - Any
Sending email for trigger: Failure - Any



Mime
View raw message