lucene-dev mailing list archives

Site index · List index
Message view « Date » · « Thread »
Top « Date » · « Thread »
From Policeman Jenkins Server <jenk...@thetaphi.de>
Subject [JENKINS] Lucene-Solr-5.x-Windows (64bit/jdk1.8.0_51) - Build # 4939 - Failure!
Date Sat, 25 Jul 2015 10:29:54 GMT
Build: http://jenkins.thetaphi.de/job/Lucene-Solr-5.x-Windows/4939/
Java: 64bit/jdk1.8.0_51 -XX:+UseCompressedOops -XX:+UseG1GC

3 tests failed.
FAILED:  junit.framework.TestSuite.org.apache.solr.core.TestLazyCores

Error Message:
ERROR: SolrIndexSearcher opens=51 closes=50

Stack Trace:
java.lang.AssertionError: ERROR: SolrIndexSearcher opens=51 closes=50
	at __randomizedtesting.SeedInfo.seed([E41DD6B1308F3792]:0)
	at org.junit.Assert.fail(Assert.java:93)
	at org.apache.solr.SolrTestCaseJ4.endTrackingSearchers(SolrTestCaseJ4.java:465)
	at org.apache.solr.SolrTestCaseJ4.afterClass(SolrTestCaseJ4.java:232)
	at sun.reflect.GeneratedMethodAccessor32.invoke(Unknown Source)
	at sun.reflect.DelegatingMethodAccessorImpl.invoke(DelegatingMethodAccessorImpl.java:43)
	at java.lang.reflect.Method.invoke(Method.java:497)
	at com.carrotsearch.randomizedtesting.RandomizedRunner.invoke(RandomizedRunner.java:1627)
	at com.carrotsearch.randomizedtesting.RandomizedRunner$5.evaluate(RandomizedRunner.java:799)
	at com.carrotsearch.randomizedtesting.rules.StatementAdapter.evaluate(StatementAdapter.java:36)
	at com.carrotsearch.randomizedtesting.rules.SystemPropertiesRestoreRule$1.evaluate(SystemPropertiesRestoreRule.java:57)
	at org.apache.lucene.util.AbstractBeforeAfterRule$1.evaluate(AbstractBeforeAfterRule.java:46)
	at com.carrotsearch.randomizedtesting.rules.StatementAdapter.evaluate(StatementAdapter.java:36)
	at org.apache.lucene.util.TestRuleStoreClassName$1.evaluate(TestRuleStoreClassName.java:42)
	at com.carrotsearch.randomizedtesting.rules.NoShadowingOrOverridesOnMethodsRule$1.evaluate(NoShadowingOrOverridesOnMethodsRule.java:39)
	at com.carrotsearch.randomizedtesting.rules.NoShadowingOrOverridesOnMethodsRule$1.evaluate(NoShadowingOrOverridesOnMethodsRule.java:39)
	at com.carrotsearch.randomizedtesting.rules.StatementAdapter.evaluate(StatementAdapter.java:36)
	at com.carrotsearch.randomizedtesting.rules.StatementAdapter.evaluate(StatementAdapter.java:36)
	at com.carrotsearch.randomizedtesting.rules.StatementAdapter.evaluate(StatementAdapter.java:36)
	at org.apache.lucene.util.TestRuleAssertionsRequired$1.evaluate(TestRuleAssertionsRequired.java:54)
	at org.apache.lucene.util.TestRuleMarkFailure$1.evaluate(TestRuleMarkFailure.java:48)
	at org.apache.lucene.util.TestRuleIgnoreAfterMaxFailures$1.evaluate(TestRuleIgnoreAfterMaxFailures.java:65)
	at org.apache.lucene.util.TestRuleIgnoreTestSuites$1.evaluate(TestRuleIgnoreTestSuites.java:55)
	at com.carrotsearch.randomizedtesting.rules.StatementAdapter.evaluate(StatementAdapter.java:36)
	at com.carrotsearch.randomizedtesting.ThreadLeakControl$StatementRunner.run(ThreadLeakControl.java:365)
	at java.lang.Thread.run(Thread.java:745)


FAILED:  junit.framework.TestSuite.org.apache.solr.core.TestLazyCores

Error Message:
1 thread leaked from SUITE scope at org.apache.solr.core.TestLazyCores:     1) Thread[id=9299, name=searcherExecutor-4748-thread-1, state=WAITING, group=TGRP-TestLazyCores]         at sun.misc.Unsafe.park(Native Method)         at java.util.concurrent.locks.LockSupport.park(LockSupport.java:175)         at java.util.concurrent.locks.AbstractQueuedSynchronizer$ConditionObject.await(AbstractQueuedSynchronizer.java:2039)         at java.util.concurrent.LinkedBlockingQueue.take(LinkedBlockingQueue.java:442)         at java.util.concurrent.ThreadPoolExecutor.getTask(ThreadPoolExecutor.java:1067)         at java.util.concurrent.ThreadPoolExecutor.runWorker(ThreadPoolExecutor.java:1127)         at java.util.concurrent.ThreadPoolExecutor$Worker.run(ThreadPoolExecutor.java:617)         at java.lang.Thread.run(Thread.java:745)

Stack Trace:
com.carrotsearch.randomizedtesting.ThreadLeakError: 1 thread leaked from SUITE scope at org.apache.solr.core.TestLazyCores: 
   1) Thread[id=9299, name=searcherExecutor-4748-thread-1, state=WAITING, group=TGRP-TestLazyCores]
        at sun.misc.Unsafe.park(Native Method)
        at java.util.concurrent.locks.LockSupport.park(LockSupport.java:175)
        at java.util.concurrent.locks.AbstractQueuedSynchronizer$ConditionObject.await(AbstractQueuedSynchronizer.java:2039)
        at java.util.concurrent.LinkedBlockingQueue.take(LinkedBlockingQueue.java:442)
        at java.util.concurrent.ThreadPoolExecutor.getTask(ThreadPoolExecutor.java:1067)
        at java.util.concurrent.ThreadPoolExecutor.runWorker(ThreadPoolExecutor.java:1127)
        at java.util.concurrent.ThreadPoolExecutor$Worker.run(ThreadPoolExecutor.java:617)
        at java.lang.Thread.run(Thread.java:745)
	at __randomizedtesting.SeedInfo.seed([E41DD6B1308F3792]:0)


FAILED:  junit.framework.TestSuite.org.apache.solr.core.TestLazyCores

Error Message:
There are still zombie threads that couldn't be terminated:    1) Thread[id=9299, name=searcherExecutor-4748-thread-1, state=WAITING, group=TGRP-TestLazyCores]         at sun.misc.Unsafe.park(Native Method)         at java.util.concurrent.locks.LockSupport.park(LockSupport.java:175)         at java.util.concurrent.locks.AbstractQueuedSynchronizer$ConditionObject.await(AbstractQueuedSynchronizer.java:2039)         at java.util.concurrent.LinkedBlockingQueue.take(LinkedBlockingQueue.java:442)         at java.util.concurrent.ThreadPoolExecutor.getTask(ThreadPoolExecutor.java:1067)         at java.util.concurrent.ThreadPoolExecutor.runWorker(ThreadPoolExecutor.java:1127)         at java.util.concurrent.ThreadPoolExecutor$Worker.run(ThreadPoolExecutor.java:617)         at java.lang.Thread.run(Thread.java:745)

Stack Trace:
com.carrotsearch.randomizedtesting.ThreadLeakError: There are still zombie threads that couldn't be terminated:
   1) Thread[id=9299, name=searcherExecutor-4748-thread-1, state=WAITING, group=TGRP-TestLazyCores]
        at sun.misc.Unsafe.park(Native Method)
        at java.util.concurrent.locks.LockSupport.park(LockSupport.java:175)
        at java.util.concurrent.locks.AbstractQueuedSynchronizer$ConditionObject.await(AbstractQueuedSynchronizer.java:2039)
        at java.util.concurrent.LinkedBlockingQueue.take(LinkedBlockingQueue.java:442)
        at java.util.concurrent.ThreadPoolExecutor.getTask(ThreadPoolExecutor.java:1067)
        at java.util.concurrent.ThreadPoolExecutor.runWorker(ThreadPoolExecutor.java:1127)
        at java.util.concurrent.ThreadPoolExecutor$Worker.run(ThreadPoolExecutor.java:617)
        at java.lang.Thread.run(Thread.java:745)
	at __randomizedtesting.SeedInfo.seed([E41DD6B1308F3792]:0)




Build Log:
[...truncated 11168 lines...]
   [junit4] Suite: org.apache.solr.core.TestLazyCores
   [junit4]   2> Creating dataDir: C:\Users\JenkinsSlave\workspace\Lucene-Solr-5.x-Windows\solr\build\solr-core\test\J0\temp\solr.core.TestLazyCores_E41DD6B1308F3792-001\init-core-data-001
   [junit4]   2> 1400428 INFO  (SUITE-TestLazyCores-seed#[E41DD6B1308F3792]-worker) [    ] o.a.s.SolrTestCaseJ4 Randomized ssl (false) and clientAuth (false)
   [junit4]   2> 1400431 INFO  (TEST-TestLazyCores.testCachingLimit-seed#[E41DD6B1308F3792]) [    ] o.a.s.SolrTestCaseJ4 ###Starting testCachingLimit
   [junit4]   2> 1400532 INFO  (TEST-TestLazyCores.testCachingLimit-seed#[E41DD6B1308F3792]) [    ] o.a.s.c.SolrResourceLoader new SolrResourceLoader for directory: 'C:\Users\JenkinsSlave\workspace\Lucene-Solr-5.x-Windows\solr\build\solr-core\test\J0\temp\solr.core.TestLazyCores_E41DD6B1308F3792-001\tempDir-001\'
   [junit4]   2> 1400560 INFO  (TEST-TestLazyCores.testCachingLimit-seed#[E41DD6B1308F3792]) [    ] o.a.s.c.CoreContainer New CoreContainer 1565531575
   [junit4]   2> 1400560 INFO  (TEST-TestLazyCores.testCachingLimit-seed#[E41DD6B1308F3792]) [    ] o.a.s.c.CoreContainer Loading cores into CoreContainer [instanceDir=C:\Users\JenkinsSlave\workspace\Lucene-Solr-5.x-Windows\solr\build\solr-core\test\J0\temp\solr.core.TestLazyCores_E41DD6B1308F3792-001\tempDir-001\]
   [junit4]   2> 1400560 INFO  (TEST-TestLazyCores.testCachingLimit-seed#[E41DD6B1308F3792]) [    ] o.a.s.c.CoreContainer loading shared library: C:\Users\JenkinsSlave\workspace\Lucene-Solr-5.x-Windows\solr\build\solr-core\test\J0\temp\solr.core.TestLazyCores_E41DD6B1308F3792-001\tempDir-001\lib
   [junit4]   2> 1400561 WARN  (TEST-TestLazyCores.testCachingLimit-seed#[E41DD6B1308F3792]) [    ] o.a.s.c.SolrResourceLoader Can't find (or read) directory to add to classloader: lib (resolved as: C:\Users\JenkinsSlave\workspace\Lucene-Solr-5.x-Windows\solr\build\solr-core\test\J0\temp\solr.core.TestLazyCores_E41DD6B1308F3792-001\tempDir-001\lib).
   [junit4]   2> 1400569 INFO  (TEST-TestLazyCores.testCachingLimit-seed#[E41DD6B1308F3792]) [    ] o.a.s.h.c.HttpShardHandlerFactory created with socketTimeout : 600000,connTimeout : 60000,maxConnectionsPerHost : 20,maxConnections : 10000,corePoolSize : 0,maximumPoolSize : 2147483647,maxThreadIdleTime : 5,sizeOfQueue : -1,fairnessPolicy : false,useRetries : false,
   [junit4]   2> 1400573 INFO  (TEST-TestLazyCores.testCachingLimit-seed#[E41DD6B1308F3792]) [    ] o.a.s.u.UpdateShardHandler Creating UpdateShardHandler HTTP client with params: socketTimeout=600000&connTimeout=60000&retry=true
   [junit4]   2> 1400574 INFO  (TEST-TestLazyCores.testCachingLimit-seed#[E41DD6B1308F3792]) [    ] o.a.s.c.CoreContainer Allocating transient cache for 4 transient cores
   [junit4]   2> 1400577 INFO  (TEST-TestLazyCores.testCachingLimit-seed#[E41DD6B1308F3792]) [    ] o.a.s.l.LogWatcher SLF4J impl is org.slf4j.impl.Log4jLoggerFactory
   [junit4]   2> 1400578 INFO  (TEST-TestLazyCores.testCachingLimit-seed#[E41DD6B1308F3792]) [    ] o.a.s.l.LogWatcher Registering Log Listener [Log4j (org.slf4j.impl.Log4jLoggerFactory)]
   [junit4]   2> 1400578 INFO  (TEST-TestLazyCores.testCachingLimit-seed#[E41DD6B1308F3792]) [    ] o.a.s.c.CoreContainer No authentication plugin used.
   [junit4]   2> 1400580 INFO  (TEST-TestLazyCores.testCachingLimit-seed#[E41DD6B1308F3792]) [    ] o.a.s.c.SolrCore Created CoreDescriptor: {name=collection1, config=solrconfig.xml, transient=false, schema=schema.xml, loadOnStartup=true, configSetProperties=configsetprops.json, instanceDir=collection1, absoluteInstDir=C:\Users\JenkinsSlave\workspace\Lucene-Solr-5.x-Windows\solr\build\solr-core\test\J0\temp\solr.core.TestLazyCores_E41DD6B1308F3792-001\tempDir-001\collection1\, dataDir=data\}
   [junit4]   2> 1400581 INFO  (TEST-TestLazyCores.testCachingLimit-seed#[E41DD6B1308F3792]) [    ] o.a.s.c.SolrCore Created CoreDescriptor: {name=collectionLazy2, config=solrconfig.xml, transient=true, schema=schema.xml, loadOnStartup=true, configSetProperties=configsetprops.json, instanceDir=collection2, absoluteInstDir=C:\Users\JenkinsSlave\workspace\Lucene-Solr-5.x-Windows\solr\build\solr-core\test\J0\temp\solr.core.TestLazyCores_E41DD6B1308F3792-001\tempDir-001\collection2\, dataDir=data\}
   [junit4]   2> 1400582 INFO  (TEST-TestLazyCores.testCachingLimit-seed#[E41DD6B1308F3792]) [    ] o.a.s.c.SolrCore Created CoreDescriptor: {name=collectionLazy3, config=solrconfig.xml, transient=on, schema=schema.xml, loadOnStartup=false, configSetProperties=configsetprops.json, instanceDir=collection3, absoluteInstDir=C:\Users\JenkinsSlave\workspace\Lucene-Solr-5.x-Windows\solr\build\solr-core\test\J0\temp\solr.core.TestLazyCores_E41DD6B1308F3792-001\tempDir-001\collection3\, dataDir=data\}
   [junit4]   2> 1400584 INFO  (TEST-TestLazyCores.testCachingLimit-seed#[E41DD6B1308F3792]) [    ] o.a.s.c.SolrCore Created CoreDescriptor: {name=collectionLazy4, config=solrconfig.xml, transient=false, schema=schema.xml, loadOnStartup=false, configSetProperties=configsetprops.json, instanceDir=collection4, absoluteInstDir=C:\Users\JenkinsSlave\workspace\Lucene-Solr-5.x-Windows\solr\build\solr-core\test\J0\temp\solr.core.TestLazyCores_E41DD6B1308F3792-001\tempDir-001\collection4\, dataDir=data\}
   [junit4]   2> 1400585 INFO  (TEST-TestLazyCores.testCachingLimit-seed#[E41DD6B1308F3792]) [    ] o.a.s.c.SolrCore Created CoreDescriptor: {name=collectionLazy5, config=solrconfig.xml, transient=false, schema=schema.xml, loadOnStartup=true, configSetProperties=configsetprops.json, instanceDir=collection5, absoluteInstDir=C:\Users\JenkinsSlave\workspace\Lucene-Solr-5.x-Windows\solr\build\solr-core\test\J0\temp\solr.core.TestLazyCores_E41DD6B1308F3792-001\tempDir-001\collection5\, dataDir=data\}
   [junit4]   2> 1400586 INFO  (TEST-TestLazyCores.testCachingLimit-seed#[E41DD6B1308F3792]) [    ] o.a.s.c.SolrCore Created CoreDescriptor: {name=collectionLazy6, config=solrconfig.xml, transient=true, schema=schema.xml, loadOnStartup=false, configSetProperties=configsetprops.json, instanceDir=collection6, absoluteInstDir=C:\Users\JenkinsSlave\workspace\Lucene-Solr-5.x-Windows\solr\build\solr-core\test\J0\temp\solr.core.TestLazyCores_E41DD6B1308F3792-001\tempDir-001\collection6\, dataDir=data\}
   [junit4]   2> 1400587 INFO  (TEST-TestLazyCores.testCachingLimit-seed#[E41DD6B1308F3792]) [    ] o.a.s.c.SolrCore Created CoreDescriptor: {name=collectionLazy7, config=solrconfig.xml, transient=true, schema=schema.xml, loadOnStartup=false, configSetProperties=configsetprops.json, instanceDir=collection7, absoluteInstDir=C:\Users\JenkinsSlave\workspace\Lucene-Solr-5.x-Windows\solr\build\solr-core\test\J0\temp\solr.core.TestLazyCores_E41DD6B1308F3792-001\tempDir-001\collection7\, dataDir=data\}
   [junit4]   2> 1400588 INFO  (TEST-TestLazyCores.testCachingLimit-seed#[E41DD6B1308F3792]) [    ] o.a.s.c.SolrCore Created CoreDescriptor: {name=collectionLazy8, config=solrconfig.xml, transient=true, schema=schema.xml, loadOnStartup=false, configSetProperties=configsetprops.json, instanceDir=collection8, absoluteInstDir=C:\Users\JenkinsSlave\workspace\Lucene-Solr-5.x-Windows\solr\build\solr-core\test\J0\temp\solr.core.TestLazyCores_E41DD6B1308F3792-001\tempDir-001\collection8\, dataDir=data\}
   [junit4]   2> 1400588 INFO  (TEST-TestLazyCores.testCachingLimit-seed#[E41DD6B1308F3792]) [    ] o.a.s.c.SolrCore Created CoreDescriptor: {name=collectionLazy9, config=solrconfig.xml, transient=true, schema=schema.xml, loadOnStartup=false, configSetProperties=configsetprops.json, instanceDir=collection9, absoluteInstDir=C:\Users\JenkinsSlave\workspace\Lucene-Solr-5.x-Windows\solr\build\solr-core\test\J0\temp\solr.core.TestLazyCores_E41DD6B1308F3792-001\tempDir-001\collection9\, dataDir=data\}
   [junit4]   2> 1400589 INFO  (coreLoadExecutor-4745-thread-1) [    ] o.a.s.c.SolrResourceLoader new SolrResourceLoader for directory: 'C:\Users\JenkinsSlave\workspace\Lucene-Solr-5.x-Windows\solr\build\solr-core\test\J0\temp\solr.core.TestLazyCores_E41DD6B1308F3792-001\tempDir-001\collection1\'
   [junit4]   2> 1400590 INFO  (coreLoadExecutor-4745-thread-2) [    ] o.a.s.c.SolrResourceLoader new SolrResourceLoader for directory: 'C:\Users\JenkinsSlave\workspace\Lucene-Solr-5.x-Windows\solr\build\solr-core\test\J0\temp\solr.core.TestLazyCores_E41DD6B1308F3792-001\tempDir-001\collection2\'
   [junit4]   2> 1400594 INFO  (coreLoadExecutor-4745-thread-3) [    ] o.a.s.c.SolrResourceLoader new SolrResourceLoader for directory: 'C:\Users\JenkinsSlave\workspace\Lucene-Solr-5.x-Windows\solr\build\solr-core\test\J0\temp\solr.core.TestLazyCores_E41DD6B1308F3792-001\tempDir-001\collection5\'
   [junit4]   2> 1400617 INFO  (coreLoadExecutor-4745-thread-1) [    ] o.a.s.c.SolrConfig current version of requestparams : -1
   [junit4]   2> 1400619 INFO  (coreLoadExecutor-4745-thread-2) [    ] o.a.s.c.SolrConfig current version of requestparams : -1
   [junit4]   2> 1400621 INFO  (coreLoadExecutor-4745-thread-1) [    ] o.a.s.c.SolrConfig Using Lucene MatchVersion: 5.3.0
   [junit4]   2> 1400623 INFO  (coreLoadExecutor-4745-thread-3) [    ] o.a.s.c.SolrConfig current version of requestparams : -1
   [junit4]   2> 1400635 INFO  (coreLoadExecutor-4745-thread-1) [    ] o.a.s.c.Config Loaded SolrConfig: solrconfig.xml
   [junit4]   2> 1400636 INFO  (coreLoadExecutor-4745-thread-1) [    ] o.a.s.s.IndexSchema Reading Solr Schema from C:\Users\JenkinsSlave\workspace\Lucene-Solr-5.x-Windows\solr\build\solr-core\test\J0\temp\solr.core.TestLazyCores_E41DD6B1308F3792-001\tempDir-001\collection1\conf\schema.xml
   [junit4]   2> 1400636 INFO  (coreLoadExecutor-4745-thread-3) [    ] o.a.s.c.SolrConfig Using Lucene MatchVersion: 5.3.0
   [junit4]   2> 1400640 INFO  (coreLoadExecutor-4745-thread-1) [    ] o.a.s.s.IndexSchema [collection1] Schema name=tiny
   [junit4]   2> 1400641 INFO  (coreLoadExecutor-4745-thread-3) [    ] o.a.s.c.Config Loaded SolrConfig: solrconfig.xml
   [junit4]   2> 1400641 INFO  (coreLoadExecutor-4745-thread-3) [    ] o.a.s.s.IndexSchema Reading Solr Schema from C:\Users\JenkinsSlave\workspace\Lucene-Solr-5.x-Windows\solr\build\solr-core\test\J0\temp\solr.core.TestLazyCores_E41DD6B1308F3792-001\tempDir-001\collection5\conf\schema.xml
   [junit4]   2> 1400644 INFO  (coreLoadExecutor-4745-thread-1) [    ] o.a.s.s.IndexSchema unique key field: id
   [junit4]   2> 1400644 INFO  (coreLoadExecutor-4745-thread-2) [    ] o.a.s.c.SolrConfig Using Lucene MatchVersion: 5.3.0
   [junit4]   2> 1400646 INFO  (coreLoadExecutor-4745-thread-3) [    ] o.a.s.s.IndexSchema [collectionLazy5] Schema name=tiny
   [junit4]   2> 1400647 INFO  (coreLoadExecutor-4745-thread-1) [    ] o.a.s.c.ConfigSetProperties Did not find ConfigSet properties, assuming default properties: Can't find resource 'configsetprops.json' in classpath or 'C:\Users\JenkinsSlave\workspace\Lucene-Solr-5.x-Windows\solr\build\solr-core\test\J0\temp\solr.core.TestLazyCores_E41DD6B1308F3792-001\tempDir-001\collection1\conf'
   [junit4]   2> 1400647 INFO  (coreLoadExecutor-4745-thread-1) [    ] o.a.s.c.CoreContainer Creating SolrCore 'collection1' using configuration from instancedir C:\Users\JenkinsSlave\workspace\Lucene-Solr-5.x-Windows\solr\build\solr-core\test\J0\temp\solr.core.TestLazyCores_E41DD6B1308F3792-001\tempDir-001\collection1\
   [junit4]   2> 1400647 INFO  (coreLoadExecutor-4745-thread-1) [    x:collection1] o.a.s.c.SolrCore org.apache.solr.core.MockDirectoryFactory
   [junit4]   2> 1400647 INFO  (coreLoadExecutor-4745-thread-1) [    x:collection1] o.a.s.c.SolrCore [[collection1] ] Opening new SolrCore at [C:\Users\JenkinsSlave\workspace\Lucene-Solr-5.x-Windows\solr\build\solr-core\test\J0\temp\solr.core.TestLazyCores_E41DD6B1308F3792-001\tempDir-001\collection1\], dataDir=[null]
   [junit4]   2> 1400647 INFO  (coreLoadExecutor-4745-thread-1) [    x:collection1] o.a.s.c.SolrCore JMX monitoring not detected for core: collection1
   [junit4]   2> 1400648 INFO  (coreLoadExecutor-4745-thread-3) [    ] o.a.s.s.IndexSchema unique key field: id
   [junit4]   2> 1400648 INFO  (coreLoadExecutor-4745-thread-1) [    x:collection1] o.a.s.c.CachingDirectoryFactory return new directory for C:\Users\JenkinsSlave\workspace\Lucene-Solr-5.x-Windows\solr\build\solr-core\test\J0\temp\solr.core.TestLazyCores_E41DD6B1308F3792-001\tempDir-001\collection1\data\
   [junit4]   2> 1400648 INFO  (coreLoadExecutor-4745-thread-1) [    x:collection1] o.a.s.c.SolrCore New index directory detected: old=null new=C:\Users\JenkinsSlave\workspace\Lucene-Solr-5.x-Windows\solr\build\solr-core\test\J0\temp\solr.core.TestLazyCores_E41DD6B1308F3792-001\tempDir-001\collection1\data\index/
   [junit4]   2> 1400648 WARN  (coreLoadExecutor-4745-thread-1) [    x:collection1] o.a.s.c.SolrCore [collection1] Solr index directory 'C:\Users\JenkinsSlave\workspace\Lucene-Solr-5.x-Windows\solr\build\solr-core\test\J0\temp\solr.core.TestLazyCores_E41DD6B1308F3792-001\tempDir-001\collection1\data\index' doesn't exist. Creating new index...
   [junit4]   2> 1400649 INFO  (coreLoadExecutor-4745-thread-1) [    x:collection1] o.a.s.c.CachingDirectoryFactory return new directory for C:\Users\JenkinsSlave\workspace\Lucene-Solr-5.x-Windows\solr\build\solr-core\test\J0\temp\solr.core.TestLazyCores_E41DD6B1308F3792-001\tempDir-001\collection1\data\index
   [junit4]   2> 1400649 INFO  (coreLoadExecutor-4745-thread-1) [    x:collection1] o.a.s.u.RandomMergePolicy RandomMergePolicy wrapping class org.apache.lucene.index.TieredMergePolicy: [TieredMergePolicy: maxMergeAtOnce=44, maxMergeAtOnceExplicit=25, maxMergedSegmentMB=96.0869140625, floorSegmentMB=0.701171875, forceMergeDeletesPctAllowed=7.881921496790701, segmentsPerTier=50.0, maxCFSSegmentSizeMB=8.796093022207999E12, noCFSRatio=0.0
   [junit4]   2> 1400649 INFO  (coreLoadExecutor-4745-thread-3) [    ] o.a.s.c.ConfigSetProperties Did not find ConfigSet properties, assuming default properties: Can't find resource 'configsetprops.json' in classpath or 'C:\Users\JenkinsSlave\workspace\Lucene-Solr-5.x-Windows\solr\build\solr-core\test\J0\temp\solr.core.TestLazyCores_E41DD6B1308F3792-001\tempDir-001\collection5\conf'
   [junit4]   2> 1400649 INFO  (coreLoadExecutor-4745-thread-3) [    ] o.a.s.c.CoreContainer Creating SolrCore 'collectionLazy5' using configuration from instancedir C:\Users\JenkinsSlave\workspace\Lucene-Solr-5.x-Windows\solr\build\solr-core\test\J0\temp\solr.core.TestLazyCores_E41DD6B1308F3792-001\tempDir-001\collection5\
   [junit4]   2> 1400649 INFO  (coreLoadExecutor-4745-thread-1) [    x:collection1] o.a.s.c.SolrCore SolrDeletionPolicy.onCommit: commits: num=1
   [junit4]   2> 	commit{dir=MockDirectoryWrapper(RAMDirectory@b3e05ba lockFactory=org.apache.lucene.store.SingleInstanceLockFactory@50ace0b6),segFN=segments_1,generation=1}
   [junit4]   2> 1400649 INFO  (coreLoadExecutor-4745-thread-1) [    x:collection1] o.a.s.c.SolrCore newest commit generation = 1
   [junit4]   2> 1400649 INFO  (coreLoadExecutor-4745-thread-3) [    x:collectionLazy5] o.a.s.c.SolrCore org.apache.solr.core.MockDirectoryFactory
   [junit4]   2> 1400650 INFO  (coreLoadExecutor-4745-thread-3) [    x:collectionLazy5] o.a.s.c.SolrCore [[collectionLazy5] ] Opening new SolrCore at [C:\Users\JenkinsSlave\workspace\Lucene-Solr-5.x-Windows\solr\build\solr-core\test\J0\temp\solr.core.TestLazyCores_E41DD6B1308F3792-001\tempDir-001\collection5\], dataDir=[null]
   [junit4]   2> 1400650 INFO  (coreLoadExecutor-4745-thread-3) [    x:collectionLazy5] o.a.s.c.SolrCore JMX monitoring not detected for core: collectionLazy5
   [junit4]   2> 1400650 INFO  (coreLoadExecutor-4745-thread-3) [    x:collectionLazy5] o.a.s.c.CachingDirectoryFactory return new directory for C:\Users\JenkinsSlave\workspace\Lucene-Solr-5.x-Windows\solr\build\solr-core\test\J0\temp\solr.core.TestLazyCores_E41DD6B1308F3792-001\tempDir-001\collection5\data\
   [junit4]   2> 1400650 INFO  (coreLoadExecutor-4745-thread-3) [    x:collectionLazy5] o.a.s.c.SolrCore New index directory detected: old=null new=C:\Users\JenkinsSlave\workspace\Lucene-Solr-5.x-Windows\solr\build\solr-core\test\J0\temp\solr.core.TestLazyCores_E41DD6B1308F3792-001\tempDir-001\collection5\data\index/
   [junit4]   2> 1400650 WARN  (coreLoadExecutor-4745-thread-3) [    x:collectionLazy5] o.a.s.c.SolrCore [collectionLazy5] Solr index directory 'C:\Users\JenkinsSlave\workspace\Lucene-Solr-5.x-Windows\solr\build\solr-core\test\J0\temp\solr.core.TestLazyCores_E41DD6B1308F3792-001\tempDir-001\collection5\data\index' doesn't exist. Creating new index...
   [junit4]   2> 1400651 INFO  (coreLoadExecutor-4745-thread-3) [    x:collectionLazy5] o.a.s.c.CachingDirectoryFactory return new directory for C:\Users\JenkinsSlave\workspace\Lucene-Solr-5.x-Windows\solr\build\solr-core\test\J0\temp\solr.core.TestLazyCores_E41DD6B1308F3792-001\tempDir-001\collection5\data\index
   [junit4]   2> 1400651 INFO  (coreLoadExecutor-4745-thread-3) [    x:collectionLazy5] o.a.s.u.RandomMergePolicy RandomMergePolicy wrapping class org.apache.lucene.index.TieredMergePolicy: [TieredMergePolicy: maxMergeAtOnce=44, maxMergeAtOnceExplicit=25, maxMergedSegmentMB=96.0869140625, floorSegmentMB=0.701171875, forceMergeDeletesPctAllowed=7.881921496790701, segmentsPerTier=50.0, maxCFSSegmentSizeMB=8.796093022207999E12, noCFSRatio=0.0
   [junit4]   2> 1400651 INFO  (coreLoadExecutor-4745-thread-3) [    x:collectionLazy5] o.a.s.c.SolrCore SolrDeletionPolicy.onCommit: commits: num=1
   [junit4]   2> 	commit{dir=MockDirectoryWrapper(RAMDirectory@4e96b804 lockFactory=org.apache.lucene.store.SingleInstanceLockFactory@8d12ed7),segFN=segments_1,generation=1}
   [junit4]   2> 1400651 INFO  (coreLoadExecutor-4745-thread-3) [    x:collectionLazy5] o.a.s.c.SolrCore newest commit generation = 1
   [junit4]   2> 1400652 INFO  (coreLoadExecutor-4745-thread-2) [    ] o.a.s.c.Config Loaded SolrConfig: solrconfig.xml
   [junit4]   2> 1400652 INFO  (coreLoadExecutor-4745-thread-1) [    x:collection1] o.a.s.c.SolrCore no updateRequestProcessorChain defined as default, creating implicit default
   [junit4]   2> 1400654 INFO  (coreLoadExecutor-4745-thread-3) [    x:collectionLazy5] o.a.s.c.SolrCore no updateRequestProcessorChain defined as default, creating implicit default
   [junit4]   2> 1400655 INFO  (coreLoadExecutor-4745-thread-2) [    ] o.a.s.s.IndexSchema Reading Solr Schema from C:\Users\JenkinsSlave\workspace\Lucene-Solr-5.x-Windows\solr\build\solr-core\test\J0\temp\solr.core.TestLazyCores_E41DD6B1308F3792-001\tempDir-001\collection2\conf\schema.xml
   [junit4]   2> 1400656 INFO  (coreLoadExecutor-4745-thread-3) [    x:collectionLazy5] o.a.s.h.l.XMLLoader xsltCacheLifetimeSeconds=60
   [junit4]   2> 1400657 INFO  (coreLoadExecutor-4745-thread-3) [    x:collectionLazy5] o.a.s.h.l.XMLLoader xsltCacheLifetimeSeconds=60
   [junit4]   2> 1400658 INFO  (coreLoadExecutor-4745-thread-2) [    ] o.a.s.s.IndexSchema [collectionLazy2] Schema name=tiny
   [junit4]   2> 1400658 INFO  (coreLoadExecutor-4745-thread-3) [    x:collectionLazy5] o.a.s.h.l.XMLLoader xsltCacheLifetimeSeconds=60
   [junit4]   2> 1400659 INFO  (coreLoadExecutor-4745-thread-2) [    ] o.a.s.s.IndexSchema unique key field: id
   [junit4]   2> 1400659 INFO  (coreLoadExecutor-4745-thread-2) [    ] o.a.s.c.ConfigSetProperties Did not find ConfigSet properties, assuming default properties: Can't find resource 'configsetprops.json' in classpath or 'C:\Users\JenkinsSlave\workspace\Lucene-Solr-5.x-Windows\solr\build\solr-core\test\J0\temp\solr.core.TestLazyCores_E41DD6B1308F3792-001\tempDir-001\collection2\conf'
   [junit4]   2> 1400660 INFO  (coreLoadExecutor-4745-thread-2) [    ] o.a.s.c.CoreContainer Creating SolrCore 'collectionLazy2' using configuration from instancedir C:\Users\JenkinsSlave\workspace\Lucene-Solr-5.x-Windows\solr\build\solr-core\test\J0\temp\solr.core.TestLazyCores_E41DD6B1308F3792-001\tempDir-001\collection2\
   [junit4]   2> 1400660 INFO  (coreLoadExecutor-4745-thread-2) [    x:collectionLazy2] o.a.s.c.SolrCore org.apache.solr.core.MockDirectoryFactory
   [junit4]   2> 1400660 INFO  (coreLoadExecutor-4745-thread-2) [    x:collectionLazy2] o.a.s.c.SolrCore [[collectionLazy2] ] Opening new SolrCore at [C:\Users\JenkinsSlave\workspace\Lucene-Solr-5.x-Windows\solr\build\solr-core\test\J0\temp\solr.core.TestLazyCores_E41DD6B1308F3792-001\tempDir-001\collection2\], dataDir=[null]
   [junit4]   2> 1400660 INFO  (coreLoadExecutor-4745-thread-2) [    x:collectionLazy2] o.a.s.c.SolrCore JMX monitoring not detected for core: collectionLazy2
   [junit4]   2> 1400660 INFO  (coreLoadExecutor-4745-thread-2) [    x:collectionLazy2] o.a.s.c.CachingDirectoryFactory return new directory for C:\Users\JenkinsSlave\workspace\Lucene-Solr-5.x-Windows\solr\build\solr-core\test\J0\temp\solr.core.TestLazyCores_E41DD6B1308F3792-001\tempDir-001\collection2\data\
   [junit4]   2> 1400661 INFO  (OldIndexDirectoryCleanupThreadForCore-collection1) [    x:collection1] o.a.s.c.SolrCore Looking for old index directories to cleanup for core collection1 in C:\Users\JenkinsSlave\workspace\Lucene-Solr-5.x-Windows\solr\build\solr-core\test\J0\temp\solr.core.TestLazyCores_E41DD6B1308F3792-001\tempDir-001\collection1\data\
   [junit4]   2> 1400661 INFO  (coreLoadExecutor-4745-thread-1) [    x:collection1] o.a.s.h.l.XMLLoader xsltCacheLifetimeSeconds=60
   [junit4]   2> 1400661 WARN  (OldIndexDirectoryCleanupThreadForCore-collection1) [    x:collection1] o.a.s.c.DirectoryFactory C:\Users\JenkinsSlave\workspace\Lucene-Solr-5.x-Windows\solr\build\solr-core\test\J0\temp\solr.core.TestLazyCores_E41DD6B1308F3792-001\tempDir-001\collection1\data\ does not point to a valid data directory; skipping clean-up of old index directories.
   [junit4]   2> 1400662 INFO  (coreLoadExecutor-4745-thread-1) [    x:collection1] o.a.s.h.l.XMLLoader xsltCacheLifetimeSeconds=60
   [junit4]   2> 1400663 INFO  (coreLoadExecutor-4745-thread-1) [    x:collection1] o.a.s.h.l.XMLLoader xsltCacheLifetimeSeconds=60
   [junit4]   2> 1400663 INFO  (coreLoadExecutor-4745-thread-2) [    x:collectionLazy2] o.a.s.c.SolrCore New index directory detected: old=null new=C:\Users\JenkinsSlave\workspace\Lucene-Solr-5.x-Windows\solr\build\solr-core\test\J0\temp\solr.core.TestLazyCores_E41DD6B1308F3792-001\tempDir-001\collection2\data\index/
   [junit4]   2> 1400663 WARN  (coreLoadExecutor-4745-thread-2) [    x:collectionLazy2] o.a.s.c.SolrCore [collectionLazy2] Solr index directory 'C:\Users\JenkinsSlave\workspace\Lucene-Solr-5.x-Windows\solr\build\solr-core\test\J0\temp\solr.core.TestLazyCores_E41DD6B1308F3792-001\tempDir-001\collection2\data\index' doesn't exist. Creating new index...
   [junit4]   2> 1400664 INFO  (coreLoadExecutor-4745-thread-2) [    x:collectionLazy2] o.a.s.c.CachingDirectoryFactory return new directory for C:\Users\JenkinsSlave\workspace\Lucene-Solr-5.x-Windows\solr\build\solr-core\test\J0\temp\solr.core.TestLazyCores_E41DD6B1308F3792-001\tempDir-001\collection2\data\index
   [junit4]   2> 1400664 INFO  (coreLoadExecutor-4745-thread-1) [    x:collection1] o.a.s.h.l.XMLLoader xsltCacheLifetimeSeconds=60
   [junit4]   2> 1400664 INFO  (coreLoadExecutor-4745-thread-2) [    x:collectionLazy2] o.a.s.u.RandomMergePolicy RandomMergePolicy wrapping class org.apache.lucene.index.TieredMergePolicy: [TieredMergePolicy: maxMergeAtOnce=44, maxMergeAtOnceExplicit=25, maxMergedSegmentMB=96.0869140625, floorSegmentMB=0.701171875, forceMergeDeletesPctAllowed=7.881921496790701, segmentsPerTier=50.0, maxCFSSegmentSizeMB=8.796093022207999E12, noCFSRatio=0.0
   [junit4]   2> 1400664 INFO  (coreLoadExecutor-4745-thread-2) [    x:collectionLazy2] o.a.s.c.SolrCore SolrDeletionPolicy.onCommit: commits: num=1
   [junit4]   2> 	commit{dir=MockDirectoryWrapper(RAMDirectory@18008904 lockFactory=org.apache.lucene.store.SingleInstanceLockFactory@2cac2f0c),segFN=segments_1,generation=1}
   [junit4]   2> 1400664 INFO  (coreLoadExecutor-4745-thread-2) [    x:collectionLazy2] o.a.s.c.SolrCore newest commit generation = 1
   [junit4]   2> 1400664 INFO  (coreLoadExecutor-4745-thread-3) [    x:collectionLazy5] o.a.s.h.l.XMLLoader xsltCacheLifetimeSeconds=60
   [junit4]   2> 1400665 INFO  (coreLoadExecutor-4745-thread-1) [    x:collection1] o.a.s.c.RequestHandlers Registered paths: /admin/mbeans,/update/csv,/update/json/docs,/admin/luke,/select,/admin/segments,/get,/admin/system,/replication,/admin/properties,/config,/schema,/admin/plugins,/admin/logging,/update/json,/admin/threads,/admin/ping,/update,/admin/file
   [junit4]   2> 1400665 INFO  (coreLoadExecutor-4745-thread-1) [    x:collection1] o.a.s.c.SolrCore Using default statsCache cache: org.apache.solr.search.stats.LocalStatsCache
   [junit4]   2> 1400666 INFO  (OldIndexDirectoryCleanupThreadForCore-collectionLazy5) [    x:collectionLazy5] o.a.s.c.SolrCore Looking for old index directories to cleanup for core collectionLazy5 in C:\Users\JenkinsSlave\workspace\Lucene-Solr-5.x-Windows\solr\build\solr-core\test\J0\temp\solr.core.TestLazyCores_E41DD6B1308F3792-001\tempDir-001\collection5\data\
   [junit4]   2> 1400667 WARN  (OldIndexDirectoryCleanupThreadForCore-collectionLazy5) [    x:collectionLazy5] o.a.s.c.DirectoryFactory C:\Users\JenkinsSlave\workspace\Lucene-Solr-5.x-Windows\solr\build\solr-core\test\J0\temp\solr.core.TestLazyCores_E41DD6B1308F3792-001\tempDir-001\collection5\data\ does not point to a valid data directory; skipping clean-up of old index directories.
   [junit4]   2> 1400667 INFO  (coreLoadExecutor-4745-thread-2) [    x:collectionLazy2] o.a.s.c.SolrCore no updateRequestProcessorChain defined as default, creating implicit default
   [junit4]   2> 1400666 INFO  (coreLoadExecutor-4745-thread-1) [    x:collection1] o.a.s.c.SolrCore Hard AutoCommit: disabled
   [junit4]   2> 1400669 INFO  (coreLoadExecutor-4745-thread-1) [    x:collection1] o.a.s.c.SolrCore Soft AutoCommit: disabled
   [junit4]   2> 1400669 INFO  (coreLoadExecutor-4745-thread-1) [    x:collection1] o.a.s.u.RandomMergePolicy RandomMergePolicy wrapping class org.apache.lucene.index.LogDocMergePolicy: [LogDocMergePolicy: minMergeSize=1000, mergeFactor=49, maxMergeSize=9223372036854775807, maxMergeSizeForForcedMerge=9223372036854775807, calibrateSizeByDeletes=false, maxMergeDocs=2147483647, maxCFSSegmentSizeMB=8.796093022207999E12, noCFSRatio=1.0]
   [junit4]   2> 1400669 INFO  (coreLoadExecutor-4745-thread-2) [    x:collectionLazy2] o.a.s.h.l.XMLLoader xsltCacheLifetimeSeconds=60
   [junit4]   2> 1400670 INFO  (coreLoadExecutor-4745-thread-1) [    x:collection1] o.a.s.c.SolrCore SolrDeletionPolicy.onInit: commits: num=1
   [junit4]   2> 	commit{dir=MockDirectoryWrapper(RAMDirectory@b3e05ba lockFactory=org.apache.lucene.store.SingleInstanceLockFactory@50ace0b6),segFN=segments_1,generation=1}
   [junit4]   2> 1400670 INFO  (coreLoadExecutor-4745-thread-1) [    x:collection1] o.a.s.c.SolrCore newest commit generation = 1
   [junit4]   2> 1400670 INFO  (coreLoadExecutor-4745-thread-1) [    x:collection1] o.a.s.s.SolrIndexSearcher Opening Searcher@187bc4dc[collection1] main
   [junit4]   2> 1400670 INFO  (coreLoadExecutor-4745-thread-3) [    x:collectionLazy5] o.a.s.c.RequestHandlers Registered paths: /admin/mbeans,/update/csv,/update/json/docs,/admin/luke,/select,/admin/segments,/get,/admin/system,/replication,/admin/properties,/config,/schema,/admin/plugins,/admin/logging,/update/json,/admin/threads,/admin/ping,/update,/admin/file
   [junit4]   2> 1400670 INFO  (coreLoadExecutor-4745-thread-3) [    x:collectionLazy5] o.a.s.c.SolrCore Using default statsCache cache: org.apache.solr.search.stats.LocalStatsCache
   [junit4]   2> 1400670 INFO  (coreLoadExecutor-4745-thread-1) [    x:collection1] o.a.s.r.ManagedResourceStorage File-based storage initialized to use dir: C:\Users\JenkinsSlave\workspace\Lucene-Solr-5.x-Windows\solr\build\solr-core\test\J0\temp\solr.core.TestLazyCores_E41DD6B1308F3792-001\tempDir-001\collection1\conf
   [junit4]   2> 1400671 INFO  (coreLoadExecutor-4745-thread-1) [    x:collection1] o.a.s.r.RestManager Initializing RestManager with initArgs: {storageDir=C:\Users\JenkinsSlave\workspace\Lucene-Solr-5.x-Windows\solr\build\solr-core\test\J0\temp\solr.core.TestLazyCores_E41DD6B1308F3792-001\tempDir-001\collection1\conf}
   [junit4]   2> 1400671 INFO  (coreLoadExecutor-4745-thread-1) [    x:collection1] o.a.s.r.ManagedResourceStorage Reading _rest_managed.json using file:dir=C:\Users\JenkinsSlave\workspace\Lucene-Solr-5.x-Windows\solr\build\solr-core\test\J0\temp\solr.core.TestLazyCores_E41DD6B1308F3792-001\tempDir-001\collection1\conf
   [junit4]   2> 1400671 INFO  (coreLoadExecutor-4745-thread-2) [    x:collectionLazy2] o.a.s.h.l.XMLLoader xsltCacheLifetimeSeconds=60
   [junit4]   2> 1400671 INFO  (coreLoadExecutor-4745-thread-1) [    x:collection1] o.a.s.r.RestManager Initializing 0 registered ManagedResources
   [junit4]   2> 1400671 INFO  (coreLoadExecutor-4745-thread-1) [    x:collection1] o.a.s.h.ReplicationHandler Commits will be reserved for  10000
   [junit4]   2> 1400666 INFO  (OldIndexDirectoryCleanupThreadForCore-collectionLazy2) [    x:collectionLazy2] o.a.s.c.SolrCore Looking for old index directories to cleanup for core collectionLazy2 in C:\Users\JenkinsSlave\workspace\Lucene-Solr-5.x-Windows\solr\build\solr-core\test\J0\temp\solr.core.TestLazyCores_E41DD6B1308F3792-001\tempDir-001\collection2\data\
   [junit4]   2> 1400672 WARN  (OldIndexDirectoryCleanupThreadForCore-collectionLazy2) [    x:collectionLazy2] o.a.s.c.DirectoryFactory C:\Users\JenkinsSlave\workspace\Lucene-Solr-5.x-Windows\solr\build\solr-core\test\J0\temp\solr.core.TestLazyCores_E41DD6B1308F3792-001\tempDir-001\collection2\data\ does not point to a valid data directory; skipping clean-up of old index directories.
   [junit4]   2> 1400672 INFO  (coreLoadExecutor-4745-thread-2) [    x:collectionLazy2] o.a.s.h.l.XMLLoader xsltCacheLifetimeSeconds=60
   [junit4]   2> 1400672 INFO  (coreLoadExecutor-4745-thread-3) [    x:collectionLazy5] o.a.s.c.SolrCore Hard AutoCommit: disabled
   [junit4]   2> 1400672 INFO  (coreLoadExecutor-4745-thread-3) [    x:collectionLazy5] o.a.s.c.SolrCore Soft AutoCommit: disabled
   [junit4]   2> 1400673 INFO  (coreLoadExecutor-4745-thread-3) [    x:collectionLazy5] o.a.s.u.RandomMergePolicy RandomMergePolicy wrapping class org.apache.lucene.index.LogDocMergePolicy: [LogDocMergePolicy: minMergeSize=1000, mergeFactor=49, maxMergeSize=9223372036854775807, maxMergeSizeForForcedMerge=9223372036854775807, calibrateSizeByDeletes=false, maxMergeDocs=2147483647, maxCFSSegmentSizeMB=8.796093022207999E12, noCFSRatio=1.0]
   [junit4]   2> 1400673 INFO  (coreLoadExecutor-4745-thread-3) [    x:collectionLazy5] o.a.s.c.SolrCore SolrDeletionPolicy.onInit: commits: num=1
   [junit4]   2> 	commit{dir=MockDirectoryWrapper(RAMDirectory@4e96b804 lockFactory=org.apache.lucene.store.SingleInstanceLockFactory@8d12ed7),segFN=segments_1,generation=1}
   [junit4]   2> 1400673 INFO  (coreLoadExecutor-4745-thread-3) [    x:collectionLazy5] o.a.s.c.SolrCore newest commit generation = 1
   [junit4]   2> 1400673 INFO  (coreLoadExecutor-4745-thread-3) [    x:collectionLazy5] o.a.s.s.SolrIndexSearcher Opening Searcher@776db666[collectionLazy5] main
   [junit4]   2> 1400673 INFO  (coreLoadExecutor-4745-thread-2) [    x:collectionLazy2] o.a.s.h.l.XMLLoader xsltCacheLifetimeSeconds=60
   [junit4]   2> 1400674 INFO  (coreLoadExecutor-4745-thread-3) [    x:collectionLazy5] o.a.s.r.ManagedResourceStorage File-based storage initialized to use dir: C:\Users\JenkinsSlave\workspace\Lucene-Solr-5.x-Windows\solr\build\solr-core\test\J0\temp\solr.core.TestLazyCores_E41DD6B1308F3792-001\tempDir-001\collection5\conf
   [junit4]   2> 1400674 INFO  (coreLoadExecutor-4745-thread-3) [    x:collectionLazy5] o.a.s.r.RestManager Initializing RestManager with initArgs: {storageDir=C:\Users\JenkinsSlave\workspace\Lucene-Solr-5.x-Windows\solr\build\solr-core\test\J0\temp\solr.core.TestLazyCores_E41DD6B1308F3792-001\tempDir-001\collection5\conf}
   [junit4]   2> 1400674 INFO  (coreLoadExecutor-4745-thread-3) [    x:collectionLazy5] o.a.s.r.ManagedResourceStorage Reading _rest_managed.json using file:dir=C:\Users\JenkinsSlave\workspace\Lucene-Solr-5.x-Windows\solr\build\solr-core\test\J0\temp\solr.core.TestLazyCores_E41DD6B1308F3792-001\tempDir-001\collection5\conf
   [junit4]   2> 1400674 INFO  (searcherExecutor-4746-thread-1-processing-x:collection1) [    x:collection1] o.a.s.c.SolrCore [collection1] Registered new searcher Searcher@187bc4dc[collection1] main{ExitableDirectoryReader(UninvertingDirectoryReader())}
   [junit4]   2> 1400674 INFO  (coreLoadExecutor-4745-thread-1) [    x:collection1] o.a.s.c.CoreContainer registering core: collection1
   [junit4]   2> 1400675 INFO  (coreLoadExecutor-4745-thread-2) [    x:collectionLazy2] o.a.s.c.RequestHandlers Registered paths: /admin/mbeans,/update/csv,/update/json/docs,/admin/luke,/select,/admin/segments,/get,/admin/system,/replication,/admin/properties,/config,/schema,/admin/plugins,/admin/logging,/update/json,/admin/threads,/admin/ping,/update,/admin/file
   [junit4]   2> 1400675 INFO  (coreLoadExecutor-4745-thread-2) [    x:collectionLazy2] o.a.s.c.SolrCore Using default statsCache cache: org.apache.solr.search.stats.LocalStatsCache
   [junit4]   2> 1400676 INFO  (coreLoadExecutor-4745-thread-3) [    x:collectionLazy5] o.a.s.r.RestManager Initializing 0 registered ManagedResources
   [junit4]   2> 1400676 INFO  (coreLoadExecutor-4745-thread-3) [    x:collectionLazy5] o.a.s.h.ReplicationHandler Commits will be reserved for  10000
   [junit4]   2> 1400676 INFO  (coreLoadExecutor-4745-thread-2) [    x:collectionLazy2] o.a.s.c.SolrCore Hard AutoCommit: disabled
   [junit4]   2> 1400676 INFO  (coreLoadExecutor-4745-thread-3) [    x:collectionLazy5] o.a.s.c.CoreContainer registering core: collectionLazy5
   [junit4]   2> 1400676 INFO  (searcherExecutor-4747-thread-1-processing-x:collectionLazy5) [    x:collectionLazy5] o.a.s.c.SolrCore [collectionLazy5] Registered new searcher Searcher@776db666[collectionLazy5] main{ExitableDirectoryReader(UninvertingDirectoryReader())}
   [junit4]   2> 1400676 INFO  (coreLoadExecutor-4745-thread-2) [    x:collectionLazy2] o.a.s.c.SolrCore Soft AutoCommit: disabled
   [junit4]   2> 1400676 INFO  (coreLoadExecutor-4745-thread-2) [    x:collectionLazy2] o.a.s.u.RandomMergePolicy RandomMergePolicy wrapping class org.apache.lucene.index.LogDocMergePolicy: [LogDocMergePolicy: minMergeSize=1000, mergeFactor=49, maxMergeSize=9223372036854775807, maxMergeSizeForForcedMerge=9223372036854775807, calibrateSizeByDeletes=false, maxMergeDocs=2147483647, maxCFSSegmentSizeMB=8.796093022207999E12, noCFSRatio=1.0]
   [junit4]   2> 1400677 INFO  (coreLoadExecutor-4745-thread-2) [    x:collectionLazy2] o.a.s.c.SolrCore SolrDeletionPolicy.onInit: commits: num=1
   [junit4]   2> 	commit{dir=MockDirectoryWrapper(RAMDirectory@18008904 lockFactory=org.apache.lucene.store.SingleInstanceLockFactory@2cac2f0c),segFN=segments_1,generation=1}
   [junit4]   2> 1400677 INFO  (coreLoadExecutor-4745-thread-2) [    x:collectionLazy2] o.a.s.c.SolrCore newest commit generation = 1
   [junit4]   2> 1400677 INFO  (coreLoadExecutor-4745-thread-2) [    x:collectionLazy2] o.a.s.s.SolrIndexSearcher Opening Searcher@3b0023b4[collectionLazy2] main
   [junit4]   2> 1400678 INFO  (coreLoadExecutor-4745-thread-2) [    x:collectionLazy2] o.a.s.r.ManagedResourceStorage File-based storage initialized to use dir: C:\Users\JenkinsSlave\workspace\Lucene-Solr-5.x-Windows\solr\build\solr-core\test\J0\temp\solr.core.TestLazyCores_E41DD6B1308F3792-001\tempDir-001\collection2\conf
   [junit4]   2> 1400678 INFO  (coreLoadExecutor-4745-thread-2) [    x:collectionLazy2] o.a.s.r.RestManager Initializing RestManager with initArgs: {storageDir=C:\Users\JenkinsSlave\workspace\Lucene-Solr-5.x-Windows\solr\build\solr-core\test\J0\temp\solr.core.TestLazyCores_E41DD6B1308F3792-001\tempDir-001\collection2\conf}
   [junit4]   2> 1400678 INFO  (coreLoadExecutor-4745-thread-2) [    x:collectionLazy2] o.a.s.r.ManagedResourceStorage Reading _rest_managed.json using file:dir=C:\Users\JenkinsSlave\workspace\Lucene-Solr-5.x-Windows\solr\build\solr-core\test\J0\temp\solr.core.TestLazyCores_E41DD6B1308F3792-001\tempDir-001\collection2\conf
   [junit4]   2> 1400678 INFO  (coreLoadExecutor-4745-thread-2) [    x:collectionLazy2] o.a.s.r.RestManager Initializing 0 registered ManagedResources
   [junit4]   2> 1400678 INFO  (coreLoadExecutor-4745-thread-2) [    x:collectionLazy2] o.a.s.h.ReplicationHandler Commits will be reserved for  10000
   [junit4]   2> 1400678 INFO  (searcherExecutor-4748-thread-1-processing-x:collectionLazy2) [    x:collectionLazy2] o.a.s.c.SolrCore [collectionLazy2] Registered new searcher Searcher@3b0023b4[collectionLazy2] main{ExitableDirectoryReader(UninvertingDirectoryReader())}
   [junit4]   2> 1400678 INFO  (coreLoadExecutor-4745-thread-2) [    x:collectionLazy2] o.a.s.c.CoreContainer Opening transient core collectionLazy2
   [junit4]   2> 1400679 INFO  (coreLoadExecutor-4745-thread-2) [    x:collectionLazy2] o.a.s.c.CoreContainer registering core: collectionLazy2
   [junit4]   2> 1400680 INFO  (TEST-TestLazyCores.testCachingLimit-seed#[E41DD6B1308F3792]) [    ] o.a.s.c.SolrResourceLoader new SolrResourceLoader for directory: 'C:\Users\JenkinsSlave\workspace\Lucene-Solr-5.x-Windows\solr\build\solr-core\test\J0\temp\solr.core.TestLazyCores_E41DD6B1308F3792-001\tempDir-001\collection3\'
   [junit4]   2> 1400703 INFO  (TEST-TestLazyCores.testCachingLimit-seed#[E41DD6B1308F3792]) [    ] o.a.s.c.SolrConfig current version of requestparams : -1
   [junit4]   2> 1400706 INFO  (TEST-TestLazyCores.testCachingLimit-seed#[E41DD6B1308F3792]) [    ] o.a.s.c.SolrConfig Using Lucene MatchVersion: 5.3.0
   [junit4]   2> 1400711 INFO  (TEST-TestLazyCores.testCachingLimit-seed#[E41DD6B1308F3792]) [    ] o.a.s.c.Config Loaded SolrConfig: solrconfig.xml
   [junit4]   2> 1400712 INFO  (TEST-TestLazyCores.testCachingLimit-seed#[E41DD6B1308F3792]) [    ] o.a.s.s.IndexSchema Reading Solr Schema from C:\Users\JenkinsSlave\workspace\Lucene-Solr-5.x-Windows\solr\build\solr-core\test\J0\temp\solr.core.TestLazyCores_E41DD6B1308F3792-001\tempDir-001\collection3\conf\schema.xml
   [junit4]   2> 1400715 INFO  (TEST-TestLazyCores.testCachingLimit-seed#[E41DD6B1308F3792]) [    ] o.a.s.s.IndexSchema [collectionLazy3] Schema name=tiny
   [junit4]   2> 1400717 INFO  (TEST-TestLazyCores.testCachingLimit-seed#[E41DD6B1308F3792]) [    ] o.a.s.s.IndexSchema unique key field: id
   [junit4]   2> 1400719 INFO  (TEST-TestLazyCores.testCachingLimit-seed#[E41DD6B1308F3792]) [    ] o.a.s.c.ConfigSetProperties Did not find ConfigSet properties, assuming default properties: Can't find resource 'configsetprops.json' in classpath or 'C:\Users\JenkinsSlave\workspace\Lucene-Solr-5.x-Windows\solr\build\solr-core\test\J0\temp\solr.core.TestLazyCores_E41DD6B1308F3792-001\tempDir-001\collection3\conf'
   [junit4]   2> 1400719 INFO  (TEST-TestLazyCores.testCachingLimit-seed#[E41DD6B1308F3792]) [    ] o.a.s.c.CoreContainer Creating SolrCore 'collectionLazy3' using configuration from instancedir C:\Users\JenkinsSlave\workspace\Lucene-Solr-5.x-Windows\solr\build\solr-core\test\J0\temp\solr.core.TestLazyCores_E41DD6B1308F3792-001\tempDir-001\collection3\
   [junit4]   2> 1400719 INFO  (TEST-TestLazyCores.testCachingLimit-seed#[E41DD6B1308F3792]) [    x:collectionLazy3] o.a.s.c.SolrCore org.apache.solr.core.MockDirectoryFactory
   [junit4]   2> 1400719 INFO  (TEST-TestLazyCores.testCachingLimit-seed#[E41DD6B1308F3792]) [    x:collectionLazy3] o.a.s.c.SolrCore [[collectionLazy3] ] Opening new SolrCore at [C:\Users\JenkinsSlave\workspace\Lucene-Solr-5.x-Windows\solr\build\solr-core\test\J0\temp\solr.core.TestLazyCores_E41DD6B1308F3792-001\tempDir-001\collection3\], dataDir=[null]
   [junit4]   2> 1400720 INFO  (TEST-TestLazyCores.testCachingLimit-seed#[E41DD6B1308F3792]) [    x:collectionLazy3] o.a.s.c.SolrCore JMX monitoring not detected for core: collectionLazy3
   [junit4]   2> 1400720 INFO  (TEST-TestLazyCores.testCachingLimit-seed#[E41DD6B1308F3792]) [    x:collectionLazy3] o.a.s.c.CachingDirectoryFactory return new directory for C:\Users\JenkinsSlave\workspace\Lucene-Solr-5.x-Windows\solr\build\solr-core\test\J0\temp\solr.core.TestLazyCores_E41DD6B1308F3792-001\tempDir-001\collection3\data\
   [junit4]   2> 1400720 INFO  (TEST-TestLazyCores.testCachingLimit-seed#[E41DD6B1308F3792]) [    x:collectionLazy3] o.a.s.c.SolrCore New index directory detected: old=null new=C:\Users\JenkinsSlave\workspace\Lucene-Solr-5.x-Windows\solr\build\solr-core\test\J0\temp\solr.core.TestLazyCores_E41DD6B1308F3792-001\tempDir-001\collection3\data\index/
   [junit4]   2> 1400721 WARN  (TEST-TestLazyCores.testCachingLimit-seed#[E41DD6B1308F3792]) [    x:collectionLazy3] o.a.s.c.SolrCore [collectionLazy3] Solr index directory 'C:\Users\JenkinsSlave\workspace\Lucene-Solr-5.x-Windows\solr\build\solr-core\test\J0\temp\solr.core.TestLazyCores_E41DD6B1308F3792-001\tempDir-001\collection3\data\index' doesn't exist. Creating new index...
   [junit4]   2> 1400721 INFO  (TEST-TestLazyCores.testCachingLimit-seed#[E41DD6B1308F3792]) [    x:collectionLazy3] o.a.s.c.CachingDirectoryFactory return new directory for C:\Users\JenkinsSlave\workspace\Lucene-Solr-5.x-Windows\solr\build\solr-core\test\J0\temp\solr.core.TestLazyCores_E41DD6B1308F3792-001\tempDir-001\collection3\data\index
   [junit4]   2> 1400721 INFO  (TEST-TestLazyCores.testCachingLimit-seed#[E41DD6B1308F3792]) [    x:collectionLazy3] o.a.s.u.RandomMergePolicy RandomMergePolicy wrapping class org.apache.lucene.index.TieredMergePolicy: [TieredMergePolicy: maxMergeAtOnce=39, maxMergeAtOnceExplicit=35, maxMergedSegmentMB=99.908203125, floorSegmentMB=0.8935546875, forceMergeDeletesPctAllowed=12.730908441470575, segmentsPerTier=50.0, maxCFSSegmentSizeMB=8.796093022207999E12, noCFSRatio=1.0
   [junit4]   2> 1400722 INFO  (TEST-TestLazyCores.testCachingLimit-seed#[E41DD6B1308F3792]) [    x:collectionLazy3] o.a.s.c.SolrCore SolrDeletionPolicy.onCommit: commits: num=1
   [junit4]   2> 	commit{dir=MockDirectoryWrapper(RAMDirectory@38bae193 lockFactory=org.apache.lucene.store.SingleInstanceLockFactory@caba81b),segFN=segments_1,generation=1}
   [junit4]   2> 1400722 INFO  (TEST-TestLazyCores.testCachingLimit-seed#[E41DD6B1308F3792]) [    x:collectionLazy3] o.a.s.c.SolrCore newest commit generation = 1
   [junit4]   2> 1400725 INFO  (TEST-TestLazyCores.testCachingLimit-seed#[E41DD6B1308F3792]) [    x:collectionLazy3] o.a.s.c.SolrCore no updateRequestProcessorChain defined as default, creating implicit default
   [junit4]   2> 1400726 INFO  (TEST-TestLazyCores.testCachingLimit-seed#[E41DD6B1308F3792]) [    x:collectionLazy3] o.a.s.h.l.XMLLoader xsltCacheLifetimeSeconds=60
   [junit4]   2> 1400728 INFO  (TEST-TestLazyCores.testCachingLimit-seed#[E41DD6B1308F3792]) [    x:collectionLazy3] o.a.s.h.l.XMLLoader xsltCacheLifetimeSeconds=60
   [junit4]   2> 1400729 INFO  (TEST-TestLazyCores.testCachingLimit-seed#[E41DD6B1308F3792]) [    x:collectionLazy3] o.a.s.h.l.XMLLoader xsltCacheLifetimeSeconds=60
   [junit4]   2> 1400731 INFO  (TEST-TestLazyCores.testCachingLimit-seed#[E41DD6B1308F3792]) [    x:collectionLazy3] o.a.s.h.l.XMLLoader xsltCacheLifetimeSeconds=60
   [junit4]   2> 1400732 INFO  (TEST-TestLazyCores.testCachingLimit-seed#[E41DD6B1308F3792]) [    x:collectionLazy3] o.a.s.c.RequestHandlers Registered paths: /admin/mbeans,/update/csv,/update/json/docs,/admin/luke,/select,/admin/segments,/get,/admin/system,/replication,/admin/properties,/config,/schema,/admin/plugins,/admin/logging,/update/json,/admin/threads,/admin/ping,/update,/admin/file
   [junit4]   2> 1400733 INFO  (OldIndexDirectoryCleanupThreadForCore-collectionLazy3) [    x:collectionLazy3] o.a.s.c.SolrCore Looking for old index directories to cleanup for core collectionLazy3 in C:\Users\JenkinsSlave\workspace\Lucene-Solr-5.x-Windows\solr\build\solr-core\test\J0\temp\solr.core.TestLazyCores_E41DD6B1308F3792-001\tempDir-001\collection3\data\
   [junit4]   2> 1400733 INFO  (TEST-TestLazyCores.testCachingLimit-seed#[E41DD6B1308F3792]) [    x:collectionLazy3] o.a.s.c.SolrCore Using default statsCache cache: org.apache.solr.search.stats.LocalStatsCache
   [junit4]   2> 1400733 WARN  (OldIndexDirectoryCleanupThreadForCore-collectionLazy3) [    x:collectionLazy3] o.a.s.c.DirectoryFactory C:\Users\JenkinsSlave\workspace\Lucene-Solr-5.x-Windows\solr\build\solr-core\test\J0\temp\solr.core.TestLazyCores_E41DD6B1308F3792-001\tempDir-001\collection3\data\ does not point to a valid data directory; skipping clean-up of old index directories.
   [junit4]   2> 1400733 INFO  (TEST-TestLazyCores.testCachingLimit-seed#[E41DD6B1308F3792]) [    x:collectionLazy3] o.a.s.c.SolrCore Hard AutoCommit: disabled
   [junit4]   2> 1400734 INFO  (TEST-TestLazyCores.testCachingLimit-seed#[E41DD6B1308F3792]) [    x:collectionLazy3] o.a.s.c.SolrCore Soft AutoCommit: disabled
   [junit4]   2> 1400736 INFO  (TEST-TestLazyCores.testCachingLimit-seed#[E41DD6B1308F3792]) [    x:collectionLazy3] o.a.s.u.RandomMergePolicy RandomMergePolicy wrapping class org.apache.lucene.index.LogDocMergePolicy: [LogDocMergePolicy: minMergeSize=1000, mergeFactor=46, maxMergeSize=9223372036854775807, maxMergeSizeForForcedMerge=9223372036854775807, calibrateSizeByDeletes=true, maxMergeDocs=2147483647, maxCFSSegmentSizeMB=8.796093022207999E12, noCFSRatio=0.7950678445840756]
   [junit4]   2> 1400737 INFO  (TEST-TestLazyCores.testCachingLimit-seed#[E41DD6B1308F3792]) [    x:collectionLazy3] o.a.s.c.SolrCore SolrDeletionPolicy.onInit: commits: num=1
   [junit4]   2> 	commit{dir=MockDirectoryWrapper(RAMDirectory@38bae193 lockFactory=org.apache.lucene.store.SingleInstanceLockFactory@caba81b),segFN=segments_1,generation=1}
   [junit4]   2> 1400737 INFO  (TEST-TestLazyCores.testCachingLimit-seed#[E41DD6B1308F3792]) [    x:collectionLazy3] o.a.s.c.SolrCore newest commit generation = 1
   [junit4]   2> 1400737 INFO  (TEST-TestLazyCores.testCachingLimit-seed#[E41DD6B1308F3792]) [    x:collectionLazy3] o.a.s.s.SolrIndexSearcher Opening Searcher@4c2e852d[collectionLazy3] main
   [junit4]   2> 1400737 INFO  (TEST-TestLazyCores.testCachingLimit-seed#[E41DD6B1308F3792]) [    x:collectionLazy3] o.a.s.r.ManagedResourceStorage File-based storage initialized to use dir: C:\Users\JenkinsSlave\workspace\Lucene-Solr-5.x-Windows\solr\build\solr-core\test\J0\temp\solr.core.TestLazyCores_E41DD6B1308F3792-001\tempDir-001\collection3\conf
   [junit4]   2> 1400738 INFO  (TEST-TestLazyCores.testCachingLimit-seed#[E41DD6B1308F3792]) [    x:collectionLazy3] o.a.s.r.RestManager Initializing RestManager with initArgs: {storageDir=C:\Users\JenkinsSlave\workspace\Lucene-Solr-5.x-Windows\solr\build\solr-core\test\J0\temp\solr.core.TestLazyCores_E41DD6B1308F3792-001\tempDir-001\collection3\conf}
   [junit4]   2> 1400738 INFO  (TEST-TestLazyCores.testCachingLimit-seed#[E41DD6B1308F3792]) [    x:collectionLazy3] o.a.s.r.ManagedResourceStorage Reading _rest_managed.json using file:dir=C:\Users\JenkinsSlave\workspace\Lucene-Solr-5.x-Windows\solr\build\solr-core\test\J0\temp\solr.core.TestLazyCores_E41DD6B1308F3792-001\tempDir-001\collection3\conf
   [junit4]   2> 1400738 INFO  (TEST-TestLazyCores.testCachingLimit-seed#[E41DD6B1308F3792]) [    x:collectionLazy3] o.a.s.r.RestManager Initializing 0 registered ManagedResources
   [junit4]   2> 1400738 INFO  (TEST-TestLazyCores.testCachingLimit-seed#[E41DD6B1308F3792]) [    x:collectionLazy3] o.a.s.h.ReplicationHandler Commits will be reserved for  10000
   [junit4]   2> 1400738 INFO  (TEST-TestLazyCores.testCachingLimit-seed#[E41DD6B1308F3792]) [    x:collectionLazy3] o.a.s.c.CoreContainer Opening transient core collectionLazy3
   [junit4]   2> 1400738 INFO  (TEST-TestLazyCores.testCachingLimit-seed#[E41DD6B1308F3792]) [    x:collectionLazy3] o.a.s.c.CoreContainer registering core: collectionLazy3
   [junit4]   2> 1400739 INFO  (TEST-TestLazyCores.testCachingLimit-seed#[E41DD6B1308F3792]) [    x:collectionLazy3] o.a.s.c.SolrResourceLoader new SolrResourceLoader for directory: 'C:\Users\JenkinsSlave\workspace\Lucene-Solr-5.x-Windows\solr\build\solr-core\test\J0\temp\solr.core.TestLazyCores_E41DD6B1308F3792-001\tempDir-001\collection4\'
   [junit4]   2> 1400739 INFO  (searcherExecutor-4758-thread-1-processing-x:collectionLazy3) [    x:collectionLazy3] o.a.s.c.SolrCore [collectionLazy3] Registered new searcher Searcher@4c2e852d[collectionLazy3] main{ExitableDirectoryReader(UninvertingDirectoryReader())}
   [junit4]   2> 1400787 INFO  (TEST-TestLazyCores.testCachingLimit-seed#[E41DD6B1308F3792]) [    x:collectionLazy3] o.a.s.c.SolrConfig current version of requestparams : -1
   [junit4]   2> 1400790 INFO  (TEST-TestLazyCores.testCachingLimit-seed#[E41DD6B1308F3792]) [    x:collectionLazy3] o.a.s.c.SolrConfig Using Lucene MatchVersion: 5.3.0
   [junit4]   2> 1400795 INFO  (TEST-TestLazyCores.testCachingLimit-seed#[E41DD6B1308F3792]) [    x:collectionLazy3] o.a.s.c.Config Loaded SolrConfig: solrconfig.xml
   [junit4]   2> 1400796 INFO  (TEST-TestLazyCores.testCachingLimit-seed#[E41DD6B1308F3792]) [    x:collectionLazy3] o.a.s.s.IndexSchema Reading Solr Schema from C:\Users\JenkinsSlave\workspace\Lucene-Solr-5.x-Windows\solr\build\solr-core\test\J0\temp\solr.core.TestLazyCores_E41DD6B1308F3792-001\tempDir-001\collection4\conf\schema.xml
   [junit4]   2> 1400799 INFO  (TEST-TestLazyCores.testCachingLimit-seed#[E41DD6B1308F3792]) [    x:collectionLazy3] o.a.s.s.IndexSchema [collectionLazy4] Schema name=tiny
   [junit4]   2> 1400802 INFO  (TEST-TestLazyCores.testCachingLimit-seed#[E41DD6B1308F3792]) [    x:collectionLazy3] o.a.s.s.IndexSchema unique key field: id
   [junit4]   2> 1400804 INFO  (TEST-TestLazyCores.testCachingLimit-seed#[E41DD6B1308F3792]) [    x:collectionLazy3] o.a.s.c.ConfigSetProperties Did not find ConfigSet properties, assuming default properties: Can't find resource 'configsetprops.json' in classpath or 'C:\Users\JenkinsSlave\workspace\Lucene-Solr-5.x-Windows\solr\build\solr-core\test\J0\temp\solr.core.TestLazyCores_E41DD6B1308F3792-001\tempDir-001\collection4\conf'
   [junit4]   2> 1400804 INFO  (TEST-TestLazyCores.testCachingLimit-seed#[E41DD6B1308F3792]) [    x:collectionLazy3] o.a.s.c.CoreContainer Creating SolrCore 'collectionLazy4' using configuration from instancedir C:\Users\JenkinsSlave\workspace\Lucene-Solr-5.x-Windows\solr\build\solr-core\test\J0\temp\solr.core.TestLazyCores_E41DD6B1308F3792-001\tempDir-001\collection4\
   [junit4]   2> 1400804 INFO  (TEST-TestLazyCores.testCachingLimit-seed#[E41DD6B1308F3792]) [    x:collectionLazy4] o.a.s.c.SolrCore org.apache.solr.core.MockDirectoryFactory
   [junit4]   2> 1400804 INFO  (TEST-TestLazyCores.testCachingLimit-seed#[E41DD6B1308F3792]) [    x:collectionLazy4] o.a.s.c.SolrCore [[collectionLazy4] ] Opening new SolrCore at [C:\Users\JenkinsSlave\workspace\Lucene-Solr-5.x-Windows\solr\build\solr-core\test\J0\temp\solr.core.TestLazyCores_E41DD6B1308F3792-001\tempDir-001\collection4\], dataDir=[null]
   [junit4]   2> 1400804 INFO  (TEST-TestLazyCores.testCachingLimit-seed#[E41DD6B1308F3792]) [    x:collectionLazy4] o.a.s.c.SolrCore JMX monitoring not detected for core: collectionLazy4
   [junit4]   2> 1400805 INFO  (TEST-TestLazyCores.testCachingLimit-seed#[E41DD6B1308F3792]) [    x:collectionLazy4] o.a.s.c.CachingDirectoryFactory return new directory for C:\Users\JenkinsSlave\workspace\Lucene-Solr-5.x-Windows\solr\build\solr-core\test\J0\temp\solr.core.TestLazyCores_E41DD6B1308F3792-001\tempDir-001\collection4\data\
   [junit4]   2> 1400805 INFO  (TEST-TestLazyCores.testCachingLimit-seed#[E41DD6B1308F3792]) [    x:collectionLazy4] o.a.s.c.SolrCore New index directory detected: old=null new=C:\Users\JenkinsSlave\workspace\Lucene-Solr-5.x-Windows\solr\build\solr-core\test\J0\temp\solr.core.TestLazyCores_E41DD6B1308F3792-001\tempDir-001\collection4\data\index/
   [junit4]   2> 1400805 WARN  (TEST-TestLazyCores.testCachingLimit-seed#[E41DD6B1308F3792]) [    x:collectionLazy4] o.a.s.c.SolrCore [collectionLazy4] Solr index directory 'C:\Users\JenkinsSlave\workspace\Lucene-Solr-5.x-Windows\solr\build\solr-core\test\J0\temp\solr.core.TestLazyCores_E41DD6B1308F3792-001\tempDir-001\collection4\data\index' doesn't exist. Creating new index...
   [junit4]   2> 1400806 INFO  (TEST-TestLazyCores.testCachingLimit-seed#[E41DD6B1308F3792]) [    x:collectionLazy4] o.a.s.c.CachingDirectoryFactory return new directory for C:\Users\JenkinsSlave\workspace\Lucene-Solr-5.x-Windows\solr\build\solr-core\test\J0\temp\solr.core.TestLazyCores_E41DD6B1308F3792-001\tempDir-001\collection4\data\index
   [junit4]   2> 1400806 INFO  (TEST-TestLazyCores.testCachingLimit-seed#[E41DD6B1308F3792]) [    x:collectionLazy4] o.a.s.u.RandomMergePolicy RandomMergePolicy wrapping class org.apache.lucene.index.LogByteSizeMergePolicy: [LogByteSizeMergePolicy: minMergeSize=1677721, mergeFactor=39, maxMergeSize=2147483648, maxMergeSizeForForcedMerge=9223372036854775807, calibrateSizeByDeletes=true, maxMergeDocs=2147483647, maxCFSSegmentSizeMB=8.796093022207999E12, noCFSRatio=0.0]
   [junit4]   2> 1400807 INFO  (TEST-TestLazyCores.testCachingLimit-seed#[E41DD6B1308F3792]) [    x:collectionLazy4] o.a.s.c.SolrCore SolrDeletionPolicy.onCommit: commits: num=1
   [junit4]   2> 	commit{dir=MockDirectoryWrapper(RAMDirectory@32245fa0 lockFactory=org.apache.lucene.store.SingleInstanceLockFactory@399ac6c2),segFN=segments_1,generation=1}
   [junit4]   2> 1400807 INFO  (TEST-TestLazyCores.testCachingLimit-seed#[E41DD6B1308F3792]) [    x:collectionLazy4] o.a.s.c.SolrCore newest commit generation = 1
   [junit4]   2> 1400809 INFO  (TEST-TestLazyCores.testCachingLimit-seed#[E41DD6B1308F3792]) [    x:collectionLazy4] o.a.s.c.SolrCore no updateRequestProcessorChain defined as default, creating implicit default
   [junit4]   2> 1400810 INFO  (TEST-TestLazyCores.testCachingLimit-seed#[E41DD6B1308F3792]) [    x:collectionLazy4] o.a.s.h.l.XMLLoader xsltCacheLifetimeSeconds=60
   [junit4]   2> 1400811 INFO  (TEST-TestLazyCores.testCachingLimit-seed#[E41DD6B1308F3792]) [    x:collectionLazy4] o.a.s.h.l.XMLLoader xsltCacheLifetimeSeconds=60
   [junit4]   2> 1400812 INFO  (TEST-TestLazyCores.testCachingLimit-seed#[E41DD6B1308F3792]) [    x:collectionLazy4] o.a.s.h.l.XMLLoader xsltCacheLifetimeSeconds=60
   [junit4]   2> 1400813 INFO  (TEST-TestLazyCores.testCachingLimit-seed#[E41DD6B1308F3792]) [    x:collectionLazy4] o.a.s.h.l.XMLLoader xsltCacheLifetimeSeconds=60
   [junit4]   2> 1400813 INFO  (OldIndexDirectoryCleanupThreadForCore-collectionLazy4) [    x:collectionLazy4] o.a.s.c.SolrCore Looking for old index directories to cleanup for core collectionLazy4 in C:\Users\JenkinsSlave\workspace\Lucene-Solr-5.x-Windows\solr\build\solr-core\test\J0\temp\solr.core.TestLazyCores_E41DD6B1308F3792-001\tempDir-001\collection4\data\
   [junit4]   2> 1400814 WARN  (OldIndexDirectoryCleanupThreadForCore-collectionLazy4) [    x:collectionLazy4] o.a.s.c.DirectoryFactory C:\Users\JenkinsSlave\workspace\Lucene-Solr-5.x-Windows\solr\build\solr-core\test\J0\temp\solr.core.TestLazyCores_E41DD6B1308F3792-001\tempDir-001\collection4\data\ does not point to a valid data directory; skipping clean-up of old index directories.
   [junit4]   2> 1400815 INFO  (TEST-TestLazyCores.testCachingLimit-seed#[E41DD6B1308F3792]) [    x:collectionLazy4] o.a.s.c.RequestHandlers Registered paths: /admin/mbeans,/update/csv,/update/json/docs,/admin/luke,/select,/admin/segments,/get,/admin/system,/replication,/admin/properties,/config,/schema,/admin/plugins,/admin/logging,/update/json,/admin/threads,/admin/ping,/update,/admin/file
   [junit4]   2> 1400815 INFO  (TEST-TestLazyCores.testCachingLimit-seed#[E41DD6B1308F3792]) [    x:collectionLazy4] o.a.s.c.SolrCore Using default statsCache cache: org.apache.solr.search.stats.LocalStatsCache
   [junit4]   2> 1400816 INFO  (TEST-TestLazyCores.testCachingLimit-seed#[E41DD6B1308F3792]) [    x:collectionLazy4] o.a.s.c.SolrCore Hard AutoCommit: disabled
   [junit4]   2> 1400816 INFO  (TEST-TestLazyCores.testCachingLimit-seed#[E41DD6B1308F3792]) [    x:collectionLazy4] o.a.s.c.SolrCore Soft AutoCommit: disabled
   [junit4]   2> 1400816 INFO  (TEST-TestLazyCores.testCachingLimit-seed#[E41DD6B1308F3792]) [    x:collectionLazy4] o.a.s.u.RandomMergePolicy RandomMergePolicy wrapping class org.apache.lucene.index.AlcoholicMergePolicy: [AlcoholicMergePolicy: minMergeSize=0, mergeFactor=10, maxMergeSize=616857619, maxMergeSizeForForcedMerge=9223372036854775807, calibrateSizeByDeletes=true, maxMergeDocs=2147483647, maxCFSSegmentSizeMB=8.796093022207999E12, noCFSRatio=0.1]
   [junit4]   2> 1400817 INFO  (TEST-TestLazyCores.testCachingLimit-seed#[E41DD6B1308F3792]) [    x:collectionLazy4] o.a.s.c.SolrCore SolrDeletionPolicy.onInit: commits: num=1
   [junit4]   2> 	commit{dir=MockDirectoryWrapper(RAMDirectory@32245fa0 lockFactory=org.apache.lucene.store.SingleInstanceLockFactory@399ac6c2),segFN=segments_1,generation=1}
   [junit4]   2> 1400817 INFO  (TEST-TestLazyCores.testCachingLimit-seed#[E41DD6B1308F3792]) [    x:collectionLazy4] o.a.s.c.SolrCore newest commit generation = 1
   [junit4]   2> 1400817 INFO  (TEST-TestLazyCores.testCachingLimit-seed#[E41DD6B1308F3792]) [    x:collectionLazy4] o.a.s.s.SolrIndexSearcher Opening Searcher@43bb80ac[collectionLazy4] main
   [junit4]   2> 1400818 INFO  (TEST-TestLazyCores.testCachingLimit-seed#[E41DD6B1308F3792]) [    x:collectionLazy4] o.a.s.r.ManagedResourceStorage File-based storage initialized to use dir: C:\Users\JenkinsSlave\workspace\Lucene-Solr-5.x-Windows\solr\build\solr-core\test\J0\temp\solr.core.TestLazyCores_E41DD6B1308F3792-001\tempDir-001\collection4\conf
   [junit4]   2> 1400818 INFO  (TEST-TestLazyCores.testCachingLimit-seed#[E41DD6B1308F3792]) [    x:collectionLazy4] o.a.s.r.RestManager Initializing RestManager with initArgs: {storageDir=C:\Users\JenkinsSlave\workspace\Lucene-Solr-5.x-Windows\solr\build\solr-core\test\J0\temp\solr.core.TestLazyCores_E41DD6B1308F3792-001\tempDir-001\collection4\conf}
   [junit4]   2> 1400818 INFO  (TEST-TestLazyCores.testCachingLimit-seed#[E41DD6B1308F3792]) [    x:collectionLazy4] o.a.s.r.ManagedResourceStorage Reading _rest_managed.json using file:dir=C:\Users\JenkinsSlave\workspace\Lucene-Solr-5.x-Windows\solr\build\solr-core\test\J0\temp\solr.core.TestLazyCores_E41DD6B1308F3792-001\tempDir-001\collection4\conf
   [junit4]   2> 1400819 INFO  (TEST-TestLazyCores.testCachingLimit-seed#[E41DD6B1308F3792]) [    x:collectionLazy4] o.a.s.r.RestManager Initializing 0 registered ManagedResources
   [junit4]   2> 1400819 INFO  (TEST-TestLazyCores.testCachingLimit-seed#[E41DD6B1308F3792]) [    x:collectionLazy4] o.a.s.h.ReplicationHandler Commits will be reserved for  10000
   [junit4]   2> 1400819 INFO  (searcherExecutor-4762-thread-1-processing-x:collectionLazy4) [    x:collectionLazy4] o.a.s.c.SolrCore [collectionLazy4] Registered new searcher Searcher@43bb80ac[collectionLazy4] main{ExitableDirectoryReader(UninvertingDirectoryReader())}
   [junit4]   2> 1400819 INFO  (TEST-TestLazyCores.testCachingLimit-seed#[E41DD6B1308F3792]) [    x:collectionLazy4] o.a.s.c.CoreContainer registering core: collectionLazy4
   [junit4]   2> 1400820 INFO  (TEST-TestLazyCores.testCachingLimit-seed#[E41DD6B1308F3792]) [    x:collectionLazy4] o.a.s.c.SolrResourceLoader new SolrResourceLoader for directory: 'C:\Users\JenkinsSlave\workspace\Lucene-Solr-5.x-Windows\solr\build\solr-core\test\J0\temp\solr.core.TestLazyCores_E41DD6B1308F3792-001\tempDir-001\collection6\'
   [junit4]   2> 1400836 INFO  (TEST-TestLazyCores.testCachingLimit-seed#[E41DD6B1308F3792]) [    x:collectionLazy4] o.a.s.c.SolrConfig current version of requestparams : -1
   [junit4]   2> 1400837 INFO  (TEST-TestLazyCores.testCachingLimit-seed#[E41DD6B1308F3792]) [    x:collectionLazy4] o.a.s.c.SolrConfig Using Lucene MatchVersion: 5.3.0
   [junit4]   2> 1400841 INFO  (TEST-TestLazyCores.testCachingLimit-seed#[E41DD6B1308F3792]) [    x:collectionLazy4] o.a.s.c.Config Loaded SolrConfig: solrconfig.xml
   [junit4]   2> 1400842 INFO  (TEST-TestLazyCores.testCachingLimit-seed#[E41DD6B1308F3792]) [    x:collectionLazy4] o.a.s.s.IndexSchema Reading Solr Schema from C:\Users\JenkinsSlave\workspace\Lucene-Solr-5.x-Windows\solr\build\solr-core\test\J0\temp\solr.core.TestLazyCores_E41DD6B1308F3792-001\tempDir-001\collection6\conf\schema.xml
   [junit4]   2> 1400844 INFO  (TEST-TestLazyCores.testCachingLimit-seed#[E41DD6B1308F3792]) [    x:collectionLazy4] o.a.s.s.IndexSchema [collectionLazy6] Schema name=tiny
   [junit4]   2> 1400847 INFO  (TEST-TestLazyCores.testCachingLimit-seed#[E41DD6B1308F3792]) [    x:collectionLazy4] o.a.s.s.IndexSchema unique key field: id
   [junit4]   2> 1400847 INFO  (TEST-TestLazyCores.testCachingLimit-seed#[E41DD6B1308F3792]) [    x:collectionLazy4] o.a.s.c.ConfigSetProperties Did not find ConfigSet properties, assuming default properties: Can't find resource 'configsetprops.json' in classpath or 'C:\Users\JenkinsSlave\workspace\Lucene-Solr-5.x-Windows\solr\build\solr-core\test\J0\temp\solr.core.TestLazyCores_E41DD6B1308F3792-001\tempDir-001\collection6\conf'
   [junit4]   2> 1400848 INFO  (TEST-TestLazyCores.testCachingLimit-seed#[E41DD6B1308F3792]) [    x:collectionLazy4] o.a.s.c.CoreContainer Creating SolrCore 'collectionLazy6' using configuration from instancedir C:\Users\JenkinsSlave\workspace\Lucene-Solr-5.x-Windows\solr\build\solr-core\test\J0\temp\solr.core.TestLazyCores_E41DD6B1308F3792-001\tempDir-001\collection6\
   [junit4]   2> 1400848 INFO  (TEST-TestLazyCores.testCachingLimit-seed#[E41DD6B1308F3792]) [    x:collectionLazy6] o.a.s.c.SolrCore org.apache.solr.core.MockDirectoryFactory
   [junit4]   2> 1400848 INFO  (TEST-TestLazyCores.testCachingLimit-seed#[E41DD6B1308F3792]) [    x:collectionLazy6] o.a.s.c.SolrCore [[collectionLazy6] ] Opening new SolrCore at [C:\Users\JenkinsSlave\workspace\Lucene-Solr-5.x-Windows\solr\build\solr-core\test\J0\temp\solr.core.TestLazyCores_E41DD6B1308F3792-001\tempDir-001\collection6\], dataDir=[null]
   [junit4]   2> 1400848 INFO  (TEST-TestLazyCores.testCachingLimit-seed#[E41DD6B1308F3792]) [    x:collectionLazy6] o.a.s.c.SolrCore JMX monitoring not detected for core: collectionLazy6
   [junit4]   2> 1400848 INFO  (TEST-TestLazyCores.testCachingLimit-seed#[E41DD6B1308F3792]) [    x:collectionLazy6] o.a.s.c.CachingDirectoryFactory return new directory for C:\Users\JenkinsSlave\workspace\Lucene-Solr-5.x-Windows\solr\build\solr-core\test\J0\temp\solr.core.TestLazyCores_E41DD6B1308F3792-001\tempDir-001\collection6\data\
   [junit4]   2> 1400849 INFO  (TEST-TestLazyCores.testCachingLimit-seed#[E41DD6B1308F3792]) [    x:collectionLazy6] o.a.s.c.SolrCore New index directory detected: old=null new=C:\Users\JenkinsSlave\workspace\Lucene-Solr-5.x-Windows\solr\build\solr-core\test\J0\temp\solr.core.TestLazyCores_E41DD6B1308F3792-001\tempDir-001\collection6\data\index/
   [junit4]   2> 1400849 WARN  (TEST-TestLazyCores.testCachingLimit-seed#[E41DD6B1308F3792]) [    x:collectionLazy6] o.a.s.c.SolrCore [collectionLazy6] Solr index directory 'C:\Users\JenkinsSlave\workspace\Lucene-Solr-5.x-Windows\solr\build\solr-core\test\J0\temp\solr.core.TestLazyCores_E41DD6B1308F3792-001\tempDir-001\collection6\data\index' doesn't exist. Creating new index...
   [junit4]   2> 1400849 INFO  (TEST-TestLazyCores.testCachingLimit-seed#[E41DD6B1308F3792]) [    x:collectionLazy6] o.a.s.c.CachingDirectoryFactory return new directory for C:\Users\JenkinsSlave\workspace\Lucene-Solr-5.x-Windows\solr\build\solr-core\test\J0\temp\solr.core.TestLazyCores_E41DD6B1308F3792-001\tempDir-001\collection6\data\index
   [junit4]   2> 1400849 INFO  (TEST-TestLazyCores.testCachingLimit-seed#[E41DD6B1308F3792]) [    x:collectionLazy6] o.a.s.u.RandomMergePolicy RandomMergePolicy wrapping class org.apache.lucene.index.TieredMergePolicy: [TieredMergePolicy: maxMergeAtOnce=14, maxMergeAtOnceExplicit=42, maxMergedSegmentMB=99.748046875, floorSegmentMB=1.783203125, forceMergeDeletesPctAllowed=16.763916089132348, segmentsPerTier=10.0, maxCFSSegmentSizeMB=8.796093022207999E12, noCFSRatio=0.8251402940489311
   [junit4]   2> 1400850 INFO  (TEST-TestLazyCores.testCachingLimit-seed#[E41DD6B1308F3792]) [    x:collectionLazy6] o.a.s.c.SolrCore SolrDeletionPolicy.onCommit: commits: num=1
   [junit4]   2> 	commit{dir=MockDirectoryWrapper(RAMDirectory@50d95c68 lockFactory=org.apache.lucene.store.SingleInstanceLockFactory@671d6ba5),segFN=segments_1,generation=1}
   [junit4]   2> 1400850 INFO  (TEST-TestLazyCores.testCachingLimit-seed#[E41DD6B1308F3792]) [    x:collectionLazy6] o.a.s.c.SolrCore newest commit generation = 1
   [junit4]   2> 1400851 INFO  (OldIndexDirectoryCleanupThreadForCore-collectionLazy6) [    x:collectionLazy6] o.a.s.c.SolrCore Looking for old index directories to cleanup for core collectionLazy6 in C:\Users\JenkinsSlave\workspace\Lucene-Solr-5.x-Windows\solr\build\solr-core\test\J0\temp\solr.core.TestLazyCores_E41DD6B1308F3792-001\tempDir-001\collection6\data\
   [junit4]   2> 1400851 WARN  (OldIndexDirectoryCleanupThreadForCore-collectionLazy6) [    x:collectionLazy6] o.a.s.c.DirectoryFactory C:\Users\JenkinsSlave\workspace\Lucene-Solr-5.x-Windows\solr\build\solr-core\test\J0\temp\solr.core.TestLazyCores_E41DD6B1308F3792-001\tempDir-001\collection6\data\ does not point to a valid data directory; skipping clean-up of old index directories.
   [junit4]   2> 1400852 INFO  (TEST-TestLazyCores.testCachingLimit-seed#[E41DD6B1308F3792]) [    x:collectionLazy6] o.a.s.c.SolrCore no updateRequestProcessorChain defined as default, creating implicit default
   [junit4]   2> 1400854 INFO  (TEST-TestLazyCores.testCachingLimit-seed#[E41DD6B1308F3792]) [    x:collectionLazy6] o.a.s.h.l.XMLLoader xsltCacheLifetimeSeconds=60
   [junit4]   2> 1400855 INFO  (TEST-TestLazyCores.testCachingLimit-seed#[E41DD6B1308F3792]) [    x:collectionLazy6] o.a.s.h.l.XMLLoader xsltCacheLifetimeSeconds=60
   [junit4]   2> 1400856 INFO  (TEST-TestLazyCores.testCachingLimit-seed#[E41DD6B1308F3792]) [    x:collectionLazy6] o.a.s.h.l.XMLLoader xsltCacheLifetimeSeconds=60
   [junit4]   2> 1400856 INFO  (TEST-TestLazyCores.testCachingLimit-seed#[E41DD6B1308F3792]) [    x:collectionLazy6] o.a.s.h.l.XMLLoader xsltCacheLifetimeSeconds=60
   [junit4]   2> 1400857 INFO  (TEST-TestLazyCores.testCachingLimit-seed#[E41DD6B1308F3792]) [    x:collectionLazy6] o.a.s.c.RequestHandlers Registered paths: /admin/mbeans,/update/csv,/update/json/docs,/admin/luke,/select,/admin/segments,/get,/admin/system,/replication,/admin/properties,/config,/schema,/admin/plugins,/admin/logging,/update/json,/admin/threads,/admin/ping,/update,/admin/file
   [junit4]   2> 1400858 INFO  (TEST-TestLazyCores.testCachingLimit-seed#[E41DD6B1308F3792]) [    x:collectionLazy6] o.a.s.c.SolrCore Using default statsCache cache: org.apache.solr.search.stats.LocalStatsCache
   [junit4]   2> 1400858 INFO  (TEST-TestLazyCores.testCachingLimit-seed#[E41DD6B1308F3792]) [    x:collectionLazy6] o.a.s.c.SolrCore Hard AutoCommit: disabled
   [junit4]   2> 1400858 INFO  (TEST-TestLazyCores.testCachingLimit-seed#[E41DD6B1308F3792]) [    x:collectionLazy6] o.a.s.c.SolrCore Soft AutoCommit: disabled
   [junit4]   2> 1400859 INFO  (TEST-TestLazyCores.testCachingLimit-seed#[E41DD6B1308F3792]) [    x:collectionLazy6] o.a.s.u.RandomMergePolicy RandomMergePolicy wrapping class org.apache.lucene.index.TieredMergePolicy: [TieredMergePolicy: maxMergeAtOnce=16, maxMergeAtOnceExplicit=30, maxMergedSegmentMB=7.765625, floorSegmentMB=2.046875, forceMergeDeletesPctAllowed=22.17633066524894, segmentsPerTier=13.0, maxCFSSegmentSizeMB=8.796093022207999E12, noCFSRatio=0.0
   [junit4]   2> 1400859 INFO  (TEST-TestLazyCores.testCachingLimit-seed#[E41DD6B1308F3792]) [    x:collectionLazy6] o.a.s.c.SolrCore SolrDeletionPolicy.onInit: commits: num=1
   [junit4]   2> 	commit{dir=MockDirectoryWrapper(RAMDirectory@50d95c68 lockFactory=org.apache.lucene.store.SingleInstanceLockFactory@671d6ba5),segFN=segments_1,generation=1}
   [junit4]   2> 1400859 INFO  (TEST-TestLazyCores.testCachingLimit-seed#[E41DD6B1308F3792]) [    x:collectionLazy6] o.a.s.c.SolrCore newest commit generation = 1
   [junit4]   2> 1400859 INFO  (TEST-TestLazyCores.testCachingLimit-seed#[E41DD6B1308F3792]) [    x:collectionLazy6] o.a.s.s.SolrIndexSearcher Opening Searcher@5691febd[collectionLazy6] main
   [junit4]   2> 1400860 INFO  (TEST-TestLazyCores.testCachingLimit-seed#[E41DD6B1308F3792]) [    x:collectionLazy6] o.a.s.r.ManagedResourceStorage File-based storage initialized to use dir: C:\Users\JenkinsSlave\workspace\Lucene-Solr-5.x-Windows\solr\build\solr-core\test\J0\temp\solr.core.TestLazyCores_E41DD6B1308F3792-001\tempDir-001\collection6\conf
   [junit4]   2> 1400860 INFO  (TEST-TestLazyCores.testCachingLimit-seed#[E41DD6B1308F3792]) [    x:collectionLazy6] o.a.s.r.RestManager Initializing RestManager with initArgs: {storageDir=C:\Users\JenkinsSlave\workspace\Lucene-Solr-5.x-Windows\solr\build\solr-core\test\J0\temp\solr.core.TestLazyCores_E41DD6B1308F3792-001\tempDir-001\collection6\conf}
   [junit4]   2> 1400860 INFO  (TEST-TestLazyCores.testCachingLimit-seed#[E41DD6B1308F3792]) [    x:collectionLazy6] o.a.s.r.ManagedResourceStorage Reading _rest_managed.json using file:dir=C:\Users\JenkinsSlave\workspace\Lucene-Solr-5.x-Windows\solr\build\solr-core\test\J0\temp\solr.core.TestLazyCores_E41DD6B1308F3792-001\tempDir-001\collection6\conf
   [junit4]   2> 1400860 INFO  (TEST-TestLazyCores.testCachingLimit-seed#[E41DD6B1308F3792]) [    x:collectionLazy6] o.a.s.r.RestManager Initializing 0 registered ManagedResources
   [junit4]   2> 1400860 INFO  (TEST-TestLazyCores.testCachingLimit-seed#[E41DD6B1308F3792]) [    x:collectionLazy6] o.a.s.h.ReplicationHandler Commits will be reserved for  10000
   [junit4]   2> 1400861 INFO  (searcherExecutor-4766-thread-1-processing-x:collectionLazy6) [    x:collectionLazy6] o.a.s.c.SolrCore [collectionLazy6] Registered new searcher Searcher@5691febd[collectionLazy6] main{ExitableDirectoryReader(UninvertingDirectoryReader())}
   [junit4]   2> 1400861 INFO  (TEST-TestLazyCores.testCachingLimit-seed#[E41DD6B1308F3792]) [    x:collectionLazy6] o.a.s.c.CoreContainer Opening transient core collectionLazy6
   [junit4]   2> 1400861 INFO  (TEST-TestLazyCores.testCachingLimit-seed#[E41DD6B1308F3792]) [    x:collectionLazy6] o.a.s.c.CoreContainer registering core: collectionLazy6
   [junit4]   2> 1400861 INFO  (TEST-TestLazyCores.testCachingLimit-seed#[E41DD6B1308F3792]) [    x:collectionLazy6] o.a.s.c.SolrResourceLoader new SolrResourceLoader for directory: 'C:\Users\JenkinsSlave\workspace\Lucene-Solr-5.x-Windows\solr\build\solr-core\test\J0\temp\solr.core.TestLazyCores_E41DD6B1308F3792-001\tempDir-001\collection7\'
   [junit4]   2> 1400885 INFO  (TEST-TestLazyCores.testCachingLimit-seed#[E41DD6B1308F3792]) [    x:collectionLazy6] o.a.s.c.SolrConfig current version of requestparams : -1
   [junit4]   2> 1400887 INFO  (TEST-TestLazyCores.testCachingLimit-seed#[E41DD6B1308F3792]) [    x:collectionLazy6] o.a.s.c.SolrConfig Using Lucene MatchVersion: 5.3.0
   [junit4]   2> 1400890 INFO  (TEST-TestLazyCores.testCachingLimit-seed#[E41DD6B1308F3792]) [    x:collectionLazy6] o.a.s.c.Config Loaded SolrConfig: solrconfig.xml
   [junit4]   2> 1400891 INFO  (TEST-TestLazyCores.testCachingLimit-seed#[E41DD6B1308F3792]) [    x:collectionLazy6] o.a.s.s.IndexSchema Reading Solr Schema from C:\Users\JenkinsSlave\workspace\Lucene-Solr-5.x-Windows\solr\build\solr-core\test\J0\temp\solr.core.TestLazyCores_E41DD6B1308F3792-001\tempDir-001\collection7\conf\schema.xml
   [junit4]   2> 1400896 INFO  (TEST-TestLazyCores.testCachingLimit-seed#[E41DD6B1308F3792]) [    x:collectionLazy6] o.a.s.s.IndexSchema [collectionLazy7] Schema name=tiny
   [junit4]   2> 1400899 INFO  (TEST-TestLazyCores.testCachingLimit-seed#[E41DD6B1308F3792]) [    x:collectionLazy6] o.a.s.s.IndexSchema unique key field: id
   [junit4]   2> 1400900 INFO  (TEST-TestLazyCores.testCachingLimit-seed#[E41DD6B1308F3792]) [    x:collectionLazy6] o.a.s.c.ConfigSetProperties Did not find ConfigSet properties, assuming default properties: Can't find resource 'configsetprops.json' in classpath or 'C:\Users\JenkinsSlave\workspace\Lucene-Solr-5.x-Windows\solr\build\solr-core\test\J0\temp\solr.core.TestLazyCores_E41DD6B1308F3792-001\tempDir-001\collection7\conf'
   [junit4]   2> 1400900 INFO  (TEST-TestLazyCores.testCachingLimit-seed#[E41DD6B1308F3792]) [    x:collectionLazy6] o.a.s.c.CoreContainer Creating SolrCore 'collectionLazy7' using configuration from instancedir C:\Users\JenkinsSlave\workspace\Lucene-Solr-5.x-Windows\solr\build\solr-core\test\J0\temp\solr.core.TestLazyCores_E41DD6B1308F3792-001\tempDir-001\collection7\
   [junit4]   2> 1400900 INFO  (TEST-TestLazyCores.testCachingLimit-seed#[E41DD6B1308F3792]) [    x:collectionLazy7] o.a.s.c.SolrCore org.apache.solr.core.MockDirectoryFactory
   [junit4]   2> 1400900 INFO  (TEST-TestLazyCores.testCachingLimit-seed#[E41DD6B1308F3792]) [    x:collectionLazy7] o.a.s.c.SolrCore [[collectionLazy7] ] Opening new SolrCore at [C:\Users\JenkinsSlave\workspace\Lucene-Solr-5.x-Windows\solr\build\solr-core\test\J0\temp\solr.core.TestLazyCores_E41DD6B1308F3792-001\tempDir-001\collection7\], dataDir=[null]
   [junit4]   2> 1400900 INFO  (TEST-TestLazyCores.testCachingLimit-seed#[E41DD6B1308F3792]) [    x:collectionLazy7] o.a.s.c.SolrCore JMX monitoring not detected for core: collectionLazy7
   [junit4]   2> 1400901 INFO  (TEST-TestLazyCores.testCachingLimit-seed#[E41DD6B1308F3792]) [    x:collectionLazy7] o.a.s.c.CachingDirectoryFactory return new directory for C:\Users\JenkinsSlave\workspace\Lucene-Solr-5.x-Windows\solr\build\solr-core\test\J0\temp\solr.core.TestLazyCores_E41DD6B1308F3792-001\tempDir-001\collection7\data\
   [junit4]   2> 1400901 INFO  (TEST-TestLazyCores.testCachingLimit-seed#[E41DD6B1308F3792]) [    x:collectionLazy7] o.a.s.c.SolrCore New index directory detected: old=null new=C:\Users\JenkinsSlave\workspace\Lucene-Solr-5.x-Windows\solr\build\solr-core\test\J0\temp\solr.core.TestLazyCores_E41DD6B1308F3792-001\tempDir-001\collection7\data\index/
   [junit4]   2> 1400901 WARN  (TEST-TestLazyCores.testCachingLimit-seed#[E41DD6B1308F3792]) [    x:collectionLazy7] o.a.s.c.SolrCore [collectionLazy7] Solr index directory 'C:\Users\JenkinsSlave\workspace\Lucene-Solr-5.x-Windows\solr\build\solr-core\test\J0\temp\solr.core.TestLazyCores_E41DD6B1308F3792-001\tempDir-001\collection7\data\index' doesn't exist. Creating new index...
   [junit4]   2> 1400901 INFO  (TEST-TestLazyCores.testCachingLimit-seed#[E41DD6B1308F3792]) [    x:collectionLazy7] o.a.s.c.CachingDirectoryFactory return new directory for C:\Users\JenkinsSlave\workspace\Lucene-Solr-5.x-Windows\solr\build\solr-core\test\J0\temp\solr.core.TestLazyCores_E41DD6B1308F3792-001\tempDir-001\collection7\data\index
   [junit4]   2> 1400901 INFO  (TEST-TestLazyCores.testCachingLimit-seed#[E41DD6B1308F3792]) [    x:collectionLazy7] o.a.s.u.RandomMergePolicy RandomMergePolicy wrapping class org.apache.lucene.index.TieredMergePolicy: [TieredMergePolicy: maxMergeAtOnce=36, maxMergeAtOnceExplicit=44, maxMergedSegmentMB=78.98046875, floorSegmentMB=0.7177734375, forceMergeDeletesPctAllowed=15.725372458542967, segmentsPerTier=25.0, maxCFSSegmentSizeMB=8.796093022207999E12, noCFSRatio=0.0
   [junit4]   2> 1400902 INFO  (TEST-TestLazyCores.testCachingLimit-seed#[E41DD6B1308F3792]) [    x:collectionLazy7] o.a.s.c.SolrCore SolrDeletionPolicy.onCommit: commits: num=1
   [junit4]   2> 	commit{dir=MockDirectoryWrapper(RAMDirectory@8ac8901 lockFactory=org.apache.lucene.store.SingleInstanceLockFactory@524e3680),segFN=segments_1,generation=1}
   [junit4]   2> 1400902 INFO  (TEST-TestLazyCores.testCachingLimit-seed#[E41DD6B1308F3792]) [    x:collectionLazy7] o.a.s.c.SolrCore newest commit generation = 1
   [junit4]   2> 1400905 INFO  (TEST-TestLazyCores.testCachingLimit-seed#[E41DD6B1308F3792]) [    x:collectionLazy7] o.a.s.c.SolrCore no updateRequestProcessorChain defined as default, creating implicit default
   [junit4]   2> 1400907 INFO  (TEST-TestLazyCores.testCachingLimit-seed#[E41DD6B1308F3792]) [    x:collectionLazy7] o.a.s.h.l.XMLLoader xsltCacheLifetimeSeconds=60
   [junit4]   2> 1400907 INFO  (OldIndexDirectoryCleanupThreadForCore-collectionLazy7) [    x:collectionLazy7] o.a.s.c.SolrCore Looking for old index directories to cleanup for core collectionLazy7 in C:\Users\JenkinsSlave\workspace\Lucene-Solr-5.x-Windows\solr\build\solr-core\test\J0\temp\solr.core.TestLazyCores_E41DD6B1308F3792-001\tempDir-001\collection7\data\
   [junit4]   2> 1400908 WARN  (OldIndexDirectoryCleanupThreadForCore-collectionLazy7) [    x:collectionLazy7] o.a.s.c.DirectoryFactory C:\Users\JenkinsSlave\workspace\Lucene-Solr-5.x-Windows\solr\build\solr-core\test\J0\temp\solr.core.TestLazyCores_E41DD6B1308F3792-001\tempDir-001\collection7\data\ does not point to a valid data directory; skipping clean-up of old index directories.
   [junit4]   2> 1400908 INFO  (TEST-TestLazyCores.testCachingLimit-seed#[E41DD6B1308F3792]) [    x:collectionLazy7] o.a.s.h.l.XMLLoader xsltCacheLifetimeSeconds=60
   [junit4]   2> 1400908 INFO  (TEST-TestLazyCores.testCachingLimit-seed#[E41DD6B1308F3792]) [    x:collectionLazy7] o.a.s.h.l.XMLLoader xsltCacheLifetimeSeconds=60
   [junit4]   2> 1400909 INFO  (TEST-TestLazyCores.testCachingLimit-seed#[E41DD6B1308F3792]) [    x:collectionLazy7] o.a.s.h.l.XMLLoader xsltCacheLifetimeSeconds=60
   [junit4]   2> 1400910 INFO  (TEST-TestLazyCores.testCachingLimit-seed#[E41DD6B1308F3792]) [    x:collectionLazy7] o.a.s.c.RequestHandlers Registered paths: /admin/mbeans,/update/csv,/update/json/docs,/admin/luke,/select,/admin/segments,/get,/admin/system,/replication,/admin/properties,/config,/schema,/admin/plugins,/admin/logging,/update/json,/admin/threads,/admin/ping,/update,/admin/file
   [junit4]   2> 1400911 INFO  (TEST-TestLazyCores.testCachingLimit-seed#[E41DD6B1308F3792]) [    x:collectionLazy7] o.a.s.c.SolrCore Using default statsCache cache: org.apache.solr.search.stats.LocalStatsCache
   [junit4]   2> 1400911 INFO  (TEST-TestLazyCores.testCachingLimit-seed#[E41DD6B1308F3792]) [    x:collectionLazy7] o.a.s.c.SolrCore Hard AutoCommit: disabled
   [junit4]   2> 1400911 INFO  (TEST-TestLazyCores.testCachingLimit-seed#[E41DD6B1308F3792]) [    x:collectionLazy7] o.a.s.c.SolrCore Soft AutoCommit: disabled
   [junit4]   2> 1400911 INFO  (TEST-TestLazyCores.testCachingLimit-seed#[E41DD6B1308F3792]) [    x:collectionLazy7] o.a.s.u.RandomMergePolicy RandomMergePolicy wrapping class org.apache.lucene.index.AlcoholicMergePolicy: [AlcoholicMergePolicy: minMergeSize=0, mergeFactor=10, maxMergeSize=1080520603, maxMergeSizeForForcedMerge=9223372036854775807, calibrateSizeByDeletes=true, maxMergeDocs=2147483647, maxCFSSegmentSizeMB=8.796093022207999E12, noCFSRatio=0.1]
   [junit4]   2> 1400912 INFO  (TEST-TestLazyCores.testCachingLimit-seed#[E41DD6B1308F3792]) [    x:collectionLazy7] o.a.s.c.SolrCore SolrDeletionPolicy.onInit: commits: num=1
   [junit4]   2> 	commit{dir=MockDirectoryWrapper(RAMDirectory@8ac8901 lockFactory=org.apache.lucene.store.SingleInstanceLockFactory@524e3680),segFN=segments_1,generation=1}
   [junit4]   2> 1400912 INFO  (TEST-TestLazyCores.testCachingLimit-seed#[E41DD6B1308F3792]) [    x:collectionLazy7] o.a.s.c.SolrCore newest commit generation = 1
   [junit4]   2> 1400912 INFO  (TEST-TestLazyCores.testCachingLimit-seed#[E41DD6B1308F3792]) [    x:collectionLazy7] o.a.s.s.SolrIndexSearcher Opening Searcher@3cba5b0e[collectionLazy7] main
   [junit4]   2> 1400913 INFO  (TEST-TestLazyCores.testCachingLimit-seed#[E41DD6B1308F3792]) [    x:collectionLazy7] o.a.s.r.ManagedResourceStorage File-based storage initialized to use dir: C:\Users\JenkinsSlave\workspace\Lucene-Solr-5.x-Windows\solr\build\solr-core\test\J0\temp\solr.core.TestLazyCores_E41DD6B1308F3792-001\tempDir-001\collection7\conf
   [junit4]   2> 1400913 INFO  (TEST-TestLazyCores.testCachingLimit-seed#[E41DD6B1308F3792]) [    x:collectionLazy7] o.a.s.r.RestManager Initializing RestManager with initArgs: {storageDir=C:\Users\JenkinsSlave\workspace\Lucene-Solr-5.x-Windows\solr\build\solr-core\test\J0\temp\solr.core.TestLazyCores_E41DD6B1308F3792-001\tempDir-001\collection7\conf}
   [junit4]   2> 1400913 INFO  (TEST-TestLazyCores.testCachingLimit-seed#[E41DD6B1308F3792]) [    x:collectionLazy7] o.a.s.r.ManagedResourceStorage Reading _rest_managed.json using file:dir=C:\Users\JenkinsSlave\workspace\Lucene-Solr-5.x-Windows\solr\build\solr-core\test\J0\temp\solr.core.TestLazyCores_E41DD6B1308F3792-001\tempDir-001\collection7\conf
   [junit4]   2> 1400913 INFO  (TEST-TestLazyCores.testCachingLimit-seed#[E41DD6B1308F3792]) [    x:collectionLazy7] o.a.s.r.RestManager Initializing 0 registered ManagedResources
   [junit4]   2> 1400914 INFO  (TEST-TestLazyCores.testCachingLimit-seed#[E41DD6B1308F3792]) [    x:collectionLazy7] o.a.s.h.ReplicationHandler Commits will be reserved for  10000
   [junit4]   2> 1400914 INFO  (searcherExecutor-4770-thread-1-processing-x:collectionLazy7) [    x:collectionLazy7] o.a.s.c.SolrCore [collectionLazy7] Registered new searcher Searcher@3cba5b0e[collectionLazy7] main{ExitableDirectoryReader(UninvertingDirectoryReader())}
   [junit4]   2> 1400914 INFO  (TEST-TestLazyCores.testCachingLimit-seed#[E41DD6B1308F3792]) [    x:collectionLazy7] o.a.s.c.CoreContainer Opening transient core collectionLazy7
   [junit4]   2> 1400914 INFO  (TEST-TestLazyCores.testCachingLimit-seed#[E41DD6B1308F3792]) [    x:collectionLazy7] o.a.s.c.CoreContainer registering core: collectionLazy7
   [junit4]   2> 1400914 INFO  (TEST-TestLazyCores.testCachingLimit-seed#[E41DD6B1308F3792]) [    x:collectionLazy7] o.a.s.c.SolrResourceLoader new SolrResourceLoader for directory: 'C:\Users\JenkinsSlave\workspace\Lucene-Solr-5.x-Windows\solr\build\solr-core\test\J0\temp\solr.core.TestLazyCores_E41DD6B1308F3792-001\tempDir-001\collection8\'
   [junit4]   2> 1400936 INFO  (TEST-TestLazyCores.testCachingLimit-seed#[E41DD6B1308F3792]) [    x:collectionLazy7] o.a.s.c.SolrConfig current version of requestparams : -1
   [junit4]   2> 1400939 INFO  (TEST-TestLazyCores.testCachingLimit-seed#[E41DD6B1308F3792]) [    x:collectionLazy7] o.a.s.c.SolrConfig Using Lucene MatchVersion: 5.3.0
   [junit4]   2> 1400942 INFO  (TEST-TestLazyCores.testCachingLimit-seed#[E41DD6B1308F3792]) [    x:collectionLazy7] o.a.s.c.Config Loaded SolrConfig: solrconfig.xml
   [junit4]   2> 1400942 INFO  (TEST-TestLazyCores.testCachingLimit-seed#[E41DD6B1308F3792]) [    x:collectionLazy7] o.a.s.s.IndexSchema Reading Solr Schema from C:\Users\JenkinsSlave\workspace\Lucene-Solr-5.x-Windows\solr\build\solr-core\test\J0\temp\solr.core.TestLazyCores_E41DD6B1308F3792-001\tempDir-001\collection8\conf\schema.xml
   [junit4]   2> 1400945 INFO  (TEST-TestLazyCores.testCachingLimit-seed#[E41DD6B1308F3792]) [    x:collectionLazy7] o.a.s.s.IndexSchema [collectionLazy8] Schema name=tiny
   [junit4]   2> 1400949 INFO  (TEST-TestLazyCores.testCachingLimit-seed#[E41DD6B1308F3792]) [    x:collectionLazy7] o.a.s.s.IndexSchema unique key field: id
   [junit4]   2> 1400951 INFO  (TEST-Tes

[...truncated too long message...]

tTask(ThreadPoolExecutor.java:1067)
   [junit4]   2>         at java.util.concurrent.ThreadPoolExecutor.runWorker(ThreadPoolExecutor.java:1127)
   [junit4]   2>         at java.util.concurrent.ThreadPoolExecutor$Worker.run(ThreadPoolExecutor.java:617)
   [junit4]   2>         at java.lang.Thread.run(Thread.java:745)
   [junit4]   2> Jul 25, 2015 10:28:46 AM com.carrotsearch.randomizedtesting.ThreadLeakControl tryToInterruptAll
   [junit4]   2> INFO: Starting to interrupt leaked threads:
   [junit4]   2>    1) Thread[id=9299, name=searcherExecutor-4748-thread-1, state=WAITING, group=TGRP-TestLazyCores]
   [junit4]   2> Jul 25, 2015 10:28:49 AM com.carrotsearch.randomizedtesting.ThreadLeakControl tryToInterruptAll
   [junit4]   2> SEVERE: There are still zombie threads that couldn't be terminated:
   [junit4]   2>    1) Thread[id=9299, name=searcherExecutor-4748-thread-1, state=WAITING, group=TGRP-TestLazyCores]
   [junit4]   2>         at sun.misc.Unsafe.park(Native Method)
   [junit4]   2>         at java.util.concurrent.locks.LockSupport.park(LockSupport.java:175)
   [junit4]   2>         at java.util.concurrent.locks.AbstractQueuedSynchronizer$ConditionObject.await(AbstractQueuedSynchronizer.java:2039)
   [junit4]   2>         at java.util.concurrent.LinkedBlockingQueue.take(LinkedBlockingQueue.java:442)
   [junit4]   2>         at java.util.concurrent.ThreadPoolExecutor.getTask(ThreadPoolExecutor.java:1067)
   [junit4]   2>         at java.util.concurrent.ThreadPoolExecutor.runWorker(ThreadPoolExecutor.java:1127)
   [junit4]   2>         at java.util.concurrent.ThreadPoolExecutor$Worker.run(ThreadPoolExecutor.java:617)
   [junit4]   2>         at java.lang.Thread.run(Thread.java:745)
   [junit4]   2> NOTE: test params are: codec=Asserting(Lucene53): {v_t=PostingsFormat(name=Memory doPackFST= false), id=PostingsFormat(name=Memory doPackFST= false), v_s=Lucene50(blocksize=128), v_f=BlockTreeOrds(blocksize=128)}, docValues:{}, sim=DefaultSimilarity, locale=bg, timezone=GMT
   [junit4]   2> NOTE: Windows 7 6.1 amd64/Oracle Corporation 1.8.0_51 (64-bit)/cpus=3,threads=2,free=233438168,total=528482304
   [junit4]   2> NOTE: All tests run in this JVM: [TestDownShardTolerantSearch, DistributedQueueTest, SimpleFacetsTest, TestDocBasedVersionConstraints, TestSurroundQueryParser, ZkStateWriterTest, SampleTest, TestCharFilters, TestCloudManagedSchema, TestManagedSchemaFieldResource, DistributedSuggestComponentTest, TestBlendedInfixSuggestions, UnloadDistributedZkTest, TestElisionMultitermQuery, XmlUpdateRequestHandlerTest, TestSchemaSimilarityResource, FieldAnalysisRequestHandlerTest, DOMUtilTest, TestCloudInspectUtil, SolrPluginUtilsTest, HdfsUnloadDistributedZkTest, DocValuesTest, TestUniqueKeyFieldResource, DistributedFacetPivotWhiteBoxTest, ShowFileRequestHandlerTest, SolrCoreTest, TestSimpleTrackingShardHandler, TestFaceting, TestSchemaManager, DirectSolrConnectionTest, TestJsonRequest, TestIndexingPerformance, IgnoreCommitOptimizeUpdateProcessorFactoryTest, BufferStoreTest, TestUpdate, InfoHandlerTest, CoreMergeIndexesAdminHandlerTest, RequestHandlersTest, ScriptEngineTest, HdfsLockFactoryTest, TestReRankQParserPlugin, TestManagedSynonymFilterFactory, SolrCoreCheckLockOnStartupTest, SolrCloudExampleTest, HdfsRecoveryZkTest, TestImplicitCoreProperties, TestFastLRUCache, JSONWriterTest, TestShardHandlerFactory, RuleEngineTest, TestFieldCollectionResource, TestStressRecovery, ShardRoutingTest, TestFreeTextSuggestions, TestCSVResponseWriter, DistanceUnitsTest, SolrXmlInZkTest, TestCursorMarkWithoutUniqueKey, TestDistribDocBasedVersion, TestComplexPhraseQParserPlugin, DirectUpdateHandlerTest, TestIBSimilarityFactory, CoreAdminHandlerTest, BadCopyFieldTest, StressHdfsTest, PathHierarchyTokenizerFactoryTest, SortByFunctionTest, RequiredFieldsTest, DistributedExpandComponentTest, TestExceedMaxTermLength, TestCollationFieldDocValues, TestSort, CacheHeaderTest, BitVectorTest, TestWordDelimiterFilterFactory, SuggesterFSTTest, DefaultValueUpdateProcessorTest, SharedFSAutoReplicaFailoverTest, VMParamsZkACLAndCredentialsProvidersTest, CursorMarkTest, ConnectionManagerTest, TestReplicationHandlerBackup, TestRebalanceLeaders, ClusterStateTest, EnumFieldTest, NoCacheHeaderTest, DistributedFacetPivotSmallTest, IndexSchemaRuntimeFieldTest, TestLeaderElectionZkExpiry, TestLRUStatsCache, SyncSliceTest, TestArbitraryIndexDir, ClusterStateUpdateTest, MultiThreadedOCPTest, PreAnalyzedFieldTest, TestPerFieldSimilarity, TestIndexSearcher, CircularListTest, QueryElevationComponentTest, TestDistributedMissingSort, HardAutoCommitTest, ConcurrentDeleteAndCreateCollectionTest, SoftAutoCommitTest, TestConfigOverlay, HLLSerializationTest, TestSweetSpotSimilarityFactory, TestRequestStatusCollectionAPI, TestSolrIndexConfig, BasicDistributedZkTest, BlockCacheTest, TestExpandComponent, TestTrackingShardHandlerFactory, TestExactSharedStatsCache, SuggesterWFSTTest, SpatialRPTFieldTypeTest, PeerSyncTest, TestSortingResponseWriter, UUIDFieldTest, TestXIncludeConfig, DistributedQueryComponentCustomSortTest, TestStressReorder, SolrIndexSplitterTest, DocValuesMultiTest, TestCollationField, TestIntervalFaceting, CloudExitableDirectoryReaderTest, TestDocumentBuilder, TestComponentsName, TestJmxIntegration, OverseerTest, BasicZkTest, RecoveryZkTest, TestReplicationHandler, ZkCLITest, AutoCommitTest, TestDistributedGrouping, TestHashPartitioner, DistributedSpellCheckComponentTest, TermVectorComponentDistributedTest, ZkControllerTest, TestRealTimeGet, TestJoin, TestStressVersions, TestRangeQuery, TestCoreContainer, StatsComponentTest, SpellCheckComponentTest, TestGroupingSearch, ConvertedLegacyTest, TestFunctionQuery, TestLazyCores]
   [junit4]   2> NOTE: reproduce with: ant test  -Dtestcase=TestLazyCores -Dtests.seed=E41DD6B1308F3792 -Dtests.slow=true -Dtests.locale=bg -Dtests.timezone=GMT -Dtests.asserts=true -Dtests.file.encoding=ISO-8859-1
   [junit4] ERROR   0.00s J0 | TestLazyCores (suite) <<<
   [junit4]    > Throwable #1: java.lang.AssertionError: ERROR: SolrIndexSearcher opens=51 closes=50
   [junit4]    > 	at __randomizedtesting.SeedInfo.seed([E41DD6B1308F3792]:0)
   [junit4]    > 	at org.apache.solr.SolrTestCaseJ4.endTrackingSearchers(SolrTestCaseJ4.java:465)
   [junit4]    > 	at org.apache.solr.SolrTestCaseJ4.afterClass(SolrTestCaseJ4.java:232)
   [junit4]    > 	at java.lang.Thread.run(Thread.java:745)Throwable #2: com.carrotsearch.randomizedtesting.ThreadLeakError: 1 thread leaked from SUITE scope at org.apache.solr.core.TestLazyCores: 
   [junit4]    >    1) Thread[id=9299, name=searcherExecutor-4748-thread-1, state=WAITING, group=TGRP-TestLazyCores]
   [junit4]    >         at sun.misc.Unsafe.park(Native Method)
   [junit4]    >         at java.util.concurrent.locks.LockSupport.park(LockSupport.java:175)
   [junit4]    >         at java.util.concurrent.locks.AbstractQueuedSynchronizer$ConditionObject.await(AbstractQueuedSynchronizer.java:2039)
   [junit4]    >         at java.util.concurrent.LinkedBlockingQueue.take(LinkedBlockingQueue.java:442)
   [junit4]    >         at java.util.concurrent.ThreadPoolExecutor.getTask(ThreadPoolExecutor.java:1067)
   [junit4]    >         at java.util.concurrent.ThreadPoolExecutor.runWorker(ThreadPoolExecutor.java:1127)
   [junit4]    >         at java.util.concurrent.ThreadPoolExecutor$Worker.run(ThreadPoolExecutor.java:617)
   [junit4]    >         at java.lang.Thread.run(Thread.java:745)
   [junit4]    > 	at __randomizedtesting.SeedInfo.seed([E41DD6B1308F3792]:0)Throwable #3: com.carrotsearch.randomizedtesting.ThreadLeakError: There are still zombie threads that couldn't be terminated:
   [junit4]    >    1) Thread[id=9299, name=searcherExecutor-4748-thread-1, state=WAITING, group=TGRP-TestLazyCores]
   [junit4]    >         at sun.misc.Unsafe.park(Native Method)
   [junit4]    >         at java.util.concurrent.locks.LockSupport.park(LockSupport.java:175)
   [junit4]    >         at java.util.concurrent.locks.AbstractQueuedSynchronizer$ConditionObject.await(AbstractQueuedSynchronizer.java:2039)
   [junit4]    >         at java.util.concurrent.LinkedBlockingQueue.take(LinkedBlockingQueue.java:442)
   [junit4]    >         at java.util.concurrent.ThreadPoolExecutor.getTask(ThreadPoolExecutor.java:1067)
   [junit4]    >         at java.util.concurrent.ThreadPoolExecutor.runWorker(ThreadPoolExecutor.java:1127)
   [junit4]    >         at java.util.concurrent.ThreadPoolExecutor$Worker.run(ThreadPoolExecutor.java:617)
   [junit4]    >         at java.lang.Thread.run(Thread.java:745)
   [junit4]    > 	at __randomizedtesting.SeedInfo.seed([E41DD6B1308F3792]:0)
   [junit4] Completed [367/518] on J0 in 152.90s, 7 tests, 1 failure, 2 errors <<< FAILURES!

[...truncated 467 lines...]
BUILD FAILED
C:\Users\JenkinsSlave\workspace\Lucene-Solr-5.x-Windows\build.xml:724: The following error occurred while executing this line:
C:\Users\JenkinsSlave\workspace\Lucene-Solr-5.x-Windows\build.xml:668: The following error occurred while executing this line:
C:\Users\JenkinsSlave\workspace\Lucene-Solr-5.x-Windows\build.xml:59: The following error occurred while executing this line:
C:\Users\JenkinsSlave\workspace\Lucene-Solr-5.x-Windows\solr\build.xml:230: The following error occurred while executing this line:
C:\Users\JenkinsSlave\workspace\Lucene-Solr-5.x-Windows\solr\common-build.xml:516: The following error occurred while executing this line:
C:\Users\JenkinsSlave\workspace\Lucene-Solr-5.x-Windows\lucene\common-build.xml:1447: The following error occurred while executing this line:
C:\Users\JenkinsSlave\workspace\Lucene-Solr-5.x-Windows\lucene\common-build.xml:1002: There were test failures: 518 suites, 2055 tests, 3 suite-level errors, 457 ignored (35 assumptions)

Total time: 46 minutes 25 seconds
Build step 'Invoke Ant' marked build as failure
Archiving artifacts
Recording test results
Email was triggered for: Failure - Any
Sending email for trigger: Failure - Any



Mime
View raw message