lucene-dev mailing list archives

Site index · List index
Message view « Date » · « Thread »
Top « Date » · « Thread »
From Policeman Jenkins Server <jenk...@thetaphi.de>
Subject [JENKINS] Lucene-Solr-trunk-Windows (64bit/jdk1.8.0_51) - Build # 5084 - Still Failing!
Date Thu, 30 Jul 2015 19:57:27 GMT
Build: http://jenkins.thetaphi.de/job/Lucene-Solr-trunk-Windows/5084/
Java: 64bit/jdk1.8.0_51 -XX:-UseCompressedOops -XX:+UseConcMarkSweepGC

2 tests failed.
FAILED:  org.apache.solr.client.solrj.io.stream.StreamExpressionTest.testAll

Error Message:
There are still nodes recoverying - waited for 30 seconds

Stack Trace:
java.lang.AssertionError: There are still nodes recoverying - waited for 30 seconds
	at __randomizedtesting.SeedInfo.seed([537BF64616D14F4B:1F25D83F6D41108E]:0)
	at org.junit.Assert.fail(Assert.java:93)
	at org.apache.solr.cloud.AbstractDistribZkTestBase.waitForRecoveriesToFinish(AbstractDistribZkTestBase.java:172)
	at org.apache.solr.cloud.AbstractFullDistribZkTestBase.waitForRecoveriesToFinish(AbstractFullDistribZkTestBase.java:834)
	at org.apache.solr.cloud.AbstractFullDistribZkTestBase.waitForThingsToLevelOut(AbstractFullDistribZkTestBase.java:1391)
	at org.apache.solr.client.solrj.io.stream.StreamExpressionTest.testAll(StreamExpressionTest.java:117)
	at sun.reflect.NativeMethodAccessorImpl.invoke0(Native Method)
	at sun.reflect.NativeMethodAccessorImpl.invoke(NativeMethodAccessorImpl.java:62)
	at sun.reflect.DelegatingMethodAccessorImpl.invoke(DelegatingMethodAccessorImpl.java:43)
	at java.lang.reflect.Method.invoke(Method.java:497)
	at com.carrotsearch.randomizedtesting.RandomizedRunner.invoke(RandomizedRunner.java:1627)
	at com.carrotsearch.randomizedtesting.RandomizedRunner$6.evaluate(RandomizedRunner.java:836)
	at com.carrotsearch.randomizedtesting.RandomizedRunner$7.evaluate(RandomizedRunner.java:872)
	at com.carrotsearch.randomizedtesting.RandomizedRunner$8.evaluate(RandomizedRunner.java:886)
	at org.apache.solr.BaseDistributedSearchTestCase$ShardsRepeatRule$ShardsFixedStatement.callStatement(BaseDistributedSearchTestCase.java:966)
	at org.apache.solr.BaseDistributedSearchTestCase$ShardsRepeatRule$ShardsStatement.evaluate(BaseDistributedSearchTestCase.java:941)
	at com.carrotsearch.randomizedtesting.rules.SystemPropertiesRestoreRule$1.evaluate(SystemPropertiesRestoreRule.java:57)
	at org.apache.lucene.util.TestRuleSetupTeardownChained$1.evaluate(TestRuleSetupTeardownChained.java:50)
	at org.apache.lucene.util.AbstractBeforeAfterRule$1.evaluate(AbstractBeforeAfterRule.java:46)
	at org.apache.lucene.util.TestRuleThreadAndTestName$1.evaluate(TestRuleThreadAndTestName.java:49)
	at org.apache.lucene.util.TestRuleIgnoreAfterMaxFailures$1.evaluate(TestRuleIgnoreAfterMaxFailures.java:65)
	at org.apache.lucene.util.TestRuleMarkFailure$1.evaluate(TestRuleMarkFailure.java:48)
	at com.carrotsearch.randomizedtesting.rules.StatementAdapter.evaluate(StatementAdapter.java:36)
	at com.carrotsearch.randomizedtesting.ThreadLeakControl$StatementRunner.run(ThreadLeakControl.java:365)
	at com.carrotsearch.randomizedtesting.ThreadLeakControl.forkTimeoutingTask(ThreadLeakControl.java:798)
	at com.carrotsearch.randomizedtesting.ThreadLeakControl$3.evaluate(ThreadLeakControl.java:458)
	at com.carrotsearch.randomizedtesting.RandomizedRunner.runSingleTest(RandomizedRunner.java:845)
	at com.carrotsearch.randomizedtesting.RandomizedRunner$3.evaluate(RandomizedRunner.java:747)
	at com.carrotsearch.randomizedtesting.RandomizedRunner$4.evaluate(RandomizedRunner.java:781)
	at com.carrotsearch.randomizedtesting.RandomizedRunner$5.evaluate(RandomizedRunner.java:792)
	at com.carrotsearch.randomizedtesting.rules.StatementAdapter.evaluate(StatementAdapter.java:36)
	at com.carrotsearch.randomizedtesting.rules.SystemPropertiesRestoreRule$1.evaluate(SystemPropertiesRestoreRule.java:57)
	at org.apache.lucene.util.AbstractBeforeAfterRule$1.evaluate(AbstractBeforeAfterRule.java:46)
	at com.carrotsearch.randomizedtesting.rules.StatementAdapter.evaluate(StatementAdapter.java:36)
	at org.apache.lucene.util.TestRuleStoreClassName$1.evaluate(TestRuleStoreClassName.java:42)
	at com.carrotsearch.randomizedtesting.rules.NoShadowingOrOverridesOnMethodsRule$1.evaluate(NoShadowingOrOverridesOnMethodsRule.java:39)
	at com.carrotsearch.randomizedtesting.rules.NoShadowingOrOverridesOnMethodsRule$1.evaluate(NoShadowingOrOverridesOnMethodsRule.java:39)
	at com.carrotsearch.randomizedtesting.rules.StatementAdapter.evaluate(StatementAdapter.java:36)
	at com.carrotsearch.randomizedtesting.rules.StatementAdapter.evaluate(StatementAdapter.java:36)
	at com.carrotsearch.randomizedtesting.rules.StatementAdapter.evaluate(StatementAdapter.java:36)
	at org.apache.lucene.util.TestRuleAssertionsRequired$1.evaluate(TestRuleAssertionsRequired.java:54)
	at org.apache.lucene.util.TestRuleMarkFailure$1.evaluate(TestRuleMarkFailure.java:48)
	at org.apache.lucene.util.TestRuleIgnoreAfterMaxFailures$1.evaluate(TestRuleIgnoreAfterMaxFailures.java:65)
	at org.apache.lucene.util.TestRuleIgnoreTestSuites$1.evaluate(TestRuleIgnoreTestSuites.java:55)
	at com.carrotsearch.randomizedtesting.rules.StatementAdapter.evaluate(StatementAdapter.java:36)
	at com.carrotsearch.randomizedtesting.ThreadLeakControl$StatementRunner.run(ThreadLeakControl.java:365)
	at java.lang.Thread.run(Thread.java:745)


FAILED:  org.apache.solr.client.solrj.io.stream.StreamingTest.streamTests

Error Message:
There are still nodes recoverying - waited for 30 seconds

Stack Trace:
java.lang.AssertionError: There are still nodes recoverying - waited for 30 seconds
	at __randomizedtesting.SeedInfo.seed([537BF64616D14F4B:AF20D1C2BCF8B63E]:0)
	at org.junit.Assert.fail(Assert.java:93)
	at org.apache.solr.cloud.AbstractDistribZkTestBase.waitForRecoveriesToFinish(AbstractDistribZkTestBase.java:172)
	at org.apache.solr.cloud.AbstractFullDistribZkTestBase.waitForRecoveriesToFinish(AbstractFullDistribZkTestBase.java:834)
	at org.apache.solr.cloud.AbstractFullDistribZkTestBase.waitForThingsToLevelOut(AbstractFullDistribZkTestBase.java:1391)
	at org.apache.solr.client.solrj.io.stream.StreamingTest.streamTests(StreamingTest.java:1059)
	at sun.reflect.NativeMethodAccessorImpl.invoke0(Native Method)
	at sun.reflect.NativeMethodAccessorImpl.invoke(NativeMethodAccessorImpl.java:62)
	at sun.reflect.DelegatingMethodAccessorImpl.invoke(DelegatingMethodAccessorImpl.java:43)
	at java.lang.reflect.Method.invoke(Method.java:497)
	at com.carrotsearch.randomizedtesting.RandomizedRunner.invoke(RandomizedRunner.java:1627)
	at com.carrotsearch.randomizedtesting.RandomizedRunner$6.evaluate(RandomizedRunner.java:836)
	at com.carrotsearch.randomizedtesting.RandomizedRunner$7.evaluate(RandomizedRunner.java:872)
	at com.carrotsearch.randomizedtesting.RandomizedRunner$8.evaluate(RandomizedRunner.java:886)
	at org.apache.solr.BaseDistributedSearchTestCase$ShardsRepeatRule$ShardsFixedStatement.callStatement(BaseDistributedSearchTestCase.java:966)
	at org.apache.solr.BaseDistributedSearchTestCase$ShardsRepeatRule$ShardsStatement.evaluate(BaseDistributedSearchTestCase.java:941)
	at com.carrotsearch.randomizedtesting.rules.SystemPropertiesRestoreRule$1.evaluate(SystemPropertiesRestoreRule.java:57)
	at org.apache.lucene.util.TestRuleSetupTeardownChained$1.evaluate(TestRuleSetupTeardownChained.java:50)
	at org.apache.lucene.util.AbstractBeforeAfterRule$1.evaluate(AbstractBeforeAfterRule.java:46)
	at org.apache.lucene.util.TestRuleThreadAndTestName$1.evaluate(TestRuleThreadAndTestName.java:49)
	at org.apache.lucene.util.TestRuleIgnoreAfterMaxFailures$1.evaluate(TestRuleIgnoreAfterMaxFailures.java:65)
	at org.apache.lucene.util.TestRuleMarkFailure$1.evaluate(TestRuleMarkFailure.java:48)
	at com.carrotsearch.randomizedtesting.rules.StatementAdapter.evaluate(StatementAdapter.java:36)
	at com.carrotsearch.randomizedtesting.ThreadLeakControl$StatementRunner.run(ThreadLeakControl.java:365)
	at com.carrotsearch.randomizedtesting.ThreadLeakControl.forkTimeoutingTask(ThreadLeakControl.java:798)
	at com.carrotsearch.randomizedtesting.ThreadLeakControl$3.evaluate(ThreadLeakControl.java:458)
	at com.carrotsearch.randomizedtesting.RandomizedRunner.runSingleTest(RandomizedRunner.java:845)
	at com.carrotsearch.randomizedtesting.RandomizedRunner$3.evaluate(RandomizedRunner.java:747)
	at com.carrotsearch.randomizedtesting.RandomizedRunner$4.evaluate(RandomizedRunner.java:781)
	at com.carrotsearch.randomizedtesting.RandomizedRunner$5.evaluate(RandomizedRunner.java:792)
	at com.carrotsearch.randomizedtesting.rules.StatementAdapter.evaluate(StatementAdapter.java:36)
	at com.carrotsearch.randomizedtesting.rules.SystemPropertiesRestoreRule$1.evaluate(SystemPropertiesRestoreRule.java:57)
	at org.apache.lucene.util.AbstractBeforeAfterRule$1.evaluate(AbstractBeforeAfterRule.java:46)
	at com.carrotsearch.randomizedtesting.rules.StatementAdapter.evaluate(StatementAdapter.java:36)
	at org.apache.lucene.util.TestRuleStoreClassName$1.evaluate(TestRuleStoreClassName.java:42)
	at com.carrotsearch.randomizedtesting.rules.NoShadowingOrOverridesOnMethodsRule$1.evaluate(NoShadowingOrOverridesOnMethodsRule.java:39)
	at com.carrotsearch.randomizedtesting.rules.NoShadowingOrOverridesOnMethodsRule$1.evaluate(NoShadowingOrOverridesOnMethodsRule.java:39)
	at com.carrotsearch.randomizedtesting.rules.StatementAdapter.evaluate(StatementAdapter.java:36)
	at com.carrotsearch.randomizedtesting.rules.StatementAdapter.evaluate(StatementAdapter.java:36)
	at com.carrotsearch.randomizedtesting.rules.StatementAdapter.evaluate(StatementAdapter.java:36)
	at org.apache.lucene.util.TestRuleAssertionsRequired$1.evaluate(TestRuleAssertionsRequired.java:54)
	at org.apache.lucene.util.TestRuleMarkFailure$1.evaluate(TestRuleMarkFailure.java:48)
	at org.apache.lucene.util.TestRuleIgnoreAfterMaxFailures$1.evaluate(TestRuleIgnoreAfterMaxFailures.java:65)
	at org.apache.lucene.util.TestRuleIgnoreTestSuites$1.evaluate(TestRuleIgnoreTestSuites.java:55)
	at com.carrotsearch.randomizedtesting.rules.StatementAdapter.evaluate(StatementAdapter.java:36)
	at com.carrotsearch.randomizedtesting.ThreadLeakControl$StatementRunner.run(ThreadLeakControl.java:365)
	at java.lang.Thread.run(Thread.java:745)




Build Log:
[...truncated 11637 lines...]
   [junit4] Suite: org.apache.solr.client.solrj.io.stream.StreamExpressionTest
   [junit4]   2> Creating dataDir: C:\Users\JenkinsSlave\workspace\Lucene-Solr-trunk-Windows\solr\build\solr-solrj\test\J0\temp\solr.client.solrj.io.stream.StreamExpressionTest_537BF64616D14F4B-001\init-core-data-001
   [junit4]   2> 79855 INFO  (SUITE-StreamExpressionTest-seed#[537BF64616D14F4B]-worker) [    ] o.a.s.SolrTestCaseJ4 Randomized ssl (true) and clientAuth (false)
   [junit4]   2> 79855 INFO  (SUITE-StreamExpressionTest-seed#[537BF64616D14F4B]-worker) [    ] o.a.s.BaseDistributedSearchTestCase Setting hostContext system property: /
   [junit4]   2> 79858 WARN  (SUITE-StreamExpressionTest-seed#[537BF64616D14F4B]-worker) [    ] o.a.s.c.AbstractZkTestCase TEST_HOME() does not exist - solrj test?
   [junit4]   2> 79868 INFO  (TEST-StreamExpressionTest.testAll-seed#[537BF64616D14F4B]) [    ] o.a.s.c.ZkTestServer STARTING ZK TEST SERVER
   [junit4]   2> 79869 INFO  (Thread-239) [    ] o.a.s.c.ZkTestServer client port:0.0.0.0/0.0.0.0:0
   [junit4]   2> 79869 INFO  (Thread-239) [    ] o.a.s.c.ZkTestServer Starting server
   [junit4]   2> 79970 INFO  (TEST-StreamExpressionTest.testAll-seed#[537BF64616D14F4B]) [    ] o.a.s.c.ZkTestServer start zk server on port:50635
   [junit4]   2> 79970 INFO  (TEST-StreamExpressionTest.testAll-seed#[537BF64616D14F4B]) [    ] o.a.s.c.c.SolrZkClient Using default ZkCredentialsProvider
   [junit4]   2> 79972 INFO  (TEST-StreamExpressionTest.testAll-seed#[537BF64616D14F4B]) [    ] o.a.s.c.c.ConnectionManager Waiting for client to connect to ZooKeeper
   [junit4]   2> 79976 INFO  (zkCallback-30-thread-1) [    ] o.a.s.c.c.ConnectionManager Watcher org.apache.solr.common.cloud.ConnectionManager@76c597c9 name:ZooKeeperConnection Watcher:127.0.0.1:50635 got event WatchedEvent state:SyncConnected type:None path:null path:null type:None
   [junit4]   2> 79976 INFO  (TEST-StreamExpressionTest.testAll-seed#[537BF64616D14F4B]) [    ] o.a.s.c.c.ConnectionManager Client is connected to ZooKeeper
   [junit4]   2> 79976 INFO  (TEST-StreamExpressionTest.testAll-seed#[537BF64616D14F4B]) [    ] o.a.s.c.c.SolrZkClient Using default ZkACLProvider
   [junit4]   2> 79976 INFO  (TEST-StreamExpressionTest.testAll-seed#[537BF64616D14F4B]) [    ] o.a.s.c.c.SolrZkClient makePath: /solr
   [junit4]   2> 79981 INFO  (TEST-StreamExpressionTest.testAll-seed#[537BF64616D14F4B]) [    ] o.a.s.c.c.SolrZkClient Using default ZkCredentialsProvider
   [junit4]   2> 79981 WARN  (NIOServerCxn.Factory:0.0.0.0/0.0.0.0:0) [    ] o.a.z.s.NIOServerCnxn caught end of stream exception
   [junit4]   2> EndOfStreamException: Unable to read additional data from client sessionid 0x14ee087edec0000, likely client has closed socket
   [junit4]   2> 	at org.apache.zookeeper.server.NIOServerCnxn.doIO(NIOServerCnxn.java:228)
   [junit4]   2> 	at org.apache.zookeeper.server.NIOServerCnxnFactory.run(NIOServerCnxnFactory.java:208)
   [junit4]   2> 	at java.lang.Thread.run(Thread.java:745)
   [junit4]   2> 79982 INFO  (TEST-StreamExpressionTest.testAll-seed#[537BF64616D14F4B]) [    ] o.a.s.c.c.ConnectionManager Waiting for client to connect to ZooKeeper
   [junit4]   2> 79990 INFO  (zkCallback-31-thread-1) [    ] o.a.s.c.c.ConnectionManager Watcher org.apache.solr.common.cloud.ConnectionManager@667b057d name:ZooKeeperConnection Watcher:127.0.0.1:50635/solr got event WatchedEvent state:SyncConnected type:None path:null path:null type:None
   [junit4]   2> 79990 INFO  (TEST-StreamExpressionTest.testAll-seed#[537BF64616D14F4B]) [    ] o.a.s.c.c.ConnectionManager Client is connected to ZooKeeper
   [junit4]   2> 79991 INFO  (TEST-StreamExpressionTest.testAll-seed#[537BF64616D14F4B]) [    ] o.a.s.c.c.SolrZkClient Using default ZkACLProvider
   [junit4]   2> 79994 INFO  (TEST-StreamExpressionTest.testAll-seed#[537BF64616D14F4B]) [    ] o.a.s.c.c.SolrZkClient makePath: /collections/collection1
   [junit4]   2> 80000 INFO  (TEST-StreamExpressionTest.testAll-seed#[537BF64616D14F4B]) [    ] o.a.s.c.c.SolrZkClient makePath: /collections/collection1/shards
   [junit4]   2> 80005 INFO  (TEST-StreamExpressionTest.testAll-seed#[537BF64616D14F4B]) [    ] o.a.s.c.c.SolrZkClient makePath: /collections/control_collection
   [junit4]   2> 80008 INFO  (TEST-StreamExpressionTest.testAll-seed#[537BF64616D14F4B]) [    ] o.a.s.c.c.SolrZkClient makePath: /collections/control_collection/shards
   [junit4]   2> 80014 INFO  (TEST-StreamExpressionTest.testAll-seed#[537BF64616D14F4B]) [    ] o.a.s.c.AbstractZkTestCase put C:\Users\JenkinsSlave\workspace\Lucene-Solr-trunk-Windows\solr\solrj\src\test-files\solrj\solr\collection1\conf\solrconfig-streaming.xml to /configs/conf1/solrconfig.xml
   [junit4]   2> 80014 INFO  (TEST-StreamExpressionTest.testAll-seed#[537BF64616D14F4B]) [    ] o.a.s.c.c.SolrZkClient makePath: /configs/conf1/solrconfig.xml
   [junit4]   2> 80019 INFO  (TEST-StreamExpressionTest.testAll-seed#[537BF64616D14F4B]) [    ] o.a.s.c.AbstractZkTestCase put C:\Users\JenkinsSlave\workspace\Lucene-Solr-trunk-Windows\solr\solrj\src\test-files\solrj\solr\collection1\conf\schema-streaming.xml to /configs/conf1/schema.xml
   [junit4]   2> 80019 INFO  (TEST-StreamExpressionTest.testAll-seed#[537BF64616D14F4B]) [    ] o.a.s.c.c.SolrZkClient makePath: /configs/conf1/schema.xml
   [junit4]   2> 80023 INFO  (TEST-StreamExpressionTest.testAll-seed#[537BF64616D14F4B]) [    ] o.a.s.c.AbstractZkTestCase skipping C:\Users\JenkinsSlave\workspace\Lucene-Solr-trunk-Windows\solr\solrj\src\test-files\solrj\solr\collection1\conf\solrconfig.snippet.randomindexconfig.xml because it doesn't exist
   [junit4]   2> 80023 INFO  (TEST-StreamExpressionTest.testAll-seed#[537BF64616D14F4B]) [    ] o.a.s.c.AbstractZkTestCase skipping C:\Users\JenkinsSlave\workspace\Lucene-Solr-trunk-Windows\solr\solrj\src\test-files\solrj\solr\collection1\conf\stopwords.txt because it doesn't exist
   [junit4]   2> 80023 INFO  (TEST-StreamExpressionTest.testAll-seed#[537BF64616D14F4B]) [    ] o.a.s.c.AbstractZkTestCase skipping C:\Users\JenkinsSlave\workspace\Lucene-Solr-trunk-Windows\solr\solrj\src\test-files\solrj\solr\collection1\conf\protwords.txt because it doesn't exist
   [junit4]   2> 80024 INFO  (TEST-StreamExpressionTest.testAll-seed#[537BF64616D14F4B]) [    ] o.a.s.c.AbstractZkTestCase skipping C:\Users\JenkinsSlave\workspace\Lucene-Solr-trunk-Windows\solr\solrj\src\test-files\solrj\solr\collection1\conf\currency.xml because it doesn't exist
   [junit4]   2> 80024 INFO  (TEST-StreamExpressionTest.testAll-seed#[537BF64616D14F4B]) [    ] o.a.s.c.AbstractZkTestCase skipping C:\Users\JenkinsSlave\workspace\Lucene-Solr-trunk-Windows\solr\solrj\src\test-files\solrj\solr\collection1\conf\enumsConfig.xml because it doesn't exist
   [junit4]   2> 80024 INFO  (TEST-StreamExpressionTest.testAll-seed#[537BF64616D14F4B]) [    ] o.a.s.c.AbstractZkTestCase skipping C:\Users\JenkinsSlave\workspace\Lucene-Solr-trunk-Windows\solr\solrj\src\test-files\solrj\solr\collection1\conf\open-exchange-rates.json because it doesn't exist
   [junit4]   2> 80024 INFO  (TEST-StreamExpressionTest.testAll-seed#[537BF64616D14F4B]) [    ] o.a.s.c.AbstractZkTestCase skipping C:\Users\JenkinsSlave\workspace\Lucene-Solr-trunk-Windows\solr\solrj\src\test-files\solrj\solr\collection1\conf\mapping-ISOLatin1Accent.txt because it doesn't exist
   [junit4]   2> 80024 INFO  (TEST-StreamExpressionTest.testAll-seed#[537BF64616D14F4B]) [    ] o.a.s.c.AbstractZkTestCase skipping C:\Users\JenkinsSlave\workspace\Lucene-Solr-trunk-Windows\solr\solrj\src\test-files\solrj\solr\collection1\conf\old_synonyms.txt because it doesn't exist
   [junit4]   2> 80024 INFO  (TEST-StreamExpressionTest.testAll-seed#[537BF64616D14F4B]) [    ] o.a.s.c.AbstractZkTestCase skipping C:\Users\JenkinsSlave\workspace\Lucene-Solr-trunk-Windows\solr\solrj\src\test-files\solrj\solr\collection1\conf\synonyms.txt because it doesn't exist
   [junit4]   2> 80035 INFO  (TEST-StreamExpressionTest.testAll-seed#[537BF64616D14F4B]) [    ] o.a.s.c.c.SolrZkClient Using default ZkCredentialsProvider
   [junit4]   2> 80036 INFO  (TEST-StreamExpressionTest.testAll-seed#[537BF64616D14F4B]) [    ] o.a.s.c.c.ConnectionManager Waiting for client to connect to ZooKeeper
   [junit4]   2> 80040 INFO  (zkCallback-32-thread-1) [    ] o.a.s.c.c.ConnectionManager Watcher org.apache.solr.common.cloud.ConnectionManager@49b86623 name:ZooKeeperConnection Watcher:127.0.0.1:50635/solr got event WatchedEvent state:SyncConnected type:None path:null path:null type:None
   [junit4]   2> 80040 INFO  (TEST-StreamExpressionTest.testAll-seed#[537BF64616D14F4B]) [    ] o.a.s.c.c.ConnectionManager Client is connected to ZooKeeper
   [junit4]   2> 80041 INFO  (TEST-StreamExpressionTest.testAll-seed#[537BF64616D14F4B]) [    ] o.a.s.c.c.SolrZkClient Using default ZkACLProvider
   [junit4]   2> 80138 INFO  (TEST-StreamExpressionTest.testAll-seed#[537BF64616D14F4B]) [    ] o.a.s.SolrTestCaseJ4 Writing core.properties file to C:\Users\JenkinsSlave\workspace\Lucene-Solr-trunk-Windows\solr\build\solr-solrj\test\J0\temp\solr.client.solrj.io.stream.StreamExpressionTest_537BF64616D14F4B-001\control-001\cores\collection1
   [junit4]   2> 80165 INFO  (TEST-StreamExpressionTest.testAll-seed#[537BF64616D14F4B]) [    ] o.e.j.s.Server jetty-9.2.11.v20150529
   [junit4]   2> 80170 INFO  (TEST-StreamExpressionTest.testAll-seed#[537BF64616D14F4B]) [    ] o.e.j.s.h.ContextHandler Started o.e.j.s.ServletContextHandler@6f4b8dbe{/,null,AVAILABLE}
   [junit4]   2> 80308 INFO  (TEST-StreamExpressionTest.testAll-seed#[537BF64616D14F4B]) [    ] o.e.j.s.ServerConnector Started ServerConnector@53cbe33b{SSL-http/1.1}{127.0.0.1:50645}
   [junit4]   2> 80309 INFO  (TEST-StreamExpressionTest.testAll-seed#[537BF64616D14F4B]) [    ] o.e.j.s.Server Started @85297ms
   [junit4]   2> 80309 INFO  (TEST-StreamExpressionTest.testAll-seed#[537BF64616D14F4B]) [    ] o.a.s.c.s.e.JettySolrRunner Jetty properties: {solr.data.dir=C:\Users\JenkinsSlave\workspace\Lucene-Solr-trunk-Windows\solr\build\solr-solrj\test\J0\temp\solr.client.solrj.io.stream.StreamExpressionTest_537BF64616D14F4B-001\tempDir-001/control/data, hostContext=/, hostPort=50645, coreRootDirectory=C:\Users\JenkinsSlave\workspace\Lucene-Solr-trunk-Windows\solr\build\solr-solrj\test\J0\..\..\..\..\..\..\..\..\..\Users\JenkinsSlave\workspace\Lucene-Solr-trunk-Windows\solr\build\solr-solrj\test\J0\temp\solr.client.solrj.io.stream.StreamExpressionTest_537BF64616D14F4B-001\control-001\cores}
   [junit4]   2> 80319 INFO  (TEST-StreamExpressionTest.testAll-seed#[537BF64616D14F4B]) [    ] o.a.s.s.SolrDispatchFilter SolrDispatchFilter.init(): sun.misc.Launcher$AppClassLoader@659e0bfd
   [junit4]   2> 80319 INFO  (TEST-StreamExpressionTest.testAll-seed#[537BF64616D14F4B]) [    ] o.a.s.c.SolrResourceLoader new SolrResourceLoader for directory: 'C:\Users\JenkinsSlave\workspace\Lucene-Solr-trunk-Windows\solr\build\solr-solrj\test\J0\..\..\..\..\..\..\..\..\..\Users\JenkinsSlave\workspace\Lucene-Solr-trunk-Windows\solr\build\solr-solrj\test\J0\temp\solr.client.solrj.io.stream.StreamExpressionTest_537BF64616D14F4B-001\control-001\'
   [junit4]   2> 80336 INFO  (TEST-StreamExpressionTest.testAll-seed#[537BF64616D14F4B]) [    ] o.a.s.c.c.SolrZkClient Using default ZkCredentialsProvider
   [junit4]   2> 80337 INFO  (TEST-StreamExpressionTest.testAll-seed#[537BF64616D14F4B]) [    ] o.a.s.c.c.ConnectionManager Waiting for client to connect to ZooKeeper
   [junit4]   2> 80339 INFO  (zkCallback-33-thread-1) [    ] o.a.s.c.c.ConnectionManager Watcher org.apache.solr.common.cloud.ConnectionManager@67f26dbe name:ZooKeeperConnection Watcher:127.0.0.1:50635/solr got event WatchedEvent state:SyncConnected type:None path:null path:null type:None
   [junit4]   2> 80340 INFO  (TEST-StreamExpressionTest.testAll-seed#[537BF64616D14F4B]) [    ] o.a.s.c.c.ConnectionManager Client is connected to ZooKeeper
   [junit4]   2> 80340 INFO  (TEST-StreamExpressionTest.testAll-seed#[537BF64616D14F4B]) [    ] o.a.s.c.c.SolrZkClient Using default ZkACLProvider
   [junit4]   2> 80342 INFO  (TEST-StreamExpressionTest.testAll-seed#[537BF64616D14F4B]) [    ] o.a.s.s.SolrDispatchFilter Loading solr.xml from SolrHome (not found in ZooKeeper)
   [junit4]   2> 80342 INFO  (TEST-StreamExpressionTest.testAll-seed#[537BF64616D14F4B]) [    ] o.a.s.c.SolrXmlConfig Loading container configuration from C:\Users\JenkinsSlave\workspace\Lucene-Solr-trunk-Windows\solr\build\solr-solrj\test\J0\..\..\..\..\..\..\..\..\..\Users\JenkinsSlave\workspace\Lucene-Solr-trunk-Windows\solr\build\solr-solrj\test\J0\temp\solr.client.solrj.io.stream.StreamExpressionTest_537BF64616D14F4B-001\control-001\solr.xml
   [junit4]   2> 80353 INFO  (TEST-StreamExpressionTest.testAll-seed#[537BF64616D14F4B]) [    ] o.a.s.c.CoresLocator Config-defined core root directory: C:\Users\JenkinsSlave\workspace\Lucene-Solr-trunk-Windows\solr\build\solr-solrj\test\J0\..\..\..\..\..\..\..\..\..\Users\JenkinsSlave\workspace\Lucene-Solr-trunk-Windows\solr\build\solr-solrj\test\J0\temp\solr.client.solrj.io.stream.StreamExpressionTest_537BF64616D14F4B-001\control-001\cores
   [junit4]   2> 80353 INFO  (TEST-StreamExpressionTest.testAll-seed#[537BF64616D14F4B]) [    ] o.a.s.c.CoreContainer New CoreContainer 1841147072
   [junit4]   2> 80353 INFO  (TEST-StreamExpressionTest.testAll-seed#[537BF64616D14F4B]) [    ] o.a.s.c.CoreContainer Loading cores into CoreContainer [instanceDir=C:\Users\JenkinsSlave\workspace\Lucene-Solr-trunk-Windows\solr\build\solr-solrj\test\J0\..\..\..\..\..\..\..\..\..\Users\JenkinsSlave\workspace\Lucene-Solr-trunk-Windows\solr\build\solr-solrj\test\J0\temp\solr.client.solrj.io.stream.StreamExpressionTest_537BF64616D14F4B-001\control-001\]
   [junit4]   2> 80353 INFO  (TEST-StreamExpressionTest.testAll-seed#[537BF64616D14F4B]) [    ] o.a.s.c.CoreContainer loading shared library: C:\Users\JenkinsSlave\workspace\Lucene-Solr-trunk-Windows\solr\build\solr-solrj\test\J0\..\..\..\..\..\..\..\..\..\Users\JenkinsSlave\workspace\Lucene-Solr-trunk-Windows\solr\build\solr-solrj\test\J0\temp\solr.client.solrj.io.stream.StreamExpressionTest_537BF64616D14F4B-001\control-001\lib
   [junit4]   2> 80353 WARN  (TEST-StreamExpressionTest.testAll-seed#[537BF64616D14F4B]) [    ] o.a.s.c.SolrResourceLoader Can't find (or read) directory to add to classloader: lib (resolved as: C:\Users\JenkinsSlave\workspace\Lucene-Solr-trunk-Windows\solr\build\solr-solrj\test\J0\..\..\..\..\..\..\..\..\..\Users\JenkinsSlave\workspace\Lucene-Solr-trunk-Windows\solr\build\solr-solrj\test\J0\temp\solr.client.solrj.io.stream.StreamExpressionTest_537BF64616D14F4B-001\control-001\lib).
   [junit4]   2> 80360 INFO  (TEST-StreamExpressionTest.testAll-seed#[537BF64616D14F4B]) [    ] o.a.s.h.c.HttpShardHandlerFactory created with socketTimeout : 90000,urlScheme : ,connTimeout : 15000,maxConnectionsPerHost : 20,maxConnections : 10000,corePoolSize : 0,maximumPoolSize : 2147483647,maxThreadIdleTime : 5,sizeOfQueue : -1,fairnessPolicy : false,useRetries : false,
   [junit4]   2> 80364 INFO  (TEST-StreamExpressionTest.testAll-seed#[537BF64616D14F4B]) [    ] o.a.s.u.UpdateShardHandler Creating UpdateShardHandler HTTP client with params: socketTimeout=340000&connTimeout=45000&retry=true
   [junit4]   2> 80366 INFO  (TEST-StreamExpressionTest.testAll-seed#[537BF64616D14F4B]) [    ] o.a.s.l.LogWatcher SLF4J impl is org.slf4j.impl.Log4jLoggerFactory
   [junit4]   2> 80367 INFO  (TEST-StreamExpressionTest.testAll-seed#[537BF64616D14F4B]) [    ] o.a.s.l.LogWatcher Registering Log Listener [Log4j (org.slf4j.impl.Log4jLoggerFactory)]
   [junit4]   2> 80367 INFO  (TEST-StreamExpressionTest.testAll-seed#[537BF64616D14F4B]) [    ] o.a.s.c.ZkContainer Zookeeper client=127.0.0.1:50635/solr
   [junit4]   2> 80382 INFO  (TEST-StreamExpressionTest.testAll-seed#[537BF64616D14F4B]) [    ] o.a.s.c.ZkController zkHost includes chroot
   [junit4]   2> 80382 INFO  (TEST-StreamExpressionTest.testAll-seed#[537BF64616D14F4B]) [    ] o.a.s.c.c.SolrZkClient Using default ZkCredentialsProvider
   [junit4]   2> 80383 INFO  (TEST-StreamExpressionTest.testAll-seed#[537BF64616D14F4B]) [    ] o.a.s.c.c.ConnectionManager Waiting for client to connect to ZooKeeper
   [junit4]   2> 80385 INFO  (zkCallback-35-thread-1) [    ] o.a.s.c.c.ConnectionManager Watcher org.apache.solr.common.cloud.ConnectionManager@4671ab7c name:ZooKeeperConnection Watcher:127.0.0.1:50635 got event WatchedEvent state:SyncConnected type:None path:null path:null type:None
   [junit4]   2> 80386 INFO  (TEST-StreamExpressionTest.testAll-seed#[537BF64616D14F4B]) [    ] o.a.s.c.c.ConnectionManager Client is connected to ZooKeeper
   [junit4]   2> 80386 INFO  (TEST-StreamExpressionTest.testAll-seed#[537BF64616D14F4B]) [    ] o.a.s.c.c.SolrZkClient Using default ZkACLProvider
   [junit4]   2> 80395 INFO  (TEST-StreamExpressionTest.testAll-seed#[537BF64616D14F4B]) [n:127.0.0.1:50645_    ] o.a.s.c.c.ConnectionManager Waiting for client to connect to ZooKeeper
   [junit4]   2> 80396 INFO  (zkCallback-36-thread-1-processing-n:127.0.0.1:50645_) [n:127.0.0.1:50645_    ] o.a.s.c.c.ConnectionManager Watcher org.apache.solr.common.cloud.ConnectionManager@5853ddfc name:ZooKeeperConnection Watcher:127.0.0.1:50635/solr got event WatchedEvent state:SyncConnected type:None path:null path:null type:None
   [junit4]   2> 80396 INFO  (TEST-StreamExpressionTest.testAll-seed#[537BF64616D14F4B]) [n:127.0.0.1:50645_    ] o.a.s.c.c.ConnectionManager Client is connected to ZooKeeper
   [junit4]   2> 80408 INFO  (TEST-StreamExpressionTest.testAll-seed#[537BF64616D14F4B]) [n:127.0.0.1:50645_    ] o.a.s.c.c.SolrZkClient makePath: /overseer/queue
   [junit4]   2> 80412 INFO  (TEST-StreamExpressionTest.testAll-seed#[537BF64616D14F4B]) [n:127.0.0.1:50645_    ] o.a.s.c.c.SolrZkClient makePath: /overseer/collection-queue-work
   [junit4]   2> 80416 INFO  (TEST-StreamExpressionTest.testAll-seed#[537BF64616D14F4B]) [n:127.0.0.1:50645_    ] o.a.s.c.c.SolrZkClient makePath: /overseer/collection-map-running
   [junit4]   2> 80421 INFO  (TEST-StreamExpressionTest.testAll-seed#[537BF64616D14F4B]) [n:127.0.0.1:50645_    ] o.a.s.c.c.SolrZkClient makePath: /overseer/collection-map-completed
   [junit4]   2> 80424 INFO  (TEST-StreamExpressionTest.testAll-seed#[537BF64616D14F4B]) [n:127.0.0.1:50645_    ] o.a.s.c.c.SolrZkClient makePath: /overseer/collection-map-failure
   [junit4]   2> 80431 INFO  (TEST-StreamExpressionTest.testAll-seed#[537BF64616D14F4B]) [n:127.0.0.1:50645_    ] o.a.s.c.c.SolrZkClient makePath: /live_nodes
   [junit4]   2> 80434 INFO  (TEST-StreamExpressionTest.testAll-seed#[537BF64616D14F4B]) [n:127.0.0.1:50645_    ] o.a.s.c.c.SolrZkClient makePath: /aliases.json
   [junit4]   2> 80434 INFO  (TEST-StreamExpressionTest.testAll-seed#[537BF64616D14F4B]) [n:127.0.0.1:50645_    ] o.a.s.c.c.SolrZkClient makePath: /clusterstate.json
   [junit4]   2> 80436 INFO  (TEST-StreamExpressionTest.testAll-seed#[537BF64616D14F4B]) [n:127.0.0.1:50645_    ] o.a.s.c.ZkController Register node as live in ZooKeeper:/live_nodes/127.0.0.1:50645_
   [junit4]   2> 80438 INFO  (TEST-StreamExpressionTest.testAll-seed#[537BF64616D14F4B]) [n:127.0.0.1:50645_    ] o.a.s.c.c.SolrZkClient makePath: /live_nodes/127.0.0.1:50645_
   [junit4]   2> 80441 INFO  (TEST-StreamExpressionTest.testAll-seed#[537BF64616D14F4B]) [n:127.0.0.1:50645_    ] o.a.s.c.c.SolrZkClient makePath: /overseer_elect
   [junit4]   2> 80443 INFO  (TEST-StreamExpressionTest.testAll-seed#[537BF64616D14F4B]) [n:127.0.0.1:50645_    ] o.a.s.c.c.SolrZkClient makePath: /overseer_elect/election
   [junit4]   2> 80445 INFO  (TEST-StreamExpressionTest.testAll-seed#[537BF64616D14F4B]) [n:127.0.0.1:50645_    ] o.a.s.c.Overseer Overseer (id=null) closing
   [junit4]   2> 80447 INFO  (TEST-StreamExpressionTest.testAll-seed#[537BF64616D14F4B]) [n:127.0.0.1:50645_    ] o.a.s.c.LeaderElector Joined leadership election with path: /overseer_elect/election/94259516638232581-127.0.0.1:50645_-n_0000000000
   [junit4]   2> 80452 INFO  (TEST-StreamExpressionTest.testAll-seed#[537BF64616D14F4B]) [n:127.0.0.1:50645_    ] o.a.s.c.OverseerElectionContext I am going to be the leader 127.0.0.1:50645_
   [junit4]   2> 80452 INFO  (TEST-StreamExpressionTest.testAll-seed#[537BF64616D14F4B]) [n:127.0.0.1:50645_    ] o.a.s.c.c.SolrZkClient makePath: /overseer_elect/leader
   [junit4]   2> 80456 INFO  (TEST-StreamExpressionTest.testAll-seed#[537BF64616D14F4B]) [n:127.0.0.1:50645_    ] o.a.s.c.Overseer Overseer (id=94259516638232581-127.0.0.1:50645_-n_0000000000) starting
   [junit4]   2> 80469 INFO  (TEST-StreamExpressionTest.testAll-seed#[537BF64616D14F4B]) [n:127.0.0.1:50645_    ] o.a.s.c.c.SolrZkClient makePath: /overseer/queue-work
   [junit4]   2> 80493 INFO  (TEST-StreamExpressionTest.testAll-seed#[537BF64616D14F4B]) [n:127.0.0.1:50645_    ] o.a.s.c.OverseerAutoReplicaFailoverThread Starting OverseerAutoReplicaFailoverThread autoReplicaFailoverWorkLoopDelay=10000 autoReplicaFailoverWaitAfterExpiration=30000 autoReplicaFailoverBadNodeExpiration=60000
   [junit4]   2> 80502 INFO  (OverseerCollectionProcessor-94259516638232581-127.0.0.1:50645_-n_0000000000) [n:127.0.0.1:50645_    ] o.a.s.c.OverseerCollectionProcessor Process current queue of collection creations
   [junit4]   2> 80504 INFO  (TEST-StreamExpressionTest.testAll-seed#[537BF64616D14F4B]) [n:127.0.0.1:50645_    ] o.a.s.c.c.ZkStateReader Updating cluster state from ZooKeeper... 
   [junit4]   2> 80515 INFO  (OverseerStateUpdate-94259516638232581-127.0.0.1:50645_-n_0000000000) [n:127.0.0.1:50645_    ] o.a.s.c.Overseer Starting to work on the main queue
   [junit4]   2> 80539 INFO  (TEST-StreamExpressionTest.testAll-seed#[537BF64616D14F4B]) [n:127.0.0.1:50645_    ] o.a.s.c.CoreContainer No authentication plugin used.
   [junit4]   2> 80540 INFO  (TEST-StreamExpressionTest.testAll-seed#[537BF64616D14F4B]) [n:127.0.0.1:50645_    ] o.a.s.c.CoreContainer Security conf doesn't exist. Skipping setup for authorization module.
   [junit4]   2> 80543 INFO  (TEST-StreamExpressionTest.testAll-seed#[537BF64616D14F4B]) [n:127.0.0.1:50645_    ] o.a.s.c.CoresLocator Looking for core definitions underneath C:\Users\JenkinsSlave\workspace\Lucene-Solr-trunk-Windows\solr\build\solr-solrj\test\J0\..\..\..\..\..\..\..\..\..\Users\JenkinsSlave\workspace\Lucene-Solr-trunk-Windows\solr\build\solr-solrj\test\J0\temp\solr.client.solrj.io.stream.StreamExpressionTest_537BF64616D14F4B-001\control-001\cores
   [junit4]   2> 80554 INFO  (TEST-StreamExpressionTest.testAll-seed#[537BF64616D14F4B]) [n:127.0.0.1:50645_    ] o.a.s.c.SolrCore Created CoreDescriptor: {name=collection1, config=solrconfig.xml, transient=false, schema=schema.xml, loadOnStartup=true, configSetProperties=configsetprops.json, instanceDir=C:\Users\JenkinsSlave\workspace\Lucene-Solr-trunk-Windows\solr\build\solr-solrj\test\J0\..\..\..\..\..\..\..\..\..\Users\JenkinsSlave\workspace\Lucene-Solr-trunk-Windows\solr\build\solr-solrj\test\J0\temp\solr.client.solrj.io.stream.StreamExpressionTest_537BF64616D14F4B-001\control-001\cores\collection1, collection=control_collection, absoluteInstDir=C:\Users\JenkinsSlave\workspace\Lucene-Solr-trunk-Windows\solr\build\solr-solrj\test\J0\..\..\..\..\..\..\..\..\..\Users\JenkinsSlave\workspace\Lucene-Solr-trunk-Windows\solr\build\solr-solrj\test\J0\temp\solr.client.solrj.io.stream.StreamExpressionTest_537BF64616D14F4B-001\control-001\cores\collection1\, coreNodeName=, dataDir=data\, shard=}
   [junit4]   2> 80554 INFO  (TEST-StreamExpressionTest.testAll-seed#[537BF64616D14F4B]) [n:127.0.0.1:50645_    ] o.a.s.c.CoresLocator Found core collection1 in C:\Users\JenkinsSlave\workspace\Lucene-Solr-trunk-Windows\solr\build\solr-solrj\test\J0\..\..\..\..\..\..\..\..\..\Users\JenkinsSlave\workspace\Lucene-Solr-trunk-Windows\solr\build\solr-solrj\test\J0\temp\solr.client.solrj.io.stream.StreamExpressionTest_537BF64616D14F4B-001\control-001\cores\collection1\
   [junit4]   2> 80554 INFO  (TEST-StreamExpressionTest.testAll-seed#[537BF64616D14F4B]) [n:127.0.0.1:50645_    ] o.a.s.c.CoresLocator Found 1 core definitions
   [junit4]   2> 80566 INFO  (TEST-StreamExpressionTest.testAll-seed#[537BF64616D14F4B]) [n:127.0.0.1:50645_    ] o.a.s.s.SolrDispatchFilter user.dir=C:\Users\JenkinsSlave\workspace\Lucene-Solr-trunk-Windows\solr\build\solr-solrj\test\J0
   [junit4]   2> 80566 INFO  (TEST-StreamExpressionTest.testAll-seed#[537BF64616D14F4B]) [n:127.0.0.1:50645_    ] o.a.s.s.SolrDispatchFilter SolrDispatchFilter.init() done
   [junit4]   2> 80582 INFO  (coreLoadExecutor-255-thread-1-processing-n:127.0.0.1:50645_) [n:127.0.0.1:50645_ c:control_collection   x:collection1] o.a.s.c.ZkController publishing state=down
   [junit4]   2> 80583 INFO  (coreLoadExecutor-255-thread-1-processing-n:127.0.0.1:50645_) [n:127.0.0.1:50645_ c:control_collection   x:collection1] o.a.s.c.ZkController numShards not found on descriptor - reading it from system property
   [junit4]   2> 80589 INFO  (coreLoadExecutor-255-thread-1-processing-n:127.0.0.1:50645_) [n:127.0.0.1:50645_ c:control_collection   x:collection1] o.a.s.c.ZkController look for our core node name
   [junit4]   2> 80591 INFO  (zkCallback-36-thread-1-processing-n:127.0.0.1:50645_) [n:127.0.0.1:50645_    ] o.a.s.c.DistributedQueue NodeChildrenChanged fired on path /overseer/queue state SyncConnected
   [junit4]   2> 80597 INFO  (OverseerStateUpdate-94259516638232581-127.0.0.1:50645_-n_0000000000) [n:127.0.0.1:50645_    ] o.a.s.c.Overseer processMessage: queueSize: 1, message = {
   [junit4]   2>   "core":"collection1",
   [junit4]   2>   "roles":null,
   [junit4]   2>   "base_url":"https://127.0.0.1:50645",
   [junit4]   2>   "node_name":"127.0.0.1:50645_",
   [junit4]   2>   "numShards":"1",
   [junit4]   2>   "state":"down",
   [junit4]   2>   "shard":null,
   [junit4]   2>   "collection":"control_collection",
   [junit4]   2>   "operation":"state"} current state version: 0
   [junit4]   2> 80657 INFO  (OverseerStateUpdate-94259516638232581-127.0.0.1:50645_-n_0000000000) [n:127.0.0.1:50645_    ] o.a.s.c.o.ReplicaMutator Update state numShards=1 message={
   [junit4]   2>   "core":"collection1",
   [junit4]   2>   "roles":null,
   [junit4]   2>   "base_url":"https://127.0.0.1:50645",
   [junit4]   2>   "node_name":"127.0.0.1:50645_",
   [junit4]   2>   "numShards":"1",
   [junit4]   2>   "state":"down",
   [junit4]   2>   "shard":null,
   [junit4]   2>   "collection":"control_collection",
   [junit4]   2>   "operation":"state"}
   [junit4]   2> 80661 INFO  (OverseerStateUpdate-94259516638232581-127.0.0.1:50645_-n_0000000000) [n:127.0.0.1:50645_    ] o.a.s.c.o.ClusterStateMutator building a new cName: control_collection
   [junit4]   2> 80679 INFO  (OverseerStateUpdate-94259516638232581-127.0.0.1:50645_-n_0000000000) [n:127.0.0.1:50645_    ] o.a.s.c.o.ReplicaMutator Assigning new node to shard shard=shard1
   [junit4]   2> 80682 INFO  (zkCallback-36-thread-1-processing-n:127.0.0.1:50645_) [n:127.0.0.1:50645_    ] o.a.s.c.c.ZkStateReader A cluster state change: WatchedEvent state:SyncConnected type:NodeDataChanged path:/clusterstate.json, has occurred - updating... (live nodes size: 1)
   [junit4]   2> 80685 INFO  (zkCallback-36-thread-1-processing-n:127.0.0.1:50645_) [n:127.0.0.1:50645_    ] o.a.s.c.c.ZkStateReader Updated cluster state version to 1
   [junit4]   2> 81589 INFO  (coreLoadExecutor-255-thread-1-processing-n:127.0.0.1:50645_) [n:127.0.0.1:50645_ c:control_collection   x:collection1] o.a.s.c.ZkController waiting to find shard id in clusterstate for collection1
   [junit4]   2> 81589 INFO  (coreLoadExecutor-255-thread-1-processing-n:127.0.0.1:50645_) [n:127.0.0.1:50645_ c:control_collection   x:collection1] o.a.s.c.ZkController Check for collection zkNode:control_collection
   [junit4]   2> 81590 INFO  (coreLoadExecutor-255-thread-1-processing-n:127.0.0.1:50645_) [n:127.0.0.1:50645_ c:control_collection   x:collection1] o.a.s.c.ZkController Collection zkNode exists
   [junit4]   2> 81590 INFO  (coreLoadExecutor-255-thread-1-processing-n:127.0.0.1:50645_) [n:127.0.0.1:50645_ c:control_collection   x:collection1] o.a.s.c.c.ZkStateReader Load collection config from:/collections/control_collection
   [junit4]   2> 81591 INFO  (coreLoadExecutor-255-thread-1-processing-n:127.0.0.1:50645_) [n:127.0.0.1:50645_ c:control_collection   x:collection1] o.a.s.c.c.ZkStateReader path=/collections/control_collection configName=conf1 specified config exists in ZooKeeper
   [junit4]   2> 81591 INFO  (coreLoadExecutor-255-thread-1-processing-n:127.0.0.1:50645_) [n:127.0.0.1:50645_ c:control_collection   x:collection1] o.a.s.c.SolrResourceLoader new SolrResourceLoader for directory: 'C:\Users\JenkinsSlave\workspace\Lucene-Solr-trunk-Windows\solr\build\solr-solrj\test\J0\..\..\..\..\..\..\..\..\..\Users\JenkinsSlave\workspace\Lucene-Solr-trunk-Windows\solr\build\solr-solrj\test\J0\temp\solr.client.solrj.io.stream.StreamExpressionTest_537BF64616D14F4B-001\control-001\cores\collection1\'
   [junit4]   2> 81609 INFO  (coreLoadExecutor-255-thread-1-processing-n:127.0.0.1:50645_) [n:127.0.0.1:50645_ c:control_collection   x:collection1] o.a.s.c.Config loaded config solrconfig.xml with version 0 
   [junit4]   2> 81615 INFO  (coreLoadExecutor-255-thread-1-processing-n:127.0.0.1:50645_) [n:127.0.0.1:50645_ c:control_collection   x:collection1] o.a.s.c.SolrConfig current version of requestparams : -1
   [junit4]   2> 81620 INFO  (coreLoadExecutor-255-thread-1-processing-n:127.0.0.1:50645_) [n:127.0.0.1:50645_ c:control_collection   x:collection1] o.a.s.c.SolrConfig Using Lucene MatchVersion: 6.0.0
   [junit4]   2> 81627 INFO  (coreLoadExecutor-255-thread-1-processing-n:127.0.0.1:50645_) [n:127.0.0.1:50645_ c:control_collection   x:collection1] o.a.s.c.Config Loaded SolrConfig: solrconfig.xml
   [junit4]   2> 81629 INFO  (coreLoadExecutor-255-thread-1-processing-n:127.0.0.1:50645_) [n:127.0.0.1:50645_ c:control_collection   x:collection1] o.a.s.s.IndexSchema Reading Solr Schema from /configs/conf1/schema.xml
   [junit4]   2> 81634 INFO  (coreLoadExecutor-255-thread-1-processing-n:127.0.0.1:50645_) [n:127.0.0.1:50645_ c:control_collection   x:collection1] o.a.s.s.IndexSchema [collection1] Schema name=test
   [junit4]   2> 81810 INFO  (coreLoadExecutor-255-thread-1-processing-n:127.0.0.1:50645_) [n:127.0.0.1:50645_ c:control_collection   x:collection1] o.a.s.s.IndexSchema default search field in schema is text
   [junit4]   2> 81810 INFO  (coreLoadExecutor-255-thread-1-processing-n:127.0.0.1:50645_) [n:127.0.0.1:50645_ c:control_collection   x:collection1] o.a.s.s.IndexSchema unique key field: id
   [junit4]   2> 81811 WARN  (coreLoadExecutor-255-thread-1-processing-n:127.0.0.1:50645_) [n:127.0.0.1:50645_ c:control_collection   x:collection1] o.a.s.s.IndexSchema Field lowerfilt1and2 is not multivalued and destination for multiple copyFields (2)
   [junit4]   2> 81811 WARN  (coreLoadExecutor-255-thread-1-processing-n:127.0.0.1:50645_) [n:127.0.0.1:50645_ c:control_collection   x:collection1] o.a.s.s.IndexSchema Field text is not multivalued and destination for multiple copyFields (3)
   [junit4]   2> 81819 INFO  (coreLoadExecutor-255-thread-1-processing-n:127.0.0.1:50645_) [n:127.0.0.1:50645_ c:control_collection   x:collection1] o.a.s.c.ConfigSetProperties Did not find ConfigSet properties, assuming default properties: Can't find resource 'configsetprops.json' in classpath or '/configs/conf1', cwd=C:\Users\JenkinsSlave\workspace\Lucene-Solr-trunk-Windows\solr\build\solr-solrj\test\J0
   [junit4]   2> 81819 INFO  (coreLoadExecutor-255-thread-1-processing-n:127.0.0.1:50645_) [n:127.0.0.1:50645_ c:control_collection   x:collection1] o.a.s.c.CoreContainer Creating SolrCore 'collection1' using configuration from collection control_collection
   [junit4]   2> 81819 INFO  (coreLoadExecutor-255-thread-1-processing-n:127.0.0.1:50645_) [n:127.0.0.1:50645_ c:control_collection s:shard1 r:core_node1 x:collection1] o.a.s.c.SolrCore org.apache.solr.core.MockDirectoryFactory
   [junit4]   2> 81819 INFO  (coreLoadExecutor-255-thread-1-processing-n:127.0.0.1:50645_) [n:127.0.0.1:50645_ c:control_collection s:shard1 r:core_node1 x:collection1] o.a.s.c.SolrCore [[collection1] ] Opening new SolrCore at [C:\Users\JenkinsSlave\workspace\Lucene-Solr-trunk-Windows\solr\build\solr-solrj\test\J0\..\..\..\..\..\..\..\..\..\Users\JenkinsSlave\workspace\Lucene-Solr-trunk-Windows\solr\build\solr-solrj\test\J0\temp\solr.client.solrj.io.stream.StreamExpressionTest_537BF64616D14F4B-001\control-001\cores\collection1\], dataDir=[null]
   [junit4]   2> 81819 INFO  (coreLoadExecutor-255-thread-1-processing-n:127.0.0.1:50645_) [n:127.0.0.1:50645_ c:control_collection s:shard1 r:core_node1 x:collection1] o.a.s.c.SolrCore JMX monitoring not detected for core: collection1
   [junit4]   2> 81820 INFO  (coreLoadExecutor-255-thread-1-processing-n:127.0.0.1:50645_) [n:127.0.0.1:50645_ c:control_collection s:shard1 r:core_node1 x:collection1] o.a.s.c.CachingDirectoryFactory return new directory for C:\Users\JenkinsSlave\workspace\Lucene-Solr-trunk-Windows\solr\build\solr-solrj\test\J0\..\..\..\..\..\..\..\..\..\Users\JenkinsSlave\workspace\Lucene-Solr-trunk-Windows\solr\build\solr-solrj\test\J0\temp\solr.client.solrj.io.stream.StreamExpressionTest_537BF64616D14F4B-001\control-001\cores\collection1\data\
   [junit4]   2> 81820 INFO  (coreLoadExecutor-255-thread-1-processing-n:127.0.0.1:50645_) [n:127.0.0.1:50645_ c:control_collection s:shard1 r:core_node1 x:collection1] o.a.s.c.SolrCore New index directory detected: old=null new=C:\Users\JenkinsSlave\workspace\Lucene-Solr-trunk-Windows\solr\build\solr-solrj\test\J0\..\..\..\..\..\..\..\..\..\Users\JenkinsSlave\workspace\Lucene-Solr-trunk-Windows\solr\build\solr-solrj\test\J0\temp\solr.client.solrj.io.stream.StreamExpressionTest_537BF64616D14F4B-001\control-001\cores\collection1\data\index/
   [junit4]   2> 81820 WARN  (coreLoadExecutor-255-thread-1-processing-n:127.0.0.1:50645_) [n:127.0.0.1:50645_ c:control_collection s:shard1 r:core_node1 x:collection1] o.a.s.c.SolrCore [collection1] Solr index directory 'C:\Users\JenkinsSlave\workspace\Lucene-Solr-trunk-Windows\solr\build\solr-solrj\test\J0\..\..\..\..\..\..\..\..\..\Users\JenkinsSlave\workspace\Lucene-Solr-trunk-Windows\solr\build\solr-solrj\test\J0\temp\solr.client.solrj.io.stream.StreamExpressionTest_537BF64616D14F4B-001\control-001\cores\collection1\data\index' doesn't exist. Creating new index...
   [junit4]   2> 81820 INFO  (coreLoadExecutor-255-thread-1-processing-n:127.0.0.1:50645_) [n:127.0.0.1:50645_ c:control_collection s:shard1 r:core_node1 x:collection1] o.a.s.c.CachingDirectoryFactory return new directory for C:\Users\JenkinsSlave\workspace\Lucene-Solr-trunk-Windows\solr\build\solr-solrj\test\J0\..\..\..\..\..\..\..\..\..\Users\JenkinsSlave\workspace\Lucene-Solr-trunk-Windows\solr\build\solr-solrj\test\J0\temp\solr.client.solrj.io.stream.StreamExpressionTest_537BF64616D14F4B-001\control-001\cores\collection1\data\index
   [junit4]   2> 81821 INFO  (coreLoadExecutor-255-thread-1-processing-n:127.0.0.1:50645_) [n:127.0.0.1:50645_ c:control_collection s:shard1 r:core_node1 x:collection1] o.a.s.c.SolrCore SolrDeletionPolicy.onCommit: commits: num=1
   [junit4]   2> 	commit{dir=MockDirectoryWrapper(RAMDirectory@629a674e lockFactory=org.apache.lucene.store.SingleInstanceLockFactory@4350da73),segFN=segments_1,generation=1}
   [junit4]   2> 81821 INFO  (coreLoadExecutor-255-thread-1-processing-n:127.0.0.1:50645_) [n:127.0.0.1:50645_ c:control_collection s:shard1 r:core_node1 x:collection1] o.a.s.c.SolrCore newest commit generation = 1
   [junit4]   2> 81822 INFO  (OldIndexDirectoryCleanupThreadForCore-collection1) [n:127.0.0.1:50645_ c:control_collection s:shard1 r:core_node1 x:collection1] o.a.s.c.SolrCore Looking for old index directories to cleanup for core collection1 in C:\Users\JenkinsSlave\workspace\Lucene-Solr-trunk-Windows\solr\build\solr-solrj\test\J0\..\..\..\..\..\..\..\..\..\Users\JenkinsSlave\workspace\Lucene-Solr-trunk-Windows\solr\build\solr-solrj\test\J0\temp\solr.client.solrj.io.stream.StreamExpressionTest_537BF64616D14F4B-001\control-001\cores\collection1\data\
   [junit4]   2> 81822 WARN  (OldIndexDirectoryCleanupThreadForCore-collection1) [n:127.0.0.1:50645_ c:control_collection s:shard1 r:core_node1 x:collection1] o.a.s.c.DirectoryFactory C:\Users\JenkinsSlave\workspace\Lucene-Solr-trunk-Windows\solr\build\solr-solrj\test\J0\..\..\..\..\..\..\..\..\..\Users\JenkinsSlave\workspace\Lucene-Solr-trunk-Windows\solr\build\solr-solrj\test\J0\temp\solr.client.solrj.io.stream.StreamExpressionTest_537BF64616D14F4B-001\control-001\cores\collection1\data\ does not point to a valid data directory; skipping clean-up of old index directories.
   [junit4]   2> 81824 INFO  (coreLoadExecutor-255-thread-1-processing-n:127.0.0.1:50645_) [n:127.0.0.1:50645_ c:control_collection s:shard1 r:core_node1 x:collection1] o.a.s.c.SolrCore no updateRequestProcessorChain defined as default, creating implicit default
   [junit4]   2> 81827 INFO  (coreLoadExecutor-255-thread-1-processing-n:127.0.0.1:50645_) [n:127.0.0.1:50645_ c:control_collection s:shard1 r:core_node1 x:collection1] o.a.s.h.l.XMLLoader xsltCacheLifetimeSeconds=60
   [junit4]   2> 81829 INFO  (coreLoadExecutor-255-thread-1-processing-n:127.0.0.1:50645_) [n:127.0.0.1:50645_ c:control_collection s:shard1 r:core_node1 x:collection1] o.a.s.h.l.XMLLoader xsltCacheLifetimeSeconds=60
   [junit4]   2> 81829 INFO  (coreLoadExecutor-255-thread-1-processing-n:127.0.0.1:50645_) [n:127.0.0.1:50645_ c:control_collection s:shard1 r:core_node1 x:collection1] o.a.s.h.l.XMLLoader xsltCacheLifetimeSeconds=60
   [junit4]   2> 81830 INFO  (coreLoadExecutor-255-thread-1-processing-n:127.0.0.1:50645_) [n:127.0.0.1:50645_ c:control_collection s:shard1 r:core_node1 x:collection1] o.a.s.h.l.XMLLoader xsltCacheLifetimeSeconds=60
   [junit4]   2> 81831 INFO  (coreLoadExecutor-255-thread-1-processing-n:127.0.0.1:50645_) [n:127.0.0.1:50645_ c:control_collection s:shard1 r:core_node1 x:collection1] o.a.s.c.RequestHandlers Registered paths: /admin/mbeans,standard,,/update/csv,/update/json/docs,/admin/luke,/export,/admin/segments,/get,/admin/system,/replication,/admin/properties,/config,/stream,/schema,/admin/plugins,/admin/logging,/update/json,/admin/threads,/admin/ping,/update,/admin/file
   [junit4]   2> 81831 WARN  (coreLoadExecutor-255-thread-1-processing-n:127.0.0.1:50645_) [n:127.0.0.1:50645_ c:control_collection s:shard1 r:core_node1 x:collection1] o.a.s.c.RequestHandlers no default request handler is registered (either '/select' or 'standard')
   [junit4]   2> 81832 INFO  (coreLoadExecutor-255-thread-1-processing-n:127.0.0.1:50645_) [n:127.0.0.1:50645_ c:control_collection s:shard1 r:core_node1 x:collection1] o.a.s.c.SolrCore Using default statsCache cache: org.apache.solr.search.stats.LocalStatsCache
   [junit4]   2> 81833 INFO  (coreLoadExecutor-255-thread-1-processing-n:127.0.0.1:50645_) [n:127.0.0.1:50645_ c:control_collection s:shard1 r:core_node1 x:collection1] o.a.s.u.UpdateHandler Using UpdateLog implementation: org.apache.solr.update.UpdateLog
   [junit4]   2> 81833 INFO  (coreLoadExecutor-255-thread-1-processing-n:127.0.0.1:50645_) [n:127.0.0.1:50645_ c:control_collection s:shard1 r:core_node1 x:collection1] o.a.s.u.UpdateLog Initializing UpdateLog: dataDir= defaultSyncLevel=FLUSH numRecordsToKeep=100 maxNumLogsToKeep=10 numVersionBuckets=65536
   [junit4]   2> 81834 INFO  (coreLoadExecutor-255-thread-1-processing-n:127.0.0.1:50645_) [n:127.0.0.1:50645_ c:control_collection s:shard1 r:core_node1 x:collection1] o.a.s.c.SolrCore Hard AutoCommit: disabled
   [junit4]   2> 81834 INFO  (coreLoadExecutor-255-thread-1-processing-n:127.0.0.1:50645_) [n:127.0.0.1:50645_ c:control_collection s:shard1 r:core_node1 x:collection1] o.a.s.c.SolrCore Soft AutoCommit: disabled
   [junit4]   2> 81834 INFO  (coreLoadExecutor-255-thread-1-processing-n:127.0.0.1:50645_) [n:127.0.0.1:50645_ c:control_collection s:shard1 r:core_node1 x:collection1] o.a.s.c.SolrCore SolrDeletionPolicy.onInit: commits: num=1
   [junit4]   2> 	commit{dir=MockDirectoryWrapper(RAMDirectory@629a674e lockFactory=org.apache.lucene.store.SingleInstanceLockFactory@4350da73),segFN=segments_1,generation=1}
   [junit4]   2> 81834 INFO  (coreLoadExecutor-255-thread-1-processing-n:127.0.0.1:50645_) [n:127.0.0.1:50645_ c:control_collection s:shard1 r:core_node1 x:collection1] o.a.s.c.SolrCore newest commit generation = 1
   [junit4]   2> 81835 INFO  (coreLoadExecutor-255-thread-1-processing-n:127.0.0.1:50645_) [n:127.0.0.1:50645_ c:control_collection s:shard1 r:core_node1 x:collection1] o.a.s.s.SolrIndexSearcher Opening Searcher@79db5d9c[collection1] main
   [junit4]   2> 81835 INFO  (coreLoadExecutor-255-thread-1-processing-n:127.0.0.1:50645_) [n:127.0.0.1:50645_ c:control_collection s:shard1 r:core_node1 x:collection1] o.a.s.c.c.ZkStateReader Load collection config from:/collections/control_collection
   [junit4]   2> 81836 INFO  (coreLoadExecutor-255-thread-1-processing-n:127.0.0.1:50645_) [n:127.0.0.1:50645_ c:control_collection s:shard1 r:core_node1 x:collection1] o.a.s.c.c.ZkStateReader path=/collections/control_collection configName=conf1 specified config exists in ZooKeeper
   [junit4]   2> 81836 INFO  (coreLoadExecutor-255-thread-1-processing-n:127.0.0.1:50645_) [n:127.0.0.1:50645_ c:control_collection s:shard1 r:core_node1 x:collection1] o.a.s.r.ManagedResourceStorage Setting up ZooKeeper-based storage for the RestManager with znodeBase: /configs/conf1
   [junit4]   2> 81842 INFO  (coreLoadExecutor-255-thread-1-processing-n:127.0.0.1:50645_) [n:127.0.0.1:50645_ c:control_collection s:shard1 r:core_node1 x:collection1] o.a.s.r.ManagedResourceStorage Configured ZooKeeperStorageIO with znodeBase: /configs/conf1
   [junit4]   2> 81842 INFO  (coreLoadExecutor-255-thread-1-processing-n:127.0.0.1:50645_) [n:127.0.0.1:50645_ c:control_collection s:shard1 r:core_node1 x:collection1] o.a.s.r.RestManager Initializing RestManager with initArgs: {}
   [junit4]   2> 81842 INFO  (coreLoadExecutor-255-thread-1-processing-n:127.0.0.1:50645_) [n:127.0.0.1:50645_ c:control_collection s:shard1 r:core_node1 x:collection1] o.a.s.r.ManagedResourceStorage Reading _rest_managed.json using ZooKeeperStorageIO:path=/configs/conf1
   [junit4]   2> 81843 INFO  (coreLoadExecutor-255-thread-1-processing-n:127.0.0.1:50645_) [n:127.0.0.1:50645_ c:control_collection s:shard1 r:core_node1 x:collection1] o.a.s.r.ManagedResourceStorage No data found for znode /configs/conf1/_rest_managed.json
   [junit4]   2> 81843 INFO  (coreLoadExecutor-255-thread-1-processing-n:127.0.0.1:50645_) [n:127.0.0.1:50645_ c:control_collection s:shard1 r:core_node1 x:collection1] o.a.s.r.ManagedResourceStorage Loaded null at path _rest_managed.json using ZooKeeperStorageIO:path=/configs/conf1
   [junit4]   2> 81843 INFO  (coreLoadExecutor-255-thread-1-processing-n:127.0.0.1:50645_) [n:127.0.0.1:50645_ c:control_collection s:shard1 r:core_node1 x:collection1] o.a.s.r.RestManager Initializing 0 registered ManagedResources
   [junit4]   2> 81843 INFO  (coreLoadExecutor-255-thread-1-processing-n:127.0.0.1:50645_) [n:127.0.0.1:50645_ c:control_collection s:shard1 r:core_node1 x:collection1] o.a.s.h.ReplicationHandler Commits will be reserved for  10000
   [junit4]   2> 81843 INFO  (coreLoadExecutor-255-thread-1-processing-n:127.0.0.1:50645_) [n:127.0.0.1:50645_ c:control_collection s:shard1 r:core_node1 x:collection1] o.a.s.u.UpdateLog Looking up max value of version field to seed version buckets
   [junit4]   2> 81843 INFO  (coreLoadExecutor-255-thread-1-processing-n:127.0.0.1:50645_) [n:127.0.0.1:50645_ c:control_collection s:shard1 r:core_node1 x:collection1] o.a.s.u.VersionInfo Refreshing highest value of _version_ for 65536 version buckets from index
   [junit4]   2> 81843 INFO  (coreLoadExecutor-255-thread-1-processing-n:127.0.0.1:50645_) [n:127.0.0.1:50645_ c:control_collection s:shard1 r:core_node1 x:collection1] o.a.s.u.VersionInfo No terms found for _version_, cannot seed version bucket highest value from index
   [junit4]   2> 81843 INFO  (coreLoadExecutor-255-thread-1-processing-n:127.0.0.1:50645_) [n:127.0.0.1:50645_ c:control_collection s:shard1 r:core_node1 x:collection1] o.a.s.u.UpdateLog Could not find max version in index or recent updates, using new clock 1508152268277415936
   [junit4]   2> 81844 INFO  (searcherExecutor-256-thread-1-processing-n:127.0.0.1:50645_ x:collection1 s:shard1 c:control_collection r:core_node1) [n:127.0.0.1:50645_ c:control_collection s:shard1 r:core_node1 x:collection1] o.a.s.c.SolrCore [collection1] Registered new searcher Searcher@79db5d9c[collection1] main{ExitableDirectoryReader(UninvertingDirectoryReader())}
   [junit4]   2> 81845 INFO  (coreLoadExecutor-255-thread-1-processing-n:127.0.0.1:50645_) [n:127.0.0.1:50645_ c:control_collection s:shard1 r:core_node1 x:collection1] o.a.s.u.UpdateLog Took 2 ms to seed version buckets with highest version 1508152268277415936
   [junit4]   2> 81848 INFO  (coreLoadExecutor-255-thread-1-processing-n:127.0.0.1:50645_) [n:127.0.0.1:50645_ c:control_collection s:shard1 r:core_node1 x:collection1] o.a.s.c.ZkController watch zkdir /configs/conf1
   [junit4]   2> 81850 INFO  (coreLoadExecutor-255-thread-1-processing-n:127.0.0.1:50645_) [n:127.0.0.1:50645_ c:control_collection s:shard1 r:core_node1 x:collection1] o.a.s.c.CoreContainer registering core: collection1
   [junit4]   2> 81851 INFO  (coreZkRegister-249-thread-1-processing-n:127.0.0.1:50645_ x:collection1 s:shard1 c:control_collection r:core_node1) [n:127.0.0.1:50645_ c:control_collection s:shard1 r:core_node1 x:collection1] o.a.s.c.ZkController Register replica - core:collection1 address:https://127.0.0.1:50645 collection:control_collection shard:shard1
   [junit4]   2> 81864 INFO  (coreZkRegister-249-thread-1-processing-n:127.0.0.1:50645_ x:collection1 s:shard1 c:control_collection r:core_node1) [n:127.0.0.1:50645_ c:control_collection s:shard1 r:core_node1 x:collection1] o.a.s.c.c.SolrZkClient makePath: /collections/control_collection/leader_elect/shard1/election
   [junit4]   2> 81870 INFO  (coreZkRegister-249-thread-1-processing-n:127.0.0.1:50645_ x:collection1 s:shard1 c:control_collection r:core_node1) [n:127.0.0.1:50645_ c:control_collection s:shard1 r:core_node1 x:collection1] o.a.s.c.LeaderElector Joined leadership election with path: /collections/control_collection/leader_elect/shard1/election/94259516638232581-core_node1-n_0000000000
   [junit4]   2> 81872 INFO  (coreZkRegister-249-thread-1-processing-n:127.0.0.1:50645_ x:collection1 s:shard1 c:control_collection r:core_node1) [n:127.0.0.1:50645_ c:control_collection s:shard1 r:core_node1 x:collection1] o.a.s.c.ShardLeaderElectionContext Running the leader process for shard shard1
   [junit4]   2> 81874 INFO  (zkCallback-36-thread-1-processing-n:127.0.0.1:50645_) [n:127.0.0.1:50645_    ] o.a.s.c.DistributedQueue NodeChildrenChanged fired on path /overseer/queue state SyncConnected
   [junit4]   2> 81874 INFO  (coreZkRegister-249-thread-1-processing-n:127.0.0.1:50645_ x:collection1 s:shard1 c:control_collection r:core_node1) [n:127.0.0.1:50645_ c:control_collection s:shard1 r:core_node1 x:collection1] o.a.s.c.ShardLeaderElectionContext Enough replicas found to continue.
   [junit4]   2> 81874 INFO  (coreZkRegister-249-thread-1-processing-n:127.0.0.1:50645_ x:collection1 s:shard1 c:control_collection r:core_node1) [n:127.0.0.1:50645_ c:control_collection s:shard1 r:core_node1 x:collection1] o.a.s.c.ShardLeaderElectionContext I may be the new leader - try and sync
   [junit4]   2> 81875 INFO  (OverseerStateUpdate-94259516638232581-127.0.0.1:50645_-n_0000000000) [n:127.0.0.1:50645_    ] o.a.s.c.Overseer processMessage: queueSize: 1, message = {
   [junit4]   2>   "operation":"leader",
   [junit4]   2>   "shard":"shard1",
   [junit4]   2>   "collection":"control_collection"} current state version: 1
   [junit4]   2> 81876 INFO  (coreZkRegister-249-thread-1-processing-n:127.0.0.1:50645_ x:collection1 s:shard1 c:control_collection r:core_node1) [n:127.0.0.1:50645_ c:control_collection s:shard1 r:core_node1 x:collection1] o.a.s.c.SyncStrategy Sync replicas to https://127.0.0.1:50645/collection1/
   [junit4]   2> 81876 INFO  (coreZkRegister-249-thread-1-processing-n:127.0.0.1:50645_ x:collection1 s:shard1 c:control_collection r:core_node1) [n:127.0.0.1:50645_ c:control_collection s:shard1 r:core_node1 x:collection1] o.a.s.c.SyncStrategy Sync Success - now sync replicas to me
   [junit4]   2> 81876 INFO  (coreZkRegister-249-thread-1-processing-n:127.0.0.1:50645_ x:collection1 s:shard1 c:control_collection r:core_node1) [n:127.0.0.1:50645_ c:control_collection s:shard1 r:core_node1 x:collection1] o.a.s.c.SyncStrategy https://127.0.0.1:50645/collection1/ has no replicas
   [junit4]   2> 81876 INFO  (coreZkRegister-249-thread-1-processing-n:127.0.0.1:50645_ x:collection1 s:shard1 c:control_collection r:core_node1) [n:127.0.0.1:50645_ c:control_collection s:shard1 r:core_node1 x:collection1] o.a.s.c.ShardLeaderElectionContext I am the new leader: https://127.0.0.1:50645/collection1/ shard1
   [junit4]   2> 81880 INFO  (coreZkRegister-249-thread-1-processing-n:127.0.0.1:50645_ x:collection1 s:shard1 c:control_collection r:core_node1) [n:127.0.0.1:50645_ c:control_collection s:shard1 r:core_node1 x:collection1] o.a.s.c.c.SolrZkClient makePath: /collections/control_collection/leaders/shard1
   [junit4]   2> 81886 INFO  (zkCallback-36-thread-1-processing-n:127.0.0.1:50645_) [n:127.0.0.1:50645_    ] o.a.s.c.DistributedQueue NodeChildrenChanged fired on path /overseer/queue state SyncConnected
   [junit4]   2> 81886 INFO  (OverseerStateUpdate-94259516638232581-127.0.0.1:50645_-n_0000000000) [n:127.0.0.1:50645_    ] o.a.s.c.Overseer processMessage: queueSize: 1, message = {
   [junit4]   2>   "operation":"leader",
   [junit4]   2>   "shard":"shard1",
   [junit4]   2>   "collection":"control_collection",
   [junit4]   2>   "base_url":"https://127.0.0.1:50645",
   [junit4]   2>   "core":"collection1",
   [junit4]   2>   "state":"active"} current state version: 1
   [junit4]   2> 81991 INFO  (zkCallback-36-thread-1-processing-n:127.0.0.1:50645_) [n:127.0.0.1:50645_    ] o.a.s.c.c.ZkStateReader A cluster state change: WatchedEvent state:SyncConnected type:NodeDataChanged path:/clusterstate.json, has occurred - updating... (live nodes size: 1)
   [junit4]   2> 81993 INFO  (zkCallback-36-thread-1-processing-n:127.0.0.1:50645_) [n:127.0.0.1:50645_    ] o.a.s.c.c.ZkStateReader Updated cluster state version to 2
   [junit4]   2> 82038 INFO  (coreZkRegister-249-thread-1-processing-n:127.0.0.1:50645_ x:collection1 s:shard1 c:control_collection r:core_node1) [n:127.0.0.1:50645_ c:control_collection s:shard1 r:core_node1 x:collection1] o.a.s.c.ZkController We are https://127.0.0.1:50645/collection1/ and leader is https://127.0.0.1:50645/collection1/
   [junit4]   2> 82038 INFO  (coreZkRegister-249-thread-1-processing-n:127.0.0.1:50645_ x:collection1 s:shard1 c:control_collection r:core_node1) [n:127.0.0.1:50645_ c:control_collection s:shard1 r:core_node1 x:collection1] o.a.s.c.ZkController No LogReplay needed for core=collection1 baseURL=https://127.0.0.1:50645
   [junit4]   2> 82038 INFO  (coreZkRegister-249-thread-1-processing-n:127.0.0.1:50645_ x:collection1 s:shard1 c:control_collection r:core_node1) [n:127.0.0.1:50645_ c:control_collection s:shard1 r:core_node1 x:collection1] o.a.s.c.ZkController I am the leader, no recovery necessary
   [junit4]   2> 82038 INFO  (coreZkRegister-249-thread-1-processing-n:127.0.0.1:50645_ x:collection1 s:shard1 c:control_collection r:core_node1) [n:127.0.0.1:50645_ c:control_collection s:shard1 r:core_node1 x:collection1] o.a.s.c.ZkController publishing state=active
   [junit4]   2> 82038 INFO  (coreZkRegister-249-thread-1-processing-n:127.0.0.1:50645_ x:collection1 s:shard1 c:control_collection r:core_node1) [n:127.0.0.1:50645_ c:control_collection s:shard1 r:core_node1 x:collection1] o.a.s.c.ZkController numShards not found on descriptor - reading it from system property
   [junit4]   2> 82039 INFO  (zkCallback-36-thread-1-processing-n:127.0.0.1:50645_) [n:127.0.0.1:50645_    ] o.a.s.c.DistributedQueue NodeChildrenChanged fired on path /overseer/queue state SyncConnected
   [junit4]   2> 82041 INFO  (OverseerStateUpdate-94259516638232581-127.0.0.1:50645_-n_0000000000) [n:127.0.0.1:50645_    ] o.a.s.c.Overseer processMessage: queueSize: 1, message = {
   [junit4]   2>   "core":"collection1",
   [junit4]   2>   "core_node_name":"core_node1",
   [junit4]   2>   "roles":null,
   [junit4]   2>   "base_url":"https://127.0.0.1:50645",
   [junit4]   2>   "node_name":"127.0.0.1:50645_",
   [junit4]   2>   "numShards":"1",
   [junit4]   2>   "state":"active",
   [junit4]   2>   "shard":"shard1",
   [junit4]   2>   "collection":"control_collection",
   [junit4]   2>   "operation":"state"} current state version: 2
   [junit4]   2> 82042 INFO  (OverseerStateUpdate-94259516638232581-127.0.0.1:50645_-n_0000000000) [n:127.0.0.1:50645_    ] o.a.s.c.o.ReplicaMutator Update state numShards=1 message={
   [junit4]   2>   "core":"collection1",
   [junit4]   2>   "core_node_name":"core_node1",
   [junit4]   2>   "roles":null,
   [junit4]   2>   "base_url":"https://127.0.0.1:50645",
   [junit4]   2>   "node_name":"127.0.0.1:50645_",
   [junit4]   2>   "numShards":"1",
   [junit4]   2>   "state":"active",
   [junit4]   2>   "shard":"shard1",
   [junit4]   2>   "collection":"control_collection",
   [junit4]   2>   "operation":"state"}
   [junit4]   2> 82080 INFO  (TEST-StreamExpressionTest.testAll-seed#[537BF64616D14F4B]) [    ] o.a.s.c.c.SolrZkClient Using default ZkCredentialsProvider
   [junit4]   2> 82082 INFO  (TEST-StreamExpressionTest.testAll-seed#[537BF64616D14F4B]) [    ] o.a.s.c.c.ConnectionManager Waiting for client to connect to ZooKeeper
   [junit4]   2> 82083 INFO  (zkCallback-38-thread-1) [    ] o.a.s.c.c.ConnectionManager Watcher org.apache.solr.common.cloud.ConnectionManager@a1cf4d8 name:ZooKeeperConnection Watcher:127.0.0.1:50635/solr got event WatchedEvent state:SyncConnected type:None path:null path:null type:None
   [junit4]   2> 82084 INFO  (TEST-StreamExpressionTest.testAll-seed#[537BF64616D14F4B]) [    ] o.a.s.c.c.ConnectionManager Client is connected to ZooKeeper
   [junit4]   2> 82084 INFO  (TEST-StreamExpressionTest.testAll-seed#[537BF64616D14F4B]) [    ] o.a.s.c.c.SolrZkClient Using default ZkACLProvider
   [junit4]   2> 82084 INFO  (TEST-StreamExpressionTest.testAll-seed#[537BF64616D14F4B]) [    ] o.a.s.c.c.ZkStateReader Updating cluster state from ZooKeeper... 
   [junit4]   2> 82089 INFO  (TEST-StreamExpressionTest.testAll-seed#[537BF64616D14F4B]) [    ] o.a.s.c.ChaosMonkey monkey: init - expire sessions:false cause connection loss:false
   [junit4]   2> 82146 INFO  (zkCallback-38-thread-1) [    ] o.a.s.c.c.ZkStateReader A cluster state change: WatchedEvent state:SyncConnected type:NodeDataChanged path:/clusterstate.json, has occurred - updating... (live nodes size: 1)
   [junit4]   2> 82146 INFO  (zkCallback-36-thread-1-processing-n:127.0.0.1:50645_) [n:127.0.0.1:50645_    ] o.a.s.c.c.ZkStateReader A cluster state change: WatchedEvent state:SyncConnected type:NodeDataChanged path:/clusterstate.json, has occurred - updating... (live nodes size: 1)
   [junit4]   2> 82149 INFO  (TEST-StreamExpressionTest.testAll-seed#[537BF64616D14F4B]) [    ] o.a.s.SolrTestCaseJ4 Writing core.properties file to C:\Users\JenkinsSlave\workspace\Lucene-Solr-trunk-Windows\solr\build\solr-solrj\test\J0\temp\solr.client.solrj.io.stream.StreamExpressionTest_537BF64616D14F4B-001\shard-1-001\cores\collection1
   [junit4]   2> 82150 INFO  (zkCallback-36-thread-1-processing-n:127.0.0.1:50645_) [n:127.0.0.1:50645_    ] o.a.s.c.c.ZkStateReader Updated cluster state version to 3
   [junit4]   2> 82152 INFO  (TEST-StreamExpressionTest.testAll-seed#[537BF64616D14F4B]) [    ] o.a.s.c.AbstractFullDistribZkTestBase create jetty 1 in directory C:\Users\JenkinsSlave\workspace\Lucene-Solr-trunk-Windows\solr\build\solr-solrj\test\J0\temp\solr.client.solrj.io.stream.StreamExpressionTest_537BF64616D14F4B-001\shard-1-001
   [junit4]   2> 82153 INFO  (TEST-StreamExpressionTest.testAll-seed#[537BF64616D14F4B]) [    ] o.e.j.s.Server jetty-9.2.11.v20150529
   [junit4]   2> 82156 INFO  (TEST-StreamExpressionTest.testAll-seed#[537BF64616D14F4B]) [    ] o.e.j.s.h.ContextHandler Started o.e.j.s.ServletContextHandler@49a56998{/,null,AVAILABLE}
   [junit4]   2> 82174 INFO  (zkCallback-38-thread-1) [    ] o.a.s.c.c.ZkStateReader Updated cluster state version to 3
   [junit4]   2> 82181 INFO  (TEST-StreamExpressionTest.testAll-seed#[537BF64616D14F4B]) [    ] o.e.j.s.ServerConnector Started ServerConnector@3b688b39{SSL-http/1.1}{127.0.0.1:50672}
   [junit4]   2> 82182 INFO  (TEST-StreamExpressionTest.testAll-seed#[537BF64616D14F4B]) [    ] o.e.j.s.Server Started @87173ms
   [junit4]   2> 82182 INFO  (TEST-StreamExpressionTest.testAll-seed#[537BF64616D14F4B]) [    ] o.a.s.c.s.e.JettySolrRunner Jetty properties: {solr.data.dir=C:\Users\JenkinsSlave\workspace\Lucene-Solr-trunk-Windows\solr\build\solr-solrj\test\J0\temp\solr.client.solrj.io.stream.StreamExpressionTest_537BF64616D14F4B-001\tempDir-001/jetty1, solrconfig=solrconfig.xml, hostContext=/, hostPort=50672, coreRootDirectory=C:\Users\JenkinsSlave\workspace\Lucene-Solr-trunk-Windows\solr\build\solr-solrj\test\J0\..\..\..\..\..\..\..\..\..\Users\JenkinsSlave\workspace\Lucene-Solr-trunk-Windows\solr\build\solr-solrj\test\J0\temp\solr.client.solrj.io.stream.StreamExpressionTest_537BF64616D14F4B-001\shard-1-001\cores}
   [junit4]   2> 82185 INFO  (TEST-StreamExpressionTest.testAll-seed#[537BF64616D14F4B]) [    ] o.a.s.s.SolrDispatchFilter SolrDispatchFilter.init(): sun.misc.Launcher$AppClassLoader@659e0bfd
   [junit4]   2> 82185 INFO  (TEST-StreamExpressionTest.testAll-seed#[537BF64616D14F4B]) [    ] o.a.s.c.SolrResourceLoader new SolrResourceLoader for directory: 'C:\Users\JenkinsSlave\workspace\Lucene-Solr-trunk-Windows\solr\build\solr-solrj\test\J0\..\..\..\..\..\..\..\..\..\Users\JenkinsSlave\workspace\Lucene-Solr-trunk-Windows\solr\build\solr-solrj\test\J0\temp\solr.client.solrj.io.stream.StreamExpressionTest_537BF64616D14F4B-001\shard-1-001\'
   [junit4]   2> 82203 INFO  (TEST-StreamExpressionTest.testAll-seed#[537BF64616D14F4B]) [    ] o.a.s.c.c.SolrZkClient Using default ZkCredentialsProvider
   [junit4]   2> 82204 INFO  (TEST-StreamExpressionTest.testAll-seed#[537BF64616D14F4B]) [    ] o.a.s.c.c.ConnectionManager Waiting for client to connect to ZooKeeper
   [junit4]   2> 82206 INFO  (zkCallback-39-thread-1) [    ] o.a.s.c.c.ConnectionManager Watcher org.apache.solr.common.cloud.ConnectionManager@24a30633 name:ZooKeeperConnection Watcher:127.0.0.1:50635/solr got event WatchedEvent state:SyncConnected type:None path:null path:null type:None
   [junit4]   2> 82207 INFO  (TEST-StreamExpressionTest.testAll-seed#[537BF64616D14F4B]) [    ] o.a.s.c.c.ConnectionManager Client is connected to ZooKeeper
   [junit4]   2> 82207 INFO  (TEST-StreamExpressionTest.testAll-seed#[537BF64616D14F4B]) [    ] o.a.s.c.c.SolrZkClient Using default ZkACLProvider
   [junit4]   2> 82209 WARN  (NIOServerCxn.Factory:0.0.0.0/0.0.0.0:0) [    ] o.a.z.s.NIOServerCnxn caught end of stream exception
   [junit4]   2> EndOfStreamException: Unable to read additional data from client sessionid 0x14ee087edec0007, likely client has closed socket
   [junit4]   2> 	at org.apache.zookeeper.server.NIOServerCnxn.doIO(NIOServerCnxn.java:228)
   [junit4]   2> 	at org.apache.zookeeper.server.NIOServerCnxnFactory.run(NIOServerCnxnFactory.java:208)
   [junit4]   2> 	at java.lang.Thread.run(Thread.java:745)
   [junit4]   2> 82209 INFO  (TEST-StreamExpressionTest.testAll-seed#[537BF64616D14F4B]) [    ] o.a.s.s.SolrDispatchFilter Loading solr.xml from SolrHome (not found in ZooKeeper)
   [junit4]   2> 82210 INFO  (TEST-StreamExpressionTest.testAll-seed#[537BF64616D14F4B]) [    ] o.a.s.c.SolrXmlConfig Loading container configuration from C:\Users\JenkinsSlave\workspace\Lucene-Solr-trunk-Windows\solr\build\solr-solrj\test\J0\..\..\..\..\..\..\..\..\..\Users\JenkinsSlave\workspace\Lucene-Solr-trunk-Windows\solr\build\solr-solrj\test\J0\temp\solr.client.solrj.io.stream.StreamExpressionTest_537BF64616D14F4B-001\shard-1-001\solr.xml
   [junit4]   2> 82223 INFO  (TEST-StreamExpressionTest.testAll-seed#[537BF64616D14F4B]) [    ] o.a.s.c.CoresLocator Config-defined core root directory: C:\Users\JenkinsSlave\workspace\Lucene-Solr-trunk-Windows\solr\build\solr-solrj\test\J0\..\..\..\..\..\..\..\..\..\Users\JenkinsSlave\workspace\Lucene-Solr-trunk-Windows\solr\build\solr-solrj\test\J0\temp\solr.client.solrj.io.stream.StreamExpressionTest_537BF64616D14F4B-001\shard-1-001\cores
   [junit4]   2> 82223 INFO  (TEST-StreamExpressionTest.testAll-seed#[537BF64616D14F4B]) [    ] o.a.s.c.CoreContainer New CoreContainer 974960249
   [junit4]   2> 82223 INFO  (TEST-StreamExpressionTest.testAll-seed#[537BF64616D14F4B]) [    ] o.a.s.c.CoreContainer Loading cores into CoreContainer [instanceDir=C:\Users\JenkinsSlave\workspace\Lucene-Solr-trunk-Windows\solr\build\solr-solrj\test\J0\..\..\..\..\..\..\..\..\..\Users\JenkinsSlave\workspace\Lucene-Solr-trunk-Windows\solr\build\solr-solrj\test\J0\temp\solr.client.solrj.io.stream.StreamExpressionTest_537BF64616D14F4B-001\shard-1-001\]
   [junit4]   2> 82223 INFO  (TEST-StreamExpressionTest.testAll-seed#[537BF64616D14F4B]) [    ] o.a.s.c.CoreContainer loading shared library: C:\Users\JenkinsSlave\workspace\Lucene-Solr-trunk-Windows\solr\build\solr-solrj\test\J0\..\..\..\..\..\..\..\..\..\Users\JenkinsSlave\workspace\Lucene-Solr-trunk-Windows\solr\build\solr-solrj\test\J0\temp\solr.client.solrj.io.stream.StreamExpressionTest_537BF64616D14F4B-001\shard-1-001\lib
   [junit4]   2> 82224 WARN  (TEST-StreamExpressionTest.testAll-seed#[537BF64616D14F4B]) [    ] o.a.s.c.SolrResourceLoader Can't find (or read) directory to add to classloader: lib (resolved as: C:\Users\JenkinsSlave\workspace\Lucene-Solr-trunk-Windows\solr\build\solr-solrj\test\J0\..\..\..\..\..\..\..\..\..\Users\JenkinsSlave\workspace\Lucene-Solr-trunk-Windows\solr\build\solr-solrj\test\J0\temp\solr.client.solrj.io.stream.StreamExpressionTest_537BF64616D14F4B-001\shard-1-001\lib).
   [junit4]   2> 82239 INFO  (TEST-StreamExpressionTest.testAll-seed#[537BF64616D14F4B]) [    ] o.a.s.h.c.HttpShardHandlerFactory created with socketTimeout : 90000,urlScheme : ,connTimeout : 15000,maxConnectionsPerHost : 20,maxConnections : 10000,corePoolSize : 0,maximumPoolSize : 2147483647,maxThreadIdleTime : 5,sizeOfQueue : -1,fairnessPolicy : false,useRetries : false,
   [junit4]   2> 82245 INFO  (TEST-StreamExpressionTest.testAll-seed#[537BF64616D14F4B]) [    ] o.a.s.u.UpdateShardHandler Creating UpdateShardHandler HTTP client with params: socketTimeout=340000&connTimeout=45000&retry=true
   [junit4]   2> 82247 INFO  (TEST-StreamExpressionTest.testAll-seed#[537BF64616D14F4B]) [    ] o.a.s.l.LogWatcher SLF4J impl is org.slf4j.impl.Log4jLoggerFactory
   [junit4]   2> 82248 INFO  (TEST-StreamExpressionTest.testAll-seed#[537BF64616D14F4B]) [    ] o.a.s.l.LogWatcher Registering Log Listener [Log4j (org.slf4j.impl.Log4jLoggerFactory)]
   [junit4]   2> 82248 INFO  (TEST-StreamExpressionTest.testAll-seed#[537BF64616D14F4B]) [    ] o.a.s.c.ZkContainer Zookeeper client=127.0.0.1:50635/solr
   [junit4]   2> 82248 INFO  (TEST-StreamExpressionTest.testAll-seed#[537BF64616D14F4B]) [    ] o.a.s.c.ZkController zkHost includes chroot
   [junit4]   2> 82248 INFO  (TEST-StreamExpressionTest.testAll-seed#[537BF64616D14F4B]) [    ] o.a.s.c.c.SolrZkClient Using default ZkCredentialsProvider
   [junit4]   2> 82249 INFO  (TEST-StreamExpressionTest.testAll-seed#[537BF64616D14F4B]) [    ] o.a.s.c.c.ConnectionManager Waiting for client to connect to ZooKeeper
   [junit4]   2> 82251 INFO  (zkCallback-41-thread-1) [    ] o.a.s.c.c.ConnectionManager Watcher org.apache.solr.common.cloud.ConnectionManager@40148473 name:ZooKeeperConnection Watcher:127.0.0.1:50635 got event WatchedEvent state:SyncConnected type:None path:null path:null type:None
   [junit4]   2> 82252 INFO  (TEST-StreamExpressionTest.testAll-seed#[537BF64616D14F4B]) [    ] o.a.s.c.c.ConnectionManager Client is connected to ZooKeeper
   [junit4]   2> 82252 INFO  (TEST-StreamExpressionTest.testAll-seed#[537BF64616D14F4B]) [    ] o.a.s.c.c.SolrZkClient Using default ZkACLProvider
   [junit4]   2> 82256 INFO  (TEST-StreamExpressionTest.testAll-seed#[537BF64616D14F4B]) [n:127.0.0.1:50672_    ] o.a.s.c.c.ConnectionManager Waiting for client to connect to ZooKeeper
   [junit4]   2> 82258 INFO  (zkCallback-42-thread-1-processing-n:127.0.0.1:50672_) [n:127.0.0.1:50672_    ] o.a.s.c.c.ConnectionManager Watcher org.apache.solr.common.cloud.ConnectionManager@83e1aee name:ZooKeeperConnection Watcher:127.0.0.1:50635/solr got event WatchedEvent state:SyncConnected type:None path:null path:null type:None
   [junit4]   2> 82258 INFO  (TEST-StreamExpressionTest.testAll-seed#[537BF64616D14F4B]) [n:127.0.0.1:50672_    ] o.a.s.c.c.ConnectionManager Client is connected to ZooKeeper
   [junit4]   2> 82266 INFO  (TEST-StreamExpressionTest.testAll-seed#[537BF64616D14F4B]) [n:127.0.0.1:50672_    ] o.a.s.c.c.ZkStateReader Updating cluster state from ZooKeeper... 
   [junit4]   2> 83269 INFO  (TEST-StreamExpressionTest.testAll-seed#[537BF64616D14F4B]) [n:127.0.0.1:50672_    ] o.a.s.c.ZkController Register node as live in ZooKeeper:/live_nodes/127.0.0.1:50672_
   [junit4]   2> 83270 INFO  (TEST-StreamExpressionTest.testAll-seed#[537BF64616D14F4B]) [n:127.0.0.1:50672_    ] o.a.s.c.c.SolrZkClient makePath: /live_nodes/127.0.0.1:50672_
   [junit4]   2> 83273 INFO  (TEST-StreamExpressionTest.testAll-seed#[537BF64616D14F4B]) [n:127.0.0.1:50672_    ] o.a.s.c.Overseer Overseer (id=null) closing
   [junit4]   2> 83276 INFO  (TEST-StreamExpressionTest.testAll-seed#[537BF64616D14F4B]) [n:127.0.0.1:50672_    ] o.a.s.c.LeaderElector Joined leadership election with path: /overseer_elect/election/94259516638232585-127.0.0.1:50672_-n_0000000001
   [junit4]   2> 83278 INFO  (TEST-StreamExpressionTest.testAll-seed#[537BF64616D14F4B]) [n:127.0.0.1:50672_    ] o.a.s.c.LeaderElector Watching path /overseer_elect/election/94259516638232581-127.0.0.1:50645_-n_0000000000 to know if I could be the leader
   [junit4]   2> 83279 INFO  (TEST-StreamExpressionTest.testAll-seed#[537BF64616D14F4B]) [n:127.0.0.1:50672_    ] o.a.s.c.CoreContainer No authentication plugin used.
   [junit4]   2> 83279 INFO  (TEST-StreamExpressionTest.testAll-seed#[537BF64616D14F4B]) [n:127.0.0.1:50672_    ] o.a.s.c.CoreContainer Security conf doesn't exist. Skipping setup for authorization module.
   [junit4]   2> 83280 INFO  (TEST-StreamExpressionTest.testAll-seed#[537BF64616D14F4B]) [n:127.0.0.1:50672_    ] o.a.s.c.CoresLocator Looking for core definitions underneath C:\Users\JenkinsSlave\workspace\Lucene-Solr-trunk-Windows\solr\build\solr-solrj\test\J0\..\..\..\..\..\..\..\..\..\Users\JenkinsSlave\workspace\Lucene-Solr-trunk-Windows\solr\build\solr-solrj\test\J0\temp\solr.client.solrj.io.stream.StreamExpressionTest_537BF64616D14F4B-001\shard-1-001\cores
   [junit4]   2> 83282 INFO  (TEST-StreamExpressionTest.testAll-seed#[537BF64616D14F4B]) [n:127.0.0.1:50672_    ] o.a.s.c.SolrCore Created CoreDescriptor: {name=collection1, config=solrconfig.xml, transient=false, schema=schema.xml, loadOnStartup=true, configSetProperties=configsetprops.json, instanceDir=C:\Users\JenkinsSlave\workspace\Lucene-Solr-trunk-Windows\solr\build\solr-solrj\test\J0\..\..\..\..\..\..\..\..\..\Users\JenkinsSlave\workspace\Lucene-Solr-trunk-Windows\solr\build\solr-solrj\test\J0\temp\solr.client.solrj.io.stream.StreamExpressionTest_537BF64616D14F4B-001\shard-1-001\cores\collection1, collection=collection1, absoluteInstDir=C:\Users\JenkinsSlave\workspace\Lucene-Solr-trunk-Windows\solr\build\solr-solrj\test\J0\..\..\..\..\..\..\..\..\..\Users\JenkinsSlave\workspace\Lucene-Solr-trunk-Windows\solr\build\solr-solrj\test\J0\temp\solr.client.solrj.io.stream.StreamExpressionTest_537BF64616D14F4B-001\shard-1-001\cores\collection1\, coreNodeName=, dataDir=data\, shard=}
   [junit4]   2> 83282 INFO  (TEST-StreamExpressionTest.testAll-seed#[537BF64616D14F4B]) [n:127.0.0.1:50672_    ] o.a.s.c.CoresLocator Found core collection1 in C:\Users\JenkinsSlave\workspace\Lucene-Solr-trunk-Windows\solr\build\solr-solrj\test\J0\..\..\..\..\..\..\..\..\..\Users\JenkinsSlave\workspace\Lucene-Solr-trunk-Windows\solr\build\solr-solrj\test\J0\temp\solr.client.solrj.io.stream.StreamExpressionTest_537BF64616D14F4B-001\shard-1-001\cores\collection1\
   [junit4]   2> 83282 INFO  (TEST-StreamExpressionTest.testAll-seed#[537BF64616D14F4B]) [n:127.0.0.1:50672_    ] o.a.s.c.CoresLocator Found 1 core definitions
   [junit4]   2> 83285 INFO  (TEST-StreamExpressionTest.testAll-seed#[537BF64616D14F4B]) [n:127.0.0.1:50672_    ] o.a.s.s.SolrDispatchFilter user.dir=C:\Users\JenkinsSlave\workspace\Lucene-Solr-trunk-Windows\solr\build\solr-solrj\test\J0
   [junit4]   2> 83285 INFO  (TEST-StreamExpressionTest.testAll-seed#[537BF64616D14F4B]) [n:127.0.0.1:50672_    ] o.a.s.s.SolrDispatchFilter SolrDispatchFilter.init() done
   [junit4]   2> 83286 INFO  (coreLoadExecutor-266-thread-1-processing-n:127.0.0.1:50672_) [n:127.0.0.1:50672_ c:collection1   x:collection1] o.a.s.c.ZkController publishing state=down
   [junit4]   2> 83286 INFO  (coreLoadExecutor-266-thread-1-processing-n:127.0.0.1:50672_) [n:127.0.0.1:50672_ c:collection1   x:collection1] o.a.s.c.ZkController numShards not found on descriptor - reading it from system property
   [junit4]   2> 83291 INFO  (zkCallback-36-thread-1-processing-n:127.0.0.1:50645_) [n:127.0.0.1:50645_    ] o.a.s.c.DistributedQueue NodeChildrenChanged fired on path /overseer/queue state SyncConnected
   [junit4]   2> 83291 INFO  (coreLoadExecutor-266-thread-1-processing-n:127.0.0.1:50672_) [n:127.0.0.1:50672_ c:collection1   x:collection1] o.a.s.c.ZkController look for our core node name
   [junit4]   2> 83295 INFO  (OverseerStateUpdate-94259516638232581-127.0.0.1:50645_-n_0000000000) [n:127.0.0.1:50645_    ] o.a.s.c.Overseer processMessage: queueSize: 1, message = {
   [junit4]   2>   "core":"collection1",
   [junit4]   2>   "roles":null,
   [junit4]   2>   "base_url":"https://127.0.0.1:50672",
   [junit4]   2>   "node_name":"127.0.0.1:50672_",
   [junit4]   2>   "numShards":"2",
   [junit4]   2>   "state":"down",
   [junit4]   2>   "shard":null,
   [junit4]   2>   "collection":"collection1",
   [junit4]   2>   "operation":"state"} current state version: 3
   [junit4]   2> 83299 INFO  (OverseerStateUpdate-94259516638232581-127.0.0.1:50645_-n_0000000000) [n:127.0.0.1:50645_    ] o.a.s.c.o.ReplicaMutator Update state numShards=2 message={
   [junit4]   2>   "core":"collection1",
   [junit4]   2>   "roles":null,
   [junit4]   2>   "base_url":"https://127.0.0.1:50672",
   [junit4]   2>   "node_name":"127.0.0.1:50672_",
   [junit4]   2>   "numShards":"2",
   [junit4]   2>   "state":"down",
   [junit4]   2>   "shard":null,
   [junit4]   2>   "collection":"collection1",
   [junit4]   2>   "operation":"state"}
   [junit4]   2> 83299 INFO  (OverseerStateUpdate-94259516638232581-127.0.0.1:50645_-n_0000000000) [n:127.0.0.1:50645_    ] o.a.s.c.o.ClusterStateMutator building a new cName: collection1
   [junit4]   2> 83299 INFO  (OverseerStateUpdate-94259516638232581-127.0.0.1:50645_-n_0000000000) [n:127.0.0.1:50645_    ] o.a.s.c.o.ReplicaMutator Assigning new node to shard shard=shard2
   [junit4]   2> 83404 INFO  (zkCallback-42-thread-1-processing-n:127.0.0.1:50672_) [n:127.0.0.1:50672_    ] o.a.s.c.c.ZkStateReader A cluster state change: WatchedEvent state:SyncConnected type:NodeDataChanged path:/clusterstate.json, has occurred - updating... (live nodes size: 2)
   [junit4]   2> 83404 INFO  (zkCallback-38-thread-1) [    ] o.a.s.c.c.ZkStateReader A cluster state change: WatchedEvent state:SyncConnected type:NodeDataChanged path:/clusterstate.json, has occurred - updating... (live nodes size: 2)
   [junit4]   2> 83404 INFO  (zkCallback-36-thread-1-processing-n:127.0.0.1:50645_) [n:127.0.0.1:50645_    ] o.a.s.c.c.ZkStateReader A cluster state change: WatchedEvent state:SyncConnected type:NodeDataChanged path:/clusterstate.json, has occurred - updating... (live nodes size: 2)
   [junit4]   2> 83410 INFO  (zkCallback-42-thread-1-processing-n:127.0.0.1:50672_) [n:127.0.0.1:50672_    ] o.a.s.c.c.ZkStateReader Updated cluster state version to 4
   [junit4]   2> 83410 INFO  (zkCallback-36-thread-1-processing-n:127.0.0.1:50645_) [n:127.0.0.1:50645_    ] o.a.s.c.c.ZkStateReader Updated cluster state version to 4
   [junit4]   2> 83410 INFO  (zkCallback-38-thread-1) [    ] o.a.s.c.c.ZkStateReader Updated cluster state version to 4
   [junit4]   2> 84291 INFO  (coreLoadExecutor-266-thread-1-processing-n:127.0.0.1:50672_) [n:127.0.0.1:50672_ c:collection1   x:collection1] o.a.s.c.ZkController waiting to find shard id in clusterstate for collection1
   [junit4]   2> 84291 INFO  (coreLoadExecutor-266-thread-1-processing-n:127.0.0.1:50672_) [n:127.0.0.1:50672_ c:collection1   x:collection1] o.a.s.c.ZkController Check for collection zkNode:collection1
   [junit4]   2> 84292 INFO  (coreLoadExecutor-266-thread-1-processing-n:127.0.0.1:50672_) [n:127.0.0.1:50672_ c:collection1   x:collection1] o.a.s.c.ZkController Collection zkNode exists
   [junit4]   2> 84292 INFO  (coreLoadExecutor-266-thread-1-processing-n:127.0.0.1:50672_) [n:127.0.0.1:50672_ c:collection1   x:collection1] o.a.s.c.c.ZkStateReader Load collection config from:/collections/collection1
   [junit4]   2> 84293 INFO  (coreLoadExecutor-266-thread-1-processing-n:127.0.0.1:50672_) [n:127.0.0.1:50672_ c:collection1   x:collection1] o.a.s.c.c.ZkStateReader path=/collections/collection1 configName=conf1 specified config exists in ZooKeeper
   [junit4]   2> 84293 INFO  (coreLoadExecutor-266-thread-1-processing-n:127.0.0.1:50672_) [n:127.0.0.1:50672_ c:collection1   x:collection1] o.a.s.c.SolrResourceLoader new SolrResourceLoader for directory: 'C:\Users\JenkinsSlave\workspace\Lucene-Solr-trunk-Windows\solr\build\solr-solrj\test\J0\..\..\..\..\..\..\..\..\..\Users\JenkinsSlave\workspace\Lucene-Solr-trunk-Windows\solr\build\solr-solrj\test\J0\temp\solr.client.solrj.io.stream.StreamExpressionTest_537BF64616D14F4B-001\shard-1-001\cores\collection1\'
   [junit4]   2> 84307 INFO  (coreLoadExecutor-266-thread-1-processing-n:127.0.0.1:50672_) [n:127.0.0.1:50672_ c:collection1   x:collection1] o.a.s.c.Config loaded config solrconfig.xml with version 0 
   [junit4]   2> 84312 INFO  (coreLoadExecutor-266-thread-1-processing-n:127.0.0.1:50672_) [n:127.0.0.1:50672_ c:collection1   x:collection1] o.a.s.c.SolrConfig current version of requestparams : -1
   [junit4]   2> 84318 INFO  (coreLoadExecutor-266-thread-1-processing-n:127.0.0.1:50672_) [n:127.0.0.1:50672_ c:collection1   x:collection1] o.a.s.c.SolrConfig Using Lucene MatchVersion: 6.0.0
   [junit4]   2> 84326 INFO  (coreLoadExecutor-266-thread-1-processing-n:127.0.0.1:50672_) [n:127.0.0.1:50672_ c:collection1   x:collection1] o.a.s.c.Config Loaded SolrConfig: solrconfig.xml
   [junit4]   2> 84328 INFO  (coreLoadExecutor-266-thread-1-processing-n:127.0.0.1:50672_) [n:127.0.0.1:50672_ c:collection1   x:collection1] o.a.s.s.IndexSchema Reading Solr Schema from /configs/conf1/schema.xml
   [junit4]   2> 84333 INFO  (coreLoadExecutor-266-thread-1-processing-n:127.0.0.1:50672_) [n:127.0.0.1:50672_ c:collection1   x:collection1] o.a.s.s.IndexSchema [collection1] Schema name=test
   [junit4]   2> 84422 INFO  (coreLoadExecutor-266-thread-1-processing-n:127.0.0.1:50672_) [n:127.0.0.1:50672_ c:collection1   x:collection1] o.a.s.s.IndexSchema default search field in schema is text
   [junit4]   2> 84423 INFO  (coreLoadExecutor-266-thread-1-processing-n:127.0.0.1:50672_) [n:127.0.0.1:50672_ c:collection1   x:collection1] o.a.s.s.IndexSchema unique key field: id
   [junit4]   2> 84424 WARN  (coreLoadExecutor-266-thread-1-processing-n:127.0.0.1:50672_) [n:127.0.0.1:50672_ c:collection1   x:collection1] o.a.s.s.IndexSchema Field lowerfilt1and2 is not multivalued and destination for multiple copyFields (2)
   [junit4]   2> 84424 WARN  (coreLoadExecutor-266-thread-1-processing-n:127.0.0.1:50672_) [n:127.0.0.1:50672_ c:collection1   x:collection1] o.a.s.s.IndexSchema Field text is not multivalued and destination for multiple copyFields (3)
   [junit4]   2> 84428 INFO  (coreLoadExecutor-266-thread-1-processing-n:127.0.0.1:50672_) [n:127.0.0.1:50672_ c:collection1   x:collection1] o.a.s.c.ConfigSetProperties Did not find ConfigSet properties, assuming default properties: Can't find resource 'configsetprops.json' in classpath or '/configs/conf1', cwd=C:\Users\JenkinsSlave\workspace\Lucene-Solr-trunk-Windows\solr\build\solr-solrj\test\J0
   [junit4]   2> 84428 INFO  (coreLoadExecutor-266-thread-1-processing-n:127.0.0.1:50672_) [n:127.0.0.1:50672_ c:collection1   x:collection1] o.a.s.c.CoreContainer Creating SolrCore 'collection1' using configuration from collection collection1
   [junit4]   2> 84428 INFO  (coreLoadExecutor-266-thread-1-processing-n:127.0.0.1:50672_) [n:127.0.0.1:50672_ c:collection1 s:shard2 r:core_node1 x:collection1] o.a.s.c.SolrCore org.apache.solr.core.MockDirectoryFactory
   [junit4]   2> 84429 INFO  (coreLoadExecutor-266-thread-1-processing-n:127.0.0.1:50672_) [n:127.0.0.1:50672_ c:collection1 s:shard2 r:core_node1 x:collection1] o.a.s.c.SolrCore [[collection1] ] Opening new SolrCore at [C:\Users\JenkinsSlave\workspace\Lucene-Solr-trunk-Windows\solr\build\solr-solrj\test\J0\..\..\..\..\..\..\..\..\..\Users\JenkinsSlave\workspace\Lucene-Solr-trunk-Windows\solr\build\solr-solrj\test\J0\temp\solr.client.solrj.io.stream.StreamExpressionTest_537BF64616D14F4B-001\shard-1-001\cores\collection1\], dataDir=[null]
   [junit4]   2> 84429 INFO  (coreLoadExecutor-266-thread-1-processing-n:127.0.0.1:50672_) [n:127.0.0.1:50672_ c:collection1 s:shard2 r:core_node1 x:collection1] o.a.s.c.SolrCore JMX monitoring not detected for core: collection1
   [junit4]   2> 84429 INFO  (coreLoadExecutor-266-thread-1-processing-n:127.0.0.1:50672_) [n:127.0.0.1:50672_ c:collection1 s:shard2 r:core_node1 x:collection1] o.a.s.c.CachingDirectoryFactory return new directory for C:\Users\JenkinsSlave\workspace\Lucene-Solr-trunk-Windows\solr\build\solr-solrj\test\J0\..\..\..\..\..\..\..\..\..\Users\JenkinsSlave\workspace\Lucene-Solr-trunk-Windows\solr\build\solr-solrj\test\J0\temp\solr.client.solrj.io.stream.StreamExpressionTest_537BF64616D14F4B-001\shard-1-001\cores\collection1\data\
   [junit4]   2> 84429 INFO  (coreLoadExecutor-266-thread-1-processing-n:127.0.0.1:50672_) [n:127.0.0.1:50672_ c:collection1 s:shard2 r:core_node1 x:collection1] o.a.s.c.SolrCore New index directory detected: old=null new=C:\Users\JenkinsSlave\workspace\Lucene-Solr-trunk-Windows\solr\build\solr-solrj\test\J0\..\..\..\..\..\..\..\..\..\Users\JenkinsSlave\workspace\Lucene-Solr-trunk-Windows\solr\build\solr-solrj\test\J0\temp\solr.client.solrj.io.stream.StreamExpressionTest_537BF64616D14F4B-001\shard-1-001\cores\collection1\data\index/
   [junit4]   2> 84429 WARN  (coreLoadExecutor-266-thread-1-processing-n:127.0.0.1:50672_) [n:127.0.0.1:50672_ c:collection1 s:shard2 r:core_node1 x:collection1] o.a.s.c.SolrCore [collection1] Solr index directory 'C:\Users\JenkinsSlave\workspace\Lucene-Solr-trunk-Windows\solr\build\solr-solrj\test\J0\..\..\..\..\..\..\..\..\..\Users\JenkinsSlave\workspace\Lucene-Solr-trunk-Windows\solr\build\solr-solrj\test\J0\temp\solr.client.solrj.io.stream.StreamExpressionT

[...truncated too long message...]

.io.stream.StreamingTest_537BF64616D14F4B-001\shard-4-001\cores\collection1\data\index;done=false>>]
   [junit4]   2> 230330 INFO  (zkCallback-103-thread-1-processing-n:127.0.0.1:51154_) [n:127.0.0.1:51154_ c:collection1 s:shard1 r:core_node4 x:collection1] o.a.s.c.CachingDirectoryFactory Closing directory: C:\Users\JenkinsSlave\workspace\Lucene-Solr-trunk-Windows\solr\build\solr-solrj\test\J0\temp\solr.client.solrj.io.stream.StreamingTest_537BF64616D14F4B-001\shard-4-001\cores\collection1\data\index
   [junit4]   2> 230330 INFO  (zkCallback-103-thread-1-processing-n:127.0.0.1:51154_) [n:127.0.0.1:51154_ c:collection1 s:shard1 r:core_node4 x:collection1] o.a.s.c.CachingDirectoryFactory looking to close C:\Users\JenkinsSlave\workspace\Lucene-Solr-trunk-Windows\solr\build\solr-solrj\test\J0\temp\solr.client.solrj.io.stream.StreamingTest_537BF64616D14F4B-001\shard-4-001\cores\collection1\data\ [CachedDir<<refCount=0;path=C:\Users\JenkinsSlave\workspace\Lucene-Solr-trunk-Windows\solr\build\solr-solrj\test\J0\temp\solr.client.solrj.io.stream.StreamingTest_537BF64616D14F4B-001\shard-4-001\cores\collection1\data\;done=false>>]
   [junit4]   2> 230330 INFO  (zkCallback-103-thread-1-processing-n:127.0.0.1:51154_) [n:127.0.0.1:51154_ c:collection1 s:shard1 r:core_node4 x:collection1] o.a.s.c.CachingDirectoryFactory Closing directory: C:\Users\JenkinsSlave\workspace\Lucene-Solr-trunk-Windows\solr\build\solr-solrj\test\J0\temp\solr.client.solrj.io.stream.StreamingTest_537BF64616D14F4B-001\shard-4-001\cores\collection1\data\
   [junit4]   2> 230330 WARN  (zkCallback-103-thread-1-processing-n:127.0.0.1:51154_) [n:127.0.0.1:51154_ c:collection1 s:shard1 r:core_node4 x:collection1] o.a.s.c.LeaderElector 
   [junit4]   2> org.apache.zookeeper.KeeperException$SessionExpiredException: KeeperErrorCode = Session expired for /collections/collection1/leader_elect/shard1/election/94259523257696274-core_node4-n_0000000002
   [junit4]   2> 	at org.apache.zookeeper.KeeperException.create(KeeperException.java:127)
   [junit4]   2> 	at org.apache.zookeeper.KeeperException.create(KeeperException.java:51)
   [junit4]   2> 	at org.apache.zookeeper.ZooKeeper.delete(ZooKeeper.java:873)
   [junit4]   2> 	at org.apache.solr.common.cloud.SolrZkClient$2.execute(SolrZkClient.java:244)
   [junit4]   2> 	at org.apache.solr.common.cloud.SolrZkClient$2.execute(SolrZkClient.java:241)
   [junit4]   2> 	at org.apache.solr.common.cloud.ZkCmdExecutor.retryOperation(ZkCmdExecutor.java:61)
   [junit4]   2> 	at org.apache.solr.common.cloud.SolrZkClient.delete(SolrZkClient.java:241)
   [junit4]   2> 	at org.apache.solr.cloud.ElectionContext.cancelElection(ElectionContext.java:79)
   [junit4]   2> 	at org.apache.solr.cloud.ShardLeaderElectionContext.runLeaderProcess(ElectionContext.java:206)
   [junit4]   2> 	at org.apache.solr.cloud.LeaderElector.runIamLeaderProcess(LeaderElector.java:199)
   [junit4]   2> 	at org.apache.solr.cloud.LeaderElector.checkIfIamLeader(LeaderElector.java:159)
   [junit4]   2> 	at org.apache.solr.cloud.LeaderElector.joinElection(LeaderElector.java:348)
   [junit4]   2> 	at org.apache.solr.cloud.LeaderElector.joinElection(LeaderElector.java:257)
   [junit4]   2> 	at org.apache.solr.cloud.ShardLeaderElectionContext.rejoinLeaderElection(ElectionContext.java:481)
   [junit4]   2> 	at org.apache.solr.cloud.ShardLeaderElectionContext.runLeaderProcess(ElectionContext.java:238)
   [junit4]   2> 	at org.apache.solr.cloud.LeaderElector.runIamLeaderProcess(LeaderElector.java:199)
   [junit4]   2> 	at org.apache.solr.cloud.LeaderElector.checkIfIamLeader(LeaderElector.java:159)
   [junit4]   2> 	at org.apache.solr.cloud.LeaderElector.access$200(LeaderElector.java:56)
   [junit4]   2> 	at org.apache.solr.cloud.LeaderElector$ElectionWatcher.process(LeaderElector.java:390)
   [junit4]   2> 	at org.apache.solr.common.cloud.SolrZkClient$3$1.run(SolrZkClient.java:269)
   [junit4]   2> 	at java.util.concurrent.Executors$RunnableAdapter.call(Executors.java:511)
   [junit4]   2> 	at java.util.concurrent.FutureTask.run(FutureTask.java:266)
   [junit4]   2> 	at org.apache.solr.common.util.ExecutorUtil$MDCAwareThreadPoolExecutor$1.run(ExecutorUtil.java:209)
   [junit4]   2> 	at java.util.concurrent.ThreadPoolExecutor.runWorker(ThreadPoolExecutor.java:1142)
   [junit4]   2> 	at java.util.concurrent.ThreadPoolExecutor$Worker.run(ThreadPoolExecutor.java:617)
   [junit4]   2> 	at java.lang.Thread.run(Thread.java:745)
   [junit4]   2> 230331 INFO  (TEST-StreamingTest.streamTests-seed#[537BF64616D14F4B]) [    ] o.e.j.s.ServerConnector Stopped ServerConnector@2d99d65a{SSL-http/1.1}{127.0.0.1:0}
   [junit4]   2> 230331 INFO  (TEST-StreamingTest.streamTests-seed#[537BF64616D14F4B]) [    ] o.e.j.s.h.ContextHandler Stopped o.e.j.s.ServletContextHandler@482a5748{/,null,UNAVAILABLE}
   [junit4]   2> 230333 INFO  (TEST-StreamingTest.streamTests-seed#[537BF64616D14F4B]) [n:127.0.0.1:51154_ c:collection1 s:shard1 r:core_node4 x:collection1] o.a.s.c.ZkTestServer connecting to 127.0.0.1:51057 51057
   [junit4]   2> 232339 INFO  (Thread-452) [    ] o.a.s.c.ZkTestServer connecting to 127.0.0.1:51057 51057
   [junit4]   2> 232340 WARN  (Thread-452) [    ] o.a.s.c.ZkTestServer Watch limit violations: 
   [junit4]   2> Maximum concurrent create/delete watches above limit:
   [junit4]   2> 
   [junit4]   2> 	6	/solr/aliases.json
   [junit4]   2> 	6	/solr/clusterstate.json
   [junit4]   2> 	5	/solr/configs/conf1
   [junit4]   2> 
   [junit4]   2> Maximum concurrent children watches above limit:
   [junit4]   2> 
   [junit4]   2> 	6	/solr/live_nodes
   [junit4]   2> 	3	/solr/overseer/collection-queue-work
   [junit4]   2> 
   [junit4]   2> NOTE: reproduce with: ant test  -Dtestcase=StreamingTest -Dtests.method=streamTests -Dtests.seed=537BF64616D14F4B -Dtests.slow=true -Dtests.locale=en_GB -Dtests.timezone=Australia/South -Dtests.asserts=true -Dtests.file.encoding=UTF-8
   [junit4] FAILURE 51.5s J0 | StreamingTest.streamTests <<<
   [junit4]    > Throwable #1: java.lang.AssertionError: There are still nodes recoverying - waited for 30 seconds
   [junit4]    > 	at __randomizedtesting.SeedInfo.seed([537BF64616D14F4B:AF20D1C2BCF8B63E]:0)
   [junit4]    > 	at org.apache.solr.cloud.AbstractDistribZkTestBase.waitForRecoveriesToFinish(AbstractDistribZkTestBase.java:172)
   [junit4]    > 	at org.apache.solr.cloud.AbstractFullDistribZkTestBase.waitForRecoveriesToFinish(AbstractFullDistribZkTestBase.java:834)
   [junit4]    > 	at org.apache.solr.cloud.AbstractFullDistribZkTestBase.waitForThingsToLevelOut(AbstractFullDistribZkTestBase.java:1391)
   [junit4]    > 	at org.apache.solr.client.solrj.io.stream.StreamingTest.streamTests(StreamingTest.java:1059)
   [junit4]    > 	at org.apache.solr.BaseDistributedSearchTestCase$ShardsRepeatRule$ShardsFixedStatement.callStatement(BaseDistributedSearchTestCase.java:966)
   [junit4]    > 	at org.apache.solr.BaseDistributedSearchTestCase$ShardsRepeatRule$ShardsStatement.evaluate(BaseDistributedSearchTestCase.java:941)
   [junit4]    > 	at java.lang.Thread.run(Thread.java:745)
   [junit4]   2> 232345 INFO  (SUITE-StreamingTest-seed#[537BF64616D14F4B]-worker) [n:127.0.0.1:51154_ c:collection1 s:shard1 r:core_node4 x:collection1] o.a.s.SolrTestCaseJ4 ###deleteCore
   [junit4]   2> NOTE: leaving temporary files on disk at: C:\Users\JenkinsSlave\workspace\Lucene-Solr-trunk-Windows\solr\build\solr-solrj\test\J0\temp\solr.client.solrj.io.stream.StreamingTest_537BF64616D14F4B-001
   [junit4]   2> NOTE: test params are: codec=Asserting(Lucene53): {}, docValues:{}, sim=RandomSimilarityProvider(queryNorm=true,coord=no): {}, locale=en_GB, timezone=Australia/South
   [junit4]   2> NOTE: Windows 7 6.1 amd64/Oracle Corporation 1.8.0_51 (64-bit)/cpus=3,threads=1,free=11598472,total=134852608
   [junit4]   2> NOTE: All tests run in this JVM: [TestCoreAdmin, TestBatchUpdate, TestLBHttpSolrClient, TermsResponseTest, TestZkConfigManager, TestJavaBinCodec, TestUpdateRequestCodec, SolrExampleEmbeddedTest, TestSpellCheckResponse, TestHash, BasicHttpSolrClientTest, StreamExpressionTest, TestXMLEscaping, SolrPingTest, ShardParamsTest, NamedListTest, TestEmbeddedSolrServer, FieldAnalysisResponseTest, SolrExampleStreamingTest, SolrExampleBinaryTest, SolrExampleXMLTest, LargeVolumeBinaryJettyTest, JettyWebappTest, TestSolrProperties, MergeIndexesEmbeddedTest, QueryResponseTest, TestNamedListCodec, TestDocumentObjectBinder, ModifiableSolrParamsTest, DocumentAnalysisResponseTest, SolrDocumentTest, IteratorChainTest, FacetFieldTest, CollectionAdminRequestRequiredParamsTest, GetByIdTest, SolrSchemalessExampleTest, StreamExpressionToExpessionTest, StreamingTest]
   [junit4] Completed [66/66] on J0 in 51.49s, 1 test, 1 failure <<< FAILURES!

[...truncated 11 lines...]
BUILD FAILED
C:\Users\JenkinsSlave\workspace\Lucene-Solr-trunk-Windows\build.xml:717: The following error occurred while executing this line:
C:\Users\JenkinsSlave\workspace\Lucene-Solr-trunk-Windows\build.xml:661: The following error occurred while executing this line:
C:\Users\JenkinsSlave\workspace\Lucene-Solr-trunk-Windows\build.xml:59: The following error occurred while executing this line:
C:\Users\JenkinsSlave\workspace\Lucene-Solr-trunk-Windows\solr\build.xml:243: The following error occurred while executing this line:
C:\Users\JenkinsSlave\workspace\Lucene-Solr-trunk-Windows\solr\common-build.xml:518: The following error occurred while executing this line:
C:\Users\JenkinsSlave\workspace\Lucene-Solr-trunk-Windows\lucene\common-build.xml:1429: The following error occurred while executing this line:
C:\Users\JenkinsSlave\workspace\Lucene-Solr-trunk-Windows\lucene\common-build.xml:984: There were test failures: 66 suites, 463 tests, 2 failures

Total time: 74 minutes 54 seconds
Build step 'Invoke Ant' marked build as failure
Archiving artifacts
Recording test results
Email was triggered for: Failure - Any
Sending email for trigger: Failure - Any



Mime
View raw message