lucene-dev mailing list archives

Site index · List index
Message view « Date » · « Thread »
Top « Date » · « Thread »
From Policeman Jenkins Server <jenk...@thetaphi.de>
Subject [JENKINS] Lucene-Solr-trunk-Windows (64bit/jdk1.8.0_51) - Build # 5072 - Failure!
Date Sun, 26 Jul 2015 17:10:51 GMT
Build: http://jenkins.thetaphi.de/job/Lucene-Solr-trunk-Windows/5072/
Java: 64bit/jdk1.8.0_51 -XX:-UseCompressedOops -XX:+UseConcMarkSweepGC

1 tests failed.
FAILED:  org.apache.solr.cloud.DistributedVersionInfoTest.test

Error Message:
Captured an uncaught exception in thread: Thread[id=16657, name=Thread-5914, state=RUNNABLE, group=TGRP-DistributedVersionInfoTest]

Stack Trace:
com.carrotsearch.randomizedtesting.UncaughtExceptionError: Captured an uncaught exception in thread: Thread[id=16657, name=Thread-5914, state=RUNNABLE, group=TGRP-DistributedVersionInfoTest]
	at __randomizedtesting.SeedInfo.seed([945FDBBC6143BDF3:1C0BE466CFBFD00B]:0)
Caused by: java.lang.IllegalArgumentException: bound must be positive
	at __randomizedtesting.SeedInfo.seed([945FDBBC6143BDF3]:0)
	at java.util.Random.nextInt(Random.java:388)
	at org.apache.solr.cloud.DistributedVersionInfoTest$3.run(DistributedVersionInfoTest.java:197)




Build Log:
[...truncated 10927 lines...]
   [junit4] Suite: org.apache.solr.cloud.DistributedVersionInfoTest
   [junit4]   2> Creating dataDir: C:\Users\JenkinsSlave\workspace\Lucene-Solr-trunk-Windows\solr\build\solr-core\test\J0\temp\solr.cloud.DistributedVersionInfoTest_945FDBBC6143BDF3-001\init-core-data-001
   [junit4]   2> 2470579 INFO  (SUITE-DistributedVersionInfoTest-seed#[945FDBBC6143BDF3]-worker) [    ] o.a.s.BaseDistributedSearchTestCase Setting hostContext system property: /
   [junit4]   2> 2470583 INFO  (TEST-DistributedVersionInfoTest.test-seed#[945FDBBC6143BDF3]) [    ] o.a.s.c.ZkTestServer STARTING ZK TEST SERVER
   [junit4]   2> 2470585 INFO  (Thread-5830) [    ] o.a.s.c.ZkTestServer client port:0.0.0.0/0.0.0.0:0
   [junit4]   2> 2470585 INFO  (Thread-5830) [    ] o.a.s.c.ZkTestServer Starting server
   [junit4]   2> 2470672 INFO  (TEST-DistributedVersionInfoTest.test-seed#[945FDBBC6143BDF3]) [    ] o.a.s.c.ZkTestServer start zk server on port:51008
   [junit4]   2> 2470672 INFO  (TEST-DistributedVersionInfoTest.test-seed#[945FDBBC6143BDF3]) [    ] o.a.s.c.c.SolrZkClient Using default ZkCredentialsProvider
   [junit4]   2> 2470673 INFO  (TEST-DistributedVersionInfoTest.test-seed#[945FDBBC6143BDF3]) [    ] o.a.s.c.c.ConnectionManager Waiting for client to connect to ZooKeeper
   [junit4]   2> 2470677 INFO  (zkCallback-2699-thread-1) [    ] o.a.s.c.c.ConnectionManager Watcher org.apache.solr.common.cloud.ConnectionManager@3ca996ff name:ZooKeeperConnection Watcher:127.0.0.1:51008 got event WatchedEvent state:SyncConnected type:None path:null path:null type:None
   [junit4]   2> 2470678 INFO  (TEST-DistributedVersionInfoTest.test-seed#[945FDBBC6143BDF3]) [    ] o.a.s.c.c.ConnectionManager Client is connected to ZooKeeper
   [junit4]   2> 2470678 INFO  (TEST-DistributedVersionInfoTest.test-seed#[945FDBBC6143BDF3]) [    ] o.a.s.c.c.SolrZkClient Using default ZkACLProvider
   [junit4]   2> 2470678 INFO  (TEST-DistributedVersionInfoTest.test-seed#[945FDBBC6143BDF3]) [    ] o.a.s.c.c.SolrZkClient makePath: /solr
   [junit4]   2> 2470682 INFO  (TEST-DistributedVersionInfoTest.test-seed#[945FDBBC6143BDF3]) [    ] o.a.s.c.c.SolrZkClient Using default ZkCredentialsProvider
   [junit4]   2> 2470684 INFO  (TEST-DistributedVersionInfoTest.test-seed#[945FDBBC6143BDF3]) [    ] o.a.s.c.c.ConnectionManager Waiting for client to connect to ZooKeeper
   [junit4]   2> 2470685 INFO  (zkCallback-2700-thread-1) [    ] o.a.s.c.c.ConnectionManager Watcher org.apache.solr.common.cloud.ConnectionManager@485721ea name:ZooKeeperConnection Watcher:127.0.0.1:51008/solr got event WatchedEvent state:SyncConnected type:None path:null path:null type:None
   [junit4]   2> 2470685 INFO  (TEST-DistributedVersionInfoTest.test-seed#[945FDBBC6143BDF3]) [    ] o.a.s.c.c.ConnectionManager Client is connected to ZooKeeper
   [junit4]   2> 2470685 INFO  (TEST-DistributedVersionInfoTest.test-seed#[945FDBBC6143BDF3]) [    ] o.a.s.c.c.SolrZkClient Using default ZkACLProvider
   [junit4]   2> 2470685 INFO  (TEST-DistributedVersionInfoTest.test-seed#[945FDBBC6143BDF3]) [    ] o.a.s.c.c.SolrZkClient makePath: /collections/collection1
   [junit4]   2> 2470687 INFO  (TEST-DistributedVersionInfoTest.test-seed#[945FDBBC6143BDF3]) [    ] o.a.s.c.c.SolrZkClient makePath: /collections/collection1/shards
   [junit4]   2> 2470689 INFO  (TEST-DistributedVersionInfoTest.test-seed#[945FDBBC6143BDF3]) [    ] o.a.s.c.c.SolrZkClient makePath: /collections/control_collection
   [junit4]   2> 2470692 INFO  (TEST-DistributedVersionInfoTest.test-seed#[945FDBBC6143BDF3]) [    ] o.a.s.c.c.SolrZkClient makePath: /collections/control_collection/shards
   [junit4]   2> 2470694 INFO  (TEST-DistributedVersionInfoTest.test-seed#[945FDBBC6143BDF3]) [    ] o.a.s.c.AbstractZkTestCase put C:\Users\JenkinsSlave\workspace\Lucene-Solr-trunk-Windows\solr\core\src\test-files\solr\collection1\conf\solrconfig-tlog.xml to /configs/conf1/solrconfig.xml
   [junit4]   2> 2470694 INFO  (TEST-DistributedVersionInfoTest.test-seed#[945FDBBC6143BDF3]) [    ] o.a.s.c.c.SolrZkClient makePath: /configs/conf1/solrconfig.xml
   [junit4]   2> 2470698 INFO  (TEST-DistributedVersionInfoTest.test-seed#[945FDBBC6143BDF3]) [    ] o.a.s.c.AbstractZkTestCase put C:\Users\JenkinsSlave\workspace\Lucene-Solr-trunk-Windows\solr\core\src\test-files\solr\collection1\conf\schema.xml to /configs/conf1/schema.xml
   [junit4]   2> 2470698 INFO  (TEST-DistributedVersionInfoTest.test-seed#[945FDBBC6143BDF3]) [    ] o.a.s.c.c.SolrZkClient makePath: /configs/conf1/schema.xml
   [junit4]   2> 2470700 INFO  (TEST-DistributedVersionInfoTest.test-seed#[945FDBBC6143BDF3]) [    ] o.a.s.c.AbstractZkTestCase put C:\Users\JenkinsSlave\workspace\Lucene-Solr-trunk-Windows\solr\core\src\test-files\solr\collection1\conf\solrconfig.snippet.randomindexconfig.xml to /configs/conf1/solrconfig.snippet.randomindexconfig.xml
   [junit4]   2> 2470700 INFO  (TEST-DistributedVersionInfoTest.test-seed#[945FDBBC6143BDF3]) [    ] o.a.s.c.c.SolrZkClient makePath: /configs/conf1/solrconfig.snippet.randomindexconfig.xml
   [junit4]   2> 2470703 INFO  (TEST-DistributedVersionInfoTest.test-seed#[945FDBBC6143BDF3]) [    ] o.a.s.c.AbstractZkTestCase put C:\Users\JenkinsSlave\workspace\Lucene-Solr-trunk-Windows\solr\core\src\test-files\solr\collection1\conf\stopwords.txt to /configs/conf1/stopwords.txt
   [junit4]   2> 2470704 INFO  (TEST-DistributedVersionInfoTest.test-seed#[945FDBBC6143BDF3]) [    ] o.a.s.c.c.SolrZkClient makePath: /configs/conf1/stopwords.txt
   [junit4]   2> 2470706 INFO  (TEST-DistributedVersionInfoTest.test-seed#[945FDBBC6143BDF3]) [    ] o.a.s.c.AbstractZkTestCase put C:\Users\JenkinsSlave\workspace\Lucene-Solr-trunk-Windows\solr\core\src\test-files\solr\collection1\conf\protwords.txt to /configs/conf1/protwords.txt
   [junit4]   2> 2470706 INFO  (TEST-DistributedVersionInfoTest.test-seed#[945FDBBC6143BDF3]) [    ] o.a.s.c.c.SolrZkClient makePath: /configs/conf1/protwords.txt
   [junit4]   2> 2470709 INFO  (TEST-DistributedVersionInfoTest.test-seed#[945FDBBC6143BDF3]) [    ] o.a.s.c.AbstractZkTestCase put C:\Users\JenkinsSlave\workspace\Lucene-Solr-trunk-Windows\solr\core\src\test-files\solr\collection1\conf\currency.xml to /configs/conf1/currency.xml
   [junit4]   2> 2470709 INFO  (TEST-DistributedVersionInfoTest.test-seed#[945FDBBC6143BDF3]) [    ] o.a.s.c.c.SolrZkClient makePath: /configs/conf1/currency.xml
   [junit4]   2> 2470712 INFO  (TEST-DistributedVersionInfoTest.test-seed#[945FDBBC6143BDF3]) [    ] o.a.s.c.AbstractZkTestCase put C:\Users\JenkinsSlave\workspace\Lucene-Solr-trunk-Windows\solr\core\src\test-files\solr\collection1\conf\enumsConfig.xml to /configs/conf1/enumsConfig.xml
   [junit4]   2> 2470712 INFO  (TEST-DistributedVersionInfoTest.test-seed#[945FDBBC6143BDF3]) [    ] o.a.s.c.c.SolrZkClient makePath: /configs/conf1/enumsConfig.xml
   [junit4]   2> 2470714 INFO  (TEST-DistributedVersionInfoTest.test-seed#[945FDBBC6143BDF3]) [    ] o.a.s.c.AbstractZkTestCase put C:\Users\JenkinsSlave\workspace\Lucene-Solr-trunk-Windows\solr\core\src\test-files\solr\collection1\conf\open-exchange-rates.json to /configs/conf1/open-exchange-rates.json
   [junit4]   2> 2470715 INFO  (TEST-DistributedVersionInfoTest.test-seed#[945FDBBC6143BDF3]) [    ] o.a.s.c.c.SolrZkClient makePath: /configs/conf1/open-exchange-rates.json
   [junit4]   2> 2470717 INFO  (TEST-DistributedVersionInfoTest.test-seed#[945FDBBC6143BDF3]) [    ] o.a.s.c.AbstractZkTestCase put C:\Users\JenkinsSlave\workspace\Lucene-Solr-trunk-Windows\solr\core\src\test-files\solr\collection1\conf\mapping-ISOLatin1Accent.txt to /configs/conf1/mapping-ISOLatin1Accent.txt
   [junit4]   2> 2470718 INFO  (TEST-DistributedVersionInfoTest.test-seed#[945FDBBC6143BDF3]) [    ] o.a.s.c.c.SolrZkClient makePath: /configs/conf1/mapping-ISOLatin1Accent.txt
   [junit4]   2> 2470719 INFO  (TEST-DistributedVersionInfoTest.test-seed#[945FDBBC6143BDF3]) [    ] o.a.s.c.AbstractZkTestCase put C:\Users\JenkinsSlave\workspace\Lucene-Solr-trunk-Windows\solr\core\src\test-files\solr\collection1\conf\old_synonyms.txt to /configs/conf1/old_synonyms.txt
   [junit4]   2> 2470719 INFO  (TEST-DistributedVersionInfoTest.test-seed#[945FDBBC6143BDF3]) [    ] o.a.s.c.c.SolrZkClient makePath: /configs/conf1/old_synonyms.txt
   [junit4]   2> 2470722 INFO  (TEST-DistributedVersionInfoTest.test-seed#[945FDBBC6143BDF3]) [    ] o.a.s.c.AbstractZkTestCase put C:\Users\JenkinsSlave\workspace\Lucene-Solr-trunk-Windows\solr\core\src\test-files\solr\collection1\conf\synonyms.txt to /configs/conf1/synonyms.txt
   [junit4]   2> 2470723 INFO  (TEST-DistributedVersionInfoTest.test-seed#[945FDBBC6143BDF3]) [    ] o.a.s.c.c.SolrZkClient makePath: /configs/conf1/synonyms.txt
   [junit4]   2> 2471136 INFO  (TEST-DistributedVersionInfoTest.test-seed#[945FDBBC6143BDF3]) [    ] o.a.s.SolrTestCaseJ4 Writing core.properties file to C:\Users\JenkinsSlave\workspace\Lucene-Solr-trunk-Windows\solr\build\solr-core\test\J0\temp\solr.cloud.DistributedVersionInfoTest_945FDBBC6143BDF3-001\control-001\cores\collection1
   [junit4]   2> 2471138 INFO  (TEST-DistributedVersionInfoTest.test-seed#[945FDBBC6143BDF3]) [    ] o.e.j.s.Server jetty-9.2.11.v20150529
   [junit4]   2> 2471140 INFO  (TEST-DistributedVersionInfoTest.test-seed#[945FDBBC6143BDF3]) [    ] o.e.j.s.h.ContextHandler Started o.e.j.s.ServletContextHandler@71b27d22{/,null,AVAILABLE}
   [junit4]   2> 2471141 INFO  (TEST-DistributedVersionInfoTest.test-seed#[945FDBBC6143BDF3]) [    ] o.e.j.s.ServerConnector Started ServerConnector@1a72e1d8{HTTP/1.1}{127.0.0.1:51015}
   [junit4]   2> 2471141 INFO  (TEST-DistributedVersionInfoTest.test-seed#[945FDBBC6143BDF3]) [    ] o.e.j.s.Server Started @2478524ms
   [junit4]   2> 2471141 INFO  (TEST-DistributedVersionInfoTest.test-seed#[945FDBBC6143BDF3]) [    ] o.a.s.c.s.e.JettySolrRunner Jetty properties: {solr.data.dir=C:\Users\JenkinsSlave\workspace\Lucene-Solr-trunk-Windows\solr\build\solr-core\test\J0\temp\solr.cloud.DistributedVersionInfoTest_945FDBBC6143BDF3-001\tempDir-001/control/data, hostContext=/, hostPort=51015, coreRootDirectory=C:\Users\JenkinsSlave\workspace\Lucene-Solr-trunk-Windows\solr\build\solr-core\test\J0\temp\solr.cloud.DistributedVersionInfoTest_945FDBBC6143BDF3-001\control-001\cores}
   [junit4]   2> 2471141 INFO  (TEST-DistributedVersionInfoTest.test-seed#[945FDBBC6143BDF3]) [    ] o.a.s.s.SolrDispatchFilter SolrDispatchFilter.init(): sun.misc.Launcher$AppClassLoader@4e0e2f2a
   [junit4]   2> 2471142 INFO  (TEST-DistributedVersionInfoTest.test-seed#[945FDBBC6143BDF3]) [    ] o.a.s.c.SolrResourceLoader new SolrResourceLoader for directory: 'C:\Users\JenkinsSlave\workspace\Lucene-Solr-trunk-Windows\solr\build\solr-core\test\J0\temp\solr.cloud.DistributedVersionInfoTest_945FDBBC6143BDF3-001\control-001\'
   [junit4]   2> 2471161 INFO  (TEST-DistributedVersionInfoTest.test-seed#[945FDBBC6143BDF3]) [    ] o.a.s.c.c.SolrZkClient Using default ZkCredentialsProvider
   [junit4]   2> 2471161 INFO  (TEST-DistributedVersionInfoTest.test-seed#[945FDBBC6143BDF3]) [    ] o.a.s.c.c.ConnectionManager Waiting for client to connect to ZooKeeper
   [junit4]   2> 2471163 INFO  (zkCallback-2701-thread-1) [    ] o.a.s.c.c.ConnectionManager Watcher org.apache.solr.common.cloud.ConnectionManager@493c5017 name:ZooKeeperConnection Watcher:127.0.0.1:51008/solr got event WatchedEvent state:SyncConnected type:None path:null path:null type:None
   [junit4]   2> 2471163 INFO  (TEST-DistributedVersionInfoTest.test-seed#[945FDBBC6143BDF3]) [    ] o.a.s.c.c.ConnectionManager Client is connected to ZooKeeper
   [junit4]   2> 2471163 INFO  (TEST-DistributedVersionInfoTest.test-seed#[945FDBBC6143BDF3]) [    ] o.a.s.c.c.SolrZkClient Using default ZkACLProvider
   [junit4]   2> 2471164 INFO  (TEST-DistributedVersionInfoTest.test-seed#[945FDBBC6143BDF3]) [    ] o.a.s.s.SolrDispatchFilter Loading solr.xml from SolrHome (not found in ZooKeeper)
   [junit4]   2> 2471165 INFO  (TEST-DistributedVersionInfoTest.test-seed#[945FDBBC6143BDF3]) [    ] o.a.s.c.SolrXmlConfig Loading container configuration from C:\Users\JenkinsSlave\workspace\Lucene-Solr-trunk-Windows\solr\build\solr-core\test\J0\temp\solr.cloud.DistributedVersionInfoTest_945FDBBC6143BDF3-001\control-001\solr.xml
   [junit4]   2> 2471172 INFO  (TEST-DistributedVersionInfoTest.test-seed#[945FDBBC6143BDF3]) [    ] o.a.s.c.CoresLocator Config-defined core root directory: C:\Users\JenkinsSlave\workspace\Lucene-Solr-trunk-Windows\solr\build\solr-core\test\J0\temp\solr.cloud.DistributedVersionInfoTest_945FDBBC6143BDF3-001\control-001\cores
   [junit4]   2> 2471172 INFO  (TEST-DistributedVersionInfoTest.test-seed#[945FDBBC6143BDF3]) [    ] o.a.s.c.CoreContainer New CoreContainer 1960969179
   [junit4]   2> 2471172 INFO  (TEST-DistributedVersionInfoTest.test-seed#[945FDBBC6143BDF3]) [    ] o.a.s.c.CoreContainer Loading cores into CoreContainer [instanceDir=C:\Users\JenkinsSlave\workspace\Lucene-Solr-trunk-Windows\solr\build\solr-core\test\J0\temp\solr.cloud.DistributedVersionInfoTest_945FDBBC6143BDF3-001\control-001\]
   [junit4]   2> 2471172 INFO  (TEST-DistributedVersionInfoTest.test-seed#[945FDBBC6143BDF3]) [    ] o.a.s.c.CoreContainer loading shared library: C:\Users\JenkinsSlave\workspace\Lucene-Solr-trunk-Windows\solr\build\solr-core\test\J0\temp\solr.cloud.DistributedVersionInfoTest_945FDBBC6143BDF3-001\control-001\lib
   [junit4]   2> 2471172 WARN  (TEST-DistributedVersionInfoTest.test-seed#[945FDBBC6143BDF3]) [    ] o.a.s.c.SolrResourceLoader Can't find (or read) directory to add to classloader: lib (resolved as: C:\Users\JenkinsSlave\workspace\Lucene-Solr-trunk-Windows\solr\build\solr-core\test\J0\temp\solr.cloud.DistributedVersionInfoTest_945FDBBC6143BDF3-001\control-001\lib).
   [junit4]   2> 2471179 INFO  (TEST-DistributedVersionInfoTest.test-seed#[945FDBBC6143BDF3]) [    ] o.a.s.h.c.HttpShardHandlerFactory created with socketTimeout : 90000,urlScheme : ,connTimeout : 15000,maxConnectionsPerHost : 20,maxConnections : 10000,corePoolSize : 0,maximumPoolSize : 2147483647,maxThreadIdleTime : 5,sizeOfQueue : -1,fairnessPolicy : false,useRetries : false,
   [junit4]   2> 2471181 INFO  (TEST-DistributedVersionInfoTest.test-seed#[945FDBBC6143BDF3]) [    ] o.a.s.u.UpdateShardHandler Creating UpdateShardHandler HTTP client with params: socketTimeout=340000&connTimeout=45000&retry=true
   [junit4]   2> 2471182 INFO  (TEST-DistributedVersionInfoTest.test-seed#[945FDBBC6143BDF3]) [    ] o.a.s.l.LogWatcher SLF4J impl is org.slf4j.impl.Log4jLoggerFactory
   [junit4]   2> 2471182 INFO  (TEST-DistributedVersionInfoTest.test-seed#[945FDBBC6143BDF3]) [    ] o.a.s.l.LogWatcher Registering Log Listener [Log4j (org.slf4j.impl.Log4jLoggerFactory)]
   [junit4]   2> 2471182 INFO  (TEST-DistributedVersionInfoTest.test-seed#[945FDBBC6143BDF3]) [    ] o.a.s.c.ZkContainer Zookeeper client=127.0.0.1:51008/solr
   [junit4]   2> 2471183 INFO  (TEST-DistributedVersionInfoTest.test-seed#[945FDBBC6143BDF3]) [    ] o.a.s.c.ZkController zkHost includes chroot
   [junit4]   2> 2471183 INFO  (TEST-DistributedVersionInfoTest.test-seed#[945FDBBC6143BDF3]) [    ] o.a.s.c.c.SolrZkClient Using default ZkCredentialsProvider
   [junit4]   2> 2471185 INFO  (TEST-DistributedVersionInfoTest.test-seed#[945FDBBC6143BDF3]) [    ] o.a.s.c.c.ConnectionManager Waiting for client to connect to ZooKeeper
   [junit4]   2> 2471187 INFO  (zkCallback-2703-thread-1) [    ] o.a.s.c.c.ConnectionManager Watcher org.apache.solr.common.cloud.ConnectionManager@792d910c name:ZooKeeperConnection Watcher:127.0.0.1:51008 got event WatchedEvent state:SyncConnected type:None path:null path:null type:None
   [junit4]   2> 2471188 INFO  (TEST-DistributedVersionInfoTest.test-seed#[945FDBBC6143BDF3]) [    ] o.a.s.c.c.ConnectionManager Client is connected to ZooKeeper
   [junit4]   2> 2471188 INFO  (TEST-DistributedVersionInfoTest.test-seed#[945FDBBC6143BDF3]) [    ] o.a.s.c.c.SolrZkClient Using default ZkACLProvider
   [junit4]   2> 2471190 INFO  (TEST-DistributedVersionInfoTest.test-seed#[945FDBBC6143BDF3]) [n:127.0.0.1:51015_    ] o.a.s.c.c.ConnectionManager Waiting for client to connect to ZooKeeper
   [junit4]   2> 2471191 INFO  (zkCallback-2704-thread-1-processing-n:127.0.0.1:51015_) [n:127.0.0.1:51015_    ] o.a.s.c.c.ConnectionManager Watcher org.apache.solr.common.cloud.ConnectionManager@64761101 name:ZooKeeperConnection Watcher:127.0.0.1:51008/solr got event WatchedEvent state:SyncConnected type:None path:null path:null type:None
   [junit4]   2> 2471191 INFO  (TEST-DistributedVersionInfoTest.test-seed#[945FDBBC6143BDF3]) [n:127.0.0.1:51015_    ] o.a.s.c.c.ConnectionManager Client is connected to ZooKeeper
   [junit4]   2> 2471192 INFO  (TEST-DistributedVersionInfoTest.test-seed#[945FDBBC6143BDF3]) [n:127.0.0.1:51015_    ] o.a.s.c.c.SolrZkClient makePath: /overseer/queue
   [junit4]   2> 2471194 INFO  (TEST-DistributedVersionInfoTest.test-seed#[945FDBBC6143BDF3]) [n:127.0.0.1:51015_    ] o.a.s.c.c.SolrZkClient makePath: /overseer/collection-queue-work
   [junit4]   2> 2471196 INFO  (TEST-DistributedVersionInfoTest.test-seed#[945FDBBC6143BDF3]) [n:127.0.0.1:51015_    ] o.a.s.c.c.SolrZkClient makePath: /overseer/collection-map-running
   [junit4]   2> 2471199 INFO  (TEST-DistributedVersionInfoTest.test-seed#[945FDBBC6143BDF3]) [n:127.0.0.1:51015_    ] o.a.s.c.c.SolrZkClient makePath: /overseer/collection-map-completed
   [junit4]   2> 2471201 INFO  (TEST-DistributedVersionInfoTest.test-seed#[945FDBBC6143BDF3]) [n:127.0.0.1:51015_    ] o.a.s.c.c.SolrZkClient makePath: /overseer/collection-map-failure
   [junit4]   2> 2471202 INFO  (TEST-DistributedVersionInfoTest.test-seed#[945FDBBC6143BDF3]) [n:127.0.0.1:51015_    ] o.a.s.c.c.SolrZkClient makePath: /live_nodes
   [junit4]   2> 2471204 INFO  (TEST-DistributedVersionInfoTest.test-seed#[945FDBBC6143BDF3]) [n:127.0.0.1:51015_    ] o.a.s.c.c.SolrZkClient makePath: /aliases.json
   [junit4]   2> 2471206 INFO  (TEST-DistributedVersionInfoTest.test-seed#[945FDBBC6143BDF3]) [n:127.0.0.1:51015_    ] o.a.s.c.c.SolrZkClient makePath: /clusterstate.json
   [junit4]   2> 2471207 INFO  (TEST-DistributedVersionInfoTest.test-seed#[945FDBBC6143BDF3]) [n:127.0.0.1:51015_    ] o.a.s.c.ZkController Register node as live in ZooKeeper:/live_nodes/127.0.0.1:51015_
   [junit4]   2> 2471208 INFO  (TEST-DistributedVersionInfoTest.test-seed#[945FDBBC6143BDF3]) [n:127.0.0.1:51015_    ] o.a.s.c.c.SolrZkClient makePath: /live_nodes/127.0.0.1:51015_
   [junit4]   2> 2471208 INFO  (TEST-DistributedVersionInfoTest.test-seed#[945FDBBC6143BDF3]) [n:127.0.0.1:51015_    ] o.a.s.c.c.SolrZkClient makePath: /overseer_elect
   [junit4]   2> 2471210 INFO  (TEST-DistributedVersionInfoTest.test-seed#[945FDBBC6143BDF3]) [n:127.0.0.1:51015_    ] o.a.s.c.c.SolrZkClient makePath: /overseer_elect/election
   [junit4]   2> 2471212 INFO  (TEST-DistributedVersionInfoTest.test-seed#[945FDBBC6143BDF3]) [n:127.0.0.1:51015_    ] o.a.s.c.Overseer Overseer (id=null) closing
   [junit4]   2> 2471212 INFO  (TEST-DistributedVersionInfoTest.test-seed#[945FDBBC6143BDF3]) [n:127.0.0.1:51015_    ] o.a.s.c.LeaderElector Joined leadership election with path: /overseer_elect/election/94236182259892228-127.0.0.1:51015_-n_0000000000
   [junit4]   2> 2471213 INFO  (TEST-DistributedVersionInfoTest.test-seed#[945FDBBC6143BDF3]) [n:127.0.0.1:51015_    ] o.a.s.c.OverseerElectionContext I am going to be the leader 127.0.0.1:51015_
   [junit4]   2> 2471213 INFO  (TEST-DistributedVersionInfoTest.test-seed#[945FDBBC6143BDF3]) [n:127.0.0.1:51015_    ] o.a.s.c.c.SolrZkClient makePath: /overseer_elect/leader
   [junit4]   2> 2471215 INFO  (TEST-DistributedVersionInfoTest.test-seed#[945FDBBC6143BDF3]) [n:127.0.0.1:51015_    ] o.a.s.c.Overseer Overseer (id=94236182259892228-127.0.0.1:51015_-n_0000000000) starting
   [junit4]   2> 2471217 INFO  (TEST-DistributedVersionInfoTest.test-seed#[945FDBBC6143BDF3]) [n:127.0.0.1:51015_    ] o.a.s.c.c.SolrZkClient makePath: /overseer/queue-work
   [junit4]   2> 2471223 INFO  (TEST-DistributedVersionInfoTest.test-seed#[945FDBBC6143BDF3]) [n:127.0.0.1:51015_    ] o.a.s.c.OverseerAutoReplicaFailoverThread Starting OverseerAutoReplicaFailoverThread autoReplicaFailoverWorkLoopDelay=10000 autoReplicaFailoverWaitAfterExpiration=30000 autoReplicaFailoverBadNodeExpiration=60000
   [junit4]   2> 2471223 INFO  (TEST-DistributedVersionInfoTest.test-seed#[945FDBBC6143BDF3]) [n:127.0.0.1:51015_    ] o.a.s.c.c.ZkStateReader Updating cluster state from ZooKeeper... 
   [junit4]   2> 2471223 INFO  (OverseerCollectionProcessor-94236182259892228-127.0.0.1:51015_-n_0000000000) [n:127.0.0.1:51015_    ] o.a.s.c.OverseerCollectionProcessor Process current queue of collection creations
   [junit4]   2> 2471224 INFO  (OverseerStateUpdate-94236182259892228-127.0.0.1:51015_-n_0000000000) [n:127.0.0.1:51015_    ] o.a.s.c.Overseer Starting to work on the main queue
   [junit4]   2> 2471228 INFO  (TEST-DistributedVersionInfoTest.test-seed#[945FDBBC6143BDF3]) [n:127.0.0.1:51015_    ] o.a.s.c.CoreContainer No authentication plugin used.
   [junit4]   2> 2471228 INFO  (TEST-DistributedVersionInfoTest.test-seed#[945FDBBC6143BDF3]) [n:127.0.0.1:51015_    ] o.a.s.c.CoreContainer Security conf doesn't exist. Skipping setup for authorization module.
   [junit4]   2> 2471229 INFO  (TEST-DistributedVersionInfoTest.test-seed#[945FDBBC6143BDF3]) [n:127.0.0.1:51015_    ] o.a.s.c.CoresLocator Looking for core definitions underneath C:\Users\JenkinsSlave\workspace\Lucene-Solr-trunk-Windows\solr\build\solr-core\test\J0\temp\solr.cloud.DistributedVersionInfoTest_945FDBBC6143BDF3-001\control-001\cores
   [junit4]   2> 2471230 INFO  (TEST-DistributedVersionInfoTest.test-seed#[945FDBBC6143BDF3]) [n:127.0.0.1:51015_    ] o.a.s.c.SolrCore Created CoreDescriptor: {name=collection1, config=solrconfig.xml, transient=false, schema=schema.xml, loadOnStartup=true, configSetProperties=configsetprops.json, instanceDir=C:\Users\JenkinsSlave\workspace\Lucene-Solr-trunk-Windows\solr\build\solr-core\test\J0\temp\solr.cloud.DistributedVersionInfoTest_945FDBBC6143BDF3-001\control-001\cores\collection1, collection=control_collection, absoluteInstDir=C:\Users\JenkinsSlave\workspace\Lucene-Solr-trunk-Windows\solr\build\solr-core\test\J0\temp\solr.cloud.DistributedVersionInfoTest_945FDBBC6143BDF3-001\control-001\cores\collection1\, coreNodeName=, dataDir=data\, shard=}
   [junit4]   2> 2471231 INFO  (TEST-DistributedVersionInfoTest.test-seed#[945FDBBC6143BDF3]) [n:127.0.0.1:51015_    ] o.a.s.c.CoresLocator Found core collection1 in C:\Users\JenkinsSlave\workspace\Lucene-Solr-trunk-Windows\solr\build\solr-core\test\J0\temp\solr.cloud.DistributedVersionInfoTest_945FDBBC6143BDF3-001\control-001\cores\collection1\
   [junit4]   2> 2471231 INFO  (TEST-DistributedVersionInfoTest.test-seed#[945FDBBC6143BDF3]) [n:127.0.0.1:51015_    ] o.a.s.c.CoresLocator Found 1 core definitions
   [junit4]   2> 2471232 INFO  (coreLoadExecutor-6676-thread-1-processing-n:127.0.0.1:51015_) [n:127.0.0.1:51015_ c:control_collection   x:collection1] o.a.s.c.ZkController publishing state=down
   [junit4]   2> 2471232 INFO  (TEST-DistributedVersionInfoTest.test-seed#[945FDBBC6143BDF3]) [n:127.0.0.1:51015_    ] o.a.s.s.SolrDispatchFilter user.dir=C:\Users\JenkinsSlave\workspace\Lucene-Solr-trunk-Windows\solr\build\solr-core\test\J0
   [junit4]   2> 2471232 INFO  (TEST-DistributedVersionInfoTest.test-seed#[945FDBBC6143BDF3]) [n:127.0.0.1:51015_    ] o.a.s.s.SolrDispatchFilter SolrDispatchFilter.init() done
   [junit4]   2> 2471232 INFO  (coreLoadExecutor-6676-thread-1-processing-n:127.0.0.1:51015_) [n:127.0.0.1:51015_ c:control_collection   x:collection1] o.a.s.c.ZkController numShards not found on descriptor - reading it from system property
   [junit4]   2> 2471233 INFO  (coreLoadExecutor-6676-thread-1-processing-n:127.0.0.1:51015_) [n:127.0.0.1:51015_ c:control_collection   x:collection1] o.a.s.c.ZkController look for our core node name
   [junit4]   2> 2471233 INFO  (zkCallback-2704-thread-1-processing-n:127.0.0.1:51015_) [n:127.0.0.1:51015_    ] o.a.s.c.DistributedQueue NodeChildrenChanged fired on path /overseer/queue state SyncConnected
   [junit4]   2> 2471234 INFO  (OverseerStateUpdate-94236182259892228-127.0.0.1:51015_-n_0000000000) [n:127.0.0.1:51015_    ] o.a.s.c.Overseer processMessage: queueSize: 1, message = {
   [junit4]   2>   "core":"collection1",
   [junit4]   2>   "roles":null,
   [junit4]   2>   "base_url":"http://127.0.0.1:51015",
   [junit4]   2>   "node_name":"127.0.0.1:51015_",
   [junit4]   2>   "numShards":"1",
   [junit4]   2>   "state":"down",
   [junit4]   2>   "shard":null,
   [junit4]   2>   "collection":"control_collection",
   [junit4]   2>   "operation":"state"} current state version: 0
   [junit4]   2> 2471235 INFO  (OverseerStateUpdate-94236182259892228-127.0.0.1:51015_-n_0000000000) [n:127.0.0.1:51015_    ] o.a.s.c.o.ReplicaMutator Update state numShards=1 message={
   [junit4]   2>   "core":"collection1",
   [junit4]   2>   "roles":null,
   [junit4]   2>   "base_url":"http://127.0.0.1:51015",
   [junit4]   2>   "node_name":"127.0.0.1:51015_",
   [junit4]   2>   "numShards":"1",
   [junit4]   2>   "state":"down",
   [junit4]   2>   "shard":null,
   [junit4]   2>   "collection":"control_collection",
   [junit4]   2>   "operation":"state"}
   [junit4]   2> 2471235 INFO  (OverseerStateUpdate-94236182259892228-127.0.0.1:51015_-n_0000000000) [n:127.0.0.1:51015_    ] o.a.s.c.o.ClusterStateMutator building a new cName: control_collection
   [junit4]   2> 2471235 INFO  (OverseerStateUpdate-94236182259892228-127.0.0.1:51015_-n_0000000000) [n:127.0.0.1:51015_    ] o.a.s.c.o.ReplicaMutator Assigning new node to shard shard=shard1
   [junit4]   2> 2471235 INFO  (zkCallback-2704-thread-1-processing-n:127.0.0.1:51015_) [n:127.0.0.1:51015_    ] o.a.s.c.c.ZkStateReader A cluster state change: WatchedEvent state:SyncConnected type:NodeDataChanged path:/clusterstate.json, has occurred - updating... (live nodes size: 1)
   [junit4]   2> 2471237 INFO  (zkCallback-2704-thread-1-processing-n:127.0.0.1:51015_) [n:127.0.0.1:51015_    ] o.a.s.c.c.ZkStateReader Updated cluster state version to 1
   [junit4]   2> 2472124 INFO  (coreLoadExecutor-6676-thread-1-processing-n:127.0.0.1:51015_) [n:127.0.0.1:51015_ c:control_collection   x:collection1] o.a.s.c.ZkController waiting to find shard id in clusterstate for collection1
   [junit4]   2> 2472124 INFO  (coreLoadExecutor-6676-thread-1-processing-n:127.0.0.1:51015_) [n:127.0.0.1:51015_ c:control_collection   x:collection1] o.a.s.c.ZkController Check for collection zkNode:control_collection
   [junit4]   2> 2472125 INFO  (coreLoadExecutor-6676-thread-1-processing-n:127.0.0.1:51015_) [n:127.0.0.1:51015_ c:control_collection   x:collection1] o.a.s.c.ZkController Collection zkNode exists
   [junit4]   2> 2472125 INFO  (coreLoadExecutor-6676-thread-1-processing-n:127.0.0.1:51015_) [n:127.0.0.1:51015_ c:control_collection   x:collection1] o.a.s.c.c.ZkStateReader Load collection config from:/collections/control_collection
   [junit4]   2> 2472125 INFO  (coreLoadExecutor-6676-thread-1-processing-n:127.0.0.1:51015_) [n:127.0.0.1:51015_ c:control_collection   x:collection1] o.a.s.c.c.ZkStateReader path=/collections/control_collection configName=conf1 specified config exists in ZooKeeper
   [junit4]   2> 2472125 INFO  (coreLoadExecutor-6676-thread-1-processing-n:127.0.0.1:51015_) [n:127.0.0.1:51015_ c:control_collection   x:collection1] o.a.s.c.SolrResourceLoader new SolrResourceLoader for directory: 'C:\Users\JenkinsSlave\workspace\Lucene-Solr-trunk-Windows\solr\build\solr-core\test\J0\temp\solr.cloud.DistributedVersionInfoTest_945FDBBC6143BDF3-001\control-001\cores\collection1\'
   [junit4]   2> 2472137 INFO  (coreLoadExecutor-6676-thread-1-processing-n:127.0.0.1:51015_) [n:127.0.0.1:51015_ c:control_collection   x:collection1] o.a.s.c.Config loaded config solrconfig.xml with version 0 
   [junit4]   2> 2472143 INFO  (coreLoadExecutor-6676-thread-1-processing-n:127.0.0.1:51015_) [n:127.0.0.1:51015_ c:control_collection   x:collection1] o.a.s.c.SolrConfig current version of requestparams : -1
   [junit4]   2> 2472146 INFO  (coreLoadExecutor-6676-thread-1-processing-n:127.0.0.1:51015_) [n:127.0.0.1:51015_ c:control_collection   x:collection1] o.a.s.c.SolrConfig Using Lucene MatchVersion: 6.0.0
   [junit4]   2> 2472152 INFO  (coreLoadExecutor-6676-thread-1-processing-n:127.0.0.1:51015_) [n:127.0.0.1:51015_ c:control_collection   x:collection1] o.a.s.c.Config Loaded SolrConfig: solrconfig.xml
   [junit4]   2> 2472153 INFO  (coreLoadExecutor-6676-thread-1-processing-n:127.0.0.1:51015_) [n:127.0.0.1:51015_ c:control_collection   x:collection1] o.a.s.s.IndexSchema Reading Solr Schema from /configs/conf1/schema.xml
   [junit4]   2> 2472157 INFO  (coreLoadExecutor-6676-thread-1-processing-n:127.0.0.1:51015_) [n:127.0.0.1:51015_ c:control_collection   x:collection1] o.a.s.s.IndexSchema [collection1] Schema name=test
   [junit4]   2> 2472237 INFO  (coreLoadExecutor-6676-thread-1-processing-n:127.0.0.1:51015_) [n:127.0.0.1:51015_ c:control_collection   x:collection1] o.a.s.s.OpenExchangeRatesOrgProvider Initialized with rates=open-exchange-rates.json, refreshInterval=1440.
   [junit4]   2> 2472245 INFO  (coreLoadExecutor-6676-thread-1-processing-n:127.0.0.1:51015_) [n:127.0.0.1:51015_ c:control_collection   x:collection1] o.a.s.s.IndexSchema default search field in schema is text
   [junit4]   2> 2472246 INFO  (coreLoadExecutor-6676-thread-1-processing-n:127.0.0.1:51015_) [n:127.0.0.1:51015_ c:control_collection   x:collection1] o.a.s.s.IndexSchema unique key field: id
   [junit4]   2> 2472254 INFO  (coreLoadExecutor-6676-thread-1-processing-n:127.0.0.1:51015_) [n:127.0.0.1:51015_ c:control_collection   x:collection1] o.a.s.s.FileExchangeRateProvider Reloading exchange rates from file currency.xml
   [junit4]   2> 2472256 INFO  (coreLoadExecutor-6676-thread-1-processing-n:127.0.0.1:51015_) [n:127.0.0.1:51015_ c:control_collection   x:collection1] o.a.s.s.FileExchangeRateProvider Reloading exchange rates from file currency.xml
   [junit4]   2> 2472258 INFO  (coreLoadExecutor-6676-thread-1-processing-n:127.0.0.1:51015_) [n:127.0.0.1:51015_ c:control_collection   x:collection1] o.a.s.s.OpenExchangeRatesOrgProvider Reloading exchange rates from open-exchange-rates.json
   [junit4]   2> 2472259 WARN  (coreLoadExecutor-6676-thread-1-processing-n:127.0.0.1:51015_) [n:127.0.0.1:51015_ c:control_collection   x:collection1] o.a.s.s.OpenExchangeRatesOrgProvider Unknown key IMPORTANT NOTE
   [junit4]   2> 2472259 WARN  (coreLoadExecutor-6676-thread-1-processing-n:127.0.0.1:51015_) [n:127.0.0.1:51015_ c:control_collection   x:collection1] o.a.s.s.OpenExchangeRatesOrgProvider Expected key, got STRING
   [junit4]   2> 2472259 INFO  (coreLoadExecutor-6676-thread-1-processing-n:127.0.0.1:51015_) [n:127.0.0.1:51015_ c:control_collection   x:collection1] o.a.s.s.OpenExchangeRatesOrgProvider Reloading exchange rates from open-exchange-rates.json
   [junit4]   2> 2472259 WARN  (coreLoadExecutor-6676-thread-1-processing-n:127.0.0.1:51015_) [n:127.0.0.1:51015_ c:control_collection   x:collection1] o.a.s.s.OpenExchangeRatesOrgProvider Unknown key IMPORTANT NOTE
   [junit4]   2> 2472259 WARN  (coreLoadExecutor-6676-thread-1-processing-n:127.0.0.1:51015_) [n:127.0.0.1:51015_ c:control_collection   x:collection1] o.a.s.s.OpenExchangeRatesOrgProvider Expected key, got STRING
   [junit4]   2> 2472264 INFO  (coreLoadExecutor-6676-thread-1-processing-n:127.0.0.1:51015_) [n:127.0.0.1:51015_ c:control_collection   x:collection1] o.a.s.c.ConfigSetProperties Did not find ConfigSet properties, assuming default properties: Can't find resource 'configsetprops.json' in classpath or '/configs/conf1', cwd=C:\Users\JenkinsSlave\workspace\Lucene-Solr-trunk-Windows\solr\build\solr-core\test\J0
   [junit4]   2> 2472264 INFO  (coreLoadExecutor-6676-thread-1-processing-n:127.0.0.1:51015_) [n:127.0.0.1:51015_ c:control_collection   x:collection1] o.a.s.c.CoreContainer Creating SolrCore 'collection1' using configuration from collection control_collection
   [junit4]   2> 2472265 INFO  (coreLoadExecutor-6676-thread-1-processing-n:127.0.0.1:51015_) [n:127.0.0.1:51015_ c:control_collection s:shard1 r:core_node1 x:collection1] o.a.s.c.SolrCore org.apache.solr.core.MockDirectoryFactory
   [junit4]   2> 2472265 INFO  (coreLoadExecutor-6676-thread-1-processing-n:127.0.0.1:51015_) [n:127.0.0.1:51015_ c:control_collection s:shard1 r:core_node1 x:collection1] o.a.s.c.SolrCore [[collection1] ] Opening new SolrCore at [C:\Users\JenkinsSlave\workspace\Lucene-Solr-trunk-Windows\solr\build\solr-core\test\J0\temp\solr.cloud.DistributedVersionInfoTest_945FDBBC6143BDF3-001\control-001\cores\collection1\], dataDir=[null]
   [junit4]   2> 2472265 INFO  (coreLoadExecutor-6676-thread-1-processing-n:127.0.0.1:51015_) [n:127.0.0.1:51015_ c:control_collection s:shard1 r:core_node1 x:collection1] o.a.s.c.JmxMonitoredMap JMX monitoring is enabled. Adding Solr mbeans to JMX Server: com.sun.jmx.mbeanserver.JmxMBeanServer@3da0a645
   [junit4]   2> 2472266 INFO  (coreLoadExecutor-6676-thread-1-processing-n:127.0.0.1:51015_) [n:127.0.0.1:51015_ c:control_collection s:shard1 r:core_node1 x:collection1] o.a.s.c.CachingDirectoryFactory return new directory for C:\Users\JenkinsSlave\workspace\Lucene-Solr-trunk-Windows\solr\build\solr-core\test\J0\temp\solr.cloud.DistributedVersionInfoTest_945FDBBC6143BDF3-001\control-001\cores\collection1\data\
   [junit4]   2> 2472266 INFO  (coreLoadExecutor-6676-thread-1-processing-n:127.0.0.1:51015_) [n:127.0.0.1:51015_ c:control_collection s:shard1 r:core_node1 x:collection1] o.a.s.c.SolrCore New index directory detected: old=null new=C:\Users\JenkinsSlave\workspace\Lucene-Solr-trunk-Windows\solr\build\solr-core\test\J0\temp\solr.cloud.DistributedVersionInfoTest_945FDBBC6143BDF3-001\control-001\cores\collection1\data\index/
   [junit4]   2> 2472266 WARN  (coreLoadExecutor-6676-thread-1-processing-n:127.0.0.1:51015_) [n:127.0.0.1:51015_ c:control_collection s:shard1 r:core_node1 x:collection1] o.a.s.c.SolrCore [collection1] Solr index directory 'C:\Users\JenkinsSlave\workspace\Lucene-Solr-trunk-Windows\solr\build\solr-core\test\J0\temp\solr.cloud.DistributedVersionInfoTest_945FDBBC6143BDF3-001\control-001\cores\collection1\data\index' doesn't exist. Creating new index...
   [junit4]   2> 2472266 INFO  (coreLoadExecutor-6676-thread-1-processing-n:127.0.0.1:51015_) [n:127.0.0.1:51015_ c:control_collection s:shard1 r:core_node1 x:collection1] o.a.s.c.CachingDirectoryFactory return new directory for C:\Users\JenkinsSlave\workspace\Lucene-Solr-trunk-Windows\solr\build\solr-core\test\J0\temp\solr.cloud.DistributedVersionInfoTest_945FDBBC6143BDF3-001\control-001\cores\collection1\data\index
   [junit4]   2> 2472266 INFO  (coreLoadExecutor-6676-thread-1-processing-n:127.0.0.1:51015_) [n:127.0.0.1:51015_ c:control_collection s:shard1 r:core_node1 x:collection1] o.a.s.u.RandomMergePolicy RandomMergePolicy wrapping class org.apache.lucene.index.TieredMergePolicy: [TieredMergePolicy: maxMergeAtOnce=10, maxMergeAtOnceExplicit=12, maxMergedSegmentMB=14.0498046875, floorSegmentMB=1.6298828125, forceMergeDeletesPctAllowed=25.47221358560164, segmentsPerTier=37.0, maxCFSSegmentSizeMB=8.796093022207999E12, noCFSRatio=1.0
   [junit4]   2> 2472267 INFO  (coreLoadExecutor-6676-thread-1-processing-n:127.0.0.1:51015_) [n:127.0.0.1:51015_ c:control_collection s:shard1 r:core_node1 x:collection1] o.a.s.c.SolrCore SolrDeletionPolicy.onCommit: commits: num=1
   [junit4]   2> 	commit{dir=MockDirectoryWrapper(RAMDirectory@6f2b6498 lockFactory=org.apache.lucene.store.SingleInstanceLockFactory@64a31876),segFN=segments_1,generation=1}
   [junit4]   2> 2472267 INFO  (coreLoadExecutor-6676-thread-1-processing-n:127.0.0.1:51015_) [n:127.0.0.1:51015_ c:control_collection s:shard1 r:core_node1 x:collection1] o.a.s.c.SolrCore newest commit generation = 1
   [junit4]   2> 2472268 INFO  (OldIndexDirectoryCleanupThreadForCore-collection1) [n:127.0.0.1:51015_ c:control_collection s:shard1 r:core_node1 x:collection1] o.a.s.c.SolrCore Looking for old index directories to cleanup for core collection1 in C:\Users\JenkinsSlave\workspace\Lucene-Solr-trunk-Windows\solr\build\solr-core\test\J0\temp\solr.cloud.DistributedVersionInfoTest_945FDBBC6143BDF3-001\control-001\cores\collection1\data\
   [junit4]   2> 2472268 WARN  (OldIndexDirectoryCleanupThreadForCore-collection1) [n:127.0.0.1:51015_ c:control_collection s:shard1 r:core_node1 x:collection1] o.a.s.c.DirectoryFactory C:\Users\JenkinsSlave\workspace\Lucene-Solr-trunk-Windows\solr\build\solr-core\test\J0\temp\solr.cloud.DistributedVersionInfoTest_945FDBBC6143BDF3-001\control-001\cores\collection1\data\ does not point to a valid data directory; skipping clean-up of old index directories.
   [junit4]   2> 2472271 INFO  (coreLoadExecutor-6676-thread-1-processing-n:127.0.0.1:51015_) [n:127.0.0.1:51015_ c:control_collection s:shard1 r:core_node1 x:collection1] o.a.s.u.p.UpdateRequestProcessorChain creating updateRequestProcessorChain "nodistrib"
   [junit4]   2> 2472272 INFO  (coreLoadExecutor-6676-thread-1-processing-n:127.0.0.1:51015_) [n:127.0.0.1:51015_ c:control_collection s:shard1 r:core_node1 x:collection1] o.a.s.u.p.UpdateRequestProcessorChain creating updateRequestProcessorChain "dedupe"
   [junit4]   2> 2472272 INFO  (coreLoadExecutor-6676-thread-1-processing-n:127.0.0.1:51015_) [n:127.0.0.1:51015_ c:control_collection s:shard1 r:core_node1 x:collection1] o.a.s.u.p.UpdateRequestProcessorChain inserting DistributedUpdateProcessorFactory into updateRequestProcessorChain "dedupe"
   [junit4]   2> 2472272 INFO  (coreLoadExecutor-6676-thread-1-processing-n:127.0.0.1:51015_) [n:127.0.0.1:51015_ c:control_collection s:shard1 r:core_node1 x:collection1] o.a.s.u.p.UpdateRequestProcessorChain creating updateRequestProcessorChain "stored_sig"
   [junit4]   2> 2472272 INFO  (coreLoadExecutor-6676-thread-1-processing-n:127.0.0.1:51015_) [n:127.0.0.1:51015_ c:control_collection s:shard1 r:core_node1 x:collection1] o.a.s.u.p.UpdateRequestProcessorChain inserting DistributedUpdateProcessorFactory into updateRequestProcessorChain "stored_sig"
   [junit4]   2> 2472272 INFO  (coreLoadExecutor-6676-thread-1-processing-n:127.0.0.1:51015_) [n:127.0.0.1:51015_ c:control_collection s:shard1 r:core_node1 x:collection1] o.a.s.u.p.UpdateRequestProcessorChain creating updateRequestProcessorChain "distrib-dup-test-chain-explicit"
   [junit4]   2> 2472273 INFO  (coreLoadExecutor-6676-thread-1-processing-n:127.0.0.1:51015_) [n:127.0.0.1:51015_ c:control_collection s:shard1 r:core_node1 x:collection1] o.a.s.u.p.UpdateRequestProcessorChain creating updateRequestProcessorChain "distrib-dup-test-chain-implicit"
   [junit4]   2> 2472273 INFO  (coreLoadExecutor-6676-thread-1-processing-n:127.0.0.1:51015_) [n:127.0.0.1:51015_ c:control_collection s:shard1 r:core_node1 x:collection1] o.a.s.u.p.UpdateRequestProcessorChain inserting DistributedUpdateProcessorFactory into updateRequestProcessorChain "distrib-dup-test-chain-implicit"
   [junit4]   2> 2472273 INFO  (coreLoadExecutor-6676-thread-1-processing-n:127.0.0.1:51015_) [n:127.0.0.1:51015_ c:control_collection s:shard1 r:core_node1 x:collection1] o.a.s.c.SolrCore no updateRequestProcessorChain defined as default, creating implicit default
   [junit4]   2> 2472279 INFO  (coreLoadExecutor-6676-thread-1-processing-n:127.0.0.1:51015_) [n:127.0.0.1:51015_ c:control_collection s:shard1 r:core_node1 x:collection1] o.a.s.h.l.XMLLoader xsltCacheLifetimeSeconds=60
   [junit4]   2> 2472280 INFO  (coreLoadExecutor-6676-thread-1-processing-n:127.0.0.1:51015_) [n:127.0.0.1:51015_ c:control_collection s:shard1 r:core_node1 x:collection1] o.a.s.h.l.XMLLoader xsltCacheLifetimeSeconds=60
   [junit4]   2> 2472282 INFO  (coreLoadExecutor-6676-thread-1-processing-n:127.0.0.1:51015_) [n:127.0.0.1:51015_ c:control_collection s:shard1 r:core_node1 x:collection1] o.a.s.h.l.XMLLoader xsltCacheLifetimeSeconds=60
   [junit4]   2> 2472283 INFO  (coreLoadExecutor-6676-thread-1-processing-n:127.0.0.1:51015_) [n:127.0.0.1:51015_ c:control_collection s:shard1 r:core_node1 x:collection1] o.a.s.h.l.XMLLoader xsltCacheLifetimeSeconds=60
   [junit4]   2> 2472286 INFO  (coreLoadExecutor-6676-thread-1-processing-n:127.0.0.1:51015_) [n:127.0.0.1:51015_ c:control_collection s:shard1 r:core_node1 x:collection1] o.a.s.c.RequestHandlers Registered paths: /admin/mbeans,standard,/update/csv,/update/json/docs,/admin/luke,/admin/segments,/get,/admin/system,/replication,/admin/properties,/config,/schema,/admin/plugins,/admin/logging,/update/json,/admin/threads,/admin/ping,/update,/admin/file
   [junit4]   2> 2472286 INFO  (coreLoadExecutor-6676-thread-1-processing-n:127.0.0.1:51015_) [n:127.0.0.1:51015_ c:control_collection s:shard1 r:core_node1 x:collection1] o.a.s.c.SolrCore Using default statsCache cache: org.apache.solr.search.stats.LocalStatsCache
   [junit4]   2> 2472287 INFO  (coreLoadExecutor-6676-thread-1-processing-n:127.0.0.1:51015_) [n:127.0.0.1:51015_ c:control_collection s:shard1 r:core_node1 x:collection1] o.a.s.u.UpdateHandler Using UpdateLog implementation: org.apache.solr.update.UpdateLog
   [junit4]   2> 2472288 INFO  (coreLoadExecutor-6676-thread-1-processing-n:127.0.0.1:51015_) [n:127.0.0.1:51015_ c:control_collection s:shard1 r:core_node1 x:collection1] o.a.s.u.UpdateLog Initializing UpdateLog: dataDir= defaultSyncLevel=FLUSH numRecordsToKeep=100 maxNumLogsToKeep=10 numVersionBuckets=65536
   [junit4]   2> 2472289 INFO  (coreLoadExecutor-6676-thread-1-processing-n:127.0.0.1:51015_) [n:127.0.0.1:51015_ c:control_collection s:shard1 r:core_node1 x:collection1] o.a.s.c.SolrCore Hard AutoCommit: disabled
   [junit4]   2> 2472289 INFO  (coreLoadExecutor-6676-thread-1-processing-n:127.0.0.1:51015_) [n:127.0.0.1:51015_ c:control_collection s:shard1 r:core_node1 x:collection1] o.a.s.c.SolrCore Soft AutoCommit: disabled
   [junit4]   2> 2472290 INFO  (coreLoadExecutor-6676-thread-1-processing-n:127.0.0.1:51015_) [n:127.0.0.1:51015_ c:control_collection s:shard1 r:core_node1 x:collection1] o.a.s.u.RandomMergePolicy RandomMergePolicy wrapping class org.apache.lucene.index.AlcoholicMergePolicy: [AlcoholicMergePolicy: minMergeSize=0, mergeFactor=10, maxMergeSize=1226973845, maxMergeSizeForForcedMerge=9223372036854775807, calibrateSizeByDeletes=true, maxMergeDocs=2147483647, maxCFSSegmentSizeMB=8.796093022207999E12, noCFSRatio=0.1]
   [junit4]   2> 2472291 INFO  (coreLoadExecutor-6676-thread-1-processing-n:127.0.0.1:51015_) [n:127.0.0.1:51015_ c:control_collection s:shard1 r:core_node1 x:collection1] o.a.s.c.SolrCore SolrDeletionPolicy.onInit: commits: num=1
   [junit4]   2> 	commit{dir=MockDirectoryWrapper(RAMDirectory@6f2b6498 lockFactory=org.apache.lucene.store.SingleInstanceLockFactory@64a31876),segFN=segments_1,generation=1}
   [junit4]   2> 2472291 INFO  (coreLoadExecutor-6676-thread-1-processing-n:127.0.0.1:51015_) [n:127.0.0.1:51015_ c:control_collection s:shard1 r:core_node1 x:collection1] o.a.s.c.SolrCore newest commit generation = 1
   [junit4]   2> 2472291 INFO  (coreLoadExecutor-6676-thread-1-processing-n:127.0.0.1:51015_) [n:127.0.0.1:51015_ c:control_collection s:shard1 r:core_node1 x:collection1] o.a.s.s.SolrIndexSearcher Opening Searcher@5d54ef59[collection1] main
   [junit4]   2> 2472291 INFO  (coreLoadExecutor-6676-thread-1-processing-n:127.0.0.1:51015_) [n:127.0.0.1:51015_ c:control_collection s:shard1 r:core_node1 x:collection1] o.a.s.c.c.ZkStateReader Load collection config from:/collections/control_collection
   [junit4]   2> 2472293 INFO  (coreLoadExecutor-6676-thread-1-processing-n:127.0.0.1:51015_) [n:127.0.0.1:51015_ c:control_collection s:shard1 r:core_node1 x:collection1] o.a.s.c.c.ZkStateReader path=/collections/control_collection configName=conf1 specified config exists in ZooKeeper
   [junit4]   2> 2472293 INFO  (coreLoadExecutor-6676-thread-1-processing-n:127.0.0.1:51015_) [n:127.0.0.1:51015_ c:control_collection s:shard1 r:core_node1 x:collection1] o.a.s.r.ManagedResourceStorage Setting up ZooKeeper-based storage for the RestManager with znodeBase: /configs/conf1
   [junit4]   2> 2472293 INFO  (coreLoadExecutor-6676-thread-1-processing-n:127.0.0.1:51015_) [n:127.0.0.1:51015_ c:control_collection s:shard1 r:core_node1 x:collection1] o.a.s.r.ManagedResourceStorage Configured ZooKeeperStorageIO with znodeBase: /configs/conf1
   [junit4]   2> 2472293 INFO  (coreLoadExecutor-6676-thread-1-processing-n:127.0.0.1:51015_) [n:127.0.0.1:51015_ c:control_collection s:shard1 r:core_node1 x:collection1] o.a.s.r.RestManager Initializing RestManager with initArgs: {}
   [junit4]   2> 2472293 INFO  (coreLoadExecutor-6676-thread-1-processing-n:127.0.0.1:51015_) [n:127.0.0.1:51015_ c:control_collection s:shard1 r:core_node1 x:collection1] o.a.s.r.ManagedResourceStorage Reading _rest_managed.json using ZooKeeperStorageIO:path=/configs/conf1
   [junit4]   2> 2472293 INFO  (coreLoadExecutor-6676-thread-1-processing-n:127.0.0.1:51015_) [n:127.0.0.1:51015_ c:control_collection s:shard1 r:core_node1 x:collection1] o.a.s.r.ManagedResourceStorage No data found for znode /configs/conf1/_rest_managed.json
   [junit4]   2> 2472293 INFO  (coreLoadExecutor-6676-thread-1-processing-n:127.0.0.1:51015_) [n:127.0.0.1:51015_ c:control_collection s:shard1 r:core_node1 x:collection1] o.a.s.r.ManagedResourceStorage Loaded null at path _rest_managed.json using ZooKeeperStorageIO:path=/configs/conf1
   [junit4]   2> 2472294 INFO  (coreLoadExecutor-6676-thread-1-processing-n:127.0.0.1:51015_) [n:127.0.0.1:51015_ c:control_collection s:shard1 r:core_node1 x:collection1] o.a.s.r.RestManager Initializing 0 registered ManagedResources
   [junit4]   2> 2472294 INFO  (coreLoadExecutor-6676-thread-1-processing-n:127.0.0.1:51015_) [n:127.0.0.1:51015_ c:control_collection s:shard1 r:core_node1 x:collection1] o.a.s.h.ReplicationHandler Commits will be reserved for  10000
   [junit4]   2> 2472294 INFO  (searcherExecutor-6677-thread-1-processing-n:127.0.0.1:51015_ x:collection1 s:shard1 c:control_collection r:core_node1) [n:127.0.0.1:51015_ c:control_collection s:shard1 r:core_node1 x:collection1] o.a.s.c.SolrCore [collection1] Registered new searcher Searcher@5d54ef59[collection1] main{ExitableDirectoryReader(UninvertingDirectoryReader())}
   [junit4]   2> 2472294 INFO  (coreLoadExecutor-6676-thread-1-processing-n:127.0.0.1:51015_) [n:127.0.0.1:51015_ c:control_collection s:shard1 r:core_node1 x:collection1] o.a.s.u.UpdateLog Looking up max value of version field to seed version buckets
   [junit4]   2> 2472295 INFO  (coreLoadExecutor-6676-thread-1-processing-n:127.0.0.1:51015_) [n:127.0.0.1:51015_ c:control_collection s:shard1 r:core_node1 x:collection1] o.a.s.u.VersionInfo Refreshing highest value of _version_ for 65536 version buckets from index
   [junit4]   2> 2472295 INFO  (coreLoadExecutor-6676-thread-1-processing-n:127.0.0.1:51015_) [n:127.0.0.1:51015_ c:control_collection s:shard1 r:core_node1 x:collection1] o.a.s.u.VersionInfo No terms found for _version_, cannot seed version bucket highest value from index
   [junit4]   2> 2472295 INFO  (coreLoadExecutor-6676-thread-1-processing-n:127.0.0.1:51015_) [n:127.0.0.1:51015_ c:control_collection s:shard1 r:core_node1 x:collection1] o.a.s.u.UpdateLog Could not find max version in index or recent updates, using new clock 1507778917945049088
   [junit4]   2> 2472297 INFO  (coreLoadExecutor-6676-thread-1-processing-n:127.0.0.1:51015_) [n:127.0.0.1:51015_ c:control_collection s:shard1 r:core_node1 x:collection1] o.a.s.u.UpdateLog Took 2 ms to seed version buckets with highest version 1507778917945049088
   [junit4]   2> 2472297 INFO  (coreLoadExecutor-6676-thread-1-processing-n:127.0.0.1:51015_) [n:127.0.0.1:51015_ c:control_collection s:shard1 r:core_node1 x:collection1] o.a.s.c.ZkController watch zkdir /configs/conf1
   [junit4]   2> 2472298 INFO  (coreLoadExecutor-6676-thread-1-processing-n:127.0.0.1:51015_) [n:127.0.0.1:51015_ c:control_collection s:shard1 r:core_node1 x:collection1] o.a.s.c.CoreContainer registering core: collection1
   [junit4]   2> 2472298 INFO  (coreZkRegister-6670-thread-1-processing-n:127.0.0.1:51015_ x:collection1 s:shard1 c:control_collection r:core_node1) [n:127.0.0.1:51015_ c:control_collection s:shard1 r:core_node1 x:collection1] o.a.s.c.ZkController Register replica - core:collection1 address:http://127.0.0.1:51015 collection:control_collection shard:shard1
   [junit4]   2> 2472300 INFO  (coreZkRegister-6670-thread-1-processing-n:127.0.0.1:51015_ x:collection1 s:shard1 c:control_collection r:core_node1) [n:127.0.0.1:51015_ c:control_collection s:shard1 r:core_node1 x:collection1] o.a.s.c.c.SolrZkClient makePath: /collections/control_collection/leader_elect/shard1/election
   [junit4]   2> 2472303 INFO  (coreZkRegister-6670-thread-1-processing-n:127.0.0.1:51015_ x:collection1 s:shard1 c:control_collection r:core_node1) [n:127.0.0.1:51015_ c:control_collection s:shard1 r:core_node1 x:collection1] o.a.s.c.LeaderElector Joined leadership election with path: /collections/control_collection/leader_elect/shard1/election/94236182259892228-core_node1-n_0000000000
   [junit4]   2> 2472304 INFO  (coreZkRegister-6670-thread-1-processing-n:127.0.0.1:51015_ x:collection1 s:shard1 c:control_collection r:core_node1) [n:127.0.0.1:51015_ c:control_collection s:shard1 r:core_node1 x:collection1] o.a.s.c.ShardLeaderElectionContext Running the leader process for shard shard1
   [junit4]   2> 2472306 INFO  (zkCallback-2704-thread-1-processing-n:127.0.0.1:51015_) [n:127.0.0.1:51015_    ] o.a.s.c.DistributedQueue NodeChildrenChanged fired on path /overseer/queue state SyncConnected
   [junit4]   2> 2472306 INFO  (coreZkRegister-6670-thread-1-processing-n:127.0.0.1:51015_ x:collection1 s:shard1 c:control_collection r:core_node1) [n:127.0.0.1:51015_ c:control_collection s:shard1 r:core_node1 x:collection1] o.a.s.c.ShardLeaderElectionContext Enough replicas found to continue.
   [junit4]   2> 2472306 INFO  (coreZkRegister-6670-thread-1-processing-n:127.0.0.1:51015_ x:collection1 s:shard1 c:control_collection r:core_node1) [n:127.0.0.1:51015_ c:control_collection s:shard1 r:core_node1 x:collection1] o.a.s.c.ShardLeaderElectionContext I may be the new leader - try and sync
   [junit4]   2> 2472306 INFO  (coreZkRegister-6670-thread-1-processing-n:127.0.0.1:51015_ x:collection1 s:shard1 c:control_collection r:core_node1) [n:127.0.0.1:51015_ c:control_collection s:shard1 r:core_node1 x:collection1] o.a.s.c.SyncStrategy Sync replicas to http://127.0.0.1:51015/collection1/
   [junit4]   2> 2472306 INFO  (coreZkRegister-6670-thread-1-processing-n:127.0.0.1:51015_ x:collection1 s:shard1 c:control_collection r:core_node1) [n:127.0.0.1:51015_ c:control_collection s:shard1 r:core_node1 x:collection1] o.a.s.c.SyncStrategy Sync Success - now sync replicas to me
   [junit4]   2> 2472306 INFO  (coreZkRegister-6670-thread-1-processing-n:127.0.0.1:51015_ x:collection1 s:shard1 c:control_collection r:core_node1) [n:127.0.0.1:51015_ c:control_collection s:shard1 r:core_node1 x:collection1] o.a.s.c.SyncStrategy http://127.0.0.1:51015/collection1/ has no replicas
   [junit4]   2> 2472306 INFO  (coreZkRegister-6670-thread-1-processing-n:127.0.0.1:51015_ x:collection1 s:shard1 c:control_collection r:core_node1) [n:127.0.0.1:51015_ c:control_collection s:shard1 r:core_node1 x:collection1] o.a.s.c.ShardLeaderElectionContext I am the new leader: http://127.0.0.1:51015/collection1/ shard1
   [junit4]   2> 2472306 INFO  (coreZkRegister-6670-thread-1-processing-n:127.0.0.1:51015_ x:collection1 s:shard1 c:control_collection r:core_node1) [n:127.0.0.1:51015_ c:control_collection s:shard1 r:core_node1 x:collection1] o.a.s.c.c.SolrZkClient makePath: /collections/control_collection/leaders/shard1
   [junit4]   2> 2472306 INFO  (OverseerStateUpdate-94236182259892228-127.0.0.1:51015_-n_0000000000) [n:127.0.0.1:51015_    ] o.a.s.c.Overseer processMessage: queueSize: 1, message = {
   [junit4]   2>   "operation":"leader",
   [junit4]   2>   "shard":"shard1",
   [junit4]   2>   "collection":"control_collection"} current state version: 1
   [junit4]   2> 2472310 INFO  (zkCallback-2704-thread-1-processing-n:127.0.0.1:51015_) [n:127.0.0.1:51015_    ] o.a.s.c.DistributedQueue NodeChildrenChanged fired on path /overseer/queue state SyncConnected
   [junit4]   2> 2472313 INFO  (OverseerStateUpdate-94236182259892228-127.0.0.1:51015_-n_0000000000) [n:127.0.0.1:51015_    ] o.a.s.c.Overseer processMessage: queueSize: 1, message = {
   [junit4]   2>   "operation":"leader",
   [junit4]   2>   "shard":"shard1",
   [junit4]   2>   "collection":"control_collection",
   [junit4]   2>   "base_url":"http://127.0.0.1:51015",
   [junit4]   2>   "core":"collection1",
   [junit4]   2>   "state":"active"} current state version: 1
   [junit4]   2> 2472404 INFO  (zkCallback-2704-thread-1-processing-n:127.0.0.1:51015_) [n:127.0.0.1:51015_    ] o.a.s.c.c.ZkStateReader A cluster state change: WatchedEvent state:SyncConnected type:NodeDataChanged path:/clusterstate.json, has occurred - updating... (live nodes size: 1)
   [junit4]   2> 2472406 INFO  (zkCallback-2704-thread-1-processing-n:127.0.0.1:51015_) [n:127.0.0.1:51015_    ] o.a.s.c.c.ZkStateReader Updated cluster state version to 2
   [junit4]   2> 2472448 INFO  (coreZkRegister-6670-thread-1-processing-n:127.0.0.1:51015_ x:collection1 s:shard1 c:control_collection r:core_node1) [n:127.0.0.1:51015_ c:control_collection s:shard1 r:core_node1 x:collection1] o.a.s.c.ZkController We are http://127.0.0.1:51015/collection1/ and leader is http://127.0.0.1:51015/collection1/
   [junit4]   2> 2472448 INFO  (coreZkRegister-6670-thread-1-processing-n:127.0.0.1:51015_ x:collection1 s:shard1 c:control_collection r:core_node1) [n:127.0.0.1:51015_ c:control_collection s:shard1 r:core_node1 x:collection1] o.a.s.c.ZkController No LogReplay needed for core=collection1 baseURL=http://127.0.0.1:51015
   [junit4]   2> 2472448 INFO  (coreZkRegister-6670-thread-1-processing-n:127.0.0.1:51015_ x:collection1 s:shard1 c:control_collection r:core_node1) [n:127.0.0.1:51015_ c:control_collection s:shard1 r:core_node1 x:collection1] o.a.s.c.ZkController I am the leader, no recovery necessary
   [junit4]   2> 2472448 INFO  (coreZkRegister-6670-thread-1-processing-n:127.0.0.1:51015_ x:collection1 s:shard1 c:control_collection r:core_node1) [n:127.0.0.1:51015_ c:control_collection s:shard1 r:core_node1 x:collection1] o.a.s.c.ZkController publishing state=active
   [junit4]   2> 2472448 INFO  (coreZkRegister-6670-thread-1-processing-n:127.0.0.1:51015_ x:collection1 s:shard1 c:control_collection r:core_node1) [n:127.0.0.1:51015_ c:control_collection s:shard1 r:core_node1 x:collection1] o.a.s.c.ZkController numShards not found on descriptor - reading it from system property
   [junit4]   2> 2472449 INFO  (zkCallback-2704-thread-1-processing-n:127.0.0.1:51015_) [n:127.0.0.1:51015_    ] o.a.s.c.DistributedQueue NodeChildrenChanged fired on path /overseer/queue state SyncConnected
   [junit4]   2> 2472449 INFO  (OverseerStateUpdate-94236182259892228-127.0.0.1:51015_-n_0000000000) [n:127.0.0.1:51015_    ] o.a.s.c.Overseer processMessage: queueSize: 1, message = {
   [junit4]   2>   "core":"collection1",
   [junit4]   2>   "core_node_name":"core_node1",
   [junit4]   2>   "roles":null,
   [junit4]   2>   "base_url":"http://127.0.0.1:51015",
   [junit4]   2>   "node_name":"127.0.0.1:51015_",
   [junit4]   2>   "numShards":"1",
   [junit4]   2>   "state":"active",
   [junit4]   2>   "shard":"shard1",
   [junit4]   2>   "collection":"control_collection",
   [junit4]   2>   "operation":"state"} current state version: 2
   [junit4]   2> 2472449 INFO  (OverseerStateUpdate-94236182259892228-127.0.0.1:51015_-n_0000000000) [n:127.0.0.1:51015_    ] o.a.s.c.o.ReplicaMutator Update state numShards=1 message={
   [junit4]   2>   "core":"collection1",
   [junit4]   2>   "core_node_name":"core_node1",
   [junit4]   2>   "roles":null,
   [junit4]   2>   "base_url":"http://127.0.0.1:51015",
   [junit4]   2>   "node_name":"127.0.0.1:51015_",
   [junit4]   2>   "numShards":"1",
   [junit4]   2>   "state":"active",
   [junit4]   2>   "shard":"shard1",
   [junit4]   2>   "collection":"control_collection",
   [junit4]   2>   "operation":"state"}
   [junit4]   2> 2472541 INFO  (zkCallback-2704-thread-1-processing-n:127.0.0.1:51015_) [n:127.0.0.1:51015_    ] o.a.s.c.c.ZkStateReader A cluster state change: WatchedEvent state:SyncConnected type:NodeDataChanged path:/clusterstate.json, has occurred - updating... (live nodes size: 1)
   [junit4]   2> 2472542 INFO  (zkCallback-2704-thread-1-processing-n:127.0.0.1:51015_) [n:127.0.0.1:51015_    ] o.a.s.c.c.ZkStateReader Updated cluster state version to 3
   [junit4]   2> 2472569 INFO  (TEST-DistributedVersionInfoTest.test-seed#[945FDBBC6143BDF3]) [    ] o.a.s.c.c.SolrZkClient Using default ZkCredentialsProvider
   [junit4]   2> 2472570 INFO  (TEST-DistributedVersionInfoTest.test-seed#[945FDBBC6143BDF3]) [    ] o.a.s.c.c.ConnectionManager Waiting for client to connect to ZooKeeper
   [junit4]   2> 2472571 INFO  (zkCallback-2706-thread-1) [    ] o.a.s.c.c.ConnectionManager Watcher org.apache.solr.common.cloud.ConnectionManager@8f30379 name:ZooKeeperConnection Watcher:127.0.0.1:51008/solr got event WatchedEvent state:SyncConnected type:None path:null path:null type:None
   [junit4]   2> 2472571 INFO  (TEST-DistributedVersionInfoTest.test-seed#[945FDBBC6143BDF3]) [    ] o.a.s.c.c.ConnectionManager Client is connected to ZooKeeper
   [junit4]   2> 2472572 INFO  (TEST-DistributedVersionInfoTest.test-seed#[945FDBBC6143BDF3]) [    ] o.a.s.c.c.SolrZkClient Using default ZkACLProvider
   [junit4]   2> 2472572 INFO  (TEST-DistributedVersionInfoTest.test-seed#[945FDBBC6143BDF3]) [    ] o.a.s.c.c.ZkStateReader Updating cluster state from ZooKeeper... 
   [junit4]   2> 2472574 INFO  (TEST-DistributedVersionInfoTest.test-seed#[945FDBBC6143BDF3]) [    ] o.a.s.c.ChaosMonkey monkey: init - expire sessions:false cause connection loss:false
   [junit4]   2> 2472945 INFO  (TEST-DistributedVersionInfoTest.test-seed#[945FDBBC6143BDF3]) [    ] o.a.s.SolrTestCaseJ4 Writing core.properties file to C:\Users\JenkinsSlave\workspace\Lucene-Solr-trunk-Windows\solr\build\solr-core\test\J0\temp\solr.cloud.DistributedVersionInfoTest_945FDBBC6143BDF3-001\shard-1-001\cores\collection1
   [junit4]   2> 2472947 INFO  (TEST-DistributedVersionInfoTest.test-seed#[945FDBBC6143BDF3]) [    ] o.a.s.c.AbstractFullDistribZkTestBase create jetty 1 in directory C:\Users\JenkinsSlave\workspace\Lucene-Solr-trunk-Windows\solr\build\solr-core\test\J0\temp\solr.cloud.DistributedVersionInfoTest_945FDBBC6143BDF3-001\shard-1-001
   [junit4]   2> 2472948 INFO  (TEST-DistributedVersionInfoTest.test-seed#[945FDBBC6143BDF3]) [    ] o.e.j.s.Server jetty-9.2.11.v20150529
   [junit4]   2> 2472949 INFO  (TEST-DistributedVersionInfoTest.test-seed#[945FDBBC6143BDF3]) [    ] o.e.j.s.h.ContextHandler Started o.e.j.s.ServletContextHandler@6acb60f9{/,null,AVAILABLE}
   [junit4]   2> 2472950 INFO  (TEST-DistributedVersionInfoTest.test-seed#[945FDBBC6143BDF3]) [    ] o.e.j.s.ServerConnector Started ServerConnector@5ff4d13f{HTTP/1.1}{127.0.0.1:51030}
   [junit4]   2> 2472950 INFO  (TEST-DistributedVersionInfoTest.test-seed#[945FDBBC6143BDF3]) [    ] o.e.j.s.Server Started @2480559ms
   [junit4]   2> 2472950 INFO  (TEST-DistributedVersionInfoTest.test-seed#[945FDBBC6143BDF3]) [    ] o.a.s.c.s.e.JettySolrRunner Jetty properties: {solr.data.dir=C:\Users\JenkinsSlave\workspace\Lucene-Solr-trunk-Windows\solr\build\solr-core\test\J0\temp\solr.cloud.DistributedVersionInfoTest_945FDBBC6143BDF3-001\tempDir-001/jetty1, solrconfig=solrconfig.xml, hostContext=/, hostPort=51030, coreRootDirectory=C:\Users\JenkinsSlave\workspace\Lucene-Solr-trunk-Windows\solr\build\solr-core\test\J0\..\..\..\..\..\..\..\..\..\Users\JenkinsSlave\workspace\Lucene-Solr-trunk-Windows\solr\build\solr-core\test\J0\temp\solr.cloud.DistributedVersionInfoTest_945FDBBC6143BDF3-001\shard-1-001\cores}
   [junit4]   2> 2472950 INFO  (TEST-DistributedVersionInfoTest.test-seed#[945FDBBC6143BDF3]) [    ] o.a.s.s.SolrDispatchFilter SolrDispatchFilter.init(): sun.misc.Launcher$AppClassLoader@4e0e2f2a
   [junit4]   2> 2472950 INFO  (TEST-DistributedVersionInfoTest.test-seed#[945FDBBC6143BDF3]) [    ] o.a.s.c.SolrResourceLoader new SolrResourceLoader for directory: 'C:\Users\JenkinsSlave\workspace\Lucene-Solr-trunk-Windows\solr\build\solr-core\test\J0\..\..\..\..\..\..\..\..\..\Users\JenkinsSlave\workspace\Lucene-Solr-trunk-Windows\solr\build\solr-core\test\J0\temp\solr.cloud.DistributedVersionInfoTest_945FDBBC6143BDF3-001\shard-1-001\'
   [junit4]   2> 2472968 INFO  (TEST-DistributedVersionInfoTest.test-seed#[945FDBBC6143BDF3]) [    ] o.a.s.c.c.SolrZkClient Using default ZkCredentialsProvider
   [junit4]   2> 2472969 INFO  (TEST-DistributedVersionInfoTest.test-seed#[945FDBBC6143BDF3]) [    ] o.a.s.c.c.ConnectionManager Waiting for client to connect to ZooKeeper
   [junit4]   2> 2472971 INFO  (zkCallback-2707-thread-1) [    ] o.a.s.c.c.ConnectionManager Watcher org.apache.solr.common.cloud.ConnectionManager@39af7272 name:ZooKeeperConnection Watcher:127.0.0.1:51008/solr got event WatchedEvent state:SyncConnected type:None path:null path:null type:None
   [junit4]   2> 2472971 INFO  (TEST-DistributedVersionInfoTest.test-seed#[945FDBBC6143BDF3]) [    ] o.a.s.c.c.ConnectionManager Client is connected to ZooKeeper
   [junit4]   2> 2472972 INFO  (TEST-DistributedVersionInfoTest.test-seed#[945FDBBC6143BDF3]) [    ] o.a.s.c.c.SolrZkClient Using default ZkACLProvider
   [junit4]   2> 2472973 INFO  (TEST-DistributedVersionInfoTest.test-seed#[945FDBBC6143BDF3]) [    ] o.a.s.s.SolrDispatchFilter Loading solr.xml from SolrHome (not found in ZooKeeper)
   [junit4]   2> 2472973 INFO  (TEST-DistributedVersionInfoTest.test-seed#[945FDBBC6143BDF3]) [    ] o.a.s.c.SolrXmlConfig Loading container configuration from C:\Users\JenkinsSlave\workspace\Lucene-Solr-trunk-Windows\solr\build\solr-core\test\J0\..\..\..\..\..\..\..\..\..\Users\JenkinsSlave\workspace\Lucene-Solr-trunk-Windows\solr\build\solr-core\test\J0\temp\solr.cloud.DistributedVersionInfoTest_945FDBBC6143BDF3-001\shard-1-001\solr.xml
   [junit4]   2> 2472981 INFO  (TEST-DistributedVersionInfoTest.test-seed#[945FDBBC6143BDF3]) [    ] o.a.s.c.CoresLocator Config-defined core root directory: C:\Users\JenkinsSlave\workspace\Lucene-Solr-trunk-Windows\solr\build\solr-core\test\J0\..\..\..\..\..\..\..\..\..\Users\JenkinsSlave\workspace\Lucene-Solr-trunk-Windows\solr\build\solr-core\test\J0\temp\solr.cloud.DistributedVersionInfoTest_945FDBBC6143BDF3-001\shard-1-001\cores
   [junit4]   2> 2472981 INFO  (TEST-DistributedVersionInfoTest.test-seed#[945FDBBC6143BDF3]) [    ] o.a.s.c.CoreContainer New CoreContainer 1385074405
   [junit4]   2> 2472981 INFO  (TEST-DistributedVersionInfoTest.test-seed#[945FDBBC6143BDF3]) [    ] o.a.s.c.CoreContainer Loading cores into CoreContainer [instanceDir=C:\Users\JenkinsSlave\workspace\Lucene-Solr-trunk-Windows\solr\build\solr-core\test\J0\..\..\..\..\..\..\..\..\..\Users\JenkinsSlave\workspace\Lucene-Solr-trunk-Windows\solr\build\solr-core\test\J0\temp\solr.cloud.DistributedVersionInfoTest_945FDBBC6143BDF3-001\shard-1-001\]
   [junit4]   2> 2472981 INFO  (TEST-DistributedVersionInfoTest.test-seed#[945FDBBC6143BDF3]) [    ] o.a.s.c.CoreContainer loading shared library: C:\Users\JenkinsSlave\workspace\Lucene-Solr-trunk-Windows\solr\build\solr-core\test\J0\..\..\..\..\..\..\..\..\..\Users\JenkinsSlave\workspace\Lucene-Solr-trunk-Windows\solr\build\solr-core\test\J0\temp\solr.cloud.DistributedVersionInfoTest_945FDBBC6143BDF3-001\shard-1-001\lib
   [junit4]   2> 2472981 WARN  (TEST-DistributedVersionInfoTest.test-seed#[945FDBBC6143BDF3]) [    ] o.a.s.c.SolrResourceLoader Can't find (or read) directory to add to classloader: lib (resolved as: C:\Users\JenkinsSlave\workspace\Lucene-Solr-trunk-Windows\solr\build\solr-core\test\J0\..\..\..\..\..\..\..\..\..\Users\JenkinsSlave\workspace\Lucene-Solr-trunk-Windows\solr\build\solr-core\test\J0\temp\solr.cloud.DistributedVersionInfoTest_945FDBBC6143BDF3-001\shard-1-001\lib).
   [junit4]   2> 2472989 INFO  (TEST-DistributedVersionInfoTest.test-seed#[945FDBBC6143BDF3]) [    ] o.a.s.h.c.HttpShardHandlerFactory created with socketTimeout : 90000,urlScheme : ,connTimeout : 15000,maxConnectionsPerHost : 20,maxConnections : 10000,corePoolSize : 0,maximumPoolSize : 2147483647,maxThreadIdleTime : 5,sizeOfQueue : -1,fairnessPolicy : false,useRetries : false,
   [junit4]   2> 2472991 INFO  (TEST-DistributedVersionInfoTest.test-seed#[945FDBBC6143BDF3]) [    ] o.a.s.u.UpdateShardHandler Creating UpdateShardHandler HTTP client with params: socketTimeout=340000&connTimeout=45000&retry=true
   [junit4]   2> 2472992 INFO  (TEST-DistributedVersionInfoTest.test-seed#[945FDBBC6143BDF3]) [    ] o.a.s.l.LogWatcher SLF4J impl is org.slf4j.impl.Log4jLoggerFactory
   [junit4]   2> 2472992 INFO  (TEST-DistributedVersionInfoTest.test-seed#[945FDBBC6143BDF3]) [    ] o.a.s.l.LogWatcher Registering Log Listener [Log4j (org.slf4j.impl.Log4jLoggerFactory)]
   [junit4]   2> 2472992 INFO  (TEST-DistributedVersionInfoTest.test-seed#[945FDBBC6143BDF3]) [    ] o.a.s.c.ZkContainer Zookeeper client=127.0.0.1:51008/solr
   [junit4]   2> 2472992 INFO  (TEST-DistributedVersionInfoTest.test-seed#[945FDBBC6143BDF3]) [    ] o.a.s.c.ZkController zkHost includes chroot
   [junit4]   2> 2472992 INFO  (TEST-DistributedVersionInfoTest.test-seed#[945FDBBC6143BDF3]) [    ] o.a.s.c.c.SolrZkClient Using default ZkCredentialsProvider
   [junit4]   2> 2472994 INFO  (TEST-DistributedVersionInfoTest.test-seed#[945FDBBC6143BDF3]) [    ] o.a.s.c.c.ConnectionManager Waiting for client to connect to ZooKeeper
   [junit4]   2> 2472995 INFO  (zkCallback-2709-thread-1) [    ] o.a.s.c.c.ConnectionManager Watcher org.apache.solr.common.cloud.ConnectionManager@1a30bc03 name:ZooKeeperConnection Watcher:127.0.0.1:51008 got event WatchedEvent state:SyncConnected type:None path:null path:null type:None
   [junit4]   2> 2472996 INFO  (TEST-DistributedVersionInfoTest.test-seed#[945FDBBC6143BDF3]) [    ] o.a.s.c.c.ConnectionManager Client is connected to ZooKeeper
   [junit4]   2> 2472996 INFO  (TEST-DistributedVersionInfoTest.test-seed#[945FDBBC6143BDF3]) [    ] o.a.s.c.c.SolrZkClient Using default ZkACLProvider
   [junit4]   2> 2472997 INFO  (TEST-DistributedVersionInfoTest.test-seed#[945FDBBC6143BDF3]) [n:127.0.0.1:51030_    ] o.a.s.c.c.ConnectionManager Waiting for client to connect to ZooKeeper
   [junit4]   2> 2472998 INFO  (zkCallback-2710-thread-1-processing-n:127.0.0.1:51030_) [n:127.0.0.1:51030_    ] o.a.s.c.c.ConnectionManager Watcher org.apache.solr.common.cloud.ConnectionManager@76d429ee name:ZooKeeperConnection Watcher:127.0.0.1:51008/solr got event WatchedEvent state:SyncConnected type:None path:null path:null type:None
   [junit4]   2> 2472998 INFO  (TEST-DistributedVersionInfoTest.test-seed#[945FDBBC6143BDF3]) [n:127.0.0.1:51030_    ] o.a.s.c.c.ConnectionManager Client is connected to ZooKeeper
   [junit4]   2> 2473003 INFO  (TEST-DistributedVersionInfoTest.test-seed#[945FDBBC6143BDF3]) [n:127.0.0.1:51030_    ] o.a.s.c.c.ZkStateReader Updating cluster state from ZooKeeper... 
   [junit4]   2> 2473898 INFO  (TEST-DistributedVersionInfoTest.test-seed#[945FDBBC6143BDF3]) [n:127.0.0.1:51030_    ] o.a.s.c.ZkController Register node as live in ZooKeeper:/live_nodes/127.0.0.1:51030_
   [junit4]   2> 2473899 INFO  (TEST-DistributedVersionInfoTest.test-seed#[945FDBBC6143BDF3]) [n:127.0.0.1:51030_    ] o.a.s.c.c.SolrZkClient makePath: /live_nodes/127.0.0.1:51030_
   [junit4]   2> 2473901 INFO  (TEST-DistributedVersionInfoTest.test-seed#[945FDBBC6143BDF3]) [n:127.0.0.1:51030_    ] o.a.s.c.Overseer Overseer (id=null) closing
   [junit4]   2> 2473902 INFO  (TEST-DistributedVersionInfoTest.test-seed#[945FDBBC6143BDF3]) [n:127.0.0.1:51030_    ] o.a.s.c.LeaderElector Joined leadership election with path: /overseer_elect/election/94236182259892232-127.0.0.1:51030_-n_0000000001
   [junit4]   2> 2473903 INFO  (TEST-DistributedVersionInfoTest.test-seed#[945FDBBC6143BDF3]) [n:127.0.0.1:51030_    ] o.a.s.c.LeaderElector Watching path /overseer_elect/election/94236182259892228-127.0.0.1:51015_-n_0000000000 to know if I could be the leader
   [junit4]   2> 2473903 INFO  (TEST-DistributedVersionInfoTest.test-seed#[945FDBBC6143BDF3]) [n:127.0.0.1:51030_    ] o.a.s.c.CoreContainer No authentication plugin used.
   [junit4]   2> 2473903 INFO  (TEST-DistributedVersionInfoTest.test-seed#[945FDBBC6143BDF3]) [n:127.0.0.1:51030_    ] o.a.s.c.CoreContainer Security conf doesn't exist. Skipping setup for authorization module.
   [junit4]   2> 2473904 INFO  (TEST-DistributedVersionInfoTest.test-seed#[945FDBBC6143BDF3]) [n:127.0.0.1:51030_    ] o.a.s.c.CoresLocator Looking for core definitions underneath C:\Users\JenkinsSlave\workspace\Lucene-Solr-trunk-Windows\solr\build\solr-core\test\J0\..\..\..\..\..\..\..\..\..\Users\JenkinsSlave\workspace\Lucene-Solr-trunk-Windows\solr\build\solr-core\test\J0\temp\solr.cloud.DistributedVersionInfoTest_945FDBBC6143BDF3-001\shard-1-001\cores
   [junit4]   2> 2473907 INFO  (TEST-DistributedVersionInfoTest.test-seed#[945FDBBC6143BDF3]) [n:127.0.0.1:51030_    ] o.a.s.c.SolrCore Created CoreDescriptor: {name=collection1, config=solrconfig.xml, transient=false, schema=schema.xml, loadOnStartup=true, configSetProperties=configsetprops.json, instanceDir=C:\Users\JenkinsSlave\workspace\Lucene-Solr-trunk-Windows\solr\build\solr-core\test\J0\..\..\..\..\..\..\..\..\..\Users\JenkinsSlave\workspace\Lucene-Solr-trunk-Windows\solr\build\solr-core\test\J0\temp\solr.cloud.DistributedVersionInfoTest_945FDBBC6143BDF3-001\shard-1-001\cores\collection1, collection=collection1, absoluteInstDir=C:\Users\JenkinsSlave\workspace\Lucene-Solr-trunk-Windows\solr\build\solr-core\test\J0\..\..\..\..\..\..\..\..\..\Users\JenkinsSlave\workspace\Lucene-Solr-trunk-Windows\solr\build\solr-core\test\J0\temp\solr.cloud.DistributedVersionInfoTest_945FDBBC6143BDF3-001\shard-1-001\cores\collection1\, coreNodeName=, dataDir=data\, shard=}
   [junit4]   2> 2473907 INFO  (TEST-DistributedVersionInfoTest.test-seed#[945FDBBC6143BDF3]) [n:127.0.0.1:51030_    ] o.a.s.c.CoresLocator Found core collection1 in C:\Users\JenkinsSlave\workspace\Lucene-Solr-trunk-Windows\solr\build\solr-core\test\J0\..\..\..\..\..\..\..\..\..\Users\JenkinsSlave\workspace\Lucene-Solr-trunk-Windows\solr\build\solr-core\test\J0\temp\solr.cloud.DistributedVersionInfoTest_945FDBBC6143BDF3-001\shard-1-001\cores\collection1\
   [junit4]   2> 2473907 INFO  (TEST-DistributedVersionInfoTest.test-seed#[945FDBBC6143BDF3]) [n:127.0.0.1:51030_    ] o.a.s.c.CoresLocator Found 1 core definitions
   [junit4]   2> 2473907 INFO  (coreLoadExecutor-6687-thread-1-processing-n:127.0.0.1:51030_) [n:127.0.0.1:51030_ c:collection1   x:collection1] o.a.s.c.ZkController publishing state=down
   [junit4]   2> 2473907 INFO  (TEST-DistributedVersionInfoTest.test-seed#[945FDBBC6143BDF3]) [n:127.0.0.1:51030_    ] o.a.s.s.SolrDispatchFilter user.dir=C:\Users\JenkinsSlave\workspace\Lucene-Solr-trunk-Windows\solr\build\solr-core\test\J0
   [junit4]   2> 2473908 INFO  (TEST-DistributedVersionInfoTest.test-seed#[945FDBBC6143BDF3]) [n:127.0.0.1:51030_    ] o.a.s.s.SolrDispatchFilter SolrDispatchFilter.init() done
   [junit4]   2> 2473907 INFO  (coreLoadExecutor-6687-thread-1-processing-n:127.0.0.1:51030_) [n:127.0.0.1:51030_ c:collection1   x:collection1] o.a.s.c.ZkController numShards not found on descriptor - reading it from system property
   [junit4]   2> 2473908 INFO  (coreLoadExecutor-6687-thread-1-processing-n:127.0.0.1:51030_) [n:127.0.0.1:51030_ c:collection1   x:collection1] o.a.s.c.ZkController look for our core node name
   [junit4]   2> 2473908 INFO  (zkCallback-2704-thread-1-processing-n:127.0.0.1:51015_) [n:127.0.0.1:51015_    ] o.a.s.c.DistributedQueue NodeChildrenChanged fired on path /overseer/queue state SyncConnected
   [junit4]   2> 2473909 INFO  (OverseerStateUpdate-94236182259892228-127.0.0.1:51015_-n_0000000000) [n:127.0.0.1:51015_    ] o.a.s.c.Overseer processMessage: queueSize: 1, message = {
   [junit4]   2>   "core":"collection1",
   [junit4]   2>   "roles":null,
   [junit4]   2>   "base_url":"http://127.0.0.1:51030",
   [junit4]   2>   "node_name":"127.0.0.1:51030_",
   [junit4]   2>   "numShards":"2",
   [junit4]   2>   "state":"down",
   [junit4]   2>   "shard":null,
   [junit4]   2>   "collection":"collection1",
   [junit4]   2>   "operation":"state"} current state version: 3
   [junit4]   2> 2473910 INFO  (OverseerStateUpdate-94236182259892228-127.0.0.1:51015_-n_0000000000) [n:127.0.0.1:51015_    ] o.a.s.c.o.ReplicaMutator Update state numShards=2 message={
   [junit4]   2>   "core":"collection1",
   [junit4]   2>   "roles":null,
   [junit4]   2>   "base_url":"http://127.0.0.1:51030",
   [junit4]   2>   "node_name":"127.0.0.1:51030_",
   [junit4]   2>   "numShards":"2",
   [junit4]   2>   "state":"down",
   [junit4]   2>   "shard":null,
   [junit4]   2>   "collection":"collection1",
   [junit4]   2>   "operation":"state"}
   [junit4]   2> 2473910 INFO  (OverseerStateUpdate-94236182259892228-127.0.0.1:51015_-n_0000000000) [n:127.0.0.1:51015_    ] o.a.s.c.o.ClusterStateMutator building a new cName: collection1
   [junit4]   2> 2473910 INFO  (OverseerStateUpdate-94236182259892228-127.0.0.1:51015_-n_0000000000) [n:127.0.0.1:51015_    ] o.a.s.c.o.ReplicaMutator Assigning new node to shard shard=shard2
   [junit4]   2> 2473911 INFO  (zkCallback-2704-thread-1-processing-n:127.0.0.1:51015_) [n:127.0.0.1:51015_    ] o.a.s.c.c.ZkStateReader A cluster state change: WatchedEvent state:SyncConnected type:NodeDataChanged path:/clusterstate.json, has occurred - updating... (live nodes size: 2)
   [junit4]   2> 2473911 INFO  (zkCallback-2706-thread-1) [    ] o.a.s.c.c.ZkStateReader A cluster state change: WatchedEvent state:SyncConnected type:NodeDataChanged path:/clusterstate.json, has occurred - updating... (live nodes size: 2)
   [junit4]   2> 2473912 INFO  (zkCallback-2710-thread-1-processing-n:127.0.0.1:51030_) [n:127.0.0.1:51030_    ] o.a.s.c.c.ZkStateReader A cluster state change: WatchedEvent state:SyncConnected type:NodeDataChanged path:/clusterstate.json, has occurred - updating... (live nodes size: 2)
   [junit4]   2> 2473913 INFO  (zkCallback-2704-thread-1-processing-n:127.0.0.1:51015_) [n:127.0.0.1:51015_    ] o.a.s.c.c.ZkStateReader Updated cluster state version to 4
   [junit4]   2> 2473913 INFO  (zkCallback-2706-thread-1) [    ] o.a.s.c.c.ZkStateReader Updated cluster state version to 4
   [junit4]   2> 2473913 INFO  (zkCallback-2710-thread-1-processing-n:127.0.0.1:51030_) [n:127.0.0.1:51030_    ] o.a.s.c.c.ZkStateReader Updated cluster state version to 4
   [junit4]   2> 2474799 INFO  (coreLoadExecutor-6687-thread-1-processing-n:127.0.0.1:51030_) [n:127.0.0.1:51030_ c:collection1   x:collection1] o.a.s.c.ZkController waiting to find shard id in clusterstate for collection1
   [junit4]   2> 2474799 INFO  (coreLoadExecutor-6687-thread-1-processing-n:127.0.0.1:51030_) [n:127.0.0.1:51030_ c:collection1   x:collection1] o.a.s.c.ZkController Check for collection zkNode:collection1
   [junit4]   2> 2474799 INFO  (coreLoadExecutor-6687-thread-1-processing-n:127.0.0.1:51030_) [n:127.0.0.1:51030_ c:collection1   x:collection1] o.a.s.c.ZkController Collection zkNode exists
   [junit4]   2> 2474800 INFO  (coreLoadExecutor-6687-thread-1-processing-n:127.0.0.1:51030_) [n:127.0.0.1:51030_ c:collection1   x:collection1] o.a.s.c.c.ZkStateReader Load collection config from:/collections/collection1
   [junit4]   2> 2474801 INFO  (coreLoadExecutor-6687-thread-1-processing-n:127.0.0.1:51030_) [n:127.0.0.1:51030_ c:collection1   x:collection1] o.a.s.c.c.ZkStateReader path=/collections/collection1 configName=conf1 specified config exists in ZooKeeper
   [junit4]   2> 2474801 INFO  (coreLoadExecutor-6687-thread-1-processing-n:127.0.0.1:51030_) [n:127.0.0.1:51030_ c:collection1   x:collection1] o.a.s.c.SolrResourceLoader new SolrResourceLoader for directory: 'C:\Users\JenkinsSlave\workspace\Lucene-Solr-trunk-Windows\solr\build\solr-core\test\J0\..\..\..\..\..\..\..\..\..\Users\JenkinsSlave\workspace\Lucene-Solr-trunk-Windows\solr\build\solr-core\test\J0\temp\solr.cloud.DistributedVersionInfoTest_945FDBBC6143BDF3-001\shard-1-001\cores\collection1\'
   [junit4]   2> 2474812 INFO  (coreLoadExecutor-6687-thread-1-processing-n:127.0.0.1:51030_) [n:127.0.0.1:51030_ c:collection1   x:collection1] o.a.s.c.Config loaded config solrconfig.xml with version 0 
   [junit4]   2> 2474818 INFO  (coreLoadExecutor-6687-thread-1-processing-n:127.0.0.1:51030_) [n:127.0.0.1:51030_ c:collection1   x:collection1] o.a.s.c.SolrConfig current version of requestparams : -1
   [junit4]   2> 2474821 INFO  (coreLoadExecutor-6687-thread-1-processing-n:127.0.0.1:51030_) [n:127.0.0.1:51030_ c:collection1   x:collection1] o.a.s.c.SolrConfig Using Lucene MatchVersion: 6.0.0
   [junit4]   2> 2474828 INFO  (coreLoadExecutor-6687-thread-1-processing-n:127.0.0.1:51030_) [n:127.0.0.1:51030_ c:collection1   x:collection1] o.a.s.c.Config Loaded SolrConfig: solrconfig.xml
   [junit4]   2> 2474829 INFO  (coreLoadExecutor-6687-thread-1-processing-n:127.0.0.1:51030_) [n:127.0.0.1:51030_ c:collection1   x:collection1] o.a.s.s.IndexSchema Reading Solr Schema from /configs/conf1/schema.xml
   [junit4]   2> 2474832 INFO  (coreLoadExecutor-6687-thread-1-processing-n:127.0.0.1:51030_) [n:127.0.0.1:51030_ c:collection1   x:collection1] o.a.s.s.IndexSchema [collection1] Schema name=test
   [junit4]   2> 2474918 INFO  (coreLoadExecutor-6687-thread-1-processing-n:127.0.0.1:51030_) [n:127.0.0.1:51030_ c:collection1   x:collection1] o.a.s.s.OpenExchangeRatesOrgProvider Initialized with rates=open-exchange-rates.json, refreshInterval=1440.
   [junit4]   2> 2474924 INFO  (coreLoadExecutor-6687-thread-1-processing-n:127.0.0.1:51030_) [n:127.0.0.1:51030_ c:collection1   x:collection1] o.a.s.s.IndexSchema default search field in schema is text
   [junit4]   2> 2474925 INFO  (coreLoadExecutor-6687-thread-1-processing-n:127.0.0.1:51030_) [n:127.0.0.1:51030_ c:collection1   x:collection1] o.a.s.s.IndexSchema unique key field: id
   [junit4]   2> 2474933 INFO  (coreLoadExecutor-6687-thread-1-processing-n:127.0.0.1:51030_) [n:127.0.0.1:51030_ c:collection1   x:collection1] o.a.s.s.FileExchangeRateProvider Reloading exchange rates from file currency.xml
   [junit4]   2> 2474936 INFO  (coreLoadExecutor-6687-thread-1-processing-n:127.0.0.1:51030_) [n:127.0.0.1:51030_ c:collection1   x:collection1] o.a.s.s.FileExchangeRateProvider Reloading exchange rates from file currency.xml
   [junit4]   2> 2474939 INFO  (coreLoadExecutor-6687-thread-1-processing-n:127.0.0.1:51030_) [n:127.0.0.1:51030_ c:collection1   x:collection1] o.a.s.s.OpenExchangeRatesOrgProvider Reloading exchange rates from open-exchange-rates.json
   [junit4]   2> 2474939 WARN  (coreLoadExecutor-6687-thread-1-processing-n:127.0.0.1:51030_) [n:127.0.0.1:51030_ c:collection1   x:collection1] o.a.s.s.OpenExchangeRatesOrgProvider Unknown key IMPORTANT NOTE
   [junit4]   2> 2474939 WARN  (coreLoadExecutor-6687-thread-1-processing-n:127.0.0.1:51030_) [n:127.0.0.1:51030_ c:collection1   x:collection1] o.a.s.s.OpenExchangeRatesOrgProvider Expected key, got STRING
   [junit4]   2> 2474939 INFO  (coreLoadExecutor-6687-thread-1-processing-n:127.0.0.1:51030_) [n:127.0.0.1:51030_ c:collection1   x:collection1] o.a.s.s.OpenExchangeRatesOrgProvider Reloading exchange rates from open-exchange-rates.json
   [junit4]   2> 2474940 WARN  (coreLoadExecutor-6687-thread-1-processing-n:127.0.0.1:51030_) [n:127.0.0.1:51030_ c:collection1   x:collection1] o.a.s.s.OpenExchangeRatesOrgProvider Unknown key IMPORTANT NOTE
   [junit4]   2> 2474940 WARN  (coreLoadExecutor-6687-thread-1-processing-n:127.0.0.1:51030_) [n:127.0.0.1:51030_ c:collection1   x:collection1] o.a.s.s.OpenExchangeRatesOrgProvider Expected key, got STRING
   [junit4]   2> 2474943 INFO  (coreLoadExecutor-6687-thread-1-processing-n:127.0.0.1:51030_) [n:127.0.0.1:51030_ c:collection1   x:collection1] o.a.s.c.ConfigSetProperties Did not find ConfigSet properties, assuming default properties: Can't find resource 'configsetprops.json' in classpath or '/configs/conf1', cwd=C:\Users\JenkinsSlave\workspace\Lucene-Solr-trunk-Windows\solr\build\solr-core\test\J0
   [junit4]   2> 2474943 INFO  (coreLoadExecutor-6687-thread-1-processing-n:127.0.0.1:51030_) [n:127.0.0.1:51030_ c:collection1   x:collection1] o.a.s.c.CoreContainer Creating SolrCore 'collection1' using configuration from collection collection1
   [junit4]   2> 2474943 INFO  (coreLoadExecutor-6687-thread-1-processing-n:127.0.0.1:51030_) [n:127.0.0.1:51030_ c:collection1 s:shard2 r:core_node1 x:collection1] o.a.s.c.SolrCore org.apache.solr.core.MockDirectoryFactory
   [junit4]   2> 2474944 INFO  (coreLoadExecutor-6687-thread-1-processing-n:127.0.0.1:51030_) [n:127.0.0.1:51030_ c:collection1 s:shard2 r:core_node1 x:collection1] o.a.s.c.SolrCore [[collection1] ] Opening new SolrCore at [C:\Users\JenkinsSlave\workspace\Lucene-Solr-trunk-Windows\solr\build\solr-core\test\J0\..\..\..\..\..\..\..\..\..\Users\JenkinsSlave\workspace\Lucene-Solr-trunk-Windows\solr\build\solr-core\test\J0\temp\solr.cloud.DistributedVersionInfoTest_945FDBBC6143BDF3-001\shard-1-001\cores\collection1\], dataDir=[null]
   [junit4]   2> 2474944 INFO  (coreLoadExecutor-6687-thread-1-processing-n:127.0.0.1:51030_) [n:127.0.0.1:51030_ c:collection1 s:shard2 r:core_node1 x:collection1] o.a.s.c.JmxMonitoredMap JMX monitoring is enabled. Adding Solr mbeans to JMX Server: com.sun.jmx.mbeanserver.JmxMBeanServer@3da0a645
   [junit4]   2> 2474944 INFO  (coreLoadExecutor-6687-thread-1-processing-n:127.0.0.1:51030_) [n:127.0.0.1:51030_ c:collection1 s:shard2 r:core_node1 x:collection1] o.a.s.c.CachingDirectoryFactory return new directory for C:\Users\JenkinsSlave\workspace\Lucene-Solr-trunk-Windows\solr\build\solr-core\test\J0\..\..\..\..\..\..\..\..\..\Users\JenkinsSlave\workspace\Lucene-Solr-trunk-Windows\solr\build\solr-core\test\J0\temp\solr.cloud.DistributedVersionInfoTest_945FDBBC6143BDF3-001\shard-1-001\cores\collection1\data\
   [junit4]   2> 2474944 INFO  (coreLoadExecutor-6687-thread-1-processing-n:127.0.0.1:51030_) [n:127.0.0.1:51030_ c:collection1 s:shard2 r:core_node1 x:collection1] o.a.s.c.SolrCore New index directory detected: old=null new=C:\Users\JenkinsSlave\workspace\Lucene-Solr-trunk-Windows\solr\build\solr-core\test\J0\..\..\..\..\..\..\..\..\..\Users\JenkinsSlave\workspace\Lucene-Solr-trunk-Windows\solr\build\solr-core\test\J0\temp\solr.cloud.DistributedVersionInfoTest_945FDBBC6143BDF3-001\shard-1-001\cores\collection1\data\index/
   [junit4]   2> 2474944 WARN  (coreLoadExecutor-6687-thread-1-processing-n:127.0.0.1:51030_) [n:127.0.0.1:51030_ c:collection1 s:shard2 r:core_node1 x:collection1] o.a.s.c.SolrCore [collection1] Solr index directory 'C:\Users\JenkinsSlave\workspace\Lucene-Solr-trunk-Windows\solr\build\solr-core\test\J0\..\..\..\..\..\..\..\..\..\Users\JenkinsSlave\workspace\Lucene-Solr-trunk-Windows\solr\build\solr-core\test\J0\temp\solr.cloud.DistributedVersionInfoTest_945FDBBC6143BDF3-001\shard-1-001\cores\collection1\data\index' doesn't exist. Creating new index...
   [junit4]   2> 2474945 INFO  (coreLoadExecutor-6687-thread-1-processing-n:127.0.0.1:51030_) [n:127.0.0.1:51030_ c:collection1 s:shard2 r:core_node1 x:collection1] o.a.s.c.CachingDirectoryFactory return new directory for C:\Users\JenkinsSlave\workspace\Lucene-Solr-trunk-Windows\solr\build\solr-core\test\J0\..\..\..\..\..\..\..\..\..\Users\JenkinsSlave\workspace\Lucene-Solr-trunk-Windows\solr\build\solr-core\test\J0\temp\solr.cloud.DistributedVersionInfoTest_945FDBBC6143BDF3-001\shard-1-001\cores\collection1\data\index
   [junit4]   2> 2474945 INFO  (coreLoadExecutor-6687-thread-1-processing-n:127.0.0.1:51030_) [n:127.0.0.1:51030_ c:collection1 s:shard2 r:core_node1 x:collection1] o.a.s.u.RandomMergePolicy RandomMergePolicy wrapping class org.apache.lucene.index.TieredMergePolicy: [TieredMergePolicy: maxMergeAtOnce=10, maxMergeAtOnceExplicit=12, maxMergedSegmentMB=14.0498046875, floorSegmentMB=1.6298828125, forceMergeDeletesPctAllowed=25.47221358560164, segmentsPerTier=37.0, maxCFSSegmentSizeMB=8.796093022207999E12, noCFSRatio=1.0
   [junit4]   2> 2474945 INFO  (coreLoadExecutor-6687-thread-1-processing-n:127.0.0.1:51030_) [n:127.0.0.1:51030_ c:collection1 s:shard2 r:core_node1 x:collection1] o.a.s.c.SolrCore SolrDeletionPolicy.onCommit: commits: num=1
   [junit4]   2> 	commit{dir=MockDirectoryWrapper(RAMDirectory@7fb50e65 lockFactory=org.apache.lucene.store.SingleInstanceLockFactory@2b7b72f9),segFN=segments_1,generation=1}
   [junit4]   2> 2474945 INFO  (coreLoadExecutor-6687-thread-1-processing-n:127.0.0.1:51030_) [n:127.0.0.1:51030_ c:collection1 s:shard2 r:core_node1 x:collection1] o.a.s.c.SolrCore newest commit generation = 1
   [junit4]   2> 2474945 INFO  (OldIndexDirectoryCleanupThreadForCore-collection1) [n:127.0.0.1:51030_ c:collection1 s:shard2 r:core_node1 x:collection1] o.a.s.c.SolrCore Looking for old index directories to cleanup for core collection1 in C:\Users\JenkinsSlave\workspace\Lucene-Solr-trunk-Windows\solr\build\solr-core\test\J0\..\..\..\..\..\..\..\..\..\Users\JenkinsSlave\workspace\Lucene-Solr-trunk-Windows\solr\build\solr-core\test\J0\temp\solr.cloud.DistributedVersionInfoTest_945FDBBC6143BDF3-001\shard-1-001\cores\collection1\data\
   [junit4]   2> 2474945 WARN  (OldIndexDirectoryCleanupThreadForCore-collection1) [n:127.0.0.1:51030_ c:collection1 s:shard2 r:core_node1 x:collection1] o.a.s.c.DirectoryFactory C:\Users\JenkinsSlave\workspace\Lucene-Solr-trunk-Windows\solr\build\solr-core\test\J0\..\..\..\..\..\..\..\..\..\Users\JenkinsSlave\workspace\Lucene-Solr-trunk-Windows\solr\build\solr-core\test\J0\temp\solr.cloud.DistributedVersionInfoTest_945FDBBC6143BDF3-001\shard-1-001\cores\collection1\data\ does not point to a valid data directory; skipping clean-up of old index directories.
   [junit4]   2> 2474948 INFO  (coreLoadExecutor-6687-thread-1-processing-n:127.0.0.1:51030_) [n:127.0.0.1:51030_ c:collection1 s:shard2 r:core_node1 x:collection1] o.a.s.u.p.UpdateRequestProcessorChain creating updateRequestProcessorChain "nodistrib"
   [junit4]   2> 2474948 INFO  (coreLoadExecutor-6687-thread-1-processing-n:127.0.0.1:51030_) [n:127.0.0.1:51030_ c:collection1 s:shard2 r:core_node1 x:collection1] o.a.s.u.p.UpdateRequestProcessorChain creating updateRequestProcessorChain "dedupe"
   [junit4]   2> 2474948 INFO  (coreLoadExecutor-6687-thread-1-processing-n:127.0.0.1:51030_) [n:127.0.0.1:51030_ c:collection1 s:shard2 r:core_node1 x:collection1] o.a.s.u.p.UpdateRequestProcessorChain inserting DistributedUpdateProcessorFactory into updateRequestProcessorChain "dedupe"
   [junit4]   2> 2474948 INFO  (coreLoadExecutor-6687-thread-1-processing-n:127.0.0.1:51030_) [n:127.0.0.1:51030_ c:collection1 s:shard2 r:core_node1 x:collection1] o.a.s.u.p.UpdateRequestProcessorChain creating updateRequestProcessorChain "stored_sig"
   [junit4]   2> 2474948 INFO  (coreLoadExecutor-6687-thread-1-processing-n:127.0.0.1:51030_) [n:127.0.0.1:51030_ c:collection1 s:shard2 r:core_node1 x:collection1] o.a.s.u.p.UpdateRequestProcessorChain inserting DistributedUpdateProcessorFactory into updateRequestProcessorChain "stored_sig"
   [junit4]   2> 2474948 INFO  (coreLoadExecutor-6687-thread-1-processing-n:127.0.0.1:51030_) [n:127.0.0.1:51030_ c:collection1 s:shard2 r:core_node1 x:collection1] o.a.s.u.p.UpdateRequestProcessorChain creating updateRequestProcessorChain "distrib-dup-test-chain-explicit"
   [junit4]   2> 2474949 INFO  (coreLoadExecutor-6687-thread-1-processing-n:127.0.0.1:51030_) [n:127.0.0.1:51030_ c:collection1 s:shard2 r:core_node1 x:collection1] o.a.s.u.p.UpdateRequestProcessorChain creating updateRequestProcessorChain "distrib-dup-test-chain-implicit"
   [junit4]   2> 2474949 INFO  (coreLoadExecutor-6687-thread-1-processing-n:127.0.0.1:51030_) [n:127.0.0.1:51030_ c:collection1 s:shard2 r:core_node1 x:collection1] o.a.s.u.p.UpdateRequestProcessorChain inserting DistributedUpdateProcessorFactory into updateRequestProcessorChain "distrib-dup-test-chain-implicit"
   [junit4]   2> 2474949 INFO  (coreLoadExecutor-6687-thread-1-processing-n:127.0.0.1:51030_) [n:127.0.0.1:51030_ c:collection1 s:shard2 r:core_node1 x:collection1] o.a.s.c.SolrCore no updateRequestProcessorChain defined as default, creating implicit default
   [junit4]   2> 2474952 

[...truncated too long message...]

va:156)
   [junit4]   2> 	at java.util.concurrent.ThreadPoolExecutor.runWorker(ThreadPoolExecutor.java:1142)
   [junit4]   2> 	at java.util.concurrent.ThreadPoolExecutor$Worker.run(ThreadPoolExecutor.java:617)
   [junit4]   2> 	at java.lang.Thread.run(Thread.java:745)
   [junit4]   2> Caused by: org.apache.zookeeper.KeeperException$SessionExpiredException: KeeperErrorCode = Session expired for /collections
   [junit4]   2> 	at org.apache.zookeeper.KeeperException.create(KeeperException.java:127)
   [junit4]   2> 	at org.apache.zookeeper.KeeperException.create(KeeperException.java:51)
   [junit4]   2> 	at org.apache.zookeeper.ZooKeeper.exists(ZooKeeper.java:1045)
   [junit4]   2> 	at org.apache.solr.common.cloud.SolrZkClient$4.execute(SolrZkClient.java:302)
   [junit4]   2> 	at org.apache.solr.common.cloud.SolrZkClient$4.execute(SolrZkClient.java:299)
   [junit4]   2> 	at org.apache.solr.common.cloud.ZkCmdExecutor.retryOperation(ZkCmdExecutor.java:61)
   [junit4]   2> 	at org.apache.solr.common.cloud.SolrZkClient.exists(SolrZkClient.java:299)
   [junit4]   2> 	at org.apache.solr.common.cloud.SolrZkClient.makePath(SolrZkClient.java:493)
   [junit4]   2> 	at org.apache.solr.common.cloud.SolrZkClient.makePath(SolrZkClient.java:463)
   [junit4]   2> 	at org.apache.solr.common.cloud.SolrZkClient.makePath(SolrZkClient.java:450)
   [junit4]   2> 	at org.apache.solr.cloud.ShardLeaderElectionContextBase$1.execute(ElectionContext.java:141)
   [junit4]   2> 	at org.apache.solr.common.util.RetryUtil.retryOnThrowable(RetryUtil.java:31)
   [junit4]   2> 	at org.apache.solr.cloud.ShardLeaderElectionContextBase.runLeaderProcess(ElectionContext.java:137)
   [junit4]   2> 	... 12 more
   [junit4]   2> 
   [junit4]   2> 2539135 INFO  (TEST-DistributedVersionInfoTest.test-seed#[945FDBBC6143BDF3]) [    ] o.e.j.s.ServerConnector Stopped ServerConnector@750634df{HTTP/1.1}{127.0.0.1:0}
   [junit4]   2> 2539135 INFO  (TEST-DistributedVersionInfoTest.test-seed#[945FDBBC6143BDF3]) [    ] o.e.j.s.h.ContextHandler Stopped o.e.j.s.ServletContextHandler@3f277add{/,null,UNAVAILABLE}
   [junit4]   2> 2539136 INFO  (TEST-DistributedVersionInfoTest.test-seed#[945FDBBC6143BDF3]) [n:127.0.0.1:51120_ c:collection1 s:shard1 r:core_node4 x:collection1] o.a.s.c.ChaosMonkey monkey: stop shard! 51015
   [junit4]   2> 2539138 INFO  (TEST-DistributedVersionInfoTest.test-seed#[945FDBBC6143BDF3]) [n:127.0.0.1:51120_ c:collection1 s:shard1 r:core_node4 x:collection1] o.a.s.c.ZkTestServer connecting to 127.0.0.1:51008 51008
   [junit4]   2> 2541554 INFO  (Thread-5830) [    ] o.a.s.c.ZkTestServer connecting to 127.0.0.1:51008 51008
   [junit4]   2> 2541555 WARN  (Thread-5830) [    ] o.a.s.c.ZkTestServer Watch limit violations: 
   [junit4]   2> Maximum concurrent create/delete watches above limit:
   [junit4]   2> 
   [junit4]   2> 	6	/solr/aliases.json
   [junit4]   2> 	6	/solr/clusterstate.json
   [junit4]   2> 	5	/solr/configs/conf1
   [junit4]   2> 
   [junit4]   2> Maximum concurrent data watches above limit:
   [junit4]   2> 
   [junit4]   2> 	2	/solr/collections/c8n_vers_1x3/leader_elect/shard1/election/94236182259892232-core_node2-n_0000000000
   [junit4]   2> 
   [junit4]   2> Maximum concurrent children watches above limit:
   [junit4]   2> 
   [junit4]   2> 	6	/solr/live_nodes
   [junit4]   2> 	2	/solr/overseer/queue
   [junit4]   2> 	2	/solr/overseer/collection-queue-work
   [junit4]   2> 
   [junit4]   2> NOTE: reproduce with: ant test  -Dtestcase=DistributedVersionInfoTest -Dtests.method=test -Dtests.seed=945FDBBC6143BDF3 -Dtests.slow=true -Dtests.locale=pl -Dtests.timezone=Asia/Tehran -Dtests.asserts=true -Dtests.file.encoding=Cp1252
   [junit4] ERROR   71.0s J0 | DistributedVersionInfoTest.test <<<
   [junit4]    > Throwable #1: com.carrotsearch.randomizedtesting.UncaughtExceptionError: Captured an uncaught exception in thread: Thread[id=16657, name=Thread-5914, state=RUNNABLE, group=TGRP-DistributedVersionInfoTest]
   [junit4]    > 	at __randomizedtesting.SeedInfo.seed([945FDBBC6143BDF3:1C0BE466CFBFD00B]:0)
   [junit4]    > Caused by: java.lang.IllegalArgumentException: bound must be positive
   [junit4]    > 	at __randomizedtesting.SeedInfo.seed([945FDBBC6143BDF3]:0)
   [junit4]    > 	at java.util.Random.nextInt(Random.java:388)
   [junit4]    > 	at org.apache.solr.cloud.DistributedVersionInfoTest$3.run(DistributedVersionInfoTest.java:197)
   [junit4]   2> 2541569 INFO  (SUITE-DistributedVersionInfoTest-seed#[945FDBBC6143BDF3]-worker) [n:127.0.0.1:51120_ c:collection1 s:shard1 r:core_node4 x:collection1] o.a.s.SolrTestCaseJ4 ###deleteCore
   [junit4]   2> NOTE: test params are: codec=Lucene53, sim=RandomSimilarityProvider(queryNorm=false,coord=no): {}, locale=pl, timezone=Asia/Tehran
   [junit4]   2> NOTE: Windows 7 6.1 amd64/Oracle Corporation 1.8.0_51 (64-bit)/cpus=3,threads=1,free=251970760,total=518979584
   [junit4]   2> NOTE: All tests run in this JVM: [TestCloudInspectUtil, TestCollationField, TestSQLHandler, HdfsRecoverLeaseTest, RecoveryZkTest, TestReplicaProperties, RuleEngineTest, DeleteLastCustomShardedReplicaTest, ZkCLITest, XmlUpdateRequestHandlerTest, TestDefaultSearchFieldResource, SoftAutoCommitTest, TestSolrConfigHandler, TestRandomRequestDistribution, DOMUtilTest, IgnoreCommitOptimizeUpdateProcessorFactoryTest, TestUpdate, TestStressReorder, UnloadDistributedZkTest, DeleteShardTest, CdcrUpdateLogTest, TestCursorMarkWithoutUniqueKey, TestFastLRUCache, DocValuesMultiTest, TestIntervalFaceting, TestJsonRequest, OverseerStatusTest, TestPhraseSuggestions, EnumFieldTest, TestFunctionQuery, RequiredFieldsTest, LeaderElectionTest, TestCloudManagedSchema, SolrCoreCheckLockOnStartupTest, DeleteReplicaTest, TestStressRecovery, TestExactSharedStatsCache, TestSort, TestReplicationHandlerBackup, TestComponentsName, BigEndianAscendingWordDeserializerTest, AnalysisAfterCoreReloadTest, LeaderFailoverAfterPartitionTest, TestElisionMultitermQuery, SliceStateTest, CoreAdminCreateDiscoverTest, ClusterStateUpdateTest, TestFieldTypeCollectionResource, AtomicUpdatesTest, DistributedFacetPivotLargeTest, PreAnalyzedUpdateProcessorTest, TestBinaryResponseWriter, TestDynamicFieldResource, HardAutoCommitTest, ReplicationFactorTest, IndexSchemaRuntimeFieldTest, SolrXmlInZkTest, TestPerFieldSimilarity, BitVectorTest, CloudExitableDirectoryReaderTest, TimeZoneUtilsTest, TestCloudSchemaless, TestFieldResource, SystemInfoHandlerTest, TestClassNameShortening, TestCSVLoader, TestBM25SimilarityFactory, ScriptEngineTest, TestReRankQParserPlugin, TestIndexingPerformance, TestAtomicUpdateErrorCases, TestWriterPerf, HLLSerializationTest, TestSolrXml, TestDownShardTolerantSearch, TestManagedStopFilterFactory, TestJettySolrRunner, TestFileDictionaryLookup, TestRemoveLastDynamicCopyField, CacheHeaderTest, TestSolrConfigHandlerConcurrent, DistributedFacetPivotSmallTest, TestStressLucene, TestSurroundQueryParser, TestArbitraryIndexDir, TestWordDelimiterFilterFactory, PeerSyncTest, TestCloudManagedSchemaConcurrent, QueryElevationComponentTest, DistributedQueueTest, TestNRTOpen, TestNoOpRegenerator, TestStressVersions, HdfsWriteToMultipleCollectionsTest, TestHighFrequencyDictionaryFactory, UUIDFieldTest, CoreAdminHandlerTest, TestDistribDocBasedVersion, TestHashPartitioner, TestAnalyzedSuggestions, SimpleFacetsTest, TestEmbeddedSolrServerConstructors, TestManagedSchemaDynamicFieldResource, SuggesterTest, SharedFSAutoReplicaFailoverUtilsTest, TestJmxIntegration, TestCollationFieldDocValues, TestLazyCores, OverseerRolesTest, TestSolrQueryParserDefaultOperatorResource, TestBinaryField, SuggesterFSTTest, ConcurrentDeleteAndCreateCollectionTest, PreAnalyzedFieldTest, TestBulkSchemaAPI, TestUniqueKeyFieldResource, RulesTest, TestCryptoKeys, TestIBSimilarityFactory, SolrIndexSplitterTest, SortByFunctionTest, HdfsDirectoryTest, FacetPivotSmallTest, BasicDistributedZkTest, CollectionsAPIDistributedZkTest, SyncSliceTest, OpenCloseCoreStressTest, OverseerTest, ShardRoutingTest, BasicZkTest, FullSolrCloudDistribCmdsTest, TestReplicationHandler, TestDistributedSearch, TestSystemIdResolver, PrimUtilsTest, TestSuggestSpellingConverter, SpellingQueryConverterTest, RAMDirectoryFactoryTest, ClusterStateTest, TestSolrJ, TestLRUCache, TestDocumentBuilder, FileUtilsTest, CircularListTest, TestRTGBase, DistributedIntervalFacetingTest, SolrTestCaseJ4Test, TestDistributedMissingSort, TestHighlightDedupGrouping, TestTolerantSearch, AliasIntegrationTest, BaseCdcrDistributedZkTest, CleanupOldIndexTest, CollectionReloadTest, ConnectionManagerTest, CustomCollectionTest, DistribCursorPagingTest, DistribJoinFromCollectionTest, DistributedVersionInfoTest]
   [junit4] Completed [409/525] on J0 in 72.22s, 1 test, 1 error <<< FAILURES!

[...truncated 372 lines...]
BUILD FAILED
C:\Users\JenkinsSlave\workspace\Lucene-Solr-trunk-Windows\build.xml:717: The following error occurred while executing this line:
C:\Users\JenkinsSlave\workspace\Lucene-Solr-trunk-Windows\build.xml:661: The following error occurred while executing this line:
C:\Users\JenkinsSlave\workspace\Lucene-Solr-trunk-Windows\build.xml:59: The following error occurred while executing this line:
C:\Users\JenkinsSlave\workspace\Lucene-Solr-trunk-Windows\solr\build.xml:230: The following error occurred while executing this line:
C:\Users\JenkinsSlave\workspace\Lucene-Solr-trunk-Windows\solr\common-build.xml:517: The following error occurred while executing this line:
C:\Users\JenkinsSlave\workspace\Lucene-Solr-trunk-Windows\lucene\common-build.xml:1429: The following error occurred while executing this line:
C:\Users\JenkinsSlave\workspace\Lucene-Solr-trunk-Windows\lucene\common-build.xml:984: There were test failures: 525 suites, 2069 tests, 1 error, 69 ignored (35 assumptions)

Total time: 69 minutes 30 seconds
Build step 'Invoke Ant' marked build as failure
Archiving artifacts
Recording test results
Email was triggered for: Failure - Any
Sending email for trigger: Failure - Any



Mime
View raw message