lucene-dev mailing list archives

Site index · List index
Message view « Date » · « Thread »
Top « Date » · « Thread »
From Policeman Jenkins Server <jenk...@thetaphi.de>
Subject [JENKINS] Lucene-Solr-5.x-Linux (64bit/jdk1.8.0_60-ea-b21) - Build # 13378 - Failure!
Date Wed, 22 Jul 2015 12:00:12 GMT
Build: http://jenkins.thetaphi.de/job/Lucene-Solr-5.x-Linux/13378/
Java: 64bit/jdk1.8.0_60-ea-b21 -XX:-UseCompressedOops -XX:+UseConcMarkSweepGC

1 tests failed.
FAILED:  junit.framework.TestSuite.org.apache.solr.cloud.HttpPartitionTest

Error Message:
ObjectTracker found 1 object(s) that were not released!!! [TransactionLog]

Stack Trace:
java.lang.AssertionError: ObjectTracker found 1 object(s) that were not released!!! [TransactionLog]
	at __randomizedtesting.SeedInfo.seed([9B3050AC664637AE]:0)
	at org.junit.Assert.fail(Assert.java:93)
	at org.junit.Assert.assertTrue(Assert.java:43)
	at org.junit.Assert.assertNull(Assert.java:551)
	at org.apache.solr.SolrTestCaseJ4.afterClass(SolrTestCaseJ4.java:235)
	at sun.reflect.GeneratedMethodAccessor37.invoke(Unknown Source)
	at sun.reflect.DelegatingMethodAccessorImpl.invoke(DelegatingMethodAccessorImpl.java:43)
	at java.lang.reflect.Method.invoke(Method.java:497)
	at com.carrotsearch.randomizedtesting.RandomizedRunner.invoke(RandomizedRunner.java:1627)
	at com.carrotsearch.randomizedtesting.RandomizedRunner$5.evaluate(RandomizedRunner.java:799)
	at com.carrotsearch.randomizedtesting.rules.StatementAdapter.evaluate(StatementAdapter.java:36)
	at com.carrotsearch.randomizedtesting.rules.SystemPropertiesRestoreRule$1.evaluate(SystemPropertiesRestoreRule.java:57)
	at org.apache.lucene.util.AbstractBeforeAfterRule$1.evaluate(AbstractBeforeAfterRule.java:46)
	at com.carrotsearch.randomizedtesting.rules.StatementAdapter.evaluate(StatementAdapter.java:36)
	at org.apache.lucene.util.TestRuleStoreClassName$1.evaluate(TestRuleStoreClassName.java:42)
	at com.carrotsearch.randomizedtesting.rules.NoShadowingOrOverridesOnMethodsRule$1.evaluate(NoShadowingOrOverridesOnMethodsRule.java:39)
	at com.carrotsearch.randomizedtesting.rules.NoShadowingOrOverridesOnMethodsRule$1.evaluate(NoShadowingOrOverridesOnMethodsRule.java:39)
	at com.carrotsearch.randomizedtesting.rules.StatementAdapter.evaluate(StatementAdapter.java:36)
	at com.carrotsearch.randomizedtesting.rules.StatementAdapter.evaluate(StatementAdapter.java:36)
	at com.carrotsearch.randomizedtesting.rules.StatementAdapter.evaluate(StatementAdapter.java:36)
	at org.apache.lucene.util.TestRuleAssertionsRequired$1.evaluate(TestRuleAssertionsRequired.java:54)
	at org.apache.lucene.util.TestRuleMarkFailure$1.evaluate(TestRuleMarkFailure.java:48)
	at org.apache.lucene.util.TestRuleIgnoreAfterMaxFailures$1.evaluate(TestRuleIgnoreAfterMaxFailures.java:65)
	at org.apache.lucene.util.TestRuleIgnoreTestSuites$1.evaluate(TestRuleIgnoreTestSuites.java:55)
	at com.carrotsearch.randomizedtesting.rules.StatementAdapter.evaluate(StatementAdapter.java:36)
	at com.carrotsearch.randomizedtesting.ThreadLeakControl$StatementRunner.run(ThreadLeakControl.java:365)
	at java.lang.Thread.run(Thread.java:745)




Build Log:
[...truncated 10547 lines...]
   [junit4] Suite: org.apache.solr.cloud.HttpPartitionTest
   [junit4]   2> Creating dataDir: /home/jenkins/workspace/Lucene-Solr-5.x-Linux/solr/build/solr-core/test/J0/temp/solr.cloud.HttpPartitionTest_9B3050AC664637AE-001/init-core-data-001
   [junit4]   2> 446448 INFO  (SUITE-HttpPartitionTest-seed#[9B3050AC664637AE]-worker) [    ] o.a.s.BaseDistributedSearchTestCase Setting hostContext system property: /cts/v
   [junit4]   2> 446451 INFO  (TEST-HttpPartitionTest.test-seed#[9B3050AC664637AE]) [    ] o.a.s.c.ZkTestServer STARTING ZK TEST SERVER
   [junit4]   2> 446452 INFO  (Thread-1676) [    ] o.a.s.c.ZkTestServer client port:0.0.0.0/0.0.0.0:0
   [junit4]   2> 446452 INFO  (Thread-1676) [    ] o.a.s.c.ZkTestServer Starting server
   [junit4]   2> 446552 INFO  (TEST-HttpPartitionTest.test-seed#[9B3050AC664637AE]) [    ] o.a.s.c.ZkTestServer start zk server on port:51474
   [junit4]   2> 446553 INFO  (TEST-HttpPartitionTest.test-seed#[9B3050AC664637AE]) [    ] o.a.s.c.c.SolrZkClient Using default ZkCredentialsProvider
   [junit4]   2> 446554 INFO  (TEST-HttpPartitionTest.test-seed#[9B3050AC664637AE]) [    ] o.a.s.c.c.ConnectionManager Waiting for client to connect to ZooKeeper
   [junit4]   2> 446555 INFO  (zkCallback-337-thread-1) [    ] o.a.s.c.c.ConnectionManager Watcher org.apache.solr.common.cloud.ConnectionManager@40db0a2f name:ZooKeeperConnection Watcher:127.0.0.1:51474 got event WatchedEvent state:SyncConnected type:None path:null path:null type:None
   [junit4]   2> 446555 INFO  (TEST-HttpPartitionTest.test-seed#[9B3050AC664637AE]) [    ] o.a.s.c.c.ConnectionManager Client is connected to ZooKeeper
   [junit4]   2> 446555 INFO  (TEST-HttpPartitionTest.test-seed#[9B3050AC664637AE]) [    ] o.a.s.c.c.SolrZkClient Using default ZkACLProvider
   [junit4]   2> 446556 INFO  (TEST-HttpPartitionTest.test-seed#[9B3050AC664637AE]) [    ] o.a.s.c.c.SolrZkClient makePath: /solr
   [junit4]   2> 446574 INFO  (TEST-HttpPartitionTest.test-seed#[9B3050AC664637AE]) [    ] o.a.s.c.c.SolrZkClient Using default ZkCredentialsProvider
   [junit4]   2> 446574 INFO  (TEST-HttpPartitionTest.test-seed#[9B3050AC664637AE]) [    ] o.a.s.c.c.ConnectionManager Waiting for client to connect to ZooKeeper
   [junit4]   2> 446576 INFO  (zkCallback-338-thread-1) [    ] o.a.s.c.c.ConnectionManager Watcher org.apache.solr.common.cloud.ConnectionManager@159e414f name:ZooKeeperConnection Watcher:127.0.0.1:51474/solr got event WatchedEvent state:SyncConnected type:None path:null path:null type:None
   [junit4]   2> 446576 INFO  (TEST-HttpPartitionTest.test-seed#[9B3050AC664637AE]) [    ] o.a.s.c.c.ConnectionManager Client is connected to ZooKeeper
   [junit4]   2> 446577 INFO  (TEST-HttpPartitionTest.test-seed#[9B3050AC664637AE]) [    ] o.a.s.c.c.SolrZkClient Using default ZkACLProvider
   [junit4]   2> 446577 INFO  (TEST-HttpPartitionTest.test-seed#[9B3050AC664637AE]) [    ] o.a.s.c.c.SolrZkClient makePath: /collections/collection1
   [junit4]   2> 446578 INFO  (TEST-HttpPartitionTest.test-seed#[9B3050AC664637AE]) [    ] o.a.s.c.c.SolrZkClient makePath: /collections/collection1/shards
   [junit4]   2> 446579 INFO  (TEST-HttpPartitionTest.test-seed#[9B3050AC664637AE]) [    ] o.a.s.c.c.SolrZkClient makePath: /collections/control_collection
   [junit4]   2> 446580 INFO  (TEST-HttpPartitionTest.test-seed#[9B3050AC664637AE]) [    ] o.a.s.c.c.SolrZkClient makePath: /collections/control_collection/shards
   [junit4]   2> 446581 INFO  (TEST-HttpPartitionTest.test-seed#[9B3050AC664637AE]) [    ] o.a.s.c.AbstractZkTestCase put /home/jenkins/workspace/Lucene-Solr-5.x-Linux/solr/core/src/test-files/solr/collection1/conf/solrconfig-tlog.xml to /configs/conf1/solrconfig.xml
   [junit4]   2> 446581 INFO  (TEST-HttpPartitionTest.test-seed#[9B3050AC664637AE]) [    ] o.a.s.c.c.SolrZkClient makePath: /configs/conf1/solrconfig.xml
   [junit4]   2> 446582 INFO  (TEST-HttpPartitionTest.test-seed#[9B3050AC664637AE]) [    ] o.a.s.c.AbstractZkTestCase put /home/jenkins/workspace/Lucene-Solr-5.x-Linux/solr/core/src/test-files/solr/collection1/conf/schema.xml to /configs/conf1/schema.xml
   [junit4]   2> 446582 INFO  (TEST-HttpPartitionTest.test-seed#[9B3050AC664637AE]) [    ] o.a.s.c.c.SolrZkClient makePath: /configs/conf1/schema.xml
   [junit4]   2> 446583 INFO  (TEST-HttpPartitionTest.test-seed#[9B3050AC664637AE]) [    ] o.a.s.c.AbstractZkTestCase put /home/jenkins/workspace/Lucene-Solr-5.x-Linux/solr/core/src/test-files/solr/collection1/conf/solrconfig.snippet.randomindexconfig.xml to /configs/conf1/solrconfig.snippet.randomindexconfig.xml
   [junit4]   2> 446583 INFO  (TEST-HttpPartitionTest.test-seed#[9B3050AC664637AE]) [    ] o.a.s.c.c.SolrZkClient makePath: /configs/conf1/solrconfig.snippet.randomindexconfig.xml
   [junit4]   2> 446584 INFO  (TEST-HttpPartitionTest.test-seed#[9B3050AC664637AE]) [    ] o.a.s.c.AbstractZkTestCase put /home/jenkins/workspace/Lucene-Solr-5.x-Linux/solr/core/src/test-files/solr/collection1/conf/stopwords.txt to /configs/conf1/stopwords.txt
   [junit4]   2> 446584 INFO  (TEST-HttpPartitionTest.test-seed#[9B3050AC664637AE]) [    ] o.a.s.c.c.SolrZkClient makePath: /configs/conf1/stopwords.txt
   [junit4]   2> 446585 INFO  (TEST-HttpPartitionTest.test-seed#[9B3050AC664637AE]) [    ] o.a.s.c.AbstractZkTestCase put /home/jenkins/workspace/Lucene-Solr-5.x-Linux/solr/core/src/test-files/solr/collection1/conf/protwords.txt to /configs/conf1/protwords.txt
   [junit4]   2> 446586 INFO  (TEST-HttpPartitionTest.test-seed#[9B3050AC664637AE]) [    ] o.a.s.c.c.SolrZkClient makePath: /configs/conf1/protwords.txt
   [junit4]   2> 446586 INFO  (TEST-HttpPartitionTest.test-seed#[9B3050AC664637AE]) [    ] o.a.s.c.AbstractZkTestCase put /home/jenkins/workspace/Lucene-Solr-5.x-Linux/solr/core/src/test-files/solr/collection1/conf/currency.xml to /configs/conf1/currency.xml
   [junit4]   2> 446586 INFO  (TEST-HttpPartitionTest.test-seed#[9B3050AC664637AE]) [    ] o.a.s.c.c.SolrZkClient makePath: /configs/conf1/currency.xml
   [junit4]   2> 446587 INFO  (TEST-HttpPartitionTest.test-seed#[9B3050AC664637AE]) [    ] o.a.s.c.AbstractZkTestCase put /home/jenkins/workspace/Lucene-Solr-5.x-Linux/solr/core/src/test-files/solr/collection1/conf/enumsConfig.xml to /configs/conf1/enumsConfig.xml
   [junit4]   2> 446587 INFO  (TEST-HttpPartitionTest.test-seed#[9B3050AC664637AE]) [    ] o.a.s.c.c.SolrZkClient makePath: /configs/conf1/enumsConfig.xml
   [junit4]   2> 446588 INFO  (TEST-HttpPartitionTest.test-seed#[9B3050AC664637AE]) [    ] o.a.s.c.AbstractZkTestCase put /home/jenkins/workspace/Lucene-Solr-5.x-Linux/solr/core/src/test-files/solr/collection1/conf/open-exchange-rates.json to /configs/conf1/open-exchange-rates.json
   [junit4]   2> 446588 INFO  (TEST-HttpPartitionTest.test-seed#[9B3050AC664637AE]) [    ] o.a.s.c.c.SolrZkClient makePath: /configs/conf1/open-exchange-rates.json
   [junit4]   2> 446589 INFO  (TEST-HttpPartitionTest.test-seed#[9B3050AC664637AE]) [    ] o.a.s.c.AbstractZkTestCase put /home/jenkins/workspace/Lucene-Solr-5.x-Linux/solr/core/src/test-files/solr/collection1/conf/mapping-ISOLatin1Accent.txt to /configs/conf1/mapping-ISOLatin1Accent.txt
   [junit4]   2> 446589 INFO  (TEST-HttpPartitionTest.test-seed#[9B3050AC664637AE]) [    ] o.a.s.c.c.SolrZkClient makePath: /configs/conf1/mapping-ISOLatin1Accent.txt
   [junit4]   2> 446590 INFO  (TEST-HttpPartitionTest.test-seed#[9B3050AC664637AE]) [    ] o.a.s.c.AbstractZkTestCase put /home/jenkins/workspace/Lucene-Solr-5.x-Linux/solr/core/src/test-files/solr/collection1/conf/old_synonyms.txt to /configs/conf1/old_synonyms.txt
   [junit4]   2> 446590 INFO  (TEST-HttpPartitionTest.test-seed#[9B3050AC664637AE]) [    ] o.a.s.c.c.SolrZkClient makePath: /configs/conf1/old_synonyms.txt
   [junit4]   2> 446591 INFO  (TEST-HttpPartitionTest.test-seed#[9B3050AC664637AE]) [    ] o.a.s.c.AbstractZkTestCase put /home/jenkins/workspace/Lucene-Solr-5.x-Linux/solr/core/src/test-files/solr/collection1/conf/synonyms.txt to /configs/conf1/synonyms.txt
   [junit4]   2> 446591 INFO  (TEST-HttpPartitionTest.test-seed#[9B3050AC664637AE]) [    ] o.a.s.c.c.SolrZkClient makePath: /configs/conf1/synonyms.txt
   [junit4]   2> 446646 INFO  (TEST-HttpPartitionTest.test-seed#[9B3050AC664637AE]) [    ] o.a.s.SolrTestCaseJ4 Writing core.properties file to /home/jenkins/workspace/Lucene-Solr-5.x-Linux/solr/build/solr-core/test/J0/temp/solr.cloud.HttpPartitionTest_9B3050AC664637AE-001/control-001/cores/collection1
   [junit4]   2> 446649 INFO  (TEST-HttpPartitionTest.test-seed#[9B3050AC664637AE]) [    ] o.e.j.s.Server jetty-9.2.11.v20150529
   [junit4]   2> 446650 INFO  (TEST-HttpPartitionTest.test-seed#[9B3050AC664637AE]) [    ] o.e.j.s.h.ContextHandler Started o.e.j.s.ServletContextHandler@453a60fb{/cts/v,null,AVAILABLE}
   [junit4]   2> 446657 INFO  (TEST-HttpPartitionTest.test-seed#[9B3050AC664637AE]) [    ] o.e.j.s.ServerConnector Started ServerConnector@232e34f{HTTP/1.1}{127.0.0.1:41139}
   [junit4]   2> 446658 INFO  (TEST-HttpPartitionTest.test-seed#[9B3050AC664637AE]) [    ] o.e.j.s.Server Started @448700ms
   [junit4]   2> 446658 INFO  (TEST-HttpPartitionTest.test-seed#[9B3050AC664637AE]) [    ] o.a.s.c.s.e.JettySolrRunner Jetty properties: {solr.data.dir=/home/jenkins/workspace/Lucene-Solr-5.x-Linux/solr/build/solr-core/test/J0/temp/solr.cloud.HttpPartitionTest_9B3050AC664637AE-001/tempDir-001/control/data, hostContext=/cts/v, hostPort=34612, coreRootDirectory=/home/jenkins/workspace/Lucene-Solr-5.x-Linux/solr/build/solr-core/test/J0/temp/solr.cloud.HttpPartitionTest_9B3050AC664637AE-001/control-001/cores}
   [junit4]   2> 446658 INFO  (TEST-HttpPartitionTest.test-seed#[9B3050AC664637AE]) [    ] o.a.s.s.SolrDispatchFilter SolrDispatchFilter.init(): sun.misc.Launcher$AppClassLoader@4e0e2f2a
   [junit4]   2> 446658 INFO  (TEST-HttpPartitionTest.test-seed#[9B3050AC664637AE]) [    ] o.a.s.c.SolrResourceLoader new SolrResourceLoader for directory: '/home/jenkins/workspace/Lucene-Solr-5.x-Linux/solr/build/solr-core/test/J0/temp/solr.cloud.HttpPartitionTest_9B3050AC664637AE-001/control-001/'
   [junit4]   2> 446671 INFO  (TEST-HttpPartitionTest.test-seed#[9B3050AC664637AE]) [    ] o.a.s.c.SolrXmlConfig Loading container configuration from /home/jenkins/workspace/Lucene-Solr-5.x-Linux/solr/build/solr-core/test/J0/temp/solr.cloud.HttpPartitionTest_9B3050AC664637AE-001/control-001/solr.xml
   [junit4]   2> 446675 INFO  (TEST-HttpPartitionTest.test-seed#[9B3050AC664637AE]) [    ] o.a.s.c.CoresLocator Config-defined core root directory: /home/jenkins/workspace/Lucene-Solr-5.x-Linux/solr/build/solr-core/test/J0/temp/solr.cloud.HttpPartitionTest_9B3050AC664637AE-001/control-001/cores
   [junit4]   2> 446675 INFO  (TEST-HttpPartitionTest.test-seed#[9B3050AC664637AE]) [    ] o.a.s.c.CoreContainer New CoreContainer 1891661563
   [junit4]   2> 446675 INFO  (TEST-HttpPartitionTest.test-seed#[9B3050AC664637AE]) [    ] o.a.s.c.CoreContainer Loading cores into CoreContainer [instanceDir=/home/jenkins/workspace/Lucene-Solr-5.x-Linux/solr/build/solr-core/test/J0/temp/solr.cloud.HttpPartitionTest_9B3050AC664637AE-001/control-001/]
   [junit4]   2> 446675 INFO  (TEST-HttpPartitionTest.test-seed#[9B3050AC664637AE]) [    ] o.a.s.c.CoreContainer loading shared library: /home/jenkins/workspace/Lucene-Solr-5.x-Linux/solr/build/solr-core/test/J0/temp/solr.cloud.HttpPartitionTest_9B3050AC664637AE-001/control-001/lib
   [junit4]   2> 446675 WARN  (TEST-HttpPartitionTest.test-seed#[9B3050AC664637AE]) [    ] o.a.s.c.SolrResourceLoader Can't find (or read) directory to add to classloader: lib (resolved as: /home/jenkins/workspace/Lucene-Solr-5.x-Linux/solr/build/solr-core/test/J0/temp/solr.cloud.HttpPartitionTest_9B3050AC664637AE-001/control-001/lib).
   [junit4]   2> 446683 INFO  (TEST-HttpPartitionTest.test-seed#[9B3050AC664637AE]) [    ] o.a.s.h.c.HttpShardHandlerFactory created with socketTimeout : 90000,urlScheme : ,connTimeout : 15000,maxConnectionsPerHost : 20,maxConnections : 10000,corePoolSize : 0,maximumPoolSize : 2147483647,maxThreadIdleTime : 5,sizeOfQueue : -1,fairnessPolicy : false,useRetries : false,
   [junit4]   2> 446686 INFO  (TEST-HttpPartitionTest.test-seed#[9B3050AC664637AE]) [    ] o.a.s.u.UpdateShardHandler Creating UpdateShardHandler HTTP client with params: socketTimeout=340000&connTimeout=45000&retry=true
   [junit4]   2> 446687 INFO  (TEST-HttpPartitionTest.test-seed#[9B3050AC664637AE]) [    ] o.a.s.l.LogWatcher SLF4J impl is org.slf4j.impl.Log4jLoggerFactory
   [junit4]   2> 446687 INFO  (TEST-HttpPartitionTest.test-seed#[9B3050AC664637AE]) [    ] o.a.s.l.LogWatcher Registering Log Listener [Log4j (org.slf4j.impl.Log4jLoggerFactory)]
   [junit4]   2> 446688 INFO  (TEST-HttpPartitionTest.test-seed#[9B3050AC664637AE]) [    ] o.a.s.c.ZkContainer Zookeeper client=127.0.0.1:51474/solr
   [junit4]   2> 446688 INFO  (TEST-HttpPartitionTest.test-seed#[9B3050AC664637AE]) [    ] o.a.s.c.ZkController zkHost includes chroot
   [junit4]   2> 446688 INFO  (TEST-HttpPartitionTest.test-seed#[9B3050AC664637AE]) [    ] o.a.s.c.c.SolrZkClient Using default ZkCredentialsProvider
   [junit4]   2> 446690 INFO  (TEST-HttpPartitionTest.test-seed#[9B3050AC664637AE]) [    ] o.a.s.c.c.ConnectionManager Waiting for client to connect to ZooKeeper
   [junit4]   2> 446691 INFO  (zkCallback-340-thread-1) [    ] o.a.s.c.c.ConnectionManager Watcher org.apache.solr.common.cloud.ConnectionManager@5f9de94 name:ZooKeeperConnection Watcher:127.0.0.1:51474 got event WatchedEvent state:SyncConnected type:None path:null path:null type:None
   [junit4]   2> 446691 INFO  (TEST-HttpPartitionTest.test-seed#[9B3050AC664637AE]) [    ] o.a.s.c.c.ConnectionManager Client is connected to ZooKeeper
   [junit4]   2> 446692 INFO  (TEST-HttpPartitionTest.test-seed#[9B3050AC664637AE]) [    ] o.a.s.c.c.SolrZkClient Using default ZkACLProvider
   [junit4]   2> 446693 INFO  (TEST-HttpPartitionTest.test-seed#[9B3050AC664637AE]) [n:127.0.0.1:34612_cts%2Fv    ] o.a.s.c.c.ConnectionManager Waiting for client to connect to ZooKeeper
   [junit4]   2> 446695 INFO  (zkCallback-341-thread-1-processing-n:127.0.0.1:34612_cts%2Fv) [n:127.0.0.1:34612_cts%2Fv    ] o.a.s.c.c.ConnectionManager Watcher org.apache.solr.common.cloud.ConnectionManager@2e4f5728 name:ZooKeeperConnection Watcher:127.0.0.1:51474/solr got event WatchedEvent state:SyncConnected type:None path:null path:null type:None
   [junit4]   2> 446695 INFO  (TEST-HttpPartitionTest.test-seed#[9B3050AC664637AE]) [n:127.0.0.1:34612_cts%2Fv    ] o.a.s.c.c.ConnectionManager Client is connected to ZooKeeper
   [junit4]   2> 446696 INFO  (TEST-HttpPartitionTest.test-seed#[9B3050AC664637AE]) [n:127.0.0.1:34612_cts%2Fv    ] o.a.s.c.c.SolrZkClient makePath: /overseer/queue
   [junit4]   2> 446696 INFO  (TEST-HttpPartitionTest.test-seed#[9B3050AC664637AE]) [n:127.0.0.1:34612_cts%2Fv    ] o.a.s.c.c.SolrZkClient makePath: /overseer/collection-queue-work
   [junit4]   2> 446697 INFO  (TEST-HttpPartitionTest.test-seed#[9B3050AC664637AE]) [n:127.0.0.1:34612_cts%2Fv    ] o.a.s.c.c.SolrZkClient makePath: /overseer/collection-map-running
   [junit4]   2> 446714 INFO  (TEST-HttpPartitionTest.test-seed#[9B3050AC664637AE]) [n:127.0.0.1:34612_cts%2Fv    ] o.a.s.c.c.SolrZkClient makePath: /overseer/collection-map-completed
   [junit4]   2> 446719 INFO  (TEST-HttpPartitionTest.test-seed#[9B3050AC664637AE]) [n:127.0.0.1:34612_cts%2Fv    ] o.a.s.c.c.SolrZkClient makePath: /overseer/collection-map-failure
   [junit4]   2> 446731 INFO  (TEST-HttpPartitionTest.test-seed#[9B3050AC664637AE]) [n:127.0.0.1:34612_cts%2Fv    ] o.a.s.c.c.SolrZkClient makePath: /live_nodes
   [junit4]   2> 446732 INFO  (TEST-HttpPartitionTest.test-seed#[9B3050AC664637AE]) [n:127.0.0.1:34612_cts%2Fv    ] o.a.s.c.c.SolrZkClient makePath: /aliases.json
   [junit4]   2> 446733 INFO  (TEST-HttpPartitionTest.test-seed#[9B3050AC664637AE]) [n:127.0.0.1:34612_cts%2Fv    ] o.a.s.c.c.SolrZkClient makePath: /clusterstate.json
   [junit4]   2> 446733 INFO  (TEST-HttpPartitionTest.test-seed#[9B3050AC664637AE]) [n:127.0.0.1:34612_cts%2Fv    ] o.a.s.c.ZkController Register node as live in ZooKeeper:/live_nodes/127.0.0.1:34612_cts%2Fv
   [junit4]   2> 446734 INFO  (TEST-HttpPartitionTest.test-seed#[9B3050AC664637AE]) [n:127.0.0.1:34612_cts%2Fv    ] o.a.s.c.c.SolrZkClient makePath: /live_nodes/127.0.0.1:34612_cts%2Fv
   [junit4]   2> 446734 INFO  (TEST-HttpPartitionTest.test-seed#[9B3050AC664637AE]) [n:127.0.0.1:34612_cts%2Fv    ] o.a.s.c.c.SolrZkClient makePath: /overseer_elect
   [junit4]   2> 446737 INFO  (TEST-HttpPartitionTest.test-seed#[9B3050AC664637AE]) [n:127.0.0.1:34612_cts%2Fv    ] o.a.s.c.c.SolrZkClient makePath: /overseer_elect/election
   [junit4]   2> 446739 INFO  (TEST-HttpPartitionTest.test-seed#[9B3050AC664637AE]) [n:127.0.0.1:34612_cts%2Fv    ] o.a.s.c.Overseer Overseer (id=null) closing
   [junit4]   2> 446739 INFO  (TEST-HttpPartitionTest.test-seed#[9B3050AC664637AE]) [n:127.0.0.1:34612_cts%2Fv    ] o.a.s.c.LeaderElector Joined leadership election with path: /overseer_elect/election/94212278792355843-127.0.0.1:34612_cts%2Fv-n_0000000000
   [junit4]   2> 446739 INFO  (TEST-HttpPartitionTest.test-seed#[9B3050AC664637AE]) [n:127.0.0.1:34612_cts%2Fv    ] o.a.s.c.OverseerElectionContext I am going to be the leader 127.0.0.1:34612_cts%2Fv
   [junit4]   2> 446739 INFO  (TEST-HttpPartitionTest.test-seed#[9B3050AC664637AE]) [n:127.0.0.1:34612_cts%2Fv    ] o.a.s.c.c.SolrZkClient makePath: /overseer_elect/leader
   [junit4]   2> 446740 INFO  (TEST-HttpPartitionTest.test-seed#[9B3050AC664637AE]) [n:127.0.0.1:34612_cts%2Fv    ] o.a.s.c.Overseer Overseer (id=94212278792355843-127.0.0.1:34612_cts%2Fv-n_0000000000) starting
   [junit4]   2> 446741 INFO  (TEST-HttpPartitionTest.test-seed#[9B3050AC664637AE]) [n:127.0.0.1:34612_cts%2Fv    ] o.a.s.c.c.SolrZkClient makePath: /overseer/queue-work
   [junit4]   2> 446744 INFO  (TEST-HttpPartitionTest.test-seed#[9B3050AC664637AE]) [n:127.0.0.1:34612_cts%2Fv    ] o.a.s.c.OverseerAutoReplicaFailoverThread Starting OverseerAutoReplicaFailoverThread autoReplicaFailoverWorkLoopDelay=10000 autoReplicaFailoverWaitAfterExpiration=30000 autoReplicaFailoverBadNodeExpiration=60000
   [junit4]   2> 446745 INFO  (OverseerStateUpdate-94212278792355843-127.0.0.1:34612_cts%2Fv-n_0000000000) [n:127.0.0.1:34612_cts%2Fv    ] o.a.s.c.Overseer Starting to work on the main queue
   [junit4]   2> 446756 INFO  (OverseerCollectionProcessor-94212278792355843-127.0.0.1:34612_cts%2Fv-n_0000000000) [n:127.0.0.1:34612_cts%2Fv    ] o.a.s.c.OverseerCollectionProcessor Process current queue of collection creations
   [junit4]   2> 446756 INFO  (TEST-HttpPartitionTest.test-seed#[9B3050AC664637AE]) [n:127.0.0.1:34612_cts%2Fv    ] o.a.s.c.c.ZkStateReader Updating cluster state from ZooKeeper... 
   [junit4]   2> 446772 INFO  (TEST-HttpPartitionTest.test-seed#[9B3050AC664637AE]) [n:127.0.0.1:34612_cts%2Fv    ] o.a.s.c.CoreContainer No authentication plugin used.
   [junit4]   2> 446772 INFO  (TEST-HttpPartitionTest.test-seed#[9B3050AC664637AE]) [n:127.0.0.1:34612_cts%2Fv    ] o.a.s.c.CoreContainer Security conf doesn't exist. Skipping setup for authorization module.
   [junit4]   2> 446773 INFO  (TEST-HttpPartitionTest.test-seed#[9B3050AC664637AE]) [n:127.0.0.1:34612_cts%2Fv    ] o.a.s.c.CoresLocator Looking for core definitions underneath /home/jenkins/workspace/Lucene-Solr-5.x-Linux/solr/build/solr-core/test/J0/temp/solr.cloud.HttpPartitionTest_9B3050AC664637AE-001/control-001/cores
   [junit4]   2> 446773 INFO  (TEST-HttpPartitionTest.test-seed#[9B3050AC664637AE]) [n:127.0.0.1:34612_cts%2Fv    ] o.a.s.c.SolrCore Created CoreDescriptor: {name=collection1, config=solrconfig.xml, transient=false, schema=schema.xml, loadOnStartup=true, configSetProperties=configsetprops.json, instanceDir=/home/jenkins/workspace/Lucene-Solr-5.x-Linux/solr/build/solr-core/test/J0/temp/solr.cloud.HttpPartitionTest_9B3050AC664637AE-001/control-001/cores/collection1, collection=control_collection, absoluteInstDir=/home/jenkins/workspace/Lucene-Solr-5.x-Linux/solr/build/solr-core/test/J0/temp/solr.cloud.HttpPartitionTest_9B3050AC664637AE-001/control-001/cores/collection1/, coreNodeName=, dataDir=data/, shard=}
   [junit4]   2> 446774 INFO  (TEST-HttpPartitionTest.test-seed#[9B3050AC664637AE]) [n:127.0.0.1:34612_cts%2Fv    ] o.a.s.c.CoresLocator Found core collection1 in /home/jenkins/workspace/Lucene-Solr-5.x-Linux/solr/build/solr-core/test/J0/temp/solr.cloud.HttpPartitionTest_9B3050AC664637AE-001/control-001/cores/collection1/
   [junit4]   2> 446774 INFO  (TEST-HttpPartitionTest.test-seed#[9B3050AC664637AE]) [n:127.0.0.1:34612_cts%2Fv    ] o.a.s.c.CoresLocator Found 1 core definitions
   [junit4]   2> 446776 INFO  (coreLoadExecutor-1628-thread-1-processing-n:127.0.0.1:34612_cts%2Fv) [n:127.0.0.1:34612_cts%2Fv c:control_collection   x:collection1] o.a.s.c.ZkController publishing state=down
   [junit4]   2> 446776 INFO  (coreLoadExecutor-1628-thread-1-processing-n:127.0.0.1:34612_cts%2Fv) [n:127.0.0.1:34612_cts%2Fv c:control_collection   x:collection1] o.a.s.c.ZkController numShards not found on descriptor - reading it from system property
   [junit4]   2> 446776 INFO  (TEST-HttpPartitionTest.test-seed#[9B3050AC664637AE]) [n:127.0.0.1:34612_cts%2Fv    ] o.a.s.s.SolrDispatchFilter user.dir=/home/jenkins/workspace/Lucene-Solr-5.x-Linux/solr/build/solr-core/test/J0
   [junit4]   2> 446776 INFO  (TEST-HttpPartitionTest.test-seed#[9B3050AC664637AE]) [n:127.0.0.1:34612_cts%2Fv    ] o.a.s.s.SolrDispatchFilter SolrDispatchFilter.init() done
   [junit4]   2> 446776 INFO  (zkCallback-341-thread-1-processing-n:127.0.0.1:34612_cts%2Fv) [n:127.0.0.1:34612_cts%2Fv    ] o.a.s.c.DistributedQueue NodeChildrenChanged fired on path /overseer/queue state SyncConnected
   [junit4]   2> 446776 INFO  (coreLoadExecutor-1628-thread-1-processing-n:127.0.0.1:34612_cts%2Fv) [n:127.0.0.1:34612_cts%2Fv c:control_collection   x:collection1] o.a.s.c.ZkController look for our core node name
   [junit4]   2> 446778 INFO  (OverseerStateUpdate-94212278792355843-127.0.0.1:34612_cts%2Fv-n_0000000000) [n:127.0.0.1:34612_cts%2Fv    ] o.a.s.c.Overseer processMessage: queueSize: 1, message = {
   [junit4]   2>   "core":"collection1",
   [junit4]   2>   "roles":null,
   [junit4]   2>   "base_url":"http://127.0.0.1:34612/cts/v",
   [junit4]   2>   "node_name":"127.0.0.1:34612_cts%2Fv",
   [junit4]   2>   "numShards":"1",
   [junit4]   2>   "state":"down",
   [junit4]   2>   "shard":null,
   [junit4]   2>   "collection":"control_collection",
   [junit4]   2>   "operation":"state"} current state version: 0
   [junit4]   2> 446778 INFO  (OverseerStateUpdate-94212278792355843-127.0.0.1:34612_cts%2Fv-n_0000000000) [n:127.0.0.1:34612_cts%2Fv    ] o.a.s.c.o.ReplicaMutator Update state numShards=1 message={
   [junit4]   2>   "core":"collection1",
   [junit4]   2>   "roles":null,
   [junit4]   2>   "base_url":"http://127.0.0.1:34612/cts/v",
   [junit4]   2>   "node_name":"127.0.0.1:34612_cts%2Fv",
   [junit4]   2>   "numShards":"1",
   [junit4]   2>   "state":"down",
   [junit4]   2>   "shard":null,
   [junit4]   2>   "collection":"control_collection",
   [junit4]   2>   "operation":"state"}
   [junit4]   2> 446778 INFO  (OverseerStateUpdate-94212278792355843-127.0.0.1:34612_cts%2Fv-n_0000000000) [n:127.0.0.1:34612_cts%2Fv    ] o.a.s.c.o.ClusterStateMutator building a new cName: control_collection
   [junit4]   2> 446778 INFO  (OverseerStateUpdate-94212278792355843-127.0.0.1:34612_cts%2Fv-n_0000000000) [n:127.0.0.1:34612_cts%2Fv    ] o.a.s.c.o.ReplicaMutator Assigning new node to shard shard=shard1
   [junit4]   2> 446779 INFO  (zkCallback-341-thread-1-processing-n:127.0.0.1:34612_cts%2Fv) [n:127.0.0.1:34612_cts%2Fv    ] o.a.s.c.c.ZkStateReader A cluster state change: WatchedEvent state:SyncConnected type:NodeDataChanged path:/clusterstate.json, has occurred - updating... (live nodes size: 1)
   [junit4]   2> 446781 INFO  (zkCallback-341-thread-1-processing-n:127.0.0.1:34612_cts%2Fv) [n:127.0.0.1:34612_cts%2Fv    ] o.a.s.c.c.ZkStateReader Updated cluster state version to 1
   [junit4]   2> 447777 INFO  (coreLoadExecutor-1628-thread-1-processing-n:127.0.0.1:34612_cts%2Fv) [n:127.0.0.1:34612_cts%2Fv c:control_collection   x:collection1] o.a.s.c.ZkController waiting to find shard id in clusterstate for collection1
   [junit4]   2> 447778 INFO  (coreLoadExecutor-1628-thread-1-processing-n:127.0.0.1:34612_cts%2Fv) [n:127.0.0.1:34612_cts%2Fv c:control_collection   x:collection1] o.a.s.c.ZkController Check for collection zkNode:control_collection
   [junit4]   2> 447778 INFO  (coreLoadExecutor-1628-thread-1-processing-n:127.0.0.1:34612_cts%2Fv) [n:127.0.0.1:34612_cts%2Fv c:control_collection   x:collection1] o.a.s.c.ZkController Collection zkNode exists
   [junit4]   2> 447778 INFO  (coreLoadExecutor-1628-thread-1-processing-n:127.0.0.1:34612_cts%2Fv) [n:127.0.0.1:34612_cts%2Fv c:control_collection   x:collection1] o.a.s.c.c.ZkStateReader Load collection config from:/collections/control_collection
   [junit4]   2> 447778 INFO  (coreLoadExecutor-1628-thread-1-processing-n:127.0.0.1:34612_cts%2Fv) [n:127.0.0.1:34612_cts%2Fv c:control_collection   x:collection1] o.a.s.c.c.ZkStateReader path=/collections/control_collection configName=conf1 specified config exists in ZooKeeper
   [junit4]   2> 447779 INFO  (coreLoadExecutor-1628-thread-1-processing-n:127.0.0.1:34612_cts%2Fv) [n:127.0.0.1:34612_cts%2Fv c:control_collection   x:collection1] o.a.s.c.SolrResourceLoader new SolrResourceLoader for directory: '/home/jenkins/workspace/Lucene-Solr-5.x-Linux/solr/build/solr-core/test/J0/temp/solr.cloud.HttpPartitionTest_9B3050AC664637AE-001/control-001/cores/collection1/'
   [junit4]   2> 447798 INFO  (coreLoadExecutor-1628-thread-1-processing-n:127.0.0.1:34612_cts%2Fv) [n:127.0.0.1:34612_cts%2Fv c:control_collection   x:collection1] o.a.s.c.Config loaded config solrconfig.xml with version 0 
   [junit4]   2> 447806 INFO  (coreLoadExecutor-1628-thread-1-processing-n:127.0.0.1:34612_cts%2Fv) [n:127.0.0.1:34612_cts%2Fv c:control_collection   x:collection1] o.a.s.c.SolrConfig current version of requestparams : -1
   [junit4]   2> 447817 INFO  (coreLoadExecutor-1628-thread-1-processing-n:127.0.0.1:34612_cts%2Fv) [n:127.0.0.1:34612_cts%2Fv c:control_collection   x:collection1] o.a.s.c.SolrConfig Using Lucene MatchVersion: 5.3.0
   [junit4]   2> 447826 INFO  (coreLoadExecutor-1628-thread-1-processing-n:127.0.0.1:34612_cts%2Fv) [n:127.0.0.1:34612_cts%2Fv c:control_collection   x:collection1] o.a.s.c.Config Loaded SolrConfig: solrconfig.xml
   [junit4]   2> 447826 INFO  (coreLoadExecutor-1628-thread-1-processing-n:127.0.0.1:34612_cts%2Fv) [n:127.0.0.1:34612_cts%2Fv c:control_collection   x:collection1] o.a.s.s.IndexSchema Reading Solr Schema from /configs/conf1/schema.xml
   [junit4]   2> 447831 INFO  (coreLoadExecutor-1628-thread-1-processing-n:127.0.0.1:34612_cts%2Fv) [n:127.0.0.1:34612_cts%2Fv c:control_collection   x:collection1] o.a.s.s.IndexSchema [collection1] Schema name=test
   [junit4]   2> 447937 INFO  (coreLoadExecutor-1628-thread-1-processing-n:127.0.0.1:34612_cts%2Fv) [n:127.0.0.1:34612_cts%2Fv c:control_collection   x:collection1] o.a.s.s.OpenExchangeRatesOrgProvider Initialized with rates=open-exchange-rates.json, refreshInterval=1440.
   [junit4]   2> 447943 INFO  (coreLoadExecutor-1628-thread-1-processing-n:127.0.0.1:34612_cts%2Fv) [n:127.0.0.1:34612_cts%2Fv c:control_collection   x:collection1] o.a.s.s.IndexSchema default search field in schema is text
   [junit4]   2> 447944 INFO  (coreLoadExecutor-1628-thread-1-processing-n:127.0.0.1:34612_cts%2Fv) [n:127.0.0.1:34612_cts%2Fv c:control_collection   x:collection1] o.a.s.s.IndexSchema unique key field: id
   [junit4]   2> 447951 INFO  (coreLoadExecutor-1628-thread-1-processing-n:127.0.0.1:34612_cts%2Fv) [n:127.0.0.1:34612_cts%2Fv c:control_collection   x:collection1] o.a.s.s.FileExchangeRateProvider Reloading exchange rates from file currency.xml
   [junit4]   2> 447954 INFO  (coreLoadExecutor-1628-thread-1-processing-n:127.0.0.1:34612_cts%2Fv) [n:127.0.0.1:34612_cts%2Fv c:control_collection   x:collection1] o.a.s.s.FileExchangeRateProvider Reloading exchange rates from file currency.xml
   [junit4]   2> 447955 INFO  (coreLoadExecutor-1628-thread-1-processing-n:127.0.0.1:34612_cts%2Fv) [n:127.0.0.1:34612_cts%2Fv c:control_collection   x:collection1] o.a.s.s.OpenExchangeRatesOrgProvider Reloading exchange rates from open-exchange-rates.json
   [junit4]   2> 447956 WARN  (coreLoadExecutor-1628-thread-1-processing-n:127.0.0.1:34612_cts%2Fv) [n:127.0.0.1:34612_cts%2Fv c:control_collection   x:collection1] o.a.s.s.OpenExchangeRatesOrgProvider Unknown key IMPORTANT NOTE
   [junit4]   2> 447956 WARN  (coreLoadExecutor-1628-thread-1-processing-n:127.0.0.1:34612_cts%2Fv) [n:127.0.0.1:34612_cts%2Fv c:control_collection   x:collection1] o.a.s.s.OpenExchangeRatesOrgProvider Expected key, got STRING
   [junit4]   2> 447956 INFO  (coreLoadExecutor-1628-thread-1-processing-n:127.0.0.1:34612_cts%2Fv) [n:127.0.0.1:34612_cts%2Fv c:control_collection   x:collection1] o.a.s.s.OpenExchangeRatesOrgProvider Reloading exchange rates from open-exchange-rates.json
   [junit4]   2> 447956 WARN  (coreLoadExecutor-1628-thread-1-processing-n:127.0.0.1:34612_cts%2Fv) [n:127.0.0.1:34612_cts%2Fv c:control_collection   x:collection1] o.a.s.s.OpenExchangeRatesOrgProvider Unknown key IMPORTANT NOTE
   [junit4]   2> 447956 WARN  (coreLoadExecutor-1628-thread-1-processing-n:127.0.0.1:34612_cts%2Fv) [n:127.0.0.1:34612_cts%2Fv c:control_collection   x:collection1] o.a.s.s.OpenExchangeRatesOrgProvider Expected key, got STRING
   [junit4]   2> 447957 INFO  (coreLoadExecutor-1628-thread-1-processing-n:127.0.0.1:34612_cts%2Fv) [n:127.0.0.1:34612_cts%2Fv c:control_collection   x:collection1] o.a.s.c.ConfigSetProperties Did not find ConfigSet properties
   [junit4]   2> org.apache.solr.core.SolrResourceNotFoundException: Can't find resource 'configsetprops.json' in classpath or '/configs/conf1', cwd=/home/jenkins/workspace/Lucene-Solr-5.x-Linux/solr/build/solr-core/test/J0
   [junit4]   2> 	at org.apache.solr.cloud.ZkSolrResourceLoader.openResource(ZkSolrResourceLoader.java:99)
   [junit4]   2> 	at org.apache.solr.core.ConfigSetProperties.readFromResourceLoader(ConfigSetProperties.java:49)
   [junit4]   2> 	at org.apache.solr.core.ConfigSetService.createConfigSetProperties(ConfigSetService.java:114)
   [junit4]   2> 	at org.apache.solr.core.ConfigSetService.getConfig(ConfigSetService.java:76)
   [junit4]   2> 	at org.apache.solr.core.CoreContainer.create(CoreContainer.java:667)
   [junit4]   2> 	at org.apache.solr.core.CoreContainer$1.call(CoreContainer.java:396)
   [junit4]   2> 	at org.apache.solr.core.CoreContainer$1.call(CoreContainer.java:387)
   [junit4]   2> 	at java.util.concurrent.FutureTask.run(FutureTask.java:266)
   [junit4]   2> 	at org.apache.solr.common.util.ExecutorUtil$MDCAwareThreadPoolExecutor$1.run(ExecutorUtil.java:156)
   [junit4]   2> 	at java.util.concurrent.ThreadPoolExecutor.runWorker(ThreadPoolExecutor.java:1142)
   [junit4]   2> 	at java.util.concurrent.ThreadPoolExecutor$Worker.run(ThreadPoolExecutor.java:617)
   [junit4]   2> 	at java.lang.Thread.run(Thread.java:745)
   [junit4]   2> 447958 INFO  (coreLoadExecutor-1628-thread-1-processing-n:127.0.0.1:34612_cts%2Fv) [n:127.0.0.1:34612_cts%2Fv c:control_collection   x:collection1] o.a.s.c.CoreContainer Creating SolrCore 'collection1' using configuration from collection control_collection
   [junit4]   2> 447958 INFO  (coreLoadExecutor-1628-thread-1-processing-n:127.0.0.1:34612_cts%2Fv) [n:127.0.0.1:34612_cts%2Fv c:control_collection s:shard1 r:core_node1 x:collection1] o.a.s.c.SolrCore org.apache.solr.core.MockDirectoryFactory
   [junit4]   2> 447958 INFO  (coreLoadExecutor-1628-thread-1-processing-n:127.0.0.1:34612_cts%2Fv) [n:127.0.0.1:34612_cts%2Fv c:control_collection s:shard1 r:core_node1 x:collection1] o.a.s.c.SolrCore [[collection1] ] Opening new SolrCore at [/home/jenkins/workspace/Lucene-Solr-5.x-Linux/solr/build/solr-core/test/J0/temp/solr.cloud.HttpPartitionTest_9B3050AC664637AE-001/control-001/cores/collection1/], dataDir=[null]
   [junit4]   2> 447959 INFO  (coreLoadExecutor-1628-thread-1-processing-n:127.0.0.1:34612_cts%2Fv) [n:127.0.0.1:34612_cts%2Fv c:control_collection s:shard1 r:core_node1 x:collection1] o.a.s.c.JmxMonitoredMap JMX monitoring is enabled. Adding Solr mbeans to JMX Server: com.sun.jmx.mbeanserver.JmxMBeanServer@17908600
   [junit4]   2> 447959 INFO  (coreLoadExecutor-1628-thread-1-processing-n:127.0.0.1:34612_cts%2Fv) [n:127.0.0.1:34612_cts%2Fv c:control_collection s:shard1 r:core_node1 x:collection1] o.a.s.c.CachingDirectoryFactory return new directory for /home/jenkins/workspace/Lucene-Solr-5.x-Linux/solr/build/solr-core/test/J0/temp/solr.cloud.HttpPartitionTest_9B3050AC664637AE-001/control-001/cores/collection1/data
   [junit4]   2> 447959 INFO  (coreLoadExecutor-1628-thread-1-processing-n:127.0.0.1:34612_cts%2Fv) [n:127.0.0.1:34612_cts%2Fv c:control_collection s:shard1 r:core_node1 x:collection1] o.a.s.c.SolrCore New index directory detected: old=null new=/home/jenkins/workspace/Lucene-Solr-5.x-Linux/solr/build/solr-core/test/J0/temp/solr.cloud.HttpPartitionTest_9B3050AC664637AE-001/control-001/cores/collection1/data/index/
   [junit4]   2> 447959 WARN  (coreLoadExecutor-1628-thread-1-processing-n:127.0.0.1:34612_cts%2Fv) [n:127.0.0.1:34612_cts%2Fv c:control_collection s:shard1 r:core_node1 x:collection1] o.a.s.c.SolrCore [collection1] Solr index directory '/home/jenkins/workspace/Lucene-Solr-5.x-Linux/solr/build/solr-core/test/J0/temp/solr.cloud.HttpPartitionTest_9B3050AC664637AE-001/control-001/cores/collection1/data/index' doesn't exist. Creating new index...
   [junit4]   2> 447960 INFO  (coreLoadExecutor-1628-thread-1-processing-n:127.0.0.1:34612_cts%2Fv) [n:127.0.0.1:34612_cts%2Fv c:control_collection s:shard1 r:core_node1 x:collection1] o.a.s.c.CachingDirectoryFactory return new directory for /home/jenkins/workspace/Lucene-Solr-5.x-Linux/solr/build/solr-core/test/J0/temp/solr.cloud.HttpPartitionTest_9B3050AC664637AE-001/control-001/cores/collection1/data/index
   [junit4]   2> 447960 INFO  (coreLoadExecutor-1628-thread-1-processing-n:127.0.0.1:34612_cts%2Fv) [n:127.0.0.1:34612_cts%2Fv c:control_collection s:shard1 r:core_node1 x:collection1] o.a.s.u.RandomMergePolicy RandomMergePolicy wrapping class org.apache.lucene.index.LogByteSizeMergePolicy: [LogByteSizeMergePolicy: minMergeSize=1677721, mergeFactor=4, maxMergeSize=2147483648, maxMergeSizeForForcedMerge=9223372036854775807, calibrateSizeByDeletes=false, maxMergeDocs=2147483647, maxCFSSegmentSizeMB=8.796093022207999E12, noCFSRatio=0.31628564936638937]
   [junit4]   2> 447960 INFO  (coreLoadExecutor-1628-thread-1-processing-n:127.0.0.1:34612_cts%2Fv) [n:127.0.0.1:34612_cts%2Fv c:control_collection s:shard1 r:core_node1 x:collection1] o.a.s.c.SolrCore SolrDeletionPolicy.onCommit: commits: num=1
   [junit4]   2> 	commit{dir=MockDirectoryWrapper(RAMDirectory@383e4eff lockFactory=org.apache.lucene.store.SingleInstanceLockFactory@7d86dd04),segFN=segments_1,generation=1}
   [junit4]   2> 447961 INFO  (coreLoadExecutor-1628-thread-1-processing-n:127.0.0.1:34612_cts%2Fv) [n:127.0.0.1:34612_cts%2Fv c:control_collection s:shard1 r:core_node1 x:collection1] o.a.s.c.SolrCore newest commit generation = 1
   [junit4]   2> 447961 INFO  (OldIndexDirectoryCleanupThreadForCore-collection1) [n:127.0.0.1:34612_cts%2Fv c:control_collection s:shard1 r:core_node1 x:collection1] o.a.s.c.SolrCore Looking for old index directories to cleanup for core collection1 in /home/jenkins/workspace/Lucene-Solr-5.x-Linux/solr/build/solr-core/test/J0/temp/solr.cloud.HttpPartitionTest_9B3050AC664637AE-001/control-001/cores/collection1/data/
   [junit4]   2> 447961 WARN  (OldIndexDirectoryCleanupThreadForCore-collection1) [n:127.0.0.1:34612_cts%2Fv c:control_collection s:shard1 r:core_node1 x:collection1] o.a.s.c.DirectoryFactory /home/jenkins/workspace/Lucene-Solr-5.x-Linux/solr/build/solr-core/test/J0/temp/solr.cloud.HttpPartitionTest_9B3050AC664637AE-001/control-001/cores/collection1/data/ does not point to a valid data directory; skipping clean-up of old index directories.
   [junit4]   2> 447965 INFO  (coreLoadExecutor-1628-thread-1-processing-n:127.0.0.1:34612_cts%2Fv) [n:127.0.0.1:34612_cts%2Fv c:control_collection s:shard1 r:core_node1 x:collection1] o.a.s.u.p.UpdateRequestProcessorChain creating updateRequestProcessorChain "nodistrib"
   [junit4]   2> 447965 INFO  (coreLoadExecutor-1628-thread-1-processing-n:127.0.0.1:34612_cts%2Fv) [n:127.0.0.1:34612_cts%2Fv c:control_collection s:shard1 r:core_node1 x:collection1] o.a.s.u.p.UpdateRequestProcessorChain creating updateRequestProcessorChain "dedupe"
   [junit4]   2> 447966 INFO  (coreLoadExecutor-1628-thread-1-processing-n:127.0.0.1:34612_cts%2Fv) [n:127.0.0.1:34612_cts%2Fv c:control_collection s:shard1 r:core_node1 x:collection1] o.a.s.u.p.UpdateRequestProcessorChain inserting DistributedUpdateProcessorFactory into updateRequestProcessorChain "dedupe"
   [junit4]   2> 447966 INFO  (coreLoadExecutor-1628-thread-1-processing-n:127.0.0.1:34612_cts%2Fv) [n:127.0.0.1:34612_cts%2Fv c:control_collection s:shard1 r:core_node1 x:collection1] o.a.s.u.p.UpdateRequestProcessorChain creating updateRequestProcessorChain "stored_sig"
   [junit4]   2> 447966 INFO  (coreLoadExecutor-1628-thread-1-processing-n:127.0.0.1:34612_cts%2Fv) [n:127.0.0.1:34612_cts%2Fv c:control_collection s:shard1 r:core_node1 x:collection1] o.a.s.u.p.UpdateRequestProcessorChain inserting DistributedUpdateProcessorFactory into updateRequestProcessorChain "stored_sig"
   [junit4]   2> 447966 INFO  (coreLoadExecutor-1628-thread-1-processing-n:127.0.0.1:34612_cts%2Fv) [n:127.0.0.1:34612_cts%2Fv c:control_collection s:shard1 r:core_node1 x:collection1] o.a.s.u.p.UpdateRequestProcessorChain creating updateRequestProcessorChain "distrib-dup-test-chain-explicit"
   [junit4]   2> 447967 INFO  (coreLoadExecutor-1628-thread-1-processing-n:127.0.0.1:34612_cts%2Fv) [n:127.0.0.1:34612_cts%2Fv c:control_collection s:shard1 r:core_node1 x:collection1] o.a.s.u.p.UpdateRequestProcessorChain creating updateRequestProcessorChain "distrib-dup-test-chain-implicit"
   [junit4]   2> 447967 INFO  (coreLoadExecutor-1628-thread-1-processing-n:127.0.0.1:34612_cts%2Fv) [n:127.0.0.1:34612_cts%2Fv c:control_collection s:shard1 r:core_node1 x:collection1] o.a.s.u.p.UpdateRequestProcessorChain inserting DistributedUpdateProcessorFactory into updateRequestProcessorChain "distrib-dup-test-chain-implicit"
   [junit4]   2> 447967 INFO  (coreLoadExecutor-1628-thread-1-processing-n:127.0.0.1:34612_cts%2Fv) [n:127.0.0.1:34612_cts%2Fv c:control_collection s:shard1 r:core_node1 x:collection1] o.a.s.c.SolrCore no updateRequestProcessorChain defined as default, creating implicit default
   [junit4]   2> 447969 INFO  (coreLoadExecutor-1628-thread-1-processing-n:127.0.0.1:34612_cts%2Fv) [n:127.0.0.1:34612_cts%2Fv c:control_collection s:shard1 r:core_node1 x:collection1] o.a.s.h.l.XMLLoader xsltCacheLifetimeSeconds=60
   [junit4]   2> 447970 INFO  (coreLoadExecutor-1628-thread-1-processing-n:127.0.0.1:34612_cts%2Fv) [n:127.0.0.1:34612_cts%2Fv c:control_collection s:shard1 r:core_node1 x:collection1] o.a.s.h.l.XMLLoader xsltCacheLifetimeSeconds=60
   [junit4]   2> 447971 INFO  (coreLoadExecutor-1628-thread-1-processing-n:127.0.0.1:34612_cts%2Fv) [n:127.0.0.1:34612_cts%2Fv c:control_collection s:shard1 r:core_node1 x:collection1] o.a.s.h.l.XMLLoader xsltCacheLifetimeSeconds=60
   [junit4]   2> 447971 INFO  (coreLoadExecutor-1628-thread-1-processing-n:127.0.0.1:34612_cts%2Fv) [n:127.0.0.1:34612_cts%2Fv c:control_collection s:shard1 r:core_node1 x:collection1] o.a.s.h.l.XMLLoader xsltCacheLifetimeSeconds=60
   [junit4]   2> 447973 INFO  (coreLoadExecutor-1628-thread-1-processing-n:127.0.0.1:34612_cts%2Fv) [n:127.0.0.1:34612_cts%2Fv c:control_collection s:shard1 r:core_node1 x:collection1] o.a.s.c.RequestHandlers Registered paths: /admin/mbeans,standard,/update/csv,/update/json/docs,/admin/luke,/admin/segments,/get,/admin/system,/replication,/admin/properties,/config,/schema,/admin/plugins,/admin/logging,/update/json,/admin/threads,/admin/ping,/update,/admin/file
   [junit4]   2> 447973 INFO  (coreLoadExecutor-1628-thread-1-processing-n:127.0.0.1:34612_cts%2Fv) [n:127.0.0.1:34612_cts%2Fv c:control_collection s:shard1 r:core_node1 x:collection1] o.a.s.c.SolrCore Using default statsCache cache: org.apache.solr.search.stats.LocalStatsCache
   [junit4]   2> 447973 INFO  (coreLoadExecutor-1628-thread-1-processing-n:127.0.0.1:34612_cts%2Fv) [n:127.0.0.1:34612_cts%2Fv c:control_collection s:shard1 r:core_node1 x:collection1] o.a.s.u.UpdateHandler Using UpdateLog implementation: org.apache.solr.update.UpdateLog
   [junit4]   2> 447974 INFO  (coreLoadExecutor-1628-thread-1-processing-n:127.0.0.1:34612_cts%2Fv) [n:127.0.0.1:34612_cts%2Fv c:control_collection s:shard1 r:core_node1 x:collection1] o.a.s.u.UpdateLog Initializing UpdateLog: dataDir= defaultSyncLevel=FLUSH numRecordsToKeep=100 maxNumLogsToKeep=10 numVersionBuckets=65536
   [junit4]   2> 447974 INFO  (coreLoadExecutor-1628-thread-1-processing-n:127.0.0.1:34612_cts%2Fv) [n:127.0.0.1:34612_cts%2Fv c:control_collection s:shard1 r:core_node1 x:collection1] o.a.s.c.SolrCore Hard AutoCommit: disabled
   [junit4]   2> 447974 INFO  (coreLoadExecutor-1628-thread-1-processing-n:127.0.0.1:34612_cts%2Fv) [n:127.0.0.1:34612_cts%2Fv c:control_collection s:shard1 r:core_node1 x:collection1] o.a.s.c.SolrCore Soft AutoCommit: disabled
   [junit4]   2> 447975 INFO  (coreLoadExecutor-1628-thread-1-processing-n:127.0.0.1:34612_cts%2Fv) [n:127.0.0.1:34612_cts%2Fv c:control_collection s:shard1 r:core_node1 x:collection1] o.a.s.u.RandomMergePolicy RandomMergePolicy wrapping class org.apache.lucene.index.AlcoholicMergePolicy: [AlcoholicMergePolicy: minMergeSize=0, mergeFactor=10, maxMergeSize=1011473131, maxMergeSizeForForcedMerge=9223372036854775807, calibrateSizeByDeletes=true, maxMergeDocs=2147483647, maxCFSSegmentSizeMB=8.796093022207999E12, noCFSRatio=0.1]
   [junit4]   2> 447975 INFO  (coreLoadExecutor-1628-thread-1-processing-n:127.0.0.1:34612_cts%2Fv) [n:127.0.0.1:34612_cts%2Fv c:control_collection s:shard1 r:core_node1 x:collection1] o.a.s.c.SolrCore SolrDeletionPolicy.onInit: commits: num=1
   [junit4]   2> 	commit{dir=MockDirectoryWrapper(RAMDirectory@383e4eff lockFactory=org.apache.lucene.store.SingleInstanceLockFactory@7d86dd04),segFN=segments_1,generation=1}
   [junit4]   2> 447975 INFO  (coreLoadExecutor-1628-thread-1-processing-n:127.0.0.1:34612_cts%2Fv) [n:127.0.0.1:34612_cts%2Fv c:control_collection s:shard1 r:core_node1 x:collection1] o.a.s.c.SolrCore newest commit generation = 1
   [junit4]   2> 447975 INFO  (coreLoadExecutor-1628-thread-1-processing-n:127.0.0.1:34612_cts%2Fv) [n:127.0.0.1:34612_cts%2Fv c:control_collection s:shard1 r:core_node1 x:collection1] o.a.s.s.SolrIndexSearcher Opening Searcher@4608162[collection1] main
   [junit4]   2> 447975 INFO  (coreLoadExecutor-1628-thread-1-processing-n:127.0.0.1:34612_cts%2Fv) [n:127.0.0.1:34612_cts%2Fv c:control_collection s:shard1 r:core_node1 x:collection1] o.a.s.c.c.ZkStateReader Load collection config from:/collections/control_collection
   [junit4]   2> 447976 INFO  (coreLoadExecutor-1628-thread-1-processing-n:127.0.0.1:34612_cts%2Fv) [n:127.0.0.1:34612_cts%2Fv c:control_collection s:shard1 r:core_node1 x:collection1] o.a.s.c.c.ZkStateReader path=/collections/control_collection configName=conf1 specified config exists in ZooKeeper
   [junit4]   2> 447976 INFO  (coreLoadExecutor-1628-thread-1-processing-n:127.0.0.1:34612_cts%2Fv) [n:127.0.0.1:34612_cts%2Fv c:control_collection s:shard1 r:core_node1 x:collection1] o.a.s.r.ManagedResourceStorage Setting up ZooKeeper-based storage for the RestManager with znodeBase: /configs/conf1
   [junit4]   2> 447976 INFO  (coreLoadExecutor-1628-thread-1-processing-n:127.0.0.1:34612_cts%2Fv) [n:127.0.0.1:34612_cts%2Fv c:control_collection s:shard1 r:core_node1 x:collection1] o.a.s.r.ManagedResourceStorage Configured ZooKeeperStorageIO with znodeBase: /configs/conf1
   [junit4]   2> 447976 INFO  (coreLoadExecutor-1628-thread-1-processing-n:127.0.0.1:34612_cts%2Fv) [n:127.0.0.1:34612_cts%2Fv c:control_collection s:shard1 r:core_node1 x:collection1] o.a.s.r.RestManager Initializing RestManager with initArgs: {}
   [junit4]   2> 447976 INFO  (coreLoadExecutor-1628-thread-1-processing-n:127.0.0.1:34612_cts%2Fv) [n:127.0.0.1:34612_cts%2Fv c:control_collection s:shard1 r:core_node1 x:collection1] o.a.s.r.ManagedResourceStorage Reading _rest_managed.json using ZooKeeperStorageIO:path=/configs/conf1
   [junit4]   2> 447977 INFO  (coreLoadExecutor-1628-thread-1-processing-n:127.0.0.1:34612_cts%2Fv) [n:127.0.0.1:34612_cts%2Fv c:control_collection s:shard1 r:core_node1 x:collection1] o.a.s.r.ManagedResourceStorage No data found for znode /configs/conf1/_rest_managed.json
   [junit4]   2> 447977 INFO  (coreLoadExecutor-1628-thread-1-processing-n:127.0.0.1:34612_cts%2Fv) [n:127.0.0.1:34612_cts%2Fv c:control_collection s:shard1 r:core_node1 x:collection1] o.a.s.r.ManagedResourceStorage Loaded null at path _rest_managed.json using ZooKeeperStorageIO:path=/configs/conf1
   [junit4]   2> 447978 INFO  (coreLoadExecutor-1628-thread-1-processing-n:127.0.0.1:34612_cts%2Fv) [n:127.0.0.1:34612_cts%2Fv c:control_collection s:shard1 r:core_node1 x:collection1] o.a.s.r.RestManager Initializing 0 registered ManagedResources
   [junit4]   2> 447978 INFO  (coreLoadExecutor-1628-thread-1-processing-n:127.0.0.1:34612_cts%2Fv) [n:127.0.0.1:34612_cts%2Fv c:control_collection s:shard1 r:core_node1 x:collection1] o.a.s.h.ReplicationHandler Commits will be reserved for  10000
   [junit4]   2> 447978 INFO  (coreLoadExecutor-1628-thread-1-processing-n:127.0.0.1:34612_cts%2Fv) [n:127.0.0.1:34612_cts%2Fv c:control_collection s:shard1 r:core_node1 x:collection1] o.a.s.u.UpdateLog Looking up max value of version field to seed version buckets
   [junit4]   2> 447978 INFO  (coreLoadExecutor-1628-thread-1-processing-n:127.0.0.1:34612_cts%2Fv) [n:127.0.0.1:34612_cts%2Fv c:control_collection s:shard1 r:core_node1 x:collection1] o.a.s.u.VersionInfo Refreshing highest value of _version_ for 65536 version buckets from index
   [junit4]   2> 447978 INFO  (coreLoadExecutor-1628-thread-1-processing-n:127.0.0.1:34612_cts%2Fv) [n:127.0.0.1:34612_cts%2Fv c:control_collection s:shard1 r:core_node1 x:collection1] o.a.s.u.VersionInfo No terms found for _version_, cannot seed version bucket highest value from index
   [junit4]   2> 447979 INFO  (coreLoadExecutor-1628-thread-1-processing-n:127.0.0.1:34612_cts%2Fv) [n:127.0.0.1:34612_cts%2Fv c:control_collection s:shard1 r:core_node1 x:collection1] o.a.s.u.UpdateLog Could not find max version in index or recent updates, using new clock 1507396462275723264
   [junit4]   2> 447980 INFO  (coreLoadExecutor-1628-thread-1-processing-n:127.0.0.1:34612_cts%2Fv) [n:127.0.0.1:34612_cts%2Fv c:control_collection s:shard1 r:core_node1 x:collection1] o.a.s.u.UpdateLog Took 2 ms to seed version buckets with highest version 1507396462275723264
   [junit4]   2> 447980 INFO  (coreLoadExecutor-1628-thread-1-processing-n:127.0.0.1:34612_cts%2Fv) [n:127.0.0.1:34612_cts%2Fv c:control_collection s:shard1 r:core_node1 x:collection1] o.a.s.c.ZkController watch zkdir /configs/conf1
   [junit4]   2> 447981 INFO  (searcherExecutor-1629-thread-1-processing-n:127.0.0.1:34612_cts%2Fv x:collection1 s:shard1 c:control_collection r:core_node1) [n:127.0.0.1:34612_cts%2Fv c:control_collection s:shard1 r:core_node1 x:collection1] o.a.s.c.SolrCore [collection1] Registered new searcher Searcher@4608162[collection1] main{ExitableDirectoryReader(UninvertingDirectoryReader())}
   [junit4]   2> 447981 INFO  (coreLoadExecutor-1628-thread-1-processing-n:127.0.0.1:34612_cts%2Fv) [n:127.0.0.1:34612_cts%2Fv c:control_collection s:shard1 r:core_node1 x:collection1] o.a.s.c.CoreContainer registering core: collection1
   [junit4]   2> 447981 INFO  (coreZkRegister-1622-thread-1-processing-n:127.0.0.1:34612_cts%2Fv x:collection1 s:shard1 c:control_collection r:core_node1) [n:127.0.0.1:34612_cts%2Fv c:control_collection s:shard1 r:core_node1 x:collection1] o.a.s.c.ZkController Register replica - core:collection1 address:http://127.0.0.1:34612/cts/v collection:control_collection shard:shard1
   [junit4]   2> 447982 INFO  (coreZkRegister-1622-thread-1-processing-n:127.0.0.1:34612_cts%2Fv x:collection1 s:shard1 c:control_collection r:core_node1) [n:127.0.0.1:34612_cts%2Fv c:control_collection s:shard1 r:core_node1 x:collection1] o.a.s.c.c.SolrZkClient makePath: /collections/control_collection/leader_elect/shard1/election
   [junit4]   2> 447991 INFO  (coreZkRegister-1622-thread-1-processing-n:127.0.0.1:34612_cts%2Fv x:collection1 s:shard1 c:control_collection r:core_node1) [n:127.0.0.1:34612_cts%2Fv c:control_collection s:shard1 r:core_node1 x:collection1] o.a.s.c.LeaderElector Joined leadership election with path: /collections/control_collection/leader_elect/shard1/election/94212278792355843-core_node1-n_0000000000
   [junit4]   2> 447994 INFO  (coreZkRegister-1622-thread-1-processing-n:127.0.0.1:34612_cts%2Fv x:collection1 s:shard1 c:control_collection r:core_node1) [n:127.0.0.1:34612_cts%2Fv c:control_collection s:shard1 r:core_node1 x:collection1] o.a.s.c.ShardLeaderElectionContext Running the leader process for shard shard1
   [junit4]   2> 447995 INFO  (coreZkRegister-1622-thread-1-processing-n:127.0.0.1:34612_cts%2Fv x:collection1 s:shard1 c:control_collection r:core_node1) [n:127.0.0.1:34612_cts%2Fv c:control_collection s:shard1 r:core_node1 x:collection1] o.a.s.c.ShardLeaderElectionContext Enough replicas found to continue.
   [junit4]   2> 447995 INFO  (coreZkRegister-1622-thread-1-processing-n:127.0.0.1:34612_cts%2Fv x:collection1 s:shard1 c:control_collection r:core_node1) [n:127.0.0.1:34612_cts%2Fv c:control_collection s:shard1 r:core_node1 x:collection1] o.a.s.c.ShardLeaderElectionContext I may be the new leader - try and sync
   [junit4]   2> 447995 INFO  (coreZkRegister-1622-thread-1-processing-n:127.0.0.1:34612_cts%2Fv x:collection1 s:shard1 c:control_collection r:core_node1) [n:127.0.0.1:34612_cts%2Fv c:control_collection s:shard1 r:core_node1 x:collection1] o.a.s.c.SyncStrategy Sync replicas to http://127.0.0.1:34612/cts/v/collection1/
   [junit4]   2> 447995 INFO  (coreZkRegister-1622-thread-1-processing-n:127.0.0.1:34612_cts%2Fv x:collection1 s:shard1 c:control_collection r:core_node1) [n:127.0.0.1:34612_cts%2Fv c:control_collection s:shard1 r:core_node1 x:collection1] o.a.s.c.SyncStrategy Sync Success - now sync replicas to me
   [junit4]   2> 447995 INFO  (coreZkRegister-1622-thread-1-processing-n:127.0.0.1:34612_cts%2Fv x:collection1 s:shard1 c:control_collection r:core_node1) [n:127.0.0.1:34612_cts%2Fv c:control_collection s:shard1 r:core_node1 x:collection1] o.a.s.c.SyncStrategy http://127.0.0.1:34612/cts/v/collection1/ has no replicas
   [junit4]   2> 447995 INFO  (coreZkRegister-1622-thread-1-processing-n:127.0.0.1:34612_cts%2Fv x:collection1 s:shard1 c:control_collection r:core_node1) [n:127.0.0.1:34612_cts%2Fv c:control_collection s:shard1 r:core_node1 x:collection1] o.a.s.c.ShardLeaderElectionContext I am the new leader: http://127.0.0.1:34612/cts/v/collection1/ shard1
   [junit4]   2> 447996 INFO  (coreZkRegister-1622-thread-1-processing-n:127.0.0.1:34612_cts%2Fv x:collection1 s:shard1 c:control_collection r:core_node1) [n:127.0.0.1:34612_cts%2Fv c:control_collection s:shard1 r:core_node1 x:collection1] o.a.s.c.c.SolrZkClient makePath: /collections/control_collection/leaders/shard1
   [junit4]   2> 448002 INFO  (zkCallback-341-thread-1-processing-n:127.0.0.1:34612_cts%2Fv) [n:127.0.0.1:34612_cts%2Fv    ] o.a.s.c.DistributedQueue NodeChildrenChanged fired on path /overseer/queue state SyncConnected
   [junit4]   2> 448003 INFO  (OverseerStateUpdate-94212278792355843-127.0.0.1:34612_cts%2Fv-n_0000000000) [n:127.0.0.1:34612_cts%2Fv    ] o.a.s.c.Overseer processMessage: queueSize: 2, message = {
   [junit4]   2>   "operation":"leader",
   [junit4]   2>   "shard":"shard1",
   [junit4]   2>   "collection":"control_collection"} current state version: 1
   [junit4]   2> 448006 INFO  (OverseerStateUpdate-94212278792355843-127.0.0.1:34612_cts%2Fv-n_0000000000) [n:127.0.0.1:34612_cts%2Fv    ] o.a.s.c.Overseer processMessage: queueSize: 1, message = {
   [junit4]   2>   "operation":"leader",
   [junit4]   2>   "shard":"shard1",
   [junit4]   2>   "collection":"control_collection",
   [junit4]   2>   "base_url":"http://127.0.0.1:34612/cts/v",
   [junit4]   2>   "core":"collection1",
   [junit4]   2>   "state":"active"} current state version: 1
   [junit4]   2> 448007 INFO  (zkCallback-341-thread-1-processing-n:127.0.0.1:34612_cts%2Fv) [n:127.0.0.1:34612_cts%2Fv    ] o.a.s.c.DistributedQueue NodeChildrenChanged fired on path /overseer/queue state SyncConnected
   [junit4]   2> 448008 INFO  (zkCallback-341-thread-1-processing-n:127.0.0.1:34612_cts%2Fv) [n:127.0.0.1:34612_cts%2Fv    ] o.a.s.c.c.ZkStateReader A cluster state change: WatchedEvent state:SyncConnected type:NodeDataChanged path:/clusterstate.json, has occurred - updating... (live nodes size: 1)
   [junit4]   2> 448008 INFO  (zkCallback-341-thread-1-processing-n:127.0.0.1:34612_cts%2Fv) [n:127.0.0.1:34612_cts%2Fv    ] o.a.s.c.c.ZkStateReader Updated cluster state version to 2
   [junit4]   2> 448048 INFO  (coreZkRegister-1622-thread-1-processing-n:127.0.0.1:34612_cts%2Fv x:collection1 s:shard1 c:control_collection r:core_node1) [n:127.0.0.1:34612_cts%2Fv c:control_collection s:shard1 r:core_node1 x:collection1] o.a.s.c.ZkController We are http://127.0.0.1:34612/cts/v/collection1/ and leader is http://127.0.0.1:34612/cts/v/collection1/
   [junit4]   2> 448049 INFO  (coreZkRegister-1622-thread-1-processing-n:127.0.0.1:34612_cts%2Fv x:collection1 s:shard1 c:control_collection r:core_node1) [n:127.0.0.1:34612_cts%2Fv c:control_collection s:shard1 r:core_node1 x:collection1] o.a.s.c.ZkController No LogReplay needed for core=collection1 baseURL=http://127.0.0.1:34612/cts/v
   [junit4]   2> 448049 INFO  (coreZkRegister-1622-thread-1-processing-n:127.0.0.1:34612_cts%2Fv x:collection1 s:shard1 c:control_collection r:core_node1) [n:127.0.0.1:34612_cts%2Fv c:control_collection s:shard1 r:core_node1 x:collection1] o.a.s.c.ZkController I am the leader, no recovery necessary
   [junit4]   2> 448050 INFO  (coreZkRegister-1622-thread-1-processing-n:127.0.0.1:34612_cts%2Fv x:collection1 s:shard1 c:control_collection r:core_node1) [n:127.0.0.1:34612_cts%2Fv c:control_collection s:shard1 r:core_node1 x:collection1] o.a.s.c.ZkController publishing state=active
   [junit4]   2> 448050 INFO  (coreZkRegister-1622-thread-1-processing-n:127.0.0.1:34612_cts%2Fv x:collection1 s:shard1 c:control_collection r:core_node1) [n:127.0.0.1:34612_cts%2Fv c:control_collection s:shard1 r:core_node1 x:collection1] o.a.s.c.ZkController numShards not found on descriptor - reading it from system property
   [junit4]   2> 448053 INFO  (zkCallback-341-thread-1-processing-n:127.0.0.1:34612_cts%2Fv) [n:127.0.0.1:34612_cts%2Fv    ] o.a.s.c.DistributedQueue NodeChildrenChanged fired on path /overseer/queue state SyncConnected
   [junit4]   2> 448061 INFO  (OverseerStateUpdate-94212278792355843-127.0.0.1:34612_cts%2Fv-n_0000000000) [n:127.0.0.1:34612_cts%2Fv    ] o.a.s.c.Overseer processMessage: queueSize: 1, message = {
   [junit4]   2>   "core":"collection1",
   [junit4]   2>   "core_node_name":"core_node1",
   [junit4]   2>   "roles":null,
   [junit4]   2>   "base_url":"http://127.0.0.1:34612/cts/v",
   [junit4]   2>   "node_name":"127.0.0.1:34612_cts%2Fv",
   [junit4]   2>   "numShards":"1",
   [junit4]   2>   "state":"active",
   [junit4]   2>   "shard":"shard1",
   [junit4]   2>   "collection":"control_collection",
   [junit4]   2>   "operation":"state"} current state version: 2
   [junit4]   2> 448062 INFO  (OverseerStateUpdate-94212278792355843-127.0.0.1:34612_cts%2Fv-n_0000000000) [n:127.0.0.1:34612_cts%2Fv    ] o.a.s.c.o.ReplicaMutator Update state numShards=1 message={
   [junit4]   2>   "core":"collection1",
   [junit4]   2>   "core_node_name":"core_node1",
   [junit4]   2>   "roles":null,
   [junit4]   2>   "base_url":"http://127.0.0.1:34612/cts/v",
   [junit4]   2>   "node_name":"127.0.0.1:34612_cts%2Fv",
   [junit4]   2>   "numShards":"1",
   [junit4]   2>   "state":"active",
   [junit4]   2>   "shard":"shard1",
   [junit4]   2>   "collection":"control_collection",
   [junit4]   2>   "operation":"state"}
   [junit4]   2> 448171 INFO  (zkCallback-341-thread-1-processing-n:127.0.0.1:34612_cts%2Fv) [n:127.0.0.1:34612_cts%2Fv    ] o.a.s.c.c.ZkStateReader A cluster state change: WatchedEvent state:SyncConnected type:NodeDataChanged path:/clusterstate.json, has occurred - updating... (live nodes size: 1)
   [junit4]   2> 448172 INFO  (zkCallback-341-thread-1-processing-n:127.0.0.1:34612_cts%2Fv) [n:127.0.0.1:34612_cts%2Fv    ] o.a.s.c.c.ZkStateReader Updated cluster state version to 3
   [junit4]   2> 448281 INFO  (TEST-HttpPartitionTest.test-seed#[9B3050AC664637AE]) [    ] o.a.s.c.c.SolrZkClient Using default ZkCredentialsProvider
   [junit4]   2> 448282 INFO  (TEST-HttpPartitionTest.test-seed#[9B3050AC664637AE]) [    ] o.a.s.c.c.ConnectionManager Waiting for client to connect to ZooKeeper
   [junit4]   2> 448283 INFO  (zkCallback-343-thread-1) [    ] o.a.s.c.c.ConnectionManager Watcher org.apache.solr.common.cloud.ConnectionManager@3a493f70 name:ZooKeeperConnection Watcher:127.0.0.1:51474/solr got event WatchedEvent state:SyncConnected type:None path:null path:null type:None
   [junit4]   2> 448283 INFO  (TEST-HttpPartitionTest.test-seed#[9B3050AC664637AE]) [    ] o.a.s.c.c.ConnectionManager Client is connected to ZooKeeper
   [junit4]   2> 448283 INFO  (TEST-HttpPartitionTest.test-seed#[9B3050AC664637AE]) [    ] o.a.s.c.c.SolrZkClient Using default ZkACLProvider
   [junit4]   2> 448283 INFO  (TEST-HttpPartitionTest.test-seed#[9B3050AC664637AE]) [    ] o.a.s.c.c.ZkStateReader Updating cluster state from ZooKeeper... 
   [junit4]   2> 448301 INFO  (TEST-HttpPartitionTest.test-seed#[9B3050AC664637AE]) [    ] o.a.s.c.ChaosMonkey monkey: init - expire sessions:false cause connection loss:false
   [junit4]   2> 448361 INFO  (TEST-HttpPartitionTest.test-seed#[9B3050AC664637AE]) [    ] o.a.s.SolrTestCaseJ4 Writing core.properties file to /home/jenkins/workspace/Lucene-Solr-5.x-Linux/solr/build/solr-core/test/J0/temp/solr.cloud.HttpPartitionTest_9B3050AC664637AE-001/shard-1-001/cores/collection1
   [junit4]   2> 448362 INFO  (TEST-HttpPartitionTest.test-seed#[9B3050AC664637AE]) [    ] o.a.s.c.AbstractFullDistribZkTestBase create jetty 1 in directory /home/jenkins/workspace/Lucene-Solr-5.x-Linux/solr/build/solr-core/test/J0/temp/solr.cloud.HttpPartitionTest_9B3050AC664637AE-001/shard-1-001
   [junit4]   2> 448363 INFO  (TEST-HttpPartitionTest.test-seed#[9B3050AC664637AE]) [    ] o.e.j.s.Server jetty-9.2.11.v20150529
   [junit4]   2> 448364 INFO  (TEST-HttpPartitionTest.test-seed#[9B3050AC664637AE]) [    ] o.e.j.s.h.ContextHandler Started o.e.j.s.ServletContextHandler@7c3adeb8{/cts/v,null,AVAILABLE}
   [junit4]   2> 448364 INFO  (TEST-HttpPartitionTest.test-seed#[9B3050AC664637AE]) [    ] o.e.j.s.ServerConnector Started ServerConnector@30118ab5{HTTP/1.1}{127.0.0.1:42517}
   [junit4]   2> 448364 INFO  (TEST-HttpPartitionTest.test-seed#[9B3050AC664637AE]) [    ] o.e.j.s.Server Started @450407ms
   [junit4]   2> 448365 INFO  (TEST-HttpPartitionTest.test-seed#[9B3050AC664637AE]) [    ] o.a.s.c.s.e.JettySolrRunner Jetty properties: {solr.data.dir=/home/jenkins/workspace/Lucene-Solr-5.x-Linux/solr/build/solr-core/test/J0/temp/solr.cloud.HttpPartitionTest_9B3050AC664637AE-001/tempDir-001/jetty1, solrconfig=solrconfig.xml, hostContext=/cts/v, hostPort=41696, coreRootDirectory=/home/jenkins/workspace/Lucene-Solr-5.x-Linux/solr/build/solr-core/test/J0/temp/solr.cloud.HttpPartitionTest_9B3050AC664637AE-001/shard-1-001/cores}
   [junit4]   2> 448365 INFO  (TEST-HttpPartitionTest.test-seed#[9B3050AC664637AE]) [    ] o.a.s.s.SolrDispatchFilter SolrDispatchFilter.init(): sun.misc.Launcher$AppClassLoader@4e0e2f2a
   [junit4]   2> 448365 INFO  (TEST-HttpPartitionTest.test-seed#[9B3050AC664637AE]) [    ] o.a.s.c.SolrResourceLoader new SolrResourceLoader for directory: '/home/jenkins/workspace/Lucene-Solr-5.x-Linux/solr/build/solr-core/test/J0/temp/solr.cloud.HttpPartitionTest_9B3050AC664637AE-001/shard-1-001/'
   [junit4]   2> 448390 INFO  (TEST-HttpPartitionTest.test-seed#[9B3050AC664637AE]) [    ] o.a.s.c.SolrXmlConfig Loading container configuration from /home/jenkins/workspace/Lucene-Solr-5.x-Linux/solr/build/solr-core/test/J0/temp/solr.cloud.HttpPartitionTest_9B3050AC664637AE-001/shard-1-001/solr.xml
   [junit4]   2> 448396 INFO  (TEST-HttpPartitionTest.test-seed#[9B3050AC664637AE]) [    ] o.a.s.c.CoresLocator Config-defined core root directory: /home/jenkins/workspace/Lucene-Solr-5.x-Linux/solr/build/solr-core/test/J0/temp/solr.cloud.HttpPartitionTest_9B3050AC664637AE-001/shard-1-001/cores
   [junit4]   2> 448396 INFO  (TEST-HttpPartitionTest.test-seed#[9B3050AC664637AE]) [    ] o.a.s.c.CoreContainer New CoreContainer 94607750
   [junit4]   2> 448396 INFO  (TEST-HttpPartitionTest.test-seed#[9B3050AC664637AE]) [    ] o.a.s.c.CoreContainer Loading cores into CoreContainer [instanceDir=/home/jenkins/workspace/Lucene-Solr-5.x-Linux/solr/build/solr-core/test/J0/temp/solr.cloud.HttpPartitionTest_9B3050AC664637AE-001/shard-1-001/]
   [junit4]   2> 448396 INFO  (TEST-HttpPartitionTest.test-seed#[9B3050AC664637AE]) [    ] o.a.s.c.CoreContainer loading shared library: /home/jenkins/workspace/Lucene-Solr-5.x-Linux/solr/build/solr-core/test/J0/temp/solr.cloud.HttpPartitionTest_9B3050AC664637AE-001/shard-1-001/lib
   [junit4]   2> 448396 WARN  (TEST-HttpPartitionTest.test-seed#[9B3050AC664637AE]) [    ] o.a.s.c.SolrResourceLoader Can't find (or read) directory to add to classloader: lib (resolved as: /home/jenkins/workspace/Lucene-Solr-5.x-Linux/solr/build/solr-core/test/J0/temp/solr.cloud.HttpPartitionTest_9B3050AC664637AE-001/shard-1-001/lib).
   [junit4]   2> 448402 INFO  (TEST-HttpPartitionTest.test-seed#[9B3050AC664637AE]) [    ] o.a.s.h.c.HttpShardHandlerFactory created with socketTimeout : 90000,urlScheme : ,connTimeout : 15000,maxConnectionsPerHost : 20,maxConnections : 10000,corePoolSize : 0,maximumPoolSize : 2147483647,maxThreadIdleTime : 5,sizeOfQueue : -1,fairnessPolicy : false,useRetries : false,
   [junit4]   2> 448403 INFO  (TEST-HttpPartitionTest.test-seed#[9B3050AC664637AE]) [    ] o.a.s.u.UpdateShardHandler Creating UpdateShardHandler HTTP client with params: socketTimeout=340000&connTimeout=45000&retry=true
   [junit4]   2> 448403 INFO  (TEST-HttpPartitionTest.test-seed#[9B3050AC664637AE]) [    ] o.a.s.l.LogWatcher SLF4J impl is org.slf4j.impl.Log4jLoggerFactory
   [junit4]   2> 448403 INFO  (TEST-HttpPartitionTest.test-seed#[9B3050AC664637AE]) [    ] o.a.s.l.LogWatcher Registering Log Listener [Log4j (org.slf4j.impl.Log4jLoggerFactory)]
   [junit4]   2> 448403 INFO  (TEST-HttpPartitionTest.test-seed#[9B3050AC664637AE]) [    ] o.a.s.c.ZkContainer Zookeeper client=127.0.0.1:51474/solr
   [junit4]   2> 448403 INFO  (TEST-HttpPartitionTest.test-seed#[9B3050AC664637AE]) [    ] o.a.s.c.ZkController zkHost includes chroot
   [junit4]   2> 448403 INFO  (TEST-HttpPartitionTest.test-seed#[9B3050AC664637AE]) [    ] o.a.s.c.c.SolrZkClient Using default ZkCredentialsProvider
   [junit4]   2> 448404 INFO  (TEST-HttpPartitionTest.test-seed#[9B3050AC664637AE]) [    ] o.a.s.c.c.ConnectionManager Waiting for client to connect to ZooKeeper
   [junit4]   2> 448406 INFO  (zkCallback-345-thread-1) [    ] o.a.s.c.c.ConnectionManager Watcher org.apache.solr.common.cloud.ConnectionManager@25c19c9e name:ZooKeeperConnection Watcher:127.0.0.1:51474 got event WatchedEvent state:SyncConnected type:None path:null path:null type:None
   [junit4]   2> 448406 INFO  (TEST-HttpPartitionTest.test-seed#[9B3050AC664637AE]) [    ] o.a.s.c.c.ConnectionManager Client is connected to ZooKeeper
   [junit4]   2> 448407 INFO  (TEST-HttpPartitionTest.test-seed#[9B3050AC664637AE]) [    ] o.a.s.c.c.SolrZkClient Using default ZkACLProvider
   [junit4]   2> 448408 INFO  (TEST-HttpPartitionTest.test-seed#[9B3050AC664637AE]) [n:127.0.0.1:41696_cts%2Fv    ] o.a.s.c.c.ConnectionManager Waiting for client to connect to ZooKeeper
   [junit4]   2> 448408 INFO  (zkCallback-346-thread-1-processing-n:127.0.0.1:41696_cts%2Fv) [n:127.0.0.1:41696_cts%2Fv    ] o.a.s.c.c.ConnectionManager Watcher org.apache.solr.common.cloud.ConnectionManager@1069f635 name:ZooKeeperConnection Watcher:127.0.0.1:51474/solr got event WatchedEvent state:SyncConnected type:None path:null path:null type:None
   [junit4]   2> 448409 INFO  (TEST-HttpPartitionTest.test-seed#[9B3050AC664637AE]) [n:127.0.0.1:41696_cts%2Fv    ] o.a.s.c.c.ConnectionManager Client is connected to ZooKeeper
   [junit4]   2> 448411 INFO  (TEST-HttpPartitionTest.test-seed#[9B3050AC664637AE]) [n:127.0.0.1:41696_cts%2Fv    ] o.a.s.c.c.ZkStateReader Updating cluster state from ZooKeeper... 
   [junit4]   2> 449415 INFO  (TEST-HttpPartitionTest.test-seed#[9B3050AC664637AE]) [n:127.0.0.1:41696_cts%2Fv    ] o.a.s.c.ZkController Register node as live in ZooKeeper:/live_nodes/127.0.0.1:41696_cts%2Fv
   [junit4]   2> 449416 INFO  (TEST-HttpPartitionTest.test-seed#[9B3050AC664637AE]) [n:127.0.0.1:41696_cts%2Fv    ] o.a.s.c.c.SolrZkClient makePath: /live_nodes/127.0.0.1:41696_cts%2Fv
   [junit4]   2> 449420 INFO  (TEST-HttpPartitionTest.test-seed#[9B3050AC664637AE]) [n:127.0.0.1:41696_cts%2Fv    ] o.a.s.c.Overseer Overseer (id=null) closing
   [junit4]   2> 449421 INFO  (TEST-HttpPartitionTest.test-seed#[9B3050AC664637AE]) [n:127.0.0.1:41696_cts%2Fv    ] o.a.s.c.LeaderElector Joined leadership election with path: /overseer_elect/election/94212278792355846-127.0.0.1:41696_cts%2Fv-n_0000000001
   [junit4]   2> 449422 INFO  (TEST-HttpPartitionTest.test-seed#[9B3050AC664637AE]) [n:127.0.0.1:41696_cts%2Fv    ] o.a.s.c.LeaderElector Watching path /overseer_elect/election/94212278792355843-127.0.0.1:34612_cts%2Fv-n_0000000000 to know if I could be the leader
   [junit4]   2> 449423 INFO  (TEST-HttpPartitionTest.test-seed#[9B3050AC664637AE]) [n:127.0.0.1:41696_cts%2Fv    ] o.a.s.c.CoreContainer No authentication plugin used.
   [junit4]   2> 449424 INFO  (TEST-HttpPartitionTest.test-seed#[9B3050AC664637AE]) [n:127.0.0.1:41696_cts%2Fv    ] o.a.s.c.CoreContainer Security conf doesn't exist. Skipping setup for authorization module.
   [junit4]   2> 449426 INFO  (TEST-HttpPartitionTest.test-seed#[9B3050AC664637AE]) [n:127.0.0.1:41696_cts%2Fv    ] o.a.s.c.CoresLocator Looking for core definitions underneath /home/jenkins/workspace/Lucene-Solr-5.x-Linux/solr/build/solr-core/test/J0/temp/solr.cloud.HttpPartitionTest_9B3050AC664637AE-001/shard-1-001/cores
   [junit4]   2> 449427 INFO  (TEST-HttpPartitionTest.test-seed#[9B3050AC664637AE]) [n:127.0.0.1:41696_cts%2Fv    ] o.a.s.c.SolrCore Created CoreDescriptor: {name=collection1, config=solrconfig.xml, transient=false, schema=schema.xml, loadOnStartup=true, configSetProperties=configsetprops.json, instanceDir=/home/jenkins/workspace/Lucene-Solr-5.x-Linux/solr/build/solr-core/test/J0/temp/solr.cloud.HttpPartitionTest_9B3050AC664637AE-001/shard-1-001/cores/collection1, collection=collection1, absoluteInstDir=/home/jenkins/workspace/Lucene-Solr-5.x-Linux/solr/build/solr-core/test/J0/temp/solr.cloud.HttpPartitionTest_9B3050AC664637AE-001/shard-1-001/cores/collection1/, coreNodeName=, dataDir=data/, shard=}
   [junit4]   2> 449428 INFO  (TEST-HttpPartitionTest.test-seed#[9B3050AC664637AE]) [n:127.0.0.1:41696_cts%2Fv    ] o.a.s.c.CoresLocator Found core collection1 in /home/jenkins/workspace/Lucene-Solr-5.x-Linux/solr/build/solr-core/test/J0/temp/solr.cloud.HttpPartitionTest_9B3050AC664637AE-001/shard-1-001/cores/collection1/
   [junit4]   2> 449428 INFO  (TEST-HttpPartitionTest.test-seed#[9B3050AC664637AE]) [n:127.0.0.1:41696_cts%2Fv    ] o.a.s.c.CoresLocator Found 1 core definitions
   [junit4]   2> 449429 INFO  (coreLoadExecutor-1639-thread-1-processing-n:127.0.0.1:41696_cts%2Fv) [n:127.0.0.1:41696_cts%2Fv c:collection1   x:collection1] o.a.s.c.ZkController publishing state=down
   [junit4]   2> 449429 INFO  (coreLoadExecutor-1639-thread-1-processing-n:127.0.0.1:41696_cts%2Fv) [n:127.0.0.1:41696_cts%2Fv c:collection1   x:collection1] o.a.s.c.ZkController numShards not found on descriptor - reading it from system property
   [junit4]   2> 449431 INFO  (coreLoadExecutor-1639-thread-1-processing-n:127.0.0.1:41696_cts%2Fv) [n:127.0.0.1:41696_cts%2Fv c:collection1   x:collection1] o.a.s.c.ZkController look for our core node name
   [junit4]   2> 449431 INFO  (zkCallback-341-thread-1-processing-n:127.0.0.1:34612_cts%2Fv) [n:127.0.0.1:34612_cts%2Fv    ] o.a.s.c.DistributedQueue NodeChildrenChanged fired on path /overseer/queue state SyncConnected
   [junit4]   2> 449431 INFO  (OverseerStateUpdate-94212278792355843-127.0.0.1:34612_cts%2Fv-n_0000000000) [n:127.0.0.1:34612_cts%2Fv    ] o.a.s.c.Overseer processMessage: queueSize: 1, message = {
   [junit4]   2>   "core":"collection1",
   [junit4]   2>   "roles":null,
   [junit4]   2>   "base_url":"http://127.0.0.1:41696/cts/v",
   [junit4]   2>   "node_name":"127.0.0.1:41696_cts%2Fv",
   [junit4]   2>   "numShards":"2",
   [junit4]   2>   "state":"down",
   [junit4]   2>   "shard":null,
   [junit4]   2>   "collection":"collection1",
   [junit4]   2>   "operation":"state"} current state version: 3
   [junit4]   2> 449432 INFO  (OverseerStateUpdate-94212278792355843-127.0.0.1:34612_cts%2Fv-n_0000000000) [n:127.0.0.1:34612_cts%2Fv    ] o.a.s.c.o.ReplicaMutator Update state numShards=2 message={
   [junit4]   2>   "core":"collection1",
   [junit4]   2>   "roles":null,
   [junit4]   2>   "base_url":"http://127.0.0.1:41696/cts/v",
   [junit4]   2>   "node_name":"127.0.0.1:41696_cts%2Fv",
   [junit4]   2>   "numShards":"2",
   [junit4]   2>   "state":"down",
   [junit4]   2>   "shard":null,
   [junit4]   2>   "collection":"collection1",
   [junit4]   2>   "operation":"state"}
   [junit4]   2> 449432 INFO  (OverseerStateUpdate-94212278792355843-127.0.0.1:34612_cts%2Fv-n_0000000000) [n:127.0.0.1:34612_cts%2Fv    ] o.a.s.c.o.ClusterStateMutator building a new cName: collection1
   [junit4]   2> 449432 INFO  (OverseerStateUpdate-94212278792355843-127.0.0.1:34612_cts%2Fv-n_0000000000) [n:127.0.0.1:34612_cts%2Fv    ] o.a.s.c.o.ReplicaMutator Assigning new node to shard shard=shard2
   [junit4]   2> 449434 INFO  (TEST-HttpPartitionTest.test-seed#[9B3050AC664637AE]) [n:127.0.0.1:41696_cts%2Fv    ] o.a.s.s.SolrDispatchFilter user.dir=/home/jenkins/workspace/Lucene-Solr-5.x-Linux/solr/build/solr-core/test/J0
   [junit4]   2> 449435 INFO  (TEST-HttpPartitionTest.test-seed#[9B3050AC664637AE]) [n:127.0.0.1:41696_cts%2Fv    ] o.a.s.s.SolrDispatchFilter SolrDispatchFilter.init() done
   [junit4]   2> 449535 INFO  (zkCallback-343-thread-1) [    ] o.a.s.c.c.ZkStateReader A cluster state change: WatchedEvent state:SyncConnected type:NodeDataChanged path:/clusterstate.json, has occurred - updating... (live nodes size: 2)
   [junit4]   2> 449536 INFO  (zkCallback-346-thread-1-processing-n:127.0.0.1:41696_cts%2Fv) [n:127.0.0.1:41696_cts%2Fv    ] o.a.s.c.c.ZkStateReader A cluster state change: WatchedEvent state:SyncConnected type:NodeDataChanged path:/clusterstate.json, has occurred - updating... (live nodes size: 2)
   [junit4]   2> 449536 INFO  (zkCallback-341-thread-1-processing-n:127.0.0.1:34612_cts%2Fv) [n:127.0.0.1:34612_cts%2Fv    ] o.a.s.c.c.ZkStateReader A cluster state change: WatchedEvent state:SyncConnected type:NodeDataChanged path:/clusterstate.json, has occurred - updating... (live nodes size: 2)
   [junit4]   2> 449541 INFO  (zkCallback-346-thread-1-processing-n:127.0.0.1:41696_cts%2Fv) [n:127.0.0.1:41696_cts%2Fv    ] o.a.s.c.c.ZkStateReader Updated cluster state version to 4
   [junit4]   2> 449542 INFO  (zkCallback-343-thread-1) [    ] o.a.s.c.c.ZkStateReader Updated cluster state version to 4
   [junit4]   2> 449543 INFO  (zkCallback-341-thread-1-processing-n:127.0.0.1:34612_cts%2Fv) [n:127.0.0.1:34612_cts%2Fv    ] o.a.s.c.c.ZkStateReader Updated cluster state version to 4
   [junit4]   2> 450431 INFO  (coreLoadExecutor-1639-thread-1-processing-n:127.0.0.1:41696_cts%2Fv) [n:127.0.0.1:41696_cts%2Fv c:collection1   x:collection1] o.a.s.c.ZkController waiting to find shard id in clusterstate for collection1
   [junit4]   2> 450431 INFO  (coreLoadExecutor-1639-thread-1-processing-n:127.0.0.1:41696_cts%2Fv) [n:127.0.0.1:41696_cts%2Fv c:collection1   x:collection1] o.a.s.c.ZkController Check for collection zkNode:collection1
   [junit4]   2> 450432 INFO  (coreLoadExecutor-1639-thread-1-processing-n:127.0.0.1:41696_cts%2Fv) [n:127.0.0.1:41696_cts%2Fv c:collection1   x:collection1] o.a.s.c.ZkController Collection zkNode exists
   [junit4]   2> 450432 INFO  (coreLoadExecutor-1639-thread-1-processing-n:127.0.0.1:41696_cts%2Fv) [n:127.0.0.1:41696_cts%2Fv c:collection1   x:collection1] o.a.s.c.c.ZkStateReader Load collection config from:/collections/collection1
   [junit4]   2> 450432 INFO  (coreLoadExecutor-1639-thread-1-processing-n:127.0.0.1:41696_cts%2Fv) [n:127.0.0.1:41696_cts%2Fv c:collection1   x:collection1] o.a.s.c.c.ZkStateReader path=/collections/collection1 configName=conf1 specified config exists in ZooKeeper
   [junit4]   2> 450433 INFO  (coreLoadExecutor-1639-thread-1-processing-n:127.0.0.1:41696_cts%2Fv) [n:127.0.0.1:41696_cts%2Fv c:collection1   x:collection1] o.a.s.c.SolrResourceLoader new SolrResourceLoader for directory: '/home/jenkins/workspace/Lucene-Solr-5.x-Linux/solr/build/solr-core/test/J0/temp/solr.cloud.HttpPartitionTest_9B3050AC664637AE-001/shard-1-001/cores/collection1/'
   [junit4]   2> 450456 INFO  (coreLoadExecutor-1639-thread-1-processing-n:127.0.0.1:41696_cts%2Fv) [n:127.0.0.1:41696_cts%2Fv c:collection1   x:collection1] o.a.s.c.Config loaded config solrconfig.xml with version 0 
   [junit4]   2> 450462 INFO  (coreLoadExecutor-1639-thread-1-processing-n:127.0.0.1:41696_cts%2Fv) [n:127.0.0.1:41696_cts%2Fv c:collection1   x:collection1] o.a.s.c.SolrConfig current version of requestparams : -1
   [junit4]   2> 450467 INFO  (coreLoadExecutor-1639-thread-1-processing-n:127.0.0.1:41696_cts%2Fv) [n:127.0.0.1:41696_cts%2Fv c:collection1   x:collection1] o.a.s.c.SolrConfig Using Lucene MatchVersion: 5.3.0
   [junit4]   2> 450479 INFO  (coreLoadExecutor-1639-thread-1-processing-n:127.0.0.1:41696_cts%2Fv) [n:127.0.0.1:41696_cts%2Fv c:collection1   x:collection1] o.a.s.c.Config Loaded SolrConfig: solrconfig.xml
   [junit4]   2> 450480 INFO  (coreLoadExecutor-1639-thread-1-processing-n:127.0.0.1:41696_cts%2Fv) [n:127.0.0.1:41696_cts%2Fv c:collection1   x:collection1] o.a.s.s.IndexSchema Reading Solr Schema from /configs/conf1/schema.xml
   [junit4]   2> 450487 INFO  (coreLoadExecutor-1639-thread-1-processing-n:127.0.0.1:41696_cts%2Fv) [n:127.0.0.1:41696_cts%2Fv c:collection1   x:collection1] o.a.s.s.IndexSchema [collection1] Schema name=test
   [junit4]   2> 450602 INFO  (coreLoadExecutor-1639-thread-1-processing-n:127.0.0.1:41696_cts%2Fv) [n:127.0.0.1:41696_cts%2Fv c:collection1   x:collection1] o.a.s.s.OpenExchangeRatesOrgProvider Initialized with rates=open-exchange-rates.json, refreshInterval=1440.
   [junit4]   2> 450636 INFO  (coreLoadExecutor-1639-thread-1-processing-n:127.0.0.1:41696_cts%2Fv) [n:127.0.0.1:41696_cts%2Fv c:collection1   x:collection1] o.a.s.s.IndexSchema default search field in schema is text
   [junit4]   2> 450637 INFO  (coreLoadExecutor-1639-thread-1-processing-n:127.0.0.1:41696_cts%2Fv) [n:127.0.0.1:41696_cts%2Fv c:collection1   x:collection1] o.a.s.s.IndexSchema unique key field: id
   [junit4]   2> 450645 INFO  (coreLoadExecutor-1639-thread-1-processing-n:127.0.0.1:41696_cts%2Fv) [n:127.0.0.1:41696_cts%2Fv c:collection1   x:collection1] o.a.s.s.FileExchangeRateProvider Reloading exchange rates from file currency.xml
   [junit4]   2> 450647 INFO  (coreLoadExecutor-1639-thread-1-processing-n:127.0.0.1:41696_cts%2Fv) [n:127.0.0.1:41696_cts%2Fv c:collection1   x:collection1] o.a.s.s.FileExchangeRateProvider Reloading exchange rates from file currency.xml
   [junit4]   2> 450651 INFO  (coreLoadExecutor-1639-thread-1-processing-n:127.0.0.1:41696_cts%2Fv) [n:127.0.0.1:41696_cts%2Fv c:collection1   x:collection1] o.a.s.s.OpenExchangeRatesOrgProvider Reloading exchange rates from open-exchange-rates.json
   [junit4]   2> 450653 WARN  (coreLoadExecutor-1639-thread-1-processing-n:127.0.0.1:41696_cts%2Fv) [n:127.0.0.1:41696_cts%2Fv c:collection1   x:collection1] o.a.s.s.OpenExchangeRatesOrgProvider Unknown key IMPORTANT NOTE
   [junit4]   2> 450654 WARN  (coreLoadExecutor-1639-thread-1-processing-n:127.0.0.1:41696_cts%2Fv) [n:127.0.0.1:41696_cts%2Fv c:collection1   x:collection1] o.a.s.s.OpenExchangeRatesOrgProvider Expected key, got STRING
   [junit4]   2> 450654 INFO  (coreLoadExecutor-1639-thread-1-processing-n:127.0.0.1:41696_cts%2Fv) [n:127.0.0.1:41696_cts%2Fv c:collection1   x:collection1] o.a.s.s.OpenExchangeRatesOrgProvider Reloading exchange rates from open-exchange-rates.json
   [junit4]   2> 450654 WARN  (coreLoadExecutor-1639-thread-1-processing-n:127.0.0.1:41696_cts%2Fv) [n:127.0.0.1:41696_cts%2Fv c:collection1   x:collection1] o.a.s.s.OpenExchangeRatesOrgProvider Unknown key IMPORTANT NOTE
   [junit4]   2> 450654 WARN  (coreLoadExecutor-1639-thread-1-processing-n:127.0.0.1:41696_cts%2Fv) [n:127.0.0.1:41696_cts%2Fv c:collection1   x:collection1] o.a.s.s.OpenExchangeRatesOrgProvider Expected key, got STRING
   [junit4]   2> 450655 INFO  (coreLoadExecutor-1639-thread-1-processing-n:127.0.0.1:41696_cts%2Fv) [n:127.0.0.1:41696_cts%2Fv c:collection1   x:collection1] o.a.s.c.ConfigSetProperties Did not find ConfigSet properties
   [junit4]   2> org.apache.solr.core.SolrResourceNotFoundException: Can't find resource 'configsetprops.json' in classpath or '/configs/conf1', cwd=/home/jenkins/workspace/Lucene-Solr-5.x-Linux/solr/build/solr-core/test/J0
   [junit4]   2> 	at org.apache.solr.cloud.ZkSolrResourceLoader.openResource(ZkSolrResourceLoader.java:99)
   [junit4]   2> 	at org.apache.solr.core.ConfigSetProperties.readFromResourceLoader(ConfigSetProperties.java:49)
   [junit4]   2> 	at org.apache.solr.core.ConfigSetService.createConfigSetProperties(ConfigSetService.java:114)
   [junit4]   2> 	at org.apache.solr.core.ConfigSetService.getConfig(ConfigSetService.java:76)
   [junit4]   2> 	at org.apache.solr.core.CoreContainer.create(CoreContainer.java:667)
   [junit4]   2> 	at org.apache.solr.core.CoreContainer$1.call(CoreContainer.java:396)
   [junit4]   2> 	at org.apache.solr.core.CoreContainer$1.call(CoreContainer.java:387)
   [junit4]   2> 	at java.util.concurrent.FutureTask.run(FutureTask.java:266)
   [junit4]   2> 	at org.apache.solr.common.util.ExecutorUtil$MDCAwareThreadPoolExecutor$1.run(ExecutorUtil.java:156)
   [junit4]   2> 	at java.util.concurrent.ThreadPoolExecutor.runWorker(ThreadPoolExecutor.java:1142)
   [junit4]   2> 	at java.util.concurrent.ThreadPoolExecutor$Worker.run(ThreadPoolExecutor.java:617)
   [junit4]   2> 	at java.lang.Thread.run(Thread.java:745)
   [junit4]   2> 450655 INFO  (coreLoadExecutor-1639-thread-1-processing-n:127.0.0.1:41696_cts%2Fv) [n:127.0.0.1:41696_cts%2Fv c:collection1   x:collection1] o.a.s.c.CoreContainer Creating SolrCore 'collection1' using configuration from collection collection1
   [junit4]   2> 450655 INFO  (coreLoadExecutor-1639-thread-1-processing-n:127.0.0.1:41696_cts%2Fv) [n:127.0.0.1:41696_cts%2Fv c:collection1 s:shard2 r:core_node1 x:collection1] o.a.s.c.SolrCore org.apache.solr.core.MockDirectoryFactory
   [junit4]   2> 450655 INFO  (coreLoadExecutor-1639-thread-1-processing-n:127.0.0.1:41696_cts%2Fv) [n:127.0.0.1:41696_cts%2Fv c:collection1 s:shard2 r:core_node1 x:collection1] o.a.s.c.SolrCore [[collection1] ] Opening new SolrCore at [/home/jenkins/workspace/Lucene-Solr-5.x-Linux/solr/build/solr-core/test/J0/temp/solr.cloud.HttpPartitionTest_9B3050AC664637AE-001/shard-1-001/cores/collection1/], dataDir=[null]
   [junit4]   2> 450656 INFO  (coreLoadExecutor-1639-thread-1-processing-n:127.0.0.1:41696_cts%2Fv) [n:127.0.0.1:41696_cts%2Fv c:collection1 s:shard2 r:core_node1 x:collection1] o.a.s.c.JmxMonitoredMap JMX monitoring is enabled. Adding Solr mbeans to JMX Server: com.sun.jmx.mbeanserver.JmxMBeanServer@17908600
   [junit4]   2> 450656 INFO  (coreLoadExecutor-1639-thread-1-processing-n:127.0.0.1:41696_cts%2Fv) [n:127.0.0.1:41696_cts%2Fv c:collection1 s:shard2 r:core_node1 x:collection1] o.a.s.c.CachingDirectoryFactory return new directory for /home/jenkins/workspace/Lucene-Solr-5.x-Linux/solr/build/solr-core/test/J0/temp/solr.cloud.HttpPartitionTest_9B3050AC664637AE-001/shard-1-001/cores/collection1/data
   [junit4]   2> 450656 INFO  (coreLoadExecutor-1639-thread-1-processing-n:127.0.0.1:41696_cts%2Fv) [n:127.0.0.1:41696_cts%2Fv c:collection1 s:shard2 r:core_node1 x:collection1] o.a.s.c.SolrCore New index directory detected: old=null new=/home/jenkins/workspace/Lucene-Solr-5.x-Linux/solr/build/solr-core/test/J0/temp/solr.cloud.HttpPartitionTest_9B3050AC664637AE-001/shard-1-001/cores/collection1/data/index/
   [junit4]   2> 450656 WARN  (coreLoadExecutor-1639-thread-1-processing-n:127.0.0.1:41696_cts%2Fv) [n:127.0.0.1:41696_cts%2Fv c:collection1 s:shard2 r:core_node1 x:collection1] o.a.s.c.SolrCore [collection1] Solr index directory '/home/jenkins/workspace/Lucene-Solr-5.x-Linux/solr/build/solr-core/test/J0/temp/solr.cloud.HttpPartitionTest_9B3050AC664637AE-001/shard-1-001/cores/collection1/data/index' doesn't exist. Creating new index...
   [junit4]   2> 450657 INFO  (coreLoadExecutor-1639-thread-1-processing-n:127.0.0.1:41696_cts%2Fv) [n:127.0.0.1:41696_cts%2Fv c:collection1 s:shard2 r:core_node1 x:collection1] o.a.s.c.CachingDirectoryFactory return new directory for /home/jenkins/workspace/Lucene-Solr-5.x-Linux/solr/build/solr-core/test/J0/temp/solr.cloud.HttpPartitionTest_9B3050AC664637AE-001/shard-1-001/cores/collection1/data/index
   [junit4]   2> 450657 INFO  (coreLoadExecutor-1639-thread-1-processing-n:127.0.0.1:41696_cts%2Fv) [n:127.0.0.1:41696_cts%2Fv c:collection1 s:shard2 r:core_node1 x:collection1] o.a.s.u.RandomMergePolicy RandomMergePolicy wrapping class org.apache.lucene.index.LogByteSizeMergePolicy: [LogByteSizeMergePolicy: minMergeSize=1677721, mergeFactor=4, maxMergeSize=2147483648, maxMergeSizeForForcedMerge=9223372036854775807, calibrateSizeByDeletes=false, maxMergeDocs=2147483647, maxCFSSegmentSizeMB=8.796093022207999E12, noCFSRatio=0.31628564936638937]
   [junit4]   2> 450657 INFO  (coreLoadExecutor-1639-thread-1-processing-n:127.0.0.1:41696_cts%2Fv) [n:127.0.0.1:41696_cts%2Fv c:collection1 s:shard2 r:core_node1 x:collection1] o.a.s.c.SolrCore SolrDeletionPolicy.onCommit: commits: num=1
   [junit4]   2> 	commit{dir=MockDirectoryWrapper(RAMDirectory@433688f lockFactory=org.apache.lucene.store.SingleInstanceLockFactory@7886b2f8),segFN=segments_1,generation=1}
   [junit4]   2> 450658 INFO  (coreLoadExecutor-1639-thread-1-processing-n:127.0.0.1:41696_cts%2Fv) [n:127.0.0.1:41696_cts%2Fv c:collection1 s:shard2 r:core_node1 x:collection1] o.a.s.c.SolrCore newest commit generation = 1
   [junit4]   2> 450658 INFO  (OldIndexDirectoryCleanupThreadForCore-collection1) [n:127.0.0.1:41696_cts%2Fv c:collection1 s:shard2 r:core_node1 x:collection1] o.a.s.c.SolrCore Looking for old index directories to cleanup for core collection1 in /home/jenkins/workspace/Lucene-Solr-5.x-Linux/solr/build/solr-core/test/J0/temp/solr.cloud.HttpPartitionTest_9B3050AC664637AE-001/shard-1-001/cores/collection1/data/
   [junit4]   2> 450658 WARN  (OldIndexDirectoryCleanupThreadForCore-collection1) [n:127.0.0.1:41696_cts%2Fv c:collection1 s:shard2 r:core_node1 x:collection1] o.a.s.c.DirectoryFactory /home/jenkins/workspace/Lucene-Solr-5.x-Linux/solr/build/solr-core/test/J0/temp/solr.cloud.HttpPartitionTest_9B3050AC664637AE-001/shard-1-001/cores/collection1/data/ does not point to a valid data directory; skipping clean-up of old index directories.
   [junit4]   2> 450661 INFO  (coreLoadExecutor-1639-thread-1-processing-n:127.0.0.1:41696_cts%2Fv) [n:127.0.0.1:41696_cts%2Fv c:collection1 s:shard2 r:core_node1 x:collection1] o.a.s.u.p.UpdateRequestProcessorChain creating updateRequestProcessorChain "nodistrib"
   [junit4]   2> 450661 INFO  (coreLoadExecutor-1639-thread-1-processing-n:127.0.0.1:41696_cts%2Fv) [n:127.0.0.1:41696_cts%2Fv c:collection1 s:shard2 r:core_node1 x:collection1] o.a.s.u.p.UpdateRequestProcessorChain creating updateRequestProcessorChain "dedupe"
   [junit4]   2> 450661 INFO  (coreLoadExecutor-1639-thread-1-processing-n:127.0.0.1:41696_cts%2Fv) [n:127.0.0.1:41696_cts%2Fv c:collection1 s:shard2 r:core_node1 x:collection1] o.a.s.u.p.UpdateRequestProcessorChain inserting DistributedUpdateProcessorFactory into updateRequestProcessorChain "dedupe"
   [junit4]   2> 450661 INFO  (coreLoadExecutor-1639-thread-1-processing-n:127.0.0.1:41696_cts%2Fv) [n:127.0.0.1:41696_cts%2Fv c:collection1 s:shard2 r:core_node1 x:collection1] o.a.s.u.p.UpdateRequestProcessorChain creating updateRequestProcessorChain "stored_sig"
   [junit4]   2> 450661 INFO  (coreLoadExecutor-1639-thread-1-processing-n:127.0.0.1:41696_cts%2Fv) [n:127.0.0.1:41696_cts%2Fv c:collection1 s:shard2 r:core_node1 x:collection1] o.a.s.u.p.UpdateRequestProcessorChain inserting DistributedUpdateProcessorFactory into updateRequestProcessorChain "stored_sig"
   [junit4]   2> 450661 INFO  (coreLoadExecutor-1639-thread-1-processing-n:127.0.0.1:41696_cts%2Fv) [n:127.0.0.1:41696_cts%2Fv c:collection1 s:shard2 r:core_node1 x:collection1] o.a.s.u.p.UpdateRequestProcessorChain creating updateRequestProcessorChain "distrib-dup-test-chain-explicit"
   [junit4]   2> 450661 INFO  (coreLoadExecutor-1639-thread-1-processing-n:127.0.0.1:41696_cts%2Fv) [n:127.0.0.1:41696_cts%2Fv c:collection1 s:shard2 r:core_node1 x:collection1] o.a.s.u.p.UpdateRequestProcessorChain creating updateRequestProcessorChain "distrib-dup-test-chain-implicit"
   [junit4]   2> 450661 INFO  (coreLoadExecutor-1639-thread-1-processing-n:127.0.0.1:41696_cts%2Fv) [n:127.0.0.1:41696_cts%2Fv c:collection1 s:shard2 r:core_node1 x:collection1] o.a.s.u.p.UpdateRequestProcessorChain inserting DistributedUpdateProcessorFactory into updateRequestProcessorChain "distrib-dup-test-chain-implicit"
   [junit4]   2> 450662 INFO  (coreLoadExecutor-1639-thread-1-processing-n:127.0.0.1:41696_cts%2Fv) [n:127.0.0.1:41696_cts%2Fv c:collection1 s:shard2 r:core_node1 x:collection1] o.a.s.c.SolrCore no updateRequestProcessorChain defined as default, creating implicit default
   [junit4]   2> 450663 INFO  (coreLoadExecutor-1639-thread-1-processing-n:127.0.0.1:41696_cts%2Fv) [n:127.0.0.1:41696_cts%2Fv c:collection1 s:shard2 r:core_node1 x:collection1] o.a.s.h.l.XMLLoader xsltCacheLifetimeSeconds=60
   [junit4]  

[...truncated too long message...]

onTest.test-seed#[9B3050AC664637AE]) [n:127.0.0.1:53820_cts%2Fv c:c8n_1x2_leader_session_loss s:shard1 r:core_node2 x:c8n_1x2_leader_session_loss_shard1_replica1] o.a.s.c.SocketProxy Closing 3 connections to: http://127.0.0.1:34612/cts/v, target: http://127.0.0.1:41139/cts/v
   [junit4]   2> 579891 INFO  (SUITE-HttpPartitionTest-seed#[9B3050AC664637AE]-worker) [n:127.0.0.1:53820_cts%2Fv c:c8n_1x2_leader_session_loss s:shard1 r:core_node2 x:c8n_1x2_leader_session_loss_shard1_replica1] o.a.s.SolrTestCaseJ4 ###deleteCore
   [junit4]   2> ObjectTracker found 1 object(s) that were not released!!! [TransactionLog]
   [junit4]   2> org.apache.solr.common.util.ObjectReleaseTracker$ObjectTrackerException
   [junit4]   2> 	at org.apache.solr.common.util.ObjectReleaseTracker.track(ObjectReleaseTracker.java:34)
   [junit4]   2> 	at org.apache.solr.update.TransactionLog.<init>(TransactionLog.java:183)
   [junit4]   2> 	at org.apache.solr.update.TransactionLog.<init>(TransactionLog.java:141)
   [junit4]   2> 	at org.apache.solr.update.UpdateLog.ensureLog(UpdateLog.java:863)
   [junit4]   2> 	at org.apache.solr.update.UpdateLog.add(UpdateLog.java:424)
   [junit4]   2> 	at org.apache.solr.update.UpdateLog.add(UpdateLog.java:410)
   [junit4]   2> 	at org.apache.solr.update.DirectUpdateHandler2.addDoc0(DirectUpdateHandler2.java:258)
   [junit4]   2> 	at org.apache.solr.update.DirectUpdateHandler2.addDoc(DirectUpdateHandler2.java:163)
   [junit4]   2> 	at org.apache.solr.update.processor.RunUpdateProcessor.processAdd(RunUpdateProcessorFactory.java:69)
   [junit4]   2> 	at org.apache.solr.update.processor.UpdateRequestProcessor.processAdd(UpdateRequestProcessor.java:51)
   [junit4]   2> 	at org.apache.solr.update.processor.DistributedUpdateProcessor.doLocalAdd(DistributedUpdateProcessor.java:955)
   [junit4]   2> 	at org.apache.solr.update.processor.DistributedUpdateProcessor.versionAdd(DistributedUpdateProcessor.java:1110)
   [junit4]   2> 	at org.apache.solr.update.processor.DistributedUpdateProcessor.processAdd(DistributedUpdateProcessor.java:706)
   [junit4]   2> 	at org.apache.solr.update.processor.LogUpdateProcessor.processAdd(LogUpdateProcessorFactory.java:104)
   [junit4]   2> 	at org.apache.solr.handler.loader.JavabinLoader$1.update(JavabinLoader.java:101)
   [junit4]   2> 	at org.apache.solr.client.solrj.request.JavaBinUpdateRequestCodec$1.readOuterMostDocIterator(JavaBinUpdateRequestCodec.java:179)
   [junit4]   2> 	at org.apache.solr.client.solrj.request.JavaBinUpdateRequestCodec$1.readIterator(JavaBinUpdateRequestCodec.java:135)
   [junit4]   2> 	at org.apache.solr.common.util.JavaBinCodec.readVal(JavaBinCodec.java:249)
   [junit4]   2> 	at org.apache.solr.client.solrj.request.JavaBinUpdateRequestCodec$1.readNamedList(JavaBinUpdateRequestCodec.java:121)
   [junit4]   2> 	at org.apache.solr.common.util.JavaBinCodec.readVal(JavaBinCodec.java:214)
   [junit4]   2> 	at org.apache.solr.common.util.JavaBinCodec.unmarshal(JavaBinCodec.java:134)
   [junit4]   2> 	at org.apache.solr.client.solrj.request.JavaBinUpdateRequestCodec.unmarshal(JavaBinUpdateRequestCodec.java:186)
   [junit4]   2> 	at org.apache.solr.handler.loader.JavabinLoader.parseAndLoadDocs(JavabinLoader.java:111)
   [junit4]   2> 	at org.apache.solr.handler.loader.JavabinLoader.load(JavabinLoader.java:58)
   [junit4]   2> 	at org.apache.solr.handler.UpdateRequestHandler$1.load(UpdateRequestHandler.java:98)
   [junit4]   2> 	at org.apache.solr.handler.ContentStreamHandlerBase.handleRequestBody(ContentStreamHandlerBase.java:74)
   [junit4]   2> 	at org.apache.solr.handler.RequestHandlerBase.handleRequest(RequestHandlerBase.java:143)
   [junit4]   2> 	at org.apache.solr.core.SolrCore.execute(SolrCore.java:2068)
   [junit4]   2> 	at org.apache.solr.servlet.HttpSolrCall.execute(HttpSolrCall.java:649)
   [junit4]   2> 	at org.apache.solr.servlet.HttpSolrCall.call(HttpSolrCall.java:453)
   [junit4]   2> 	at org.apache.solr.servlet.SolrDispatchFilter.doFilter(SolrDispatchFilter.java:227)
   [junit4]   2> 	at org.apache.solr.servlet.SolrDispatchFilter.doFilter(SolrDispatchFilter.java:196)
   [junit4]   2> 	at org.eclipse.jetty.servlet.ServletHandler$CachedChain.doFilter(ServletHandler.java:1652)
   [junit4]   2> 	at org.apache.solr.client.solrj.embedded.JettySolrRunner$DebugFilter.doFilter(JettySolrRunner.java:106)
   [junit4]   2> 	at org.eclipse.jetty.servlet.ServletHandler$CachedChain.doFilter(ServletHandler.java:1652)
   [junit4]   2> 	at org.eclipse.jetty.servlets.UserAgentFilter.doFilter(UserAgentFilter.java:83)
   [junit4]   2> 	at org.eclipse.jetty.servlets.GzipFilter.doFilter(GzipFilter.java:300)
   [junit4]   2> 	at org.eclipse.jetty.servlet.ServletHandler$CachedChain.doFilter(ServletHandler.java:1652)
   [junit4]   2> 	at org.eclipse.jetty.servlet.ServletHandler.doHandle(ServletHandler.java:585)
   [junit4]   2> 	at org.eclipse.jetty.server.session.SessionHandler.doHandle(SessionHandler.java:221)
   [junit4]   2> 	at org.eclipse.jetty.server.handler.ContextHandler.doHandle(ContextHandler.java:1127)
   [junit4]   2> 	at org.eclipse.jetty.servlet.ServletHandler.doScope(ServletHandler.java:515)
   [junit4]   2> 	at org.eclipse.jetty.server.session.SessionHandler.doScope(SessionHandler.java:185)
   [junit4]   2> 	at org.eclipse.jetty.server.handler.ContextHandler.doScope(ContextHandler.java:1061)
   [junit4]   2> 	at org.eclipse.jetty.server.handler.ScopedHandler.handle(ScopedHandler.java:141)
   [junit4]   2> 	at org.eclipse.jetty.server.handler.HandlerWrapper.handle(HandlerWrapper.java:97)
   [junit4]   2> 	at org.eclipse.jetty.server.Server.handle(Server.java:499)
   [junit4]   2> 	at org.eclipse.jetty.server.HttpChannel.handle(HttpChannel.java:310)
   [junit4]   2> 	at org.eclipse.jetty.server.HttpConnection.onFillable(HttpConnection.java:257)
   [junit4]   2> 	at org.eclipse.jetty.io.AbstractConnection$2.run(AbstractConnection.java:540)
   [junit4]   2> 	at org.eclipse.jetty.util.thread.QueuedThreadPool.runJob(QueuedThreadPool.java:635)
   [junit4]   2> 	at org.eclipse.jetty.util.thread.QueuedThreadPool$3.run(QueuedThreadPool.java:555)
   [junit4]   2> 	at java.lang.Thread.run(Thread.java:745)
   [junit4]   2> 
   [junit4]   2> Jul 22, 2015 11:43:42 AM com.carrotsearch.randomizedtesting.ThreadLeakControl checkThreadLeaks
   [junit4]   2> WARNING: Will linger awaiting termination of 2 leaked thread(s).
   [junit4]   2> NOTE: test params are: codec=Asserting(Lucene53): {range_facet_l_dv=PostingsFormat(name=Asserting), _version_=PostingsFormat(name=MockRandom), multiDefault=FSTOrd50, a_t=FSTOrd50, intDefault=PostingsFormat(name=MockRandom), id=PostingsFormat(name=Asserting), range_facet_i_dv=FSTOrd50, text=Lucene50(blocksize=128), range_facet_l=FSTOrd50, timestamp=FSTOrd50}, docValues:{range_facet_l_dv=DocValuesFormat(name=Lucene50), range_facet_i_dv=DocValuesFormat(name=Direct), timestamp=DocValuesFormat(name=Direct)}, sim=RandomSimilarityProvider(queryNorm=false,coord=no): {}, locale=ru_RU, timezone=America/Nome
   [junit4]   2> NOTE: Linux 3.16.0-43-generic amd64/Oracle Corporation 1.8.0_60-ea (64-bit)/cpus=12,threads=1,free=368567640,total=515899392
   [junit4]   2> NOTE: All tests run in this JVM: [TestConfig, TestSearcherReuse, TestReqParamsAPI, RemoteQueryErrorTest, TestIntervalFaceting, StandardRequestHandlerTest, DeleteLastCustomShardedReplicaTest, TestPhraseSuggestions, SuggesterFSTTest, SimpleCollectionCreateDeleteTest, RankQueryTest, HdfsNNFailoverTest, TestSolrDeletionPolicy1, CollectionTooManyReplicasTest, TestReplicationHandler, SimplePostToolTest, HdfsThreadLeakTest, HdfsBasicDistributedZkTest, DeleteShardTest, TestNoOpRegenerator, TermsComponentTest, ExternalFileFieldSortTest, TestRestManager, TestInitParams, TestRandomRequestDistribution, SyncSliceTest, RulesTest, TestBulkSchemaAPI, MinimalSchemaTest, TermVectorComponentTest, TimeZoneUtilsTest, TestShortCircuitedRequests, SolrCoreTest, TestImplicitCoreProperties, TestBinaryField, HttpPartitionTest]
   [junit4]   2> NOTE: reproduce with: ant test  -Dtestcase=HttpPartitionTest -Dtests.seed=9B3050AC664637AE -Dtests.multiplier=3 -Dtests.slow=true -Dtests.locale=ru_RU -Dtests.timezone=America/Nome -Dtests.asserts=true -Dtests.file.encoding=ISO-8859-1
   [junit4] ERROR   0.00s J0 | HttpPartitionTest (suite) <<<
   [junit4]    > Throwable #1: java.lang.AssertionError: ObjectTracker found 1 object(s) that were not released!!! [TransactionLog]
   [junit4]    > 	at __randomizedtesting.SeedInfo.seed([9B3050AC664637AE]:0)
   [junit4]    > 	at org.apache.solr.SolrTestCaseJ4.afterClass(SolrTestCaseJ4.java:235)
   [junit4]    > 	at java.lang.Thread.run(Thread.java:745)
   [junit4] Completed [181/518] on J0 in 134.06s, 1 test, 1 failure <<< FAILURES!

[...truncated 1056 lines...]
BUILD FAILED
/home/jenkins/workspace/Lucene-Solr-5.x-Linux/build.xml:536: The following error occurred while executing this line:
/home/jenkins/workspace/Lucene-Solr-5.x-Linux/build.xml:484: The following error occurred while executing this line:
/home/jenkins/workspace/Lucene-Solr-5.x-Linux/build.xml:61: The following error occurred while executing this line:
/home/jenkins/workspace/Lucene-Solr-5.x-Linux/extra-targets.xml:39: The following error occurred while executing this line:
/home/jenkins/workspace/Lucene-Solr-5.x-Linux/solr/build.xml:230: The following error occurred while executing this line:
/home/jenkins/workspace/Lucene-Solr-5.x-Linux/solr/common-build.xml:512: The following error occurred while executing this line:
/home/jenkins/workspace/Lucene-Solr-5.x-Linux/lucene/common-build.xml:1444: The following error occurred while executing this line:
/home/jenkins/workspace/Lucene-Solr-5.x-Linux/lucene/common-build.xml:999: There were test failures: 518 suites, 2055 tests, 1 suite-level error, 60 ignored (26 assumptions)

Total time: 47 minutes 45 seconds
Build step 'Invoke Ant' marked build as failure
Archiving artifacts
Recording test results
Email was triggered for: Failure - Any
Sending email for trigger: Failure - Any



Mime
View raw message