lucene-dev mailing list archives

Site index · List index
Message view « Date » · « Thread »
Top « Date » · « Thread »
From Policeman Jenkins Server <jenk...@thetaphi.de>
Subject [JENKINS] Lucene-Solr-trunk-Windows (64bit/jdk1.8.0_45) - Build # 5018 - Still Failing!
Date Fri, 10 Jul 2015 22:45:45 GMT
Build: http://jenkins.thetaphi.de/job/Lucene-Solr-trunk-Windows/5018/
Java: 64bit/jdk1.8.0_45 -XX:-UseCompressedOops -XX:+UseG1GC

1 tests failed.
FAILED:  org.apache.solr.client.solrj.impl.CloudSolrClientTest.test

Error Message:
There should be 3 documents because there should be two id=1 docs due to overwrite=false expected:<3> but was:<1>

Stack Trace:
java.lang.AssertionError: There should be 3 documents because there should be two id=1 docs due to overwrite=false expected:<3> but was:<1>
	at __randomizedtesting.SeedInfo.seed([7DE71572C4ABE1F1:F5B32AA86A578C09]:0)
	at org.junit.Assert.fail(Assert.java:93)
	at org.junit.Assert.failNotEquals(Assert.java:647)
	at org.junit.Assert.assertEquals(Assert.java:128)
	at org.junit.Assert.assertEquals(Assert.java:472)
	at org.apache.solr.client.solrj.impl.CloudSolrClientTest.testOverwriteOption(CloudSolrClientTest.java:160)
	at org.apache.solr.client.solrj.impl.CloudSolrClientTest.test(CloudSolrClientTest.java:118)
	at sun.reflect.NativeMethodAccessorImpl.invoke0(Native Method)
	at sun.reflect.NativeMethodAccessorImpl.invoke(NativeMethodAccessorImpl.java:62)
	at sun.reflect.DelegatingMethodAccessorImpl.invoke(DelegatingMethodAccessorImpl.java:43)
	at java.lang.reflect.Method.invoke(Method.java:497)
	at com.carrotsearch.randomizedtesting.RandomizedRunner.invoke(RandomizedRunner.java:1627)
	at com.carrotsearch.randomizedtesting.RandomizedRunner$6.evaluate(RandomizedRunner.java:836)
	at com.carrotsearch.randomizedtesting.RandomizedRunner$7.evaluate(RandomizedRunner.java:872)
	at com.carrotsearch.randomizedtesting.RandomizedRunner$8.evaluate(RandomizedRunner.java:886)
	at org.junit.rules.ExpectedException$ExpectedExceptionStatement.evaluate(ExpectedException.java:110)
	at org.apache.solr.BaseDistributedSearchTestCase$ShardsRepeatRule$ShardsFixedStatement.callStatement(BaseDistributedSearchTestCase.java:960)
	at org.apache.solr.BaseDistributedSearchTestCase$ShardsRepeatRule$ShardsStatement.evaluate(BaseDistributedSearchTestCase.java:935)
	at com.carrotsearch.randomizedtesting.rules.SystemPropertiesRestoreRule$1.evaluate(SystemPropertiesRestoreRule.java:57)
	at org.apache.lucene.util.TestRuleSetupTeardownChained$1.evaluate(TestRuleSetupTeardownChained.java:50)
	at org.apache.lucene.util.AbstractBeforeAfterRule$1.evaluate(AbstractBeforeAfterRule.java:46)
	at org.apache.lucene.util.TestRuleThreadAndTestName$1.evaluate(TestRuleThreadAndTestName.java:49)
	at org.apache.lucene.util.TestRuleIgnoreAfterMaxFailures$1.evaluate(TestRuleIgnoreAfterMaxFailures.java:65)
	at org.apache.lucene.util.TestRuleMarkFailure$1.evaluate(TestRuleMarkFailure.java:48)
	at com.carrotsearch.randomizedtesting.rules.StatementAdapter.evaluate(StatementAdapter.java:36)
	at com.carrotsearch.randomizedtesting.ThreadLeakControl$StatementRunner.run(ThreadLeakControl.java:365)
	at com.carrotsearch.randomizedtesting.ThreadLeakControl.forkTimeoutingTask(ThreadLeakControl.java:798)
	at com.carrotsearch.randomizedtesting.ThreadLeakControl$3.evaluate(ThreadLeakControl.java:458)
	at com.carrotsearch.randomizedtesting.RandomizedRunner.runSingleTest(RandomizedRunner.java:845)
	at com.carrotsearch.randomizedtesting.RandomizedRunner$3.evaluate(RandomizedRunner.java:747)
	at com.carrotsearch.randomizedtesting.RandomizedRunner$4.evaluate(RandomizedRunner.java:781)
	at com.carrotsearch.randomizedtesting.RandomizedRunner$5.evaluate(RandomizedRunner.java:792)
	at com.carrotsearch.randomizedtesting.rules.StatementAdapter.evaluate(StatementAdapter.java:36)
	at com.carrotsearch.randomizedtesting.rules.SystemPropertiesRestoreRule$1.evaluate(SystemPropertiesRestoreRule.java:57)
	at org.apache.lucene.util.AbstractBeforeAfterRule$1.evaluate(AbstractBeforeAfterRule.java:46)
	at com.carrotsearch.randomizedtesting.rules.StatementAdapter.evaluate(StatementAdapter.java:36)
	at org.apache.lucene.util.TestRuleStoreClassName$1.evaluate(TestRuleStoreClassName.java:42)
	at com.carrotsearch.randomizedtesting.rules.NoShadowingOrOverridesOnMethodsRule$1.evaluate(NoShadowingOrOverridesOnMethodsRule.java:39)
	at com.carrotsearch.randomizedtesting.rules.NoShadowingOrOverridesOnMethodsRule$1.evaluate(NoShadowingOrOverridesOnMethodsRule.java:39)
	at com.carrotsearch.randomizedtesting.rules.StatementAdapter.evaluate(StatementAdapter.java:36)
	at com.carrotsearch.randomizedtesting.rules.StatementAdapter.evaluate(StatementAdapter.java:36)
	at com.carrotsearch.randomizedtesting.rules.StatementAdapter.evaluate(StatementAdapter.java:36)
	at org.apache.lucene.util.TestRuleAssertionsRequired$1.evaluate(TestRuleAssertionsRequired.java:54)
	at org.apache.lucene.util.TestRuleMarkFailure$1.evaluate(TestRuleMarkFailure.java:48)
	at org.apache.lucene.util.TestRuleIgnoreAfterMaxFailures$1.evaluate(TestRuleIgnoreAfterMaxFailures.java:65)
	at org.apache.lucene.util.TestRuleIgnoreTestSuites$1.evaluate(TestRuleIgnoreTestSuites.java:55)
	at com.carrotsearch.randomizedtesting.rules.StatementAdapter.evaluate(StatementAdapter.java:36)
	at com.carrotsearch.randomizedtesting.ThreadLeakControl$StatementRunner.run(ThreadLeakControl.java:365)
	at java.lang.Thread.run(Thread.java:745)




Build Log:
[...truncated 11278 lines...]
   [junit4] Suite: org.apache.solr.client.solrj.impl.CloudSolrClientTest
   [junit4]   2> Creating dataDir: C:\Users\JenkinsSlave\workspace\Lucene-Solr-trunk-Windows\solr\build\solr-solrj\test\J1\temp\solr.client.solrj.impl.CloudSolrClientTest_7DE71572C4ABE1F1-001\init-core-data-001
   [junit4]   2> 43652 INFO  (SUITE-CloudSolrClientTest-seed#[7DE71572C4ABE1F1]-worker) [    ] o.a.s.SolrTestCaseJ4 Randomized ssl (false) and clientAuth (false)
   [junit4]   2> 43652 INFO  (SUITE-CloudSolrClientTest-seed#[7DE71572C4ABE1F1]-worker) [    ] o.a.s.BaseDistributedSearchTestCase Setting hostContext system property: /
   [junit4]   2> 43664 WARN  (SUITE-CloudSolrClientTest-seed#[7DE71572C4ABE1F1]-worker) [    ] o.a.s.c.AbstractZkTestCase TEST_HOME() does not exist - solrj test?
   [junit4]   2> 43754 INFO  (TEST-CloudSolrClientTest.testShutdown-seed#[7DE71572C4ABE1F1]) [    ] o.a.s.c.ZkTestServer STARTING ZK TEST SERVER
   [junit4]   2> 43757 INFO  (Thread-40) [    ] o.a.s.c.ZkTestServer client port:0.0.0.0/0.0.0.0:0
   [junit4]   2> 43758 INFO  (Thread-40) [    ] o.a.s.c.ZkTestServer Starting server
   [junit4]   2> 43936 INFO  (TEST-CloudSolrClientTest.testShutdown-seed#[7DE71572C4ABE1F1]) [    ] o.a.s.c.ZkTestServer start zk server on port:59869
   [junit4]   2> 44009 INFO  (TEST-CloudSolrClientTest.testShutdown-seed#[7DE71572C4ABE1F1]) [    ] o.a.s.c.c.SolrZkClient Using default ZkCredentialsProvider
   [junit4]   2> 44131 INFO  (TEST-CloudSolrClientTest.testShutdown-seed#[7DE71572C4ABE1F1]) [    ] o.a.s.c.c.ConnectionManager Waiting for client to connect to ZooKeeper
   [junit4]   2> 44194 INFO  (zkCallback-6-thread-1) [    ] o.a.s.c.c.ConnectionManager Watcher org.apache.solr.common.cloud.ConnectionManager@77ec8c94 name:ZooKeeperConnection Watcher:127.0.0.1:59869 got event WatchedEvent state:SyncConnected type:None path:null path:null type:None
   [junit4]   2> 44195 INFO  (TEST-CloudSolrClientTest.testShutdown-seed#[7DE71572C4ABE1F1]) [    ] o.a.s.c.c.ConnectionManager Client is connected to ZooKeeper
   [junit4]   2> 44195 INFO  (TEST-CloudSolrClientTest.testShutdown-seed#[7DE71572C4ABE1F1]) [    ] o.a.s.c.c.SolrZkClient Using default ZkACLProvider
   [junit4]   2> 44202 INFO  (TEST-CloudSolrClientTest.testShutdown-seed#[7DE71572C4ABE1F1]) [    ] o.a.s.c.c.SolrZkClient makePath: /solr
   [junit4]   2> 44270 INFO  (TEST-CloudSolrClientTest.testShutdown-seed#[7DE71572C4ABE1F1]) [    ] o.a.s.c.c.SolrZkClient Using default ZkCredentialsProvider
   [junit4]   2> 44271 INFO  (TEST-CloudSolrClientTest.testShutdown-seed#[7DE71572C4ABE1F1]) [    ] o.a.s.c.c.ConnectionManager Waiting for client to connect to ZooKeeper
   [junit4]   2> 44275 INFO  (zkCallback-7-thread-1) [    ] o.a.s.c.c.ConnectionManager Watcher org.apache.solr.common.cloud.ConnectionManager@1b82febb name:ZooKeeperConnection Watcher:127.0.0.1:59869/solr got event WatchedEvent state:SyncConnected type:None path:null path:null type:None
   [junit4]   2> 44275 INFO  (TEST-CloudSolrClientTest.testShutdown-seed#[7DE71572C4ABE1F1]) [    ] o.a.s.c.c.ConnectionManager Client is connected to ZooKeeper
   [junit4]   2> 44276 INFO  (TEST-CloudSolrClientTest.testShutdown-seed#[7DE71572C4ABE1F1]) [    ] o.a.s.c.c.SolrZkClient Using default ZkACLProvider
   [junit4]   2> 44283 INFO  (TEST-CloudSolrClientTest.testShutdown-seed#[7DE71572C4ABE1F1]) [    ] o.a.s.c.c.SolrZkClient makePath: /collections/collection1
   [junit4]   2> 44289 INFO  (TEST-CloudSolrClientTest.testShutdown-seed#[7DE71572C4ABE1F1]) [    ] o.a.s.c.c.SolrZkClient makePath: /collections/collection1/shards
   [junit4]   2> 44292 INFO  (TEST-CloudSolrClientTest.testShutdown-seed#[7DE71572C4ABE1F1]) [    ] o.a.s.c.c.SolrZkClient makePath: /collections/control_collection
   [junit4]   2> 44295 INFO  (TEST-CloudSolrClientTest.testShutdown-seed#[7DE71572C4ABE1F1]) [    ] o.a.s.c.c.SolrZkClient makePath: /collections/control_collection/shards
   [junit4]   2> 44302 INFO  (TEST-CloudSolrClientTest.testShutdown-seed#[7DE71572C4ABE1F1]) [    ] o.a.s.c.AbstractZkTestCase put C:\Users\JenkinsSlave\workspace\Lucene-Solr-trunk-Windows\solr\solrj\src\test-files\solrj\solr\collection1\conf\solrconfig.xml to /configs/conf1/solrconfig.xml
   [junit4]   2> 44303 INFO  (TEST-CloudSolrClientTest.testShutdown-seed#[7DE71572C4ABE1F1]) [    ] o.a.s.c.c.SolrZkClient makePath: /configs/conf1/solrconfig.xml
   [junit4]   2> 44310 INFO  (TEST-CloudSolrClientTest.testShutdown-seed#[7DE71572C4ABE1F1]) [    ] o.a.s.c.AbstractZkTestCase put C:\Users\JenkinsSlave\workspace\Lucene-Solr-trunk-Windows\solr\solrj\src\test-files\solrj\solr\collection1\conf\schema.xml to /configs/conf1/schema.xml
   [junit4]   2> 44312 INFO  (TEST-CloudSolrClientTest.testShutdown-seed#[7DE71572C4ABE1F1]) [    ] o.a.s.c.c.SolrZkClient makePath: /configs/conf1/schema.xml
   [junit4]   2> 44317 INFO  (TEST-CloudSolrClientTest.testShutdown-seed#[7DE71572C4ABE1F1]) [    ] o.a.s.c.AbstractZkTestCase skipping C:\Users\JenkinsSlave\workspace\Lucene-Solr-trunk-Windows\solr\solrj\src\test-files\solrj\solr\collection1\conf\solrconfig.snippet.randomindexconfig.xml because it doesn't exist
   [junit4]   2> 44317 INFO  (TEST-CloudSolrClientTest.testShutdown-seed#[7DE71572C4ABE1F1]) [    ] o.a.s.c.AbstractZkTestCase skipping C:\Users\JenkinsSlave\workspace\Lucene-Solr-trunk-Windows\solr\solrj\src\test-files\solrj\solr\collection1\conf\stopwords.txt because it doesn't exist
   [junit4]   2> 44317 INFO  (TEST-CloudSolrClientTest.testShutdown-seed#[7DE71572C4ABE1F1]) [    ] o.a.s.c.AbstractZkTestCase skipping C:\Users\JenkinsSlave\workspace\Lucene-Solr-trunk-Windows\solr\solrj\src\test-files\solrj\solr\collection1\conf\protwords.txt because it doesn't exist
   [junit4]   2> 44317 INFO  (TEST-CloudSolrClientTest.testShutdown-seed#[7DE71572C4ABE1F1]) [    ] o.a.s.c.AbstractZkTestCase skipping C:\Users\JenkinsSlave\workspace\Lucene-Solr-trunk-Windows\solr\solrj\src\test-files\solrj\solr\collection1\conf\currency.xml because it doesn't exist
   [junit4]   2> 44317 INFO  (TEST-CloudSolrClientTest.testShutdown-seed#[7DE71572C4ABE1F1]) [    ] o.a.s.c.AbstractZkTestCase skipping C:\Users\JenkinsSlave\workspace\Lucene-Solr-trunk-Windows\solr\solrj\src\test-files\solrj\solr\collection1\conf\enumsConfig.xml because it doesn't exist
   [junit4]   2> 44317 INFO  (TEST-CloudSolrClientTest.testShutdown-seed#[7DE71572C4ABE1F1]) [    ] o.a.s.c.AbstractZkTestCase skipping C:\Users\JenkinsSlave\workspace\Lucene-Solr-trunk-Windows\solr\solrj\src\test-files\solrj\solr\collection1\conf\open-exchange-rates.json because it doesn't exist
   [junit4]   2> 44317 INFO  (TEST-CloudSolrClientTest.testShutdown-seed#[7DE71572C4ABE1F1]) [    ] o.a.s.c.AbstractZkTestCase skipping C:\Users\JenkinsSlave\workspace\Lucene-Solr-trunk-Windows\solr\solrj\src\test-files\solrj\solr\collection1\conf\mapping-ISOLatin1Accent.txt because it doesn't exist
   [junit4]   2> 44318 INFO  (TEST-CloudSolrClientTest.testShutdown-seed#[7DE71572C4ABE1F1]) [    ] o.a.s.c.AbstractZkTestCase skipping C:\Users\JenkinsSlave\workspace\Lucene-Solr-trunk-Windows\solr\solrj\src\test-files\solrj\solr\collection1\conf\old_synonyms.txt because it doesn't exist
   [junit4]   2> 44318 INFO  (TEST-CloudSolrClientTest.testShutdown-seed#[7DE71572C4ABE1F1]) [    ] o.a.s.c.AbstractZkTestCase skipping C:\Users\JenkinsSlave\workspace\Lucene-Solr-trunk-Windows\solr\solrj\src\test-files\solrj\solr\collection1\conf\synonyms.txt because it doesn't exist
   [junit4]   2> 44391 INFO  (TEST-CloudSolrClientTest.testShutdown-seed#[7DE71572C4ABE1F1]) [    ] o.a.s.SolrTestCaseJ4 Writing core.properties file to C:\Users\JenkinsSlave\workspace\Lucene-Solr-trunk-Windows\solr\build\solr-solrj\test\J1\temp\solr.client.solrj.impl.CloudSolrClientTest_7DE71572C4ABE1F1-001\control-001\cores\collection1
   [junit4]   2> 44395 INFO  (TEST-CloudSolrClientTest.testShutdown-seed#[7DE71572C4ABE1F1]) [    ] o.e.j.s.Server jetty-9.2.11.v20150529
   [junit4]   2> 44398 INFO  (TEST-CloudSolrClientTest.testShutdown-seed#[7DE71572C4ABE1F1]) [    ] o.e.j.s.h.ContextHandler Started o.e.j.s.ServletContextHandler@5b531d79{/,null,AVAILABLE}
   [junit4]   2> 44406 INFO  (TEST-CloudSolrClientTest.testShutdown-seed#[7DE71572C4ABE1F1]) [    ] o.e.j.s.ServerConnector Started ServerConnector@5aeb86a5{HTTP/1.1}{127.0.0.1:59876}
   [junit4]   2> 44407 INFO  (TEST-CloudSolrClientTest.testShutdown-seed#[7DE71572C4ABE1F1]) [    ] o.e.j.s.Server Started @46299ms
   [junit4]   2> 44407 INFO  (TEST-CloudSolrClientTest.testShutdown-seed#[7DE71572C4ABE1F1]) [    ] o.a.s.c.s.e.JettySolrRunner Jetty properties: {solr.data.dir=C:\Users\JenkinsSlave\workspace\Lucene-Solr-trunk-Windows\solr\build\solr-solrj\test\J1\temp\solr.client.solrj.impl.CloudSolrClientTest_7DE71572C4ABE1F1-001\tempDir-001/control/data, hostContext=/, hostPort=59876, coreRootDirectory=C:\Users\JenkinsSlave\workspace\Lucene-Solr-trunk-Windows\solr\build\solr-solrj\test\J1\..\..\..\..\..\..\..\..\..\Users\JenkinsSlave\workspace\Lucene-Solr-trunk-Windows\solr\build\solr-solrj\test\J1\temp\solr.client.solrj.impl.CloudSolrClientTest_7DE71572C4ABE1F1-001\control-001\cores}
   [junit4]   2> 44407 INFO  (TEST-CloudSolrClientTest.testShutdown-seed#[7DE71572C4ABE1F1]) [    ] o.a.s.s.SolrDispatchFilter SolrDispatchFilter.init(): sun.misc.Launcher$AppClassLoader@659e0bfd
   [junit4]   2> 44407 INFO  (TEST-CloudSolrClientTest.testShutdown-seed#[7DE71572C4ABE1F1]) [    ] o.a.s.c.SolrResourceLoader new SolrResourceLoader for directory: 'C:\Users\JenkinsSlave\workspace\Lucene-Solr-trunk-Windows\solr\build\solr-solrj\test\J1\..\..\..\..\..\..\..\..\..\Users\JenkinsSlave\workspace\Lucene-Solr-trunk-Windows\solr\build\solr-solrj\test\J1\temp\solr.client.solrj.impl.CloudSolrClientTest_7DE71572C4ABE1F1-001\control-001\'
   [junit4]   2> 44432 INFO  (TEST-CloudSolrClientTest.testShutdown-seed#[7DE71572C4ABE1F1]) [    ] o.a.s.c.SolrXmlConfig Loading container configuration from C:\Users\JenkinsSlave\workspace\Lucene-Solr-trunk-Windows\solr\build\solr-solrj\test\J1\..\..\..\..\..\..\..\..\..\Users\JenkinsSlave\workspace\Lucene-Solr-trunk-Windows\solr\build\solr-solrj\test\J1\temp\solr.client.solrj.impl.CloudSolrClientTest_7DE71572C4ABE1F1-001\control-001\solr.xml
   [junit4]   2> 44444 INFO  (TEST-CloudSolrClientTest.testShutdown-seed#[7DE71572C4ABE1F1]) [    ] o.a.s.c.CoresLocator Config-defined core root directory: C:\Users\JenkinsSlave\workspace\Lucene-Solr-trunk-Windows\solr\build\solr-solrj\test\J1\..\..\..\..\..\..\..\..\..\Users\JenkinsSlave\workspace\Lucene-Solr-trunk-Windows\solr\build\solr-solrj\test\J1\temp\solr.client.solrj.impl.CloudSolrClientTest_7DE71572C4ABE1F1-001\control-001\cores
   [junit4]   2> 44444 INFO  (TEST-CloudSolrClientTest.testShutdown-seed#[7DE71572C4ABE1F1]) [    ] o.a.s.c.CoreContainer New CoreContainer 1769107975
   [junit4]   2> 44444 INFO  (TEST-CloudSolrClientTest.testShutdown-seed#[7DE71572C4ABE1F1]) [    ] o.a.s.c.CoreContainer Loading cores into CoreContainer [instanceDir=C:\Users\JenkinsSlave\workspace\Lucene-Solr-trunk-Windows\solr\build\solr-solrj\test\J1\..\..\..\..\..\..\..\..\..\Users\JenkinsSlave\workspace\Lucene-Solr-trunk-Windows\solr\build\solr-solrj\test\J1\temp\solr.client.solrj.impl.CloudSolrClientTest_7DE71572C4ABE1F1-001\control-001\]
   [junit4]   2> 44444 INFO  (TEST-CloudSolrClientTest.testShutdown-seed#[7DE71572C4ABE1F1]) [    ] o.a.s.c.CoreContainer loading shared library: C:\Users\JenkinsSlave\workspace\Lucene-Solr-trunk-Windows\solr\build\solr-solrj\test\J1\..\..\..\..\..\..\..\..\..\Users\JenkinsSlave\workspace\Lucene-Solr-trunk-Windows\solr\build\solr-solrj\test\J1\temp\solr.client.solrj.impl.CloudSolrClientTest_7DE71572C4ABE1F1-001\control-001\lib
   [junit4]   2> 44444 WARN  (TEST-CloudSolrClientTest.testShutdown-seed#[7DE71572C4ABE1F1]) [    ] o.a.s.c.SolrResourceLoader Can't find (or read) directory to add to classloader: lib (resolved as: C:\Users\JenkinsSlave\workspace\Lucene-Solr-trunk-Windows\solr\build\solr-solrj\test\J1\..\..\..\..\..\..\..\..\..\Users\JenkinsSlave\workspace\Lucene-Solr-trunk-Windows\solr\build\solr-solrj\test\J1\temp\solr.client.solrj.impl.CloudSolrClientTest_7DE71572C4ABE1F1-001\control-001\lib).
   [junit4]   2> 44454 INFO  (TEST-CloudSolrClientTest.testShutdown-seed#[7DE71572C4ABE1F1]) [    ] o.a.s.h.c.HttpShardHandlerFactory created with socketTimeout : 90000,urlScheme : ,connTimeout : 15000,maxConnectionsPerHost : 20,maxConnections : 10000,corePoolSize : 0,maximumPoolSize : 2147483647,maxThreadIdleTime : 5,sizeOfQueue : -1,fairnessPolicy : false,useRetries : false,
   [junit4]   2> 44456 INFO  (TEST-CloudSolrClientTest.testShutdown-seed#[7DE71572C4ABE1F1]) [    ] o.a.s.u.UpdateShardHandler Creating UpdateShardHandler HTTP client with params: socketTimeout=340000&connTimeout=45000&retry=true
   [junit4]   2> 44456 INFO  (TEST-CloudSolrClientTest.testShutdown-seed#[7DE71572C4ABE1F1]) [    ] o.a.s.l.LogWatcher SLF4J impl is org.slf4j.impl.Log4jLoggerFactory
   [junit4]   2> 44456 INFO  (TEST-CloudSolrClientTest.testShutdown-seed#[7DE71572C4ABE1F1]) [    ] o.a.s.l.LogWatcher Registering Log Listener [Log4j (org.slf4j.impl.Log4jLoggerFactory)]
   [junit4]   2> 44456 INFO  (TEST-CloudSolrClientTest.testShutdown-seed#[7DE71572C4ABE1F1]) [    ] o.a.s.c.ZkContainer Zookeeper client=127.0.0.1:59869/solr
   [junit4]   2> 44491 INFO  (TEST-CloudSolrClientTest.testShutdown-seed#[7DE71572C4ABE1F1]) [    ] o.a.s.c.ZkController zkHost includes chroot
   [junit4]   2> 44491 INFO  (TEST-CloudSolrClientTest.testShutdown-seed#[7DE71572C4ABE1F1]) [    ] o.a.s.c.c.SolrZkClient Using default ZkCredentialsProvider
   [junit4]   2> 44494 INFO  (TEST-CloudSolrClientTest.testShutdown-seed#[7DE71572C4ABE1F1]) [    ] o.a.s.c.c.ConnectionManager Waiting for client to connect to ZooKeeper
   [junit4]   2> 44497 INFO  (zkCallback-9-thread-1) [    ] o.a.s.c.c.ConnectionManager Watcher org.apache.solr.common.cloud.ConnectionManager@3c9b51c5 name:ZooKeeperConnection Watcher:127.0.0.1:59869 got event WatchedEvent state:SyncConnected type:None path:null path:null type:None
   [junit4]   2> 44497 INFO  (TEST-CloudSolrClientTest.testShutdown-seed#[7DE71572C4ABE1F1]) [    ] o.a.s.c.c.ConnectionManager Client is connected to ZooKeeper
   [junit4]   2> 44498 INFO  (TEST-CloudSolrClientTest.testShutdown-seed#[7DE71572C4ABE1F1]) [    ] o.a.s.c.c.SolrZkClient Using default ZkACLProvider
   [junit4]   2> 44513 INFO  (TEST-CloudSolrClientTest.testShutdown-seed#[7DE71572C4ABE1F1]) [n:127.0.0.1:59876_    ] o.a.s.c.c.ConnectionManager Waiting for client to connect to ZooKeeper
   [junit4]   2> 44517 INFO  (zkCallback-10-thread-1-processing-n:127.0.0.1:59876_) [n:127.0.0.1:59876_    ] o.a.s.c.c.ConnectionManager Watcher org.apache.solr.common.cloud.ConnectionManager@410cf7ed name:ZooKeeperConnection Watcher:127.0.0.1:59869/solr got event WatchedEvent state:SyncConnected type:None path:null path:null type:None
   [junit4]   2> 44517 INFO  (TEST-CloudSolrClientTest.testShutdown-seed#[7DE71572C4ABE1F1]) [n:127.0.0.1:59876_    ] o.a.s.c.c.ConnectionManager Client is connected to ZooKeeper
   [junit4]   2> 44537 INFO  (TEST-CloudSolrClientTest.testShutdown-seed#[7DE71572C4ABE1F1]) [n:127.0.0.1:59876_    ] o.a.s.c.c.SolrZkClient makePath: /overseer/queue
   [junit4]   2> 45013 INFO  (TEST-CloudSolrClientTest.testShutdown-seed#[7DE71572C4ABE1F1]) [n:127.0.0.1:59876_    ] o.a.s.c.c.SolrZkClient makePath: /overseer/collection-queue-work
   [junit4]   2> 45099 INFO  (TEST-CloudSolrClientTest.testShutdown-seed#[7DE71572C4ABE1F1]) [n:127.0.0.1:59876_    ] o.a.s.c.c.SolrZkClient makePath: /overseer/collection-map-running
   [junit4]   2> 45111 INFO  (TEST-CloudSolrClientTest.testShutdown-seed#[7DE71572C4ABE1F1]) [n:127.0.0.1:59876_    ] o.a.s.c.c.SolrZkClient makePath: /overseer/collection-map-completed
   [junit4]   2> 45117 INFO  (TEST-CloudSolrClientTest.testShutdown-seed#[7DE71572C4ABE1F1]) [n:127.0.0.1:59876_    ] o.a.s.c.c.SolrZkClient makePath: /overseer/collection-map-failure
   [junit4]   2> 45145 INFO  (TEST-CloudSolrClientTest.testShutdown-seed#[7DE71572C4ABE1F1]) [n:127.0.0.1:59876_    ] o.a.s.c.c.SolrZkClient makePath: /live_nodes
   [junit4]   2> 45150 INFO  (TEST-CloudSolrClientTest.testShutdown-seed#[7DE71572C4ABE1F1]) [n:127.0.0.1:59876_    ] o.a.s.c.c.SolrZkClient makePath: /aliases.json
   [junit4]   2> 45153 INFO  (TEST-CloudSolrClientTest.testShutdown-seed#[7DE71572C4ABE1F1]) [n:127.0.0.1:59876_    ] o.a.s.c.c.SolrZkClient makePath: /clusterstate.json
   [junit4]   2> 45156 INFO  (TEST-CloudSolrClientTest.testShutdown-seed#[7DE71572C4ABE1F1]) [n:127.0.0.1:59876_    ] o.a.s.c.ZkController Register node as live in ZooKeeper:/live_nodes/127.0.0.1:59876_
   [junit4]   2> 45160 INFO  (TEST-CloudSolrClientTest.testShutdown-seed#[7DE71572C4ABE1F1]) [n:127.0.0.1:59876_    ] o.a.s.c.c.SolrZkClient makePath: /live_nodes/127.0.0.1:59876_
   [junit4]   2> 45169 INFO  (TEST-CloudSolrClientTest.testShutdown-seed#[7DE71572C4ABE1F1]) [n:127.0.0.1:59876_    ] o.a.s.c.c.SolrZkClient makePath: /overseer_elect
   [junit4]   2> 45172 INFO  (TEST-CloudSolrClientTest.testShutdown-seed#[7DE71572C4ABE1F1]) [n:127.0.0.1:59876_    ] o.a.s.c.c.SolrZkClient makePath: /overseer_elect/election
   [junit4]   2> 45176 INFO  (TEST-CloudSolrClientTest.testShutdown-seed#[7DE71572C4ABE1F1]) [n:127.0.0.1:59876_    ] o.a.s.c.Overseer Overseer (id=null) closing
   [junit4]   2> 45177 INFO  (TEST-CloudSolrClientTest.testShutdown-seed#[7DE71572C4ABE1F1]) [n:127.0.0.1:59876_    ] o.a.s.c.LeaderElector Joined leadership election with path: /overseer_elect/election/94146930943918083-127.0.0.1:59876_-n_0000000000
   [junit4]   2> 45188 INFO  (TEST-CloudSolrClientTest.testShutdown-seed#[7DE71572C4ABE1F1]) [n:127.0.0.1:59876_    ] o.a.s.c.OverseerElectionContext I am going to be the leader 127.0.0.1:59876_
   [junit4]   2> 45188 INFO  (TEST-CloudSolrClientTest.testShutdown-seed#[7DE71572C4ABE1F1]) [n:127.0.0.1:59876_    ] o.a.s.c.c.SolrZkClient makePath: /overseer_elect/leader
   [junit4]   2> 45191 INFO  (TEST-CloudSolrClientTest.testShutdown-seed#[7DE71572C4ABE1F1]) [n:127.0.0.1:59876_    ] o.a.s.c.Overseer Overseer (id=94146930943918083-127.0.0.1:59876_-n_0000000000) starting
   [junit4]   2> 45215 INFO  (TEST-CloudSolrClientTest.testShutdown-seed#[7DE71572C4ABE1F1]) [n:127.0.0.1:59876_    ] o.a.s.c.c.SolrZkClient makePath: /overseer/queue-work
   [junit4]   2> 45252 INFO  (TEST-CloudSolrClientTest.testShutdown-seed#[7DE71572C4ABE1F1]) [n:127.0.0.1:59876_    ] o.a.s.c.OverseerAutoReplicaFailoverThread Starting OverseerAutoReplicaFailoverThread autoReplicaFailoverWorkLoopDelay=10000 autoReplicaFailoverWaitAfterExpiration=30000 autoReplicaFailoverBadNodeExpiration=60000
   [junit4]   2> 45266 INFO  (TEST-CloudSolrClientTest.testShutdown-seed#[7DE71572C4ABE1F1]) [n:127.0.0.1:59876_    ] o.a.s.c.c.ZkStateReader Updating cluster state from ZooKeeper... 
   [junit4]   2> 45277 INFO  (OverseerCollectionProcessor-94146930943918083-127.0.0.1:59876_-n_0000000000) [n:127.0.0.1:59876_    ] o.a.s.c.OverseerCollectionProcessor Process current queue of collection creations
   [junit4]   2> 45283 INFO  (OverseerStateUpdate-94146930943918083-127.0.0.1:59876_-n_0000000000) [n:127.0.0.1:59876_    ] o.a.s.c.Overseer Starting to work on the main queue
   [junit4]   2> 45296 INFO  (TEST-CloudSolrClientTest.testShutdown-seed#[7DE71572C4ABE1F1]) [n:127.0.0.1:59876_    ] o.a.s.c.CoreContainer No authentication plugin used.
   [junit4]   2> 45298 INFO  (TEST-CloudSolrClientTest.testShutdown-seed#[7DE71572C4ABE1F1]) [n:127.0.0.1:59876_    ] o.a.s.c.CoreContainer Security conf doesn't exist. Skipping setup for authorization module.
   [junit4]   2> 45300 INFO  (TEST-CloudSolrClientTest.testShutdown-seed#[7DE71572C4ABE1F1]) [n:127.0.0.1:59876_    ] o.a.s.c.CoresLocator Looking for core definitions underneath C:\Users\JenkinsSlave\workspace\Lucene-Solr-trunk-Windows\solr\build\solr-solrj\test\J1\..\..\..\..\..\..\..\..\..\Users\JenkinsSlave\workspace\Lucene-Solr-trunk-Windows\solr\build\solr-solrj\test\J1\temp\solr.client.solrj.impl.CloudSolrClientTest_7DE71572C4ABE1F1-001\control-001\cores
   [junit4]   2> 45321 INFO  (TEST-CloudSolrClientTest.testShutdown-seed#[7DE71572C4ABE1F1]) [n:127.0.0.1:59876_    ] o.a.s.c.SolrCore Created CoreDescriptor: {name=collection1, config=solrconfig.xml, transient=false, schema=schema.xml, loadOnStartup=true, instanceDir=C:\Users\JenkinsSlave\workspace\Lucene-Solr-trunk-Windows\solr\build\solr-solrj\test\J1\..\..\..\..\..\..\..\..\..\Users\JenkinsSlave\workspace\Lucene-Solr-trunk-Windows\solr\build\solr-solrj\test\J1\temp\solr.client.solrj.impl.CloudSolrClientTest_7DE71572C4ABE1F1-001\control-001\cores\collection1, collection=control_collection, absoluteInstDir=C:\Users\JenkinsSlave\workspace\Lucene-Solr-trunk-Windows\solr\build\solr-solrj\test\J1\..\..\..\..\..\..\..\..\..\Users\JenkinsSlave\workspace\Lucene-Solr-trunk-Windows\solr\build\solr-solrj\test\J1\temp\solr.client.solrj.impl.CloudSolrClientTest_7DE71572C4ABE1F1-001\control-001\cores\collection1\, coreNodeName=, dataDir=data\, shard=}
   [junit4]   2> 45322 INFO  (TEST-CloudSolrClientTest.testShutdown-seed#[7DE71572C4ABE1F1]) [n:127.0.0.1:59876_    ] o.a.s.c.CoresLocator Found core collection1 in C:\Users\JenkinsSlave\workspace\Lucene-Solr-trunk-Windows\solr\build\solr-solrj\test\J1\..\..\..\..\..\..\..\..\..\Users\JenkinsSlave\workspace\Lucene-Solr-trunk-Windows\solr\build\solr-solrj\test\J1\temp\solr.client.solrj.impl.CloudSolrClientTest_7DE71572C4ABE1F1-001\control-001\cores\collection1\
   [junit4]   2> 45322 INFO  (TEST-CloudSolrClientTest.testShutdown-seed#[7DE71572C4ABE1F1]) [n:127.0.0.1:59876_    ] o.a.s.c.CoresLocator Found 1 core definitions
   [junit4]   2> 45331 INFO  (coreLoadExecutor-30-thread-1-processing-n:127.0.0.1:59876_) [n:127.0.0.1:59876_ c:control_collection   x:collection1] o.a.s.c.ZkController publishing state=down
   [junit4]   2> 45331 INFO  (coreLoadExecutor-30-thread-1-processing-n:127.0.0.1:59876_) [n:127.0.0.1:59876_ c:control_collection   x:collection1] o.a.s.c.ZkController numShards not found on descriptor - reading it from system property
   [junit4]   2> 45335 INFO  (TEST-CloudSolrClientTest.testShutdown-seed#[7DE71572C4ABE1F1]) [n:127.0.0.1:59876_    ] o.a.s.s.SolrDispatchFilter user.dir=C:\Users\JenkinsSlave\workspace\Lucene-Solr-trunk-Windows\solr\build\solr-solrj\test\J1
   [junit4]   2> 45335 INFO  (TEST-CloudSolrClientTest.testShutdown-seed#[7DE71572C4ABE1F1]) [n:127.0.0.1:59876_    ] o.a.s.s.SolrDispatchFilter SolrDispatchFilter.init() done
   [junit4]   2> 45347 INFO  (coreLoadExecutor-30-thread-1-processing-n:127.0.0.1:59876_) [n:127.0.0.1:59876_ c:control_collection   x:collection1] o.a.s.c.ZkController look for our core node name
   [junit4]   2> 45347 INFO  (zkCallback-10-thread-1-processing-n:127.0.0.1:59876_) [n:127.0.0.1:59876_    ] o.a.s.c.DistributedQueue NodeChildrenChanged fired on path /overseer/queue state SyncConnected
   [junit4]   2> 45436 INFO  (OverseerStateUpdate-94146930943918083-127.0.0.1:59876_-n_0000000000) [n:127.0.0.1:59876_    ] o.a.s.c.Overseer processMessage: queueSize: 1, message = {
   [junit4]   2>   "core":"collection1",
   [junit4]   2>   "roles":null,
   [junit4]   2>   "base_url":"http://127.0.0.1:59876",
   [junit4]   2>   "node_name":"127.0.0.1:59876_",
   [junit4]   2>   "numShards":"1",
   [junit4]   2>   "state":"down",
   [junit4]   2>   "shard":null,
   [junit4]   2>   "collection":"control_collection",
   [junit4]   2>   "operation":"state"} current state version: 0
   [junit4]   2> 45499 INFO  (OverseerStateUpdate-94146930943918083-127.0.0.1:59876_-n_0000000000) [n:127.0.0.1:59876_    ] o.a.s.c.o.ReplicaMutator Update state numShards=1 message={
   [junit4]   2>   "core":"collection1",
   [junit4]   2>   "roles":null,
   [junit4]   2>   "base_url":"http://127.0.0.1:59876",
   [junit4]   2>   "node_name":"127.0.0.1:59876_",
   [junit4]   2>   "numShards":"1",
   [junit4]   2>   "state":"down",
   [junit4]   2>   "shard":null,
   [junit4]   2>   "collection":"control_collection",
   [junit4]   2>   "operation":"state"}
   [junit4]   2> 45504 INFO  (OverseerStateUpdate-94146930943918083-127.0.0.1:59876_-n_0000000000) [n:127.0.0.1:59876_    ] o.a.s.c.o.ClusterStateMutator building a new cName: control_collection
   [junit4]   2> 45551 INFO  (OverseerStateUpdate-94146930943918083-127.0.0.1:59876_-n_0000000000) [n:127.0.0.1:59876_    ] o.a.s.c.o.ReplicaMutator Assigning new node to shard shard=shard1
   [junit4]   2> 45566 INFO  (zkCallback-10-thread-1-processing-n:127.0.0.1:59876_) [n:127.0.0.1:59876_    ] o.a.s.c.c.ZkStateReader A cluster state change: WatchedEvent state:SyncConnected type:NodeDataChanged path:/clusterstate.json, has occurred - updating... (live nodes size: 1)
   [junit4]   2> 45577 INFO  (zkCallback-10-thread-1-processing-n:127.0.0.1:59876_) [n:127.0.0.1:59876_    ] o.a.s.c.c.ZkStateReader Updated cluster state version to 1
   [junit4]   2> 46229 INFO  (coreLoadExecutor-30-thread-1-processing-n:127.0.0.1:59876_) [n:127.0.0.1:59876_ c:control_collection   x:collection1] o.a.s.c.ZkController waiting to find shard id in clusterstate for collection1
   [junit4]   2> 46229 INFO  (coreLoadExecutor-30-thread-1-processing-n:127.0.0.1:59876_) [n:127.0.0.1:59876_ c:control_collection   x:collection1] o.a.s.c.ZkController Check for collection zkNode:control_collection
   [junit4]   2> 46229 INFO  (coreLoadExecutor-30-thread-1-processing-n:127.0.0.1:59876_) [n:127.0.0.1:59876_ c:control_collection   x:collection1] o.a.s.c.ZkController Collection zkNode exists
   [junit4]   2> 46229 INFO  (coreLoadExecutor-30-thread-1-processing-n:127.0.0.1:59876_) [n:127.0.0.1:59876_ c:control_collection   x:collection1] o.a.s.c.c.ZkStateReader Load collection config from:/collections/control_collection
   [junit4]   2> 46231 INFO  (coreLoadExecutor-30-thread-1-processing-n:127.0.0.1:59876_) [n:127.0.0.1:59876_ c:control_collection   x:collection1] o.a.s.c.c.ZkStateReader path=/collections/control_collection configName=conf1 specified config exists in ZooKeeper
   [junit4]   2> 46232 INFO  (coreLoadExecutor-30-thread-1-processing-n:127.0.0.1:59876_) [n:127.0.0.1:59876_ c:control_collection   x:collection1] o.a.s.c.SolrResourceLoader new SolrResourceLoader for directory: 'C:\Users\JenkinsSlave\workspace\Lucene-Solr-trunk-Windows\solr\build\solr-solrj\test\J1\..\..\..\..\..\..\..\..\..\Users\JenkinsSlave\workspace\Lucene-Solr-trunk-Windows\solr\build\solr-solrj\test\J1\temp\solr.client.solrj.impl.CloudSolrClientTest_7DE71572C4ABE1F1-001\control-001\cores\collection1\'
   [junit4]   2> 46275 INFO  (coreLoadExecutor-30-thread-1-processing-n:127.0.0.1:59876_) [n:127.0.0.1:59876_ c:control_collection   x:collection1] o.a.s.c.Config loaded config solrconfig.xml with version 0 
   [junit4]   2> 46288 INFO  (coreLoadExecutor-30-thread-1-processing-n:127.0.0.1:59876_) [n:127.0.0.1:59876_ c:control_collection   x:collection1] o.a.s.c.SolrConfig current version of requestparams : -1
   [junit4]   2> 46292 INFO  (coreLoadExecutor-30-thread-1-processing-n:127.0.0.1:59876_) [n:127.0.0.1:59876_ c:control_collection   x:collection1] o.a.s.c.SolrConfig Using Lucene MatchVersion: 6.0.0
   [junit4]   2> 46300 INFO  (coreLoadExecutor-30-thread-1-processing-n:127.0.0.1:59876_) [n:127.0.0.1:59876_ c:control_collection   x:collection1] o.a.s.c.Config Loaded SolrConfig: solrconfig.xml
   [junit4]   2> 46308 INFO  (coreLoadExecutor-30-thread-1-processing-n:127.0.0.1:59876_) [n:127.0.0.1:59876_ c:control_collection   x:collection1] o.a.s.s.IndexSchema Reading Solr Schema from /configs/conf1/schema.xml
   [junit4]   2> 46318 INFO  (coreLoadExecutor-30-thread-1-processing-n:127.0.0.1:59876_) [n:127.0.0.1:59876_ c:control_collection   x:collection1] o.a.s.s.IndexSchema [collection1] Schema name=test
   [junit4]   2> 46582 INFO  (coreLoadExecutor-30-thread-1-processing-n:127.0.0.1:59876_) [n:127.0.0.1:59876_ c:control_collection   x:collection1] o.a.s.s.IndexSchema default search field in schema is text
   [junit4]   2> 46583 INFO  (coreLoadExecutor-30-thread-1-processing-n:127.0.0.1:59876_) [n:127.0.0.1:59876_ c:control_collection   x:collection1] o.a.s.s.IndexSchema unique key field: id
   [junit4]   2> 46583 WARN  (coreLoadExecutor-30-thread-1-processing-n:127.0.0.1:59876_) [n:127.0.0.1:59876_ c:control_collection   x:collection1] o.a.s.s.IndexSchema Field lowerfilt1and2 is not multivalued and destination for multiple copyFields (2)
   [junit4]   2> 46583 WARN  (coreLoadExecutor-30-thread-1-processing-n:127.0.0.1:59876_) [n:127.0.0.1:59876_ c:control_collection   x:collection1] o.a.s.s.IndexSchema Field text is not multivalued and destination for multiple copyFields (3)
   [junit4]   2> 46590 INFO  (coreLoadExecutor-30-thread-1-processing-n:127.0.0.1:59876_) [n:127.0.0.1:59876_ c:control_collection   x:collection1] o.a.s.c.CoreContainer Creating SolrCore 'collection1' using configuration from collection control_collection
   [junit4]   2> 46590 INFO  (coreLoadExecutor-30-thread-1-processing-n:127.0.0.1:59876_) [n:127.0.0.1:59876_ c:control_collection s:shard1 r:core_node1 x:collection1] o.a.s.c.SolrCore org.apache.solr.core.MockDirectoryFactory
   [junit4]   2> 46591 INFO  (coreLoadExecutor-30-thread-1-processing-n:127.0.0.1:59876_) [n:127.0.0.1:59876_ c:control_collection s:shard1 r:core_node1 x:collection1] o.a.s.c.SolrCore [[collection1] ] Opening new SolrCore at [C:\Users\JenkinsSlave\workspace\Lucene-Solr-trunk-Windows\solr\build\solr-solrj\test\J1\..\..\..\..\..\..\..\..\..\Users\JenkinsSlave\workspace\Lucene-Solr-trunk-Windows\solr\build\solr-solrj\test\J1\temp\solr.client.solrj.impl.CloudSolrClientTest_7DE71572C4ABE1F1-001\control-001\cores\collection1\], dataDir=[null]
   [junit4]   2> 46591 INFO  (coreLoadExecutor-30-thread-1-processing-n:127.0.0.1:59876_) [n:127.0.0.1:59876_ c:control_collection s:shard1 r:core_node1 x:collection1] o.a.s.c.SolrCore JMX monitoring not detected for core: collection1
   [junit4]   2> 46592 INFO  (coreLoadExecutor-30-thread-1-processing-n:127.0.0.1:59876_) [n:127.0.0.1:59876_ c:control_collection s:shard1 r:core_node1 x:collection1] o.a.s.c.CachingDirectoryFactory return new directory for C:\Users\JenkinsSlave\workspace\Lucene-Solr-trunk-Windows\solr\build\solr-solrj\test\J1\..\..\..\..\..\..\..\..\..\Users\JenkinsSlave\workspace\Lucene-Solr-trunk-Windows\solr\build\solr-solrj\test\J1\temp\solr.client.solrj.impl.CloudSolrClientTest_7DE71572C4ABE1F1-001\control-001\cores\collection1\data\
   [junit4]   2> 46592 INFO  (coreLoadExecutor-30-thread-1-processing-n:127.0.0.1:59876_) [n:127.0.0.1:59876_ c:control_collection s:shard1 r:core_node1 x:collection1] o.a.s.c.SolrCore New index directory detected: old=null new=C:\Users\JenkinsSlave\workspace\Lucene-Solr-trunk-Windows\solr\build\solr-solrj\test\J1\..\..\..\..\..\..\..\..\..\Users\JenkinsSlave\workspace\Lucene-Solr-trunk-Windows\solr\build\solr-solrj\test\J1\temp\solr.client.solrj.impl.CloudSolrClientTest_7DE71572C4ABE1F1-001\control-001\cores\collection1\data\index/
   [junit4]   2> 46592 WARN  (coreLoadExecutor-30-thread-1-processing-n:127.0.0.1:59876_) [n:127.0.0.1:59876_ c:control_collection s:shard1 r:core_node1 x:collection1] o.a.s.c.SolrCore [collection1] Solr index directory 'C:\Users\JenkinsSlave\workspace\Lucene-Solr-trunk-Windows\solr\build\solr-solrj\test\J1\..\..\..\..\..\..\..\..\..\Users\JenkinsSlave\workspace\Lucene-Solr-trunk-Windows\solr\build\solr-solrj\test\J1\temp\solr.client.solrj.impl.CloudSolrClientTest_7DE71572C4ABE1F1-001\control-001\cores\collection1\data\index' doesn't exist. Creating new index...
   [junit4]   2> 46592 INFO  (coreLoadExecutor-30-thread-1-processing-n:127.0.0.1:59876_) [n:127.0.0.1:59876_ c:control_collection s:shard1 r:core_node1 x:collection1] o.a.s.c.CachingDirectoryFactory return new directory for C:\Users\JenkinsSlave\workspace\Lucene-Solr-trunk-Windows\solr\build\solr-solrj\test\J1\..\..\..\..\..\..\..\..\..\Users\JenkinsSlave\workspace\Lucene-Solr-trunk-Windows\solr\build\solr-solrj\test\J1\temp\solr.client.solrj.impl.CloudSolrClientTest_7DE71572C4ABE1F1-001\control-001\cores\collection1\data\index
   [junit4]   2> 46593 INFO  (coreLoadExecutor-30-thread-1-processing-n:127.0.0.1:59876_) [n:127.0.0.1:59876_ c:control_collection s:shard1 r:core_node1 x:collection1] o.a.s.c.SolrCore SolrDeletionPolicy.onCommit: commits: num=1
   [junit4]   2> 	commit{dir=MockDirectoryWrapper(RAMDirectory@7e780462 lockFactory=org.apache.lucene.store.SingleInstanceLockFactory@2e84c455),segFN=segments_1,generation=1}
   [junit4]   2> 46593 INFO  (coreLoadExecutor-30-thread-1-processing-n:127.0.0.1:59876_) [n:127.0.0.1:59876_ c:control_collection s:shard1 r:core_node1 x:collection1] o.a.s.c.SolrCore newest commit generation = 1
   [junit4]   2> 46596 INFO  (coreLoadExecutor-30-thread-1-processing-n:127.0.0.1:59876_) [n:127.0.0.1:59876_ c:control_collection s:shard1 r:core_node1 x:collection1] o.a.s.c.SolrCore no updateRequestProcessorChain defined as default, creating implicit default
   [junit4]   2> 46600 INFO  (OldIndexDirectoryCleanupThreadForCore-collection1) [n:127.0.0.1:59876_ c:control_collection s:shard1 r:core_node1 x:collection1] o.a.s.c.SolrCore Looking for old index directories to cleanup for core collection1 in C:\Users\JenkinsSlave\workspace\Lucene-Solr-trunk-Windows\solr\build\solr-solrj\test\J1\..\..\..\..\..\..\..\..\..\Users\JenkinsSlave\workspace\Lucene-Solr-trunk-Windows\solr\build\solr-solrj\test\J1\temp\solr.client.solrj.impl.CloudSolrClientTest_7DE71572C4ABE1F1-001\control-001\cores\collection1\data\
   [junit4]   2> 46601 INFO  (coreLoadExecutor-30-thread-1-processing-n:127.0.0.1:59876_) [n:127.0.0.1:59876_ c:control_collection s:shard1 r:core_node1 x:collection1] o.a.s.h.l.XMLLoader xsltCacheLifetimeSeconds=60
   [junit4]   2> 46603 INFO  (coreLoadExecutor-30-thread-1-processing-n:127.0.0.1:59876_) [n:127.0.0.1:59876_ c:control_collection s:shard1 r:core_node1 x:collection1] o.a.s.h.l.XMLLoader xsltCacheLifetimeSeconds=60
   [junit4]   2> 46604 INFO  (coreLoadExecutor-30-thread-1-processing-n:127.0.0.1:59876_) [n:127.0.0.1:59876_ c:control_collection s:shard1 r:core_node1 x:collection1] o.a.s.h.l.XMLLoader xsltCacheLifetimeSeconds=60
   [junit4]   2> 46605 INFO  (coreLoadExecutor-30-thread-1-processing-n:127.0.0.1:59876_) [n:127.0.0.1:59876_ c:control_collection s:shard1 r:core_node1 x:collection1] o.a.s.h.l.XMLLoader xsltCacheLifetimeSeconds=60
   [junit4]   2> 46601 WARN  (OldIndexDirectoryCleanupThreadForCore-collection1) [n:127.0.0.1:59876_ c:control_collection s:shard1 r:core_node1 x:collection1] o.a.s.c.DirectoryFactory C:\Users\JenkinsSlave\workspace\Lucene-Solr-trunk-Windows\solr\build\solr-solrj\test\J1\..\..\..\..\..\..\..\..\..\Users\JenkinsSlave\workspace\Lucene-Solr-trunk-Windows\solr\build\solr-solrj\test\J1\temp\solr.client.solrj.impl.CloudSolrClientTest_7DE71572C4ABE1F1-001\control-001\cores\collection1\data\ does not point to a valid data directory; skipping clean-up of old index directories.
   [junit4]   2> 46637 INFO  (coreLoadExecutor-30-thread-1-processing-n:127.0.0.1:59876_) [n:127.0.0.1:59876_ c:control_collection s:shard1 r:core_node1 x:collection1] o.a.s.c.RequestHandlers Registered paths: /admin/mbeans,standard,,/update/csv,/update/json/docs,/admin/luke,/admin/segments,/get,/admin/system,/replication,/admin/properties,/config,/schema,/admin/plugins,/admin/logging,/update/json,/admin/threads,/admin/ping,/update,/admin/file
   [junit4]   2> 46638 WARN  (coreLoadExecutor-30-thread-1-processing-n:127.0.0.1:59876_) [n:127.0.0.1:59876_ c:control_collection s:shard1 r:core_node1 x:collection1] o.a.s.c.RequestHandlers no default request handler is registered (either '/select' or 'standard')
   [junit4]   2> 46638 INFO  (coreLoadExecutor-30-thread-1-processing-n:127.0.0.1:59876_) [n:127.0.0.1:59876_ c:control_collection s:shard1 r:core_node1 x:collection1] o.a.s.c.SolrCore Using default statsCache cache: org.apache.solr.search.stats.LocalStatsCache
   [junit4]   2> 46640 INFO  (coreLoadExecutor-30-thread-1-processing-n:127.0.0.1:59876_) [n:127.0.0.1:59876_ c:control_collection s:shard1 r:core_node1 x:collection1] o.a.s.u.UpdateHandler Using UpdateLog implementation: org.apache.solr.update.UpdateLog
   [junit4]   2> 46640 INFO  (coreLoadExecutor-30-thread-1-processing-n:127.0.0.1:59876_) [n:127.0.0.1:59876_ c:control_collection s:shard1 r:core_node1 x:collection1] o.a.s.u.UpdateLog Initializing UpdateLog: dataDir= defaultSyncLevel=FLUSH numRecordsToKeep=100 maxNumLogsToKeep=10 numVersionBuckets=65536
   [junit4]   2> 46651 INFO  (coreLoadExecutor-30-thread-1-processing-n:127.0.0.1:59876_) [n:127.0.0.1:59876_ c:control_collection s:shard1 r:core_node1 x:collection1] o.a.s.c.SolrCore Hard AutoCommit: disabled
   [junit4]   2> 46651 INFO  (coreLoadExecutor-30-thread-1-processing-n:127.0.0.1:59876_) [n:127.0.0.1:59876_ c:control_collection s:shard1 r:core_node1 x:collection1] o.a.s.c.SolrCore Soft AutoCommit: disabled
   [junit4]   2> 46653 INFO  (coreLoadExecutor-30-thread-1-processing-n:127.0.0.1:59876_) [n:127.0.0.1:59876_ c:control_collection s:shard1 r:core_node1 x:collection1] o.a.s.c.SolrCore SolrDeletionPolicy.onInit: commits: num=1
   [junit4]   2> 	commit{dir=MockDirectoryWrapper(RAMDirectory@7e780462 lockFactory=org.apache.lucene.store.SingleInstanceLockFactory@2e84c455),segFN=segments_1,generation=1}
   [junit4]   2> 46653 INFO  (coreLoadExecutor-30-thread-1-processing-n:127.0.0.1:59876_) [n:127.0.0.1:59876_ c:control_collection s:shard1 r:core_node1 x:collection1] o.a.s.c.SolrCore newest commit generation = 1
   [junit4]   2> 46654 INFO  (coreLoadExecutor-30-thread-1-processing-n:127.0.0.1:59876_) [n:127.0.0.1:59876_ c:control_collection s:shard1 r:core_node1 x:collection1] o.a.s.s.SolrIndexSearcher Opening Searcher@5ae31796[collection1] main
   [junit4]   2> 46654 INFO  (coreLoadExecutor-30-thread-1-processing-n:127.0.0.1:59876_) [n:127.0.0.1:59876_ c:control_collection s:shard1 r:core_node1 x:collection1] o.a.s.c.c.ZkStateReader Load collection config from:/collections/control_collection
   [junit4]   2> 46663 INFO  (coreLoadExecutor-30-thread-1-processing-n:127.0.0.1:59876_) [n:127.0.0.1:59876_ c:control_collection s:shard1 r:core_node1 x:collection1] o.a.s.c.c.ZkStateReader path=/collections/control_collection configName=conf1 specified config exists in ZooKeeper
   [junit4]   2> 46663 INFO  (coreLoadExecutor-30-thread-1-processing-n:127.0.0.1:59876_) [n:127.0.0.1:59876_ c:control_collection s:shard1 r:core_node1 x:collection1] o.a.s.r.ManagedResourceStorage Setting up ZooKeeper-based storage for the RestManager with znodeBase: /configs/conf1
   [junit4]   2> 46693 INFO  (coreLoadExecutor-30-thread-1-processing-n:127.0.0.1:59876_) [n:127.0.0.1:59876_ c:control_collection s:shard1 r:core_node1 x:collection1] o.a.s.r.ManagedResourceStorage Configured ZooKeeperStorageIO with znodeBase: /configs/conf1
   [junit4]   2> 46693 INFO  (coreLoadExecutor-30-thread-1-processing-n:127.0.0.1:59876_) [n:127.0.0.1:59876_ c:control_collection s:shard1 r:core_node1 x:collection1] o.a.s.r.RestManager Initializing RestManager with initArgs: {}
   [junit4]   2> 46694 INFO  (coreLoadExecutor-30-thread-1-processing-n:127.0.0.1:59876_) [n:127.0.0.1:59876_ c:control_collection s:shard1 r:core_node1 x:collection1] o.a.s.r.ManagedResourceStorage Reading _rest_managed.json using ZooKeeperStorageIO:path=/configs/conf1
   [junit4]   2> 46695 INFO  (coreLoadExecutor-30-thread-1-processing-n:127.0.0.1:59876_) [n:127.0.0.1:59876_ c:control_collection s:shard1 r:core_node1 x:collection1] o.a.s.r.ManagedResourceStorage No data found for znode /configs/conf1/_rest_managed.json
   [junit4]   2> 46695 INFO  (coreLoadExecutor-30-thread-1-processing-n:127.0.0.1:59876_) [n:127.0.0.1:59876_ c:control_collection s:shard1 r:core_node1 x:collection1] o.a.s.r.ManagedResourceStorage Loaded null at path _rest_managed.json using ZooKeeperStorageIO:path=/configs/conf1
   [junit4]   2> 46695 INFO  (coreLoadExecutor-30-thread-1-processing-n:127.0.0.1:59876_) [n:127.0.0.1:59876_ c:control_collection s:shard1 r:core_node1 x:collection1] o.a.s.r.RestManager Initializing 0 registered ManagedResources
   [junit4]   2> 46695 INFO  (coreLoadExecutor-30-thread-1-processing-n:127.0.0.1:59876_) [n:127.0.0.1:59876_ c:control_collection s:shard1 r:core_node1 x:collection1] o.a.s.h.ReplicationHandler Commits will be reserved for  10000
   [junit4]   2> 46696 INFO  (coreLoadExecutor-30-thread-1-processing-n:127.0.0.1:59876_) [n:127.0.0.1:59876_ c:control_collection s:shard1 r:core_node1 x:collection1] o.a.s.u.UpdateLog Looking up max value of version field to seed version buckets
   [junit4]   2> 46696 INFO  (coreLoadExecutor-30-thread-1-processing-n:127.0.0.1:59876_) [n:127.0.0.1:59876_ c:control_collection s:shard1 r:core_node1 x:collection1] o.a.s.u.VersionInfo Refreshing highest value of _version_ for 65536 version buckets from index
   [junit4]   2> 46697 INFO  (coreLoadExecutor-30-thread-1-processing-n:127.0.0.1:59876_) [n:127.0.0.1:59876_ c:control_collection s:shard1 r:core_node1 x:collection1] o.a.s.u.VersionInfo No terms found for _version_, cannot seed version bucket highest value from index
   [junit4]   2> 46697 INFO  (coreLoadExecutor-30-thread-1-processing-n:127.0.0.1:59876_) [n:127.0.0.1:59876_ c:control_collection s:shard1 r:core_node1 x:collection1] o.a.s.u.UpdateLog Could not find max version in index or recent updates, using new clock 1506350898017730560
   [junit4]   2> 46700 INFO  (coreLoadExecutor-30-thread-1-processing-n:127.0.0.1:59876_) [n:127.0.0.1:59876_ c:control_collection s:shard1 r:core_node1 x:collection1] o.a.s.u.UpdateLog Took 4 ms to seed version buckets with highest version 1506350898017730560
   [junit4]   2> 46706 INFO  (coreLoadExecutor-30-thread-1-processing-n:127.0.0.1:59876_) [n:127.0.0.1:59876_ c:control_collection s:shard1 r:core_node1 x:collection1] o.a.s.c.ZkController watch zkdir /configs/conf1
   [junit4]   2> 46711 INFO  (coreLoadExecutor-30-thread-1-processing-n:127.0.0.1:59876_) [n:127.0.0.1:59876_ c:control_collection s:shard1 r:core_node1 x:collection1] o.a.s.c.CoreContainer registering core: collection1
   [junit4]   2> 46720 INFO  (coreZkRegister-24-thread-1-processing-n:127.0.0.1:59876_ x:collection1 s:shard1 c:control_collection r:core_node1) [n:127.0.0.1:59876_ c:control_collection s:shard1 r:core_node1 x:collection1] o.a.s.c.ZkController Register replica - core:collection1 address:http://127.0.0.1:59876 collection:control_collection shard:shard1
   [junit4]   2> 46773 INFO  (searcherExecutor-31-thread-1-processing-n:127.0.0.1:59876_ x:collection1 s:shard1 c:control_collection r:core_node1) [n:127.0.0.1:59876_ c:control_collection s:shard1 r:core_node1 x:collection1] o.a.s.c.SolrCore [collection1] Registered new searcher Searcher@5ae31796[collection1] main{ExitableDirectoryReader(UninvertingDirectoryReader())}
   [junit4]   2> 46784 INFO  (coreZkRegister-24-thread-1-processing-n:127.0.0.1:59876_ x:collection1 s:shard1 c:control_collection r:core_node1) [n:127.0.0.1:59876_ c:control_collection s:shard1 r:core_node1 x:collection1] o.a.s.c.c.SolrZkClient makePath: /collections/control_collection/leader_elect/shard1/election
   [junit4]   2> 46794 INFO  (coreZkRegister-24-thread-1-processing-n:127.0.0.1:59876_ x:collection1 s:shard1 c:control_collection r:core_node1) [n:127.0.0.1:59876_ c:control_collection s:shard1 r:core_node1 x:collection1] o.a.s.c.LeaderElector Joined leadership election with path: /collections/control_collection/leader_elect/shard1/election/94146930943918083-core_node1-n_0000000000
   [junit4]   2> 46797 INFO  (coreZkRegister-24-thread-1-processing-n:127.0.0.1:59876_ x:collection1 s:shard1 c:control_collection r:core_node1) [n:127.0.0.1:59876_ c:control_collection s:shard1 r:core_node1 x:collection1] o.a.s.c.ShardLeaderElectionContext Running the leader process for shard shard1
   [junit4]   2> 46804 INFO  (zkCallback-10-thread-1-processing-n:127.0.0.1:59876_) [n:127.0.0.1:59876_    ] o.a.s.c.DistributedQueue NodeChildrenChanged fired on path /overseer/queue state SyncConnected
   [junit4]   2> 46805 INFO  (coreZkRegister-24-thread-1-processing-n:127.0.0.1:59876_ x:collection1 s:shard1 c:control_collection r:core_node1) [n:127.0.0.1:59876_ c:control_collection s:shard1 r:core_node1 x:collection1] o.a.s.c.ShardLeaderElectionContext Enough replicas found to continue.
   [junit4]   2> 46805 INFO  (coreZkRegister-24-thread-1-processing-n:127.0.0.1:59876_ x:collection1 s:shard1 c:control_collection r:core_node1) [n:127.0.0.1:59876_ c:control_collection s:shard1 r:core_node1 x:collection1] o.a.s.c.ShardLeaderElectionContext I may be the new leader - try and sync
   [junit4]   2> 46808 INFO  (OverseerStateUpdate-94146930943918083-127.0.0.1:59876_-n_0000000000) [n:127.0.0.1:59876_    ] o.a.s.c.Overseer processMessage: queueSize: 1, message = {
   [junit4]   2>   "operation":"leader",
   [junit4]   2>   "shard":"shard1",
   [junit4]   2>   "collection":"control_collection"} current state version: 1
   [junit4]   2> 46813 INFO  (coreZkRegister-24-thread-1-processing-n:127.0.0.1:59876_ x:collection1 s:shard1 c:control_collection r:core_node1) [n:127.0.0.1:59876_ c:control_collection s:shard1 r:core_node1 x:collection1] o.a.s.c.SyncStrategy Sync replicas to http://127.0.0.1:59876/collection1/
   [junit4]   2> 46813 INFO  (coreZkRegister-24-thread-1-processing-n:127.0.0.1:59876_ x:collection1 s:shard1 c:control_collection r:core_node1) [n:127.0.0.1:59876_ c:control_collection s:shard1 r:core_node1 x:collection1] o.a.s.c.SyncStrategy Sync Success - now sync replicas to me
   [junit4]   2> 46813 INFO  (coreZkRegister-24-thread-1-processing-n:127.0.0.1:59876_ x:collection1 s:shard1 c:control_collection r:core_node1) [n:127.0.0.1:59876_ c:control_collection s:shard1 r:core_node1 x:collection1] o.a.s.c.SyncStrategy http://127.0.0.1:59876/collection1/ has no replicas
   [junit4]   2> 46814 INFO  (coreZkRegister-24-thread-1-processing-n:127.0.0.1:59876_ x:collection1 s:shard1 c:control_collection r:core_node1) [n:127.0.0.1:59876_ c:control_collection s:shard1 r:core_node1 x:collection1] o.a.s.c.ShardLeaderElectionContext I am the new leader: http://127.0.0.1:59876/collection1/ shard1
   [junit4]   2> 46822 INFO  (coreZkRegister-24-thread-1-processing-n:127.0.0.1:59876_ x:collection1 s:shard1 c:control_collection r:core_node1) [n:127.0.0.1:59876_ c:control_collection s:shard1 r:core_node1 x:collection1] o.a.s.c.c.SolrZkClient makePath: /collections/control_collection/leaders/shard1
   [junit4]   2> 46839 INFO  (zkCallback-10-thread-1-processing-n:127.0.0.1:59876_) [n:127.0.0.1:59876_    ] o.a.s.c.DistributedQueue NodeChildrenChanged fired on path /overseer/queue state SyncConnected
   [junit4]   2> 46840 INFO  (OverseerStateUpdate-94146930943918083-127.0.0.1:59876_-n_0000000000) [n:127.0.0.1:59876_    ] o.a.s.c.Overseer processMessage: queueSize: 1, message = {
   [junit4]   2>   "operation":"leader",
   [junit4]   2>   "shard":"shard1",
   [junit4]   2>   "collection":"control_collection",
   [junit4]   2>   "base_url":"http://127.0.0.1:59876",
   [junit4]   2>   "core":"collection1",
   [junit4]   2>   "state":"active"} current state version: 1
   [junit4]   2> 46939 INFO  (zkCallback-10-thread-1-processing-n:127.0.0.1:59876_) [n:127.0.0.1:59876_    ] o.a.s.c.c.ZkStateReader A cluster state change: WatchedEvent state:SyncConnected type:NodeDataChanged path:/clusterstate.json, has occurred - updating... (live nodes size: 1)
   [junit4]   2> 46951 INFO  (zkCallback-10-thread-1-processing-n:127.0.0.1:59876_) [n:127.0.0.1:59876_    ] o.a.s.c.c.ZkStateReader Updated cluster state version to 2
   [junit4]   2> 46973 INFO  (coreZkRegister-24-thread-1-processing-n:127.0.0.1:59876_ x:collection1 s:shard1 c:control_collection r:core_node1) [n:127.0.0.1:59876_ c:control_collection s:shard1 r:core_node1 x:collection1] o.a.s.c.ZkController We are http://127.0.0.1:59876/collection1/ and leader is http://127.0.0.1:59876/collection1/
   [junit4]   2> 46974 INFO  (coreZkRegister-24-thread-1-processing-n:127.0.0.1:59876_ x:collection1 s:shard1 c:control_collection r:core_node1) [n:127.0.0.1:59876_ c:control_collection s:shard1 r:core_node1 x:collection1] o.a.s.c.ZkController No LogReplay needed for core=collection1 baseURL=http://127.0.0.1:59876
   [junit4]   2> 46974 INFO  (coreZkRegister-24-thread-1-processing-n:127.0.0.1:59876_ x:collection1 s:shard1 c:control_collection r:core_node1) [n:127.0.0.1:59876_ c:control_collection s:shard1 r:core_node1 x:collection1] o.a.s.c.ZkController I am the leader, no recovery necessary
   [junit4]   2> 46974 INFO  (coreZkRegister-24-thread-1-processing-n:127.0.0.1:59876_ x:collection1 s:shard1 c:control_collection r:core_node1) [n:127.0.0.1:59876_ c:control_collection s:shard1 r:core_node1 x:collection1] o.a.s.c.ZkController publishing state=active
   [junit4]   2> 46974 INFO  (coreZkRegister-24-thread-1-processing-n:127.0.0.1:59876_ x:collection1 s:shard1 c:control_collection r:core_node1) [n:127.0.0.1:59876_ c:control_collection s:shard1 r:core_node1 x:collection1] o.a.s.c.ZkController numShards not found on descriptor - reading it from system property
   [junit4]   2> 46992 INFO  (zkCallback-10-thread-1-processing-n:127.0.0.1:59876_) [n:127.0.0.1:59876_    ] o.a.s.c.DistributedQueue NodeChildrenChanged fired on path /overseer/queue state SyncConnected
   [junit4]   2> 46999 INFO  (OverseerStateUpdate-94146930943918083-127.0.0.1:59876_-n_0000000000) [n:127.0.0.1:59876_    ] o.a.s.c.Overseer processMessage: queueSize: 1, message = {
   [junit4]   2>   "core":"collection1",
   [junit4]   2>   "core_node_name":"core_node1",
   [junit4]   2>   "roles":null,
   [junit4]   2>   "base_url":"http://127.0.0.1:59876",
   [junit4]   2>   "node_name":"127.0.0.1:59876_",
   [junit4]   2>   "numShards":"1",
   [junit4]   2>   "state":"active",
   [junit4]   2>   "shard":"shard1",
   [junit4]   2>   "collection":"control_collection",
   [junit4]   2>   "operation":"state"} current state version: 2
   [junit4]   2> 47004 INFO  (OverseerStateUpdate-94146930943918083-127.0.0.1:59876_-n_0000000000) [n:127.0.0.1:59876_    ] o.a.s.c.o.ReplicaMutator Update state numShards=1 message={
   [junit4]   2>   "core":"collection1",
   [junit4]   2>   "core_node_name":"core_node1",
   [junit4]   2>   "roles":null,
   [junit4]   2>   "base_url":"http://127.0.0.1:59876",
   [junit4]   2>   "node_name":"127.0.0.1:59876_",
   [junit4]   2>   "numShards":"1",
   [junit4]   2>   "state":"active",
   [junit4]   2>   "shard":"shard1",
   [junit4]   2>   "collection":"control_collection",
   [junit4]   2>   "operation":"state"}
   [junit4]   2> 47100 INFO  (zkCallback-10-thread-1-processing-n:127.0.0.1:59876_) [n:127.0.0.1:59876_    ] o.a.s.c.c.ZkStateReader A cluster state change: WatchedEvent state:SyncConnected type:NodeDataChanged path:/clusterstate.json, has occurred - updating... (live nodes size: 1)
   [junit4]   2> 47107 INFO  (zkCallback-10-thread-1-processing-n:127.0.0.1:59876_) [n:127.0.0.1:59876_    ] o.a.s.c.c.ZkStateReader Updated cluster state version to 3
   [junit4]   2> 47156 INFO  (TEST-CloudSolrClientTest.testShutdown-seed#[7DE71572C4ABE1F1]) [    ] o.a.s.c.c.SolrZkClient Using default ZkCredentialsProvider
   [junit4]   2> 47159 INFO  (TEST-CloudSolrClientTest.testShutdown-seed#[7DE71572C4ABE1F1]) [    ] o.a.s.c.c.ConnectionManager Waiting for client to connect to ZooKeeper
   [junit4]   2> 47162 INFO  (zkCallback-12-thread-1) [    ] o.a.s.c.c.ConnectionManager Watcher org.apache.solr.common.cloud.ConnectionManager@13587173 name:ZooKeeperConnection Watcher:127.0.0.1:59869/solr got event WatchedEvent state:SyncConnected type:None path:null path:null type:None
   [junit4]   2> 47163 INFO  (TEST-CloudSolrClientTest.testShutdown-seed#[7DE71572C4ABE1F1]) [    ] o.a.s.c.c.ConnectionManager Client is connected to ZooKeeper
   [junit4]   2> 47164 INFO  (TEST-CloudSolrClientTest.testShutdown-seed#[7DE71572C4ABE1F1]) [    ] o.a.s.c.c.SolrZkClient Using default ZkACLProvider
   [junit4]   2> 47164 INFO  (TEST-CloudSolrClientTest.testShutdown-seed#[7DE71572C4ABE1F1]) [    ] o.a.s.c.c.ZkStateReader Updating cluster state from ZooKeeper... 
   [junit4]   2> 47174 INFO  (TEST-CloudSolrClientTest.testShutdown-seed#[7DE71572C4ABE1F1]) [    ] o.a.s.c.ChaosMonkey monkey: init - expire sessions:false cause connection loss:false
   [junit4]   2> 47174 INFO  (TEST-CloudSolrClientTest.testShutdown-seed#[7DE71572C4ABE1F1]) [    ] o.a.s.c.AbstractFullDistribZkTestBase Creating collection1 with stateFormat=2
   [junit4]   2> 47174 INFO  (TEST-CloudSolrClientTest.testShutdown-seed#[7DE71572C4ABE1F1]) [    ] o.a.s.c.c.SolrZkClient Using default ZkCredentialsProvider
   [junit4]   2> 47177 INFO  (TEST-CloudSolrClientTest.testShutdown-seed#[7DE71572C4ABE1F1]) [    ] o.a.s.c.c.ConnectionManager Waiting for client to connect to ZooKeeper
   [junit4]   2> 47179 INFO  (zkCallback-13-thread-1) [    ] o.a.s.c.c.ConnectionManager Watcher org.apache.solr.common.cloud.ConnectionManager@675733b5 name:ZooKeeperConnection Watcher:127.0.0.1:59869/solr got event WatchedEvent state:SyncConnected type:None path:null path:null type:None
   [junit4]   2> 47179 INFO  (TEST-CloudSolrClientTest.testShutdown-seed#[7DE71572C4ABE1F1]) [    ] o.a.s.c.c.ConnectionManager Client is connected to ZooKeeper
   [junit4]   2> 47179 INFO  (TEST-CloudSolrClientTest.testShutdown-seed#[7DE71572C4ABE1F1]) [    ] o.a.s.c.c.SolrZkClient Using default ZkACLProvider
   [junit4]   2> 47183 INFO  (zkCallback-10-thread-1-processing-n:127.0.0.1:59876_) [n:127.0.0.1:59876_    ] o.a.s.c.DistributedQueue NodeChildrenChanged fired on path /overseer/queue state SyncConnected
   [junit4]   2> 47185 INFO  (OverseerStateUpdate-94146930943918083-127.0.0.1:59876_-n_0000000000) [n:127.0.0.1:59876_    ] o.a.s.c.Overseer processMessage: queueSize: 1, message = {
   [junit4]   2>   "operation":"create",
   [junit4]   2>   "name":"collection1",
   [junit4]   2>   "numShards":"2",
   [junit4]   2>   "stateFormat":"2"} current state version: 3
   [junit4]   2> 47185 INFO  (OverseerStateUpdate-94146930943918083-127.0.0.1:59876_-n_0000000000) [n:127.0.0.1:59876_    ] o.a.s.c.o.ClusterStateMutator building a new cName: collection1
   [junit4]   2> 47243 INFO  (TEST-CloudSolrClientTest.testShutdown-seed#[7DE71572C4ABE1F1]) [    ] o.a.s.SolrTestCaseJ4 Writing core.properties file to C:\Users\JenkinsSlave\workspace\Lucene-Solr-trunk-Windows\solr\build\solr-solrj\test\J1\temp\solr.client.solrj.impl.CloudSolrClientTest_7DE71572C4ABE1F1-001\shard-1-001\cores\collection1
   [junit4]   2> 47246 INFO  (TEST-CloudSolrClientTest.testShutdown-seed#[7DE71572C4ABE1F1]) [    ] o.a.s.c.AbstractFullDistribZkTestBase create jetty 1 in directory C:\Users\JenkinsSlave\workspace\Lucene-Solr-trunk-Windows\solr\build\solr-solrj\test\J1\temp\solr.client.solrj.impl.CloudSolrClientTest_7DE71572C4ABE1F1-001\shard-1-001
   [junit4]   2> 47248 INFO  (TEST-CloudSolrClientTest.testShutdown-seed#[7DE71572C4ABE1F1]) [    ] o.e.j.s.Server jetty-9.2.11.v20150529
   [junit4]   2> 47254 INFO  (TEST-CloudSolrClientTest.testShutdown-seed#[7DE71572C4ABE1F1]) [    ] o.e.j.s.h.ContextHandler Started o.e.j.s.ServletContextHandler@320bfe3e{/,null,AVAILABLE}
   [junit4]   2> 47255 INFO  (TEST-CloudSolrClientTest.testShutdown-seed#[7DE71572C4ABE1F1]) [    ] o.e.j.s.ServerConnector Started ServerConnector@3e3ae80b{HTTP/1.1}{127.0.0.1:59892}
   [junit4]   2> 47256 INFO  (TEST-CloudSolrClientTest.testShutdown-seed#[7DE71572C4ABE1F1]) [    ] o.e.j.s.Server Started @49575ms
   [junit4]   2> 47256 INFO  (TEST-CloudSolrClientTest.testShutdown-seed#[7DE71572C4ABE1F1]) [    ] o.a.s.c.s.e.JettySolrRunner Jetty properties: {solr.data.dir=C:\Users\JenkinsSlave\workspace\Lucene-Solr-trunk-Windows\solr\build\solr-solrj\test\J1\temp\solr.client.solrj.impl.CloudSolrClientTest_7DE71572C4ABE1F1-001\tempDir-001/jetty1, solrconfig=solrconfig.xml, hostContext=/, hostPort=59892, coreRootDirectory=C:\Users\JenkinsSlave\workspace\Lucene-Solr-trunk-Windows\solr\build\solr-solrj\test\J1\temp\solr.client.solrj.impl.CloudSolrClientTest_7DE71572C4ABE1F1-001\shard-1-001\cores}
   [junit4]   2> 47256 INFO  (TEST-CloudSolrClientTest.testShutdown-seed#[7DE71572C4ABE1F1]) [    ] o.a.s.s.SolrDispatchFilter SolrDispatchFilter.init(): sun.misc.Launcher$AppClassLoader@659e0bfd
   [junit4]   2> 47257 INFO  (TEST-CloudSolrClientTest.testShutdown-seed#[7DE71572C4ABE1F1]) [    ] o.a.s.c.SolrResourceLoader new SolrResourceLoader for directory: 'C:\Users\JenkinsSlave\workspace\Lucene-Solr-trunk-Windows\solr\build\solr-solrj\test\J1\temp\solr.client.solrj.impl.CloudSolrClientTest_7DE71572C4ABE1F1-001\shard-1-001\'
   [junit4]   2> 47286 INFO  (OverseerStateUpdate-94146930943918083-127.0.0.1:59876_-n_0000000000) [n:127.0.0.1:59876_    ] o.a.s.c.o.ZkStateWriter going to create_collection /collections/collection1/state.json
   [junit4]   2> 47288 INFO  (TEST-CloudSolrClientTest.testShutdown-seed#[7DE71572C4ABE1F1]) [    ] o.a.s.c.SolrXmlConfig Loading container configuration from C:\Users\JenkinsSlave\workspace\Lucene-Solr-trunk-Windows\solr\build\solr-solrj\test\J1\temp\solr.client.solrj.impl.CloudSolrClientTest_7DE71572C4ABE1F1-001\shard-1-001\solr.xml
   [junit4]   2> 47289 INFO  (zkCallback-12-thread-1) [    ] o.a.s.c.c.ZkStateReader A cluster state change: WatchedEvent state:SyncConnected type:NodeDataChanged path:/clusterstate.json, has occurred - updating... (live nodes size: 1)
   [junit4]   2> 47290 INFO  (zkCallback-10-thread-1-processing-n:127.0.0.1:59876_) [n:127.0.0.1:59876_    ] o.a.s.c.c.ZkStateReader A cluster state change: WatchedEvent state:SyncConnected type:NodeDataChanged path:/clusterstate.json, has occurred - updating... (live nodes size: 1)
   [junit4]   2> 47313 INFO  (TEST-CloudSolrClientTest.testShutdown-seed#[7DE71572C4ABE1F1]) [    ] o.a.s.c.CoresLocator Config-defined core root directory: C:\Users\JenkinsSlave\workspace\Lucene-Solr-trunk-Windows\solr\build\solr-solrj\test\J1\temp\solr.client.solrj.impl.CloudSolrClientTest_7DE71572C4ABE1F1-001\shard-1-001\cores
   [junit4]   2> 47313 INFO  (zkCallback-12-thread-1) [    ] o.a.s.c.c.ZkStateReader Updated cluster state version to 4
   [junit4]   2> 47313 INFO  (TEST-CloudSolrClientTest.testShutdown-seed#[7DE71572C4ABE1F1]) [    ] o.a.s.c.CoreContainer New CoreContainer 1059895083
   [junit4]   2> 47313 INFO  (TEST-CloudSolrClientTest.testShutdown-seed#[7DE71572C4ABE1F1]) [    ] o.a.s.c.CoreContainer Loading cores into CoreContainer [instanceDir=C:\Users\JenkinsSlave\workspace\Lucene-Solr-trunk-Windows\solr\build\solr-solrj\test\J1\temp\solr.client.solrj.impl.CloudSolrClientTest_7DE71572C4ABE1F1-001\shard-1-001\]
   [junit4]   2> 47313 INFO  (zkCallback-10-thread-1-processing-n:127.0.0.1:59876_) [n:127.0.0.1:59876_    ] o.a.s.c.c.ZkStateReader Updated cluster state version to 4
   [junit4]   2> 47314 INFO  (TEST-CloudSolrClientTest.testShutdown-seed#[7DE71572C4ABE1F1]) [    ] o.a.s.c.CoreContainer loading shared library: C:\Users\JenkinsSlave\workspace\Lucene-Solr-trunk-Windows\solr\build\solr-solrj\test\J1\temp\solr.client.solrj.impl.CloudSolrClientTest_7DE71572C4ABE1F1-001\shard-1-001\lib
   [junit4]   2> 47314 WARN  (TEST-CloudSolrClientTest.testShutdown-seed#[7DE71572C4ABE1F1]) [    ] o.a.s.c.SolrResourceLoader Can't find (or read) directory to add to classloader: lib (resolved as: C:\Users\JenkinsSlave\workspace\Lucene-Solr-trunk-Windows\solr\build\solr-solrj\test\J1\temp\solr.client.solrj.impl.CloudSolrClientTest_7DE71572C4ABE1F1-001\shard-1-001\lib).
   [junit4]   2> 47323 INFO  (TEST-CloudSolrClientTest.testShutdown-seed#[7DE71572C4ABE1F1]) [    ] o.a.s.h.c.HttpShardHandlerFactory created with socketTimeout : 90000,urlScheme : ,connTimeout : 15000,maxConnectionsPerHost : 20,maxConnections : 10000,corePoolSize : 0,maximumPoolSize : 2147483647,maxThreadIdleTime : 5,sizeOfQueue : -1,fairnessPolicy : false,useRetries : false,
   [junit4]   2> 47327 INFO  (TEST-CloudSolrClientTest.testShutdown-seed#[7DE71572C4ABE1F1]) [    ] o.a.s.u.UpdateShardHandler Creating UpdateShardHandler HTTP client with params: socketTimeout=340000&connTimeout=45000&retry=true
   [junit4]   2> 47327 INFO  (TEST-CloudSolrClientTest.testShutdown-seed#[7DE71572C4ABE1F1]) [    ] o.a.s.l.LogWatcher SLF4J impl is org.slf4j.impl.Log4jLoggerFactory
   [junit4]   2> 47328 INFO  (TEST-CloudSolrClientTest.testShutdown-seed#[7DE71572C4ABE1F1]) [    ] o.a.s.l.LogWatcher Registering Log Listener [Log4j (org.slf4j.impl.Log4jLoggerFactory)]
   [junit4]   2> 47328 INFO  (TEST-CloudSolrClientTest.testShutdown-seed#[7DE71572C4ABE1F1]) [    ] o.a.s.c.ZkContainer Zookeeper client=127.0.0.1:59869/solr
   [junit4]   2> 47328 INFO  (TEST-CloudSolrClientTest.testShutdown-seed#[7DE71572C4ABE1F1]) [    ] o.a.s.c.ZkController zkHost includes chroot
   [junit4]   2> 47328 INFO  (TEST-CloudSolrClientTest.testShutdown-seed#[7DE71572C4ABE1F1]) [    ] o.a.s.c.c.SolrZkClient Using default ZkCredentialsProvider
   [junit4]   2> 47330 INFO  (TEST-CloudSolrClientTest.testShutdown-seed#[7DE71572C4ABE1F1]) [    ] o.a.s.c.c.ConnectionManager Waiting for client to connect to ZooKeeper
   [junit4]   2> 47333 INFO  (zkCallback-15-thread-1) [    ] o.a.s.c.c.ConnectionManager Watcher org.apache.solr.common.cloud.ConnectionManager@3f289d6a name:ZooKeeperConnection Watcher:127.0.0.1:59869 got event WatchedEvent state:SyncConnected type:None path:null path:null type:None
   [junit4]   2> 47334 INFO  (TEST-CloudSolrClientTest.testShutdown-seed#[7DE71572C4ABE1F1]) [    ] o.a.s.c.c.ConnectionManager Client is connected to ZooKeeper
   [junit4]   2> 47334 INFO  (TEST-CloudSolrClientTest.testShutdown-seed#[7DE71572C4ABE1F1]) [    ] o.a.s.c.c.SolrZkClient Using default ZkACLProvider
   [junit4]   2> 47339 INFO  (TEST-CloudSolrClientTest.testShutdown-seed#[7DE71572C4ABE1F1]) [n:127.0.0.1:59892_    ] o.a.s.c.c.ConnectionManager Waiting for client to connect to ZooKeeper
   [junit4]   2> 47343 INFO  (zkCallback-16-thread-1-processing-n:127.0.0.1:59892_) [n:127.0.0.1:59892_    ] o.a.s.c.c.ConnectionManager Watcher org.apache.solr.common.cloud.ConnectionManager@cb4e9fc name:ZooKeeperConnection Watcher:127.0.0.1:59869/solr got event WatchedEvent state:SyncConnected type:None path:null path:null type:None
   [junit4]   2> 47343 INFO  (TEST-CloudSolrClientTest.testShutdown-seed#[7DE71572C4ABE1F1]) [n:127.0.0.1:59892_    ] o.a.s.c.c.ConnectionManager Client is connected to ZooKeeper
   [junit4]   2> 47352 INFO  (TEST-CloudSolrClientTest.testShutdown-seed#[7DE71572C4ABE1F1]) [n:127.0.0.1:59892_    ] o.a.s.c.c.ZkStateReader Updating cluster state from ZooKeeper... 
   [junit4]   2> 48243 INFO  (TEST-CloudSolrClientTest.testShutdown-seed#[7DE71572C4ABE1F1]) [n:127.0.0.1:59892_    ] o.a.s.c.ZkController Register node as live in ZooKeeper:/live_nodes/127.0.0.1:59892_
   [junit4]   2> 48244 INFO  (TEST-CloudSolrClientTest.testShutdown-seed#[7DE71572C4ABE1F1]) [n:127.0.0.1:59892_    ] o.a.s.c.c.SolrZkClient makePath: /live_nodes/127.0.0.1:59892_
   [junit4]   2> 48249 INFO  (TEST-CloudSolrClientTest.testShutdown-seed#[7DE71572C4ABE1F1]) [n:127.0.0.1:59892_    ] o.a.s.c.Overseer Overseer (id=null) closing
   [junit4]   2> 48250 INFO  (TEST-CloudSolrClientTest.testShutdown-seed#[7DE71572C4ABE1F1]) [n:127.0.0.1:59892_    ] o.a.s.c.LeaderElector Joined leadership election with path: /overseer_elect/election/94146930943918087-127.0.0.1:59892_-n_0000000001
   [junit4]   2> 48257 INFO  (TEST-CloudSolrClientTest.testShutdown-seed#[7DE71572C4ABE1F1]) [n:127.0.0.1:59892_    ] o.a.s.c.LeaderElector Watching path /overseer_elect/election/94146930943918083-127.0.0.1:59876_-n_0000000000 to know if I could be the leader
   [junit4]   2> 48257 INFO  (TEST-CloudSolrClientTest.testShutdown-seed#[7DE71572C4ABE1F1]) [n:127.0.0.1:59892_    ] o.a.s.c.CoreContainer No authentication plugin used.
   [junit4]   2> 48257 INFO  (TEST-CloudSolrClientTest.testShutdown-seed#[7DE71572C4ABE1F1]) [n:127.0.0.1:59892_    ] o.a.s.c.CoreContainer Security conf doesn't exist. Skipping setup for authorization module.
   [junit4]   2> 48258 INFO  (TEST-CloudSolrClientTest.testShutdown-seed#[7DE71572C4ABE1F1]) [n:127.0.0.1:59892_    ] o.a.s.c.CoresLocator Looking for core definitions underneath C:\Users\JenkinsSlave\workspace\Lucene-Solr-trunk-Windows\solr\build\solr-solrj\test\J1\temp\solr.client.solrj.impl.CloudSolrClientTest_7DE71572C4ABE1F1-001\shard-1-001\cores
   [junit4]   2> 48259 INFO  (TEST-CloudSolrClientTest.testShutdown-seed#[7DE71572C4ABE1F1]) [n:127.0.0.1:59892_    ] o.a.s.c.SolrCore Created CoreDescriptor: {name=collection1, config=solrconfig.xml, transient=false, schema=schema.xml, loadOnStartup=true, instanceDir=C:\Users\JenkinsSlave\workspace\Lucene-Solr-trunk-Windows\solr\build\solr-solrj\test\J1\temp\solr.client.solrj.impl.CloudSolrClientTest_7DE71572C4ABE1F1-001\shard-1-001\cores\collection1, collection=collection1, absoluteInstDir=C:\Users\JenkinsSlave\workspace\Lucene-Solr-trunk-Windows\solr\build\solr-solrj\test\J1\temp\solr.client.solrj.impl.CloudSolrClientTest_7DE71572C4ABE1F1-001\shard-1-001\cores\collection1\, coreNodeName=, dataDir=data\, shard=}
   [junit4]   2> 48260 INFO  (TEST-CloudSolrClientTest.testShutdown-seed#[7DE71572C4ABE1F1]) [n:127.0.0.1:59892_    ] o.a.s.c.CoresLocator Found core collection1 in C:\Users\JenkinsSlave\workspace\Lucene-Solr-trunk-Windows\solr\build\solr-solrj\test\J1\temp\solr.client.solrj.impl.CloudSolrClientTest_7DE71572C4ABE1F1-001\shard-1-001\cores\collection1\
   [junit4]   2> 48260 INFO  (TEST-CloudSolrClientTest.testShutdown-seed#[7DE71572C4ABE1F1]) [n:127.0.0.1:59892_    ] o.a.s.c.CoresLocator Found 1 core definitions
   [junit4]   2> 48263 INFO  (TEST-CloudSolrClientTest.testShutdown-seed#[7DE71572C4ABE1F1]) [n:127.0.0.1:59892_    ] o.a.s.s.SolrDispatchFilter user.dir=C:\Users\JenkinsSlave\workspace\Lucene-Solr-trunk-Windows\solr\build\solr-solrj\test\J1
   [junit4]   2> 48263 INFO  (TEST-CloudSolrClientTest.testShutdown-seed#[7DE71572C4ABE1F1]) [n:127.0.0.1:59892_    ] o.a.s.s.SolrDispatchFilter SolrDispatchFilter.init() done
   [junit4]   2> 48264 INFO  (coreLoadExecutor-41-thread-1-processing-n:127.0.0.1:59892_) [n:127.0.0.1:59892_ c:collection1   x:collection1] o.a.s.c.ZkController publishing state=down
   [junit4]   2> 48264 INFO  (coreLoadExecutor-41-thread-1-processing-n:127.0.0.1:59892_) [n:127.0.0.1:59892_ c:collection1   x:collection1] o.a.s.c.ZkController numShards not found on descriptor - reading it from system property
   [junit4]   2> 48266 INFO  (zkCallback-10-thread-1-processing-n:127.0.0.1:59876_) [n:127.0.0.1:59876_    ] o.a.s.c.DistributedQueue NodeChildrenChanged fired on path /overseer/queue state SyncConnected
   [junit4]   2> 48267 INFO  (coreLoadExecutor-41-thread-1-processing-n:127.0.0.1:59892_) [n:127.0.0.1:59892_ c:collection1   x:collection1] o.a.s.c.ZkController Registering watch for external collection collection1
   [junit4]   2> 48267 INFO  (coreLoadExecutor-41-thread-1-processing-n:127.0.0.1:59892_) [n:127.0.0.1:59892_ c:collection1   x:collection1] o.a.s.c.c.ZkStateReader addZkWatch collection1
   [junit4]   2> 48268 INFO  (coreLoadExecutor-41-thread-1-processing-n:127.0.0.1:59892_) [n:127.0.0.1:59892_ c:collection1   x:collection1] o.a.s.c.c.ZkStateReader Updating collection state at /collections/collection1/state.json from ZooKeeper... 
   [junit4]   2> 48268 INFO  (OverseerStateUpdate-94146930943918083-127.0.0.1:59876_-n_0000000000) [n:127.0.0.1:59876_    ] o.a.s.c.Overseer processMessage: queueSize: 1, message = {
   [junit4]   2>   "core":"collection1",
   [junit4]   2>   "roles":null,
   [junit4]   2>   "base_url":"http://127.0.0.1:59892",
   [junit4]   2>   "node_name":"127.0.0.1:59892_",
   [junit4]   2>   "numShards":"2",
   [junit4]   2>   "state":"down",
   [junit4]   2>   "shard":null,
   [junit4]   2>   "collection":"collection1",
   [junit4]   2>   "operation":"state"} current state version: 4
   [junit4]   2> 48269 INFO  (OverseerStateUpdate-94146930943918083-127.0.0.1:59876_-n_0000000000) [n:127.0.0.1:59876_    ] o.a.s.c.o.ReplicaMutator Update state numShards=2 message={
   [junit4]   2>   "core":"collection1",
   [junit4]   2>   "roles":null,
   [junit4]   2>   "base_url":"http://127.0.0.1:59892",
   [junit4]   2>   "node_name":"127.0.0.1:59892_",
   [junit4]   2>   "numShards":"2",
   [junit4]   2>   "state":"down",
   [junit4]   2>   "shard":null,
   [junit4]   2>   "collection":"collection1",
   [junit4]   2>   "operation":"state"}
   [junit4]   2> 48269 INFO  (OverseerStateUpdate-94146930943918083-127.0.0.1:59876_-n_0000000000) [n:127.0.0.1:59876_    ] o.a.s.c.o.ReplicaMutator Collection already exists with numShards=2
   [junit4]   2> 48269 INFO  (OverseerStateUpdate-94146930943918083-127.0.0.1:59876_-n_0000000000) [n:127.0.0.1:59876_    ] o.a.s.c.o.ReplicaMutator Assigning new node to shard shard=shard2
   [junit4]   2> 48274 INFO  (coreLoadExecutor-41-thread-1-processing-n:127.0.0.1:59892_) [n:127.0.0.1:59892_ c:collection1   x:collection1] o.a.s.c.c.ZkStateReader Updating data for collection1 to ver 0 
   [junit4]   2> 48274 INFO  (coreLoadExecutor-41-thread-1-processing-n:127.0.0.1:59892_) [n:127.0.0.1:59892_ c:collection1   x:collection1] o.a.s.c.ZkController look for our core node name
   [junit4]   2> 48363 INFO  (OverseerStateUpdate-94146930943918083-127.0.0.1:59876_-n_0000000000) [n:127.0.0.1:59876_    ] o.a.s.c.o.ZkStateWriter going to update_collection /collections/collection1/state.json version: 0
   [junit4]   2> 48365 INFO  (zkCallback-16-thread-1-processing-n:127.0.0.1:59892_) [n:127.0.0.1:59892_    ] o.a.s.c.c.ZkStateReader A cluster state change: WatchedEvent state:SyncConnected type:NodeDataChanged path:/collections/collection1/state.json for collection collection1 has occurred - updating... (live nodes size: 2)
   [junit4]   2> 48367 INFO  (zkCallback-16-thread-1-processing-n:127.0.0.1:59892_) [n:127.0.0.1:59892_    ] o.a.s.c.c.ZkStateReader Updating data for collection1 to ver 1 
   [junit4]   2> 49148 INFO  (coreLoadExecutor-41-thread-1-processing-n:127.0.0.1:59892_) [n:127.0.0.1:59892_ c:collection1   x:collection1] o.a.s.c.ZkController waiting to find shard id in clusterstate for collection1
   [junit4]   2> 49148 INFO  (coreLoadExecutor-41-thread-1-processing-n:127.0.0.1:59892_) [n:127.0.0.1:59892_ c:collection1   x:collection1] o.a.s.c.ZkController Check for collection zkNode:collection1
   [junit4]   2> 49149 INFO  (coreLoadExecutor-41-thread-1-processing-n:127.0.0.1:59892_) [n:127.0.0.1:59892_ c:collection1   x:collection1] o.a.s.c.ZkController Collection zkNode exists
   [junit4]   2> 49149 INFO  (coreLoadExecutor-41-thread-1-processing-n:127.0.0.1:59892_) [n:127.0.0.1:59892_ c:collection1   x:collection1] o.a.s.c.c.ZkStateReader Load collection config from:/collections/collection1
   [junit4]   2> 49149 INFO  (coreLoadExecutor-41-thread-1-processing-n:127.0.0.1:59892_) [n:127.0.0.1:59892_ c:collection1   x:collection1] o.a.s.c.c.ZkStateReader path=/collections/collection1 configName=conf1 specified config exists in ZooKeeper
   [junit4]   2> 49149 INFO  (coreLoadExecutor-41-thread-1-processing-n:127.0.0.1:59892_) [n:127.0.0.1:59892_ c:collection1   x:collection1] o.a.s.c.SolrResourceLoader new SolrResourceLoader for directory: 'C:\Users\JenkinsSlave\workspace\Lucene-Solr-trunk-Windows\solr\build\solr-solrj\test\J1\temp\solr.client.solrj.impl.CloudSolrClientTest_7DE71572C4ABE1F1-001\shard-1-001\cores\collection1\'
   [junit4]   2> 49169 INFO  (coreLoadExecutor-41-thread-1-processing-n:127.0.0.1:59892_) [n:127.0.0.1:59892_ c:collection1   x:collection1] o.a.s.c.Config loaded config solrconfig.xml with version 0 
   [junit4]   2> 49175 INFO  (coreLoadExecutor-41-thread-1-processing-n:127.0.0.1:59892_) [n:127.0.0.1:59892_ c:collection1   x:collection1] o.a.s.c.SolrConfig current version of requestparams : -1
   [junit4]   2> 49177 INFO  (coreLoadExecutor-41-thread-1-processing-n:127.0.0.1:59892_) [n:127.0.0.1:59892_ c:collection1   x:collection1] o.a.s.c.SolrConfig Using Lucene MatchVersion: 6.0.0
   [junit4]   2> 49184 INFO  (coreLoadExecutor-41-thread-1-processing-n:127.0.0.1:59892_) [n:127.0.0.1:59892_ c:collection1   x:collection1] o.a.s.c.Config Loaded SolrConfig: solrconfig.xml
   [junit4]   2> 49186 INFO  (coreLoadExecutor-41-thread-1-processing-n:127.0.0.1:59892_) [n:127.0.0.1:59892_ c:collection1   x:collection1] o.a.s.s.IndexSchema Reading Solr Schema from /configs/conf1/schema.xml
   [junit4]   2> 49192 INFO  (coreLoadExecutor-41-thread-1-processing-n:127.0.0.1:59892_) [n:127.0.0.1:59892_ c:collection1   x:collection1] o.a.s.s.IndexSchema [collection1] Schema name=test
   [junit4]   2> 49258 INFO  (coreLoadExecutor-41-thread-1-processing-n:127.0.0.1:59892_) [n:127.0.0.1:59892_ c:collection1   x:collection1] o.a.s.s.IndexSchema default search field in schema is text
   [junit4]   2> 49259 INFO  (coreLoadExecutor-41-thread-1-processing-n:127.0.0.1:59892_) [n:127.0.0.1:59892_ c:collection1   x:collection1] o.a.s.s.IndexSchema unique key field: id
   [junit4]   2> 49259 WARN  (coreLoadExecutor-41-thread-1-processing-n:127.0.0.1:59892_) [n:127.0.0.1:59892_ c:collection1   x:collection1] o.a.s.s.IndexSchema Field lowerfilt1and2 is not multivalued and destination for multiple copyFields (2)
   [junit4]   2> 49259 WARN  (coreLoadExecutor-41-thread-1-processing-n:127.0.0.1:59892_) [n:127.0.0.1:59892_ c:collection1   x:collection1] o.a.s.s.IndexSchema Field text is not multivalued and destination for multiple copyFields (3)
   [junit4]   2> 49259 INFO  (coreLoadExecutor-41-thread-1-processing-n:127.0.0.1:59892_) [n:127.0.0.1:59892_ c:collection1   x:collection1] o.a.s.c.CoreContainer Creating SolrCore 'collection1' using configuration from collection collection1
   [junit4]   2> 49259 INFO  (coreLoadExecutor-41-thread-1-processing-n:127.0.0.1:59892_) [n:127.0.0.1:59892_ c:collection1 s:shard2 r:core_node1 x:collection1] o.a.s.c.SolrCore org.apache.solr.core.MockDirectoryFactory
   [junit4]   2> 49260 INFO  (coreLoadExecutor-41-thread-1-processing-n:127.0.0.1:59892_) [n:127.0.0.1:59892_ c:collection1 s:shard2 r:core_node1 x:collection1] o.a.s.c.SolrCore [[collection1] ] Opening new SolrCore at [C:\Users\JenkinsSlave\workspace\Lucene-Solr-trunk-Windows\solr\build\solr-solrj\test\J1\temp\solr.client.solrj.impl.CloudSolrClientTest_7DE71572C4ABE1F1-001\shard-1-001\cores\collection1\], dataDir=[null]
   [junit4]   2> 49260 INFO  (coreLoadExecutor-41-thread-1-processing-n:127.0.0.1:59892_) [n:127.0.0.1:59892_ c:collection1 s:shard2 r:core_node1 x:collection1] o.a.s.c.SolrCore JMX monitoring not detected for core: collection1
   [junit4]   2> 49260 INFO  (coreLoadExecutor-41-thread-1-processing-n:127.0.0.1:59892_) [n:127.0.0.1:59892_ c:collection1 s:shard2 r:core_node1 x:collection1] o.a.s.c.CachingDirectoryFactory return new directory for C:\Users\JenkinsSlave\workspace\Lucene-Solr-trunk-Windows\solr\build\solr-solrj\test\J1\temp\solr.client.solrj.impl.CloudSolrClientTest_7DE71572C4ABE1F1-001\shard-1-001\cores\collection1\data\
   [junit4]   2> 49261 INFO  (coreLoadExecutor-41-thread-1-processing-n:127.0.0.1:59892_) [n:127.0.0.1:59892_ c:collection1 s:shard2 r:core_node1 x:collection1] o.a.s.c.SolrCore New index directory detected: old=null new=C:\Users\JenkinsSlave\workspace\Lucene-Solr-trunk-Windows\solr\build\solr-solrj\test\J1\temp\solr.client.solrj.impl.CloudSolrClientTest_7DE71572C4ABE1F1-001\shard-1-001\cores\collection1\data\index/
   [junit4]   2> 49261 WARN  (coreLoadExecutor-41-thread-1-processing-n:127.0.0.1:59892_) [n:127.0.0.1:59892_ c:collection1 s:shard2 r:core_node1 x:collection1] o.a.s.c.SolrCore [collection1] Solr index directory 'C:\Users\JenkinsSlave\workspace\Lucene-Solr-trunk-Windows\solr\build\solr-solrj\test\J1\temp\solr.client.solrj.impl.CloudSolrClientTest_7DE71572C4ABE1F1-001\shard-1-001\cores\collection1\data\index' doesn't exist. Creating new index...
   [junit4]   2> 49261 INFO  (coreLoadExecutor-41-thread-1-processing-n:127.0.0.1:59892_) [n:127.0.0.1:59892_ c:collection1 s:shard2 r:core_node1 x:collection1] o.a.s.c.CachingDirectoryFactory return new directory for C:\Users\JenkinsSlave\workspace\Lucene-Solr-trunk-Windows\solr\build\solr-solrj\test\J1\temp\solr.client.solrj.impl.CloudSolrClientTest_7DE71572C4ABE1F1-001\shard-1-001\cores\collection1\data\index
   [junit4]   2> 49261 INFO  (coreLoadExecutor-41-thread-1-processing-n:127.0.0.1:59892_) [n:127.0.0.1:59892_ c:collection1 s:shard2 r:core_node1 x:collection1] o.a.s.c.SolrCore SolrDeletionPolicy.onCommit: commits: num=1
   [junit4]   2> 	commit{dir=MockDirectoryWrapper(RAMDirectory@2c61d671 lockFactory=org.apache.lucene.store.SingleInstanceLockFactory@5482c42f),segFN=segments_1,generation=1}
   [junit4]   2> 49261 INFO  (coreLoadExecutor-41-thread-1-processing-n:127.0.0.1:59892_) [n:127.0.0.1:59892_ c:collection1 s:shard2 r:core_node1 x:collection1] o.a.s.c.SolrCore newest commit generation = 1
   [junit4]   2> 49262 INFO  (OldIndexDirectoryCleanupThreadForCore-collection1) [n:127.0.0.1:59892_ c:collection1 s:shard2 r:core_node1 x:collection1] o.a.s.c.SolrCore Looking for old index directories to cleanup for core collection1 in C:\Users\JenkinsSlave\workspace\Lucene-Solr-trunk-Windows\solr\build\solr-solrj\test\J1\temp\solr.client.solrj.impl.CloudSolrClientTest_7DE71572C4ABE1F1-001\shard-1-001\cores\collection1\data\
   [junit4]   2> 49263 WARN  (OldIndexDirectoryCleanupThreadForCore-collection1) [n:127.0.0.1:59892_ c:collection1 s:shard2 r:core_node1 x:collection1] o.a.s.c.DirectoryFactory C:\Users\JenkinsSlave\workspace\Lucene-Solr-trunk-Windows\solr\build\solr-solrj\test\J1\temp\solr.client.solrj.impl.CloudSolrClientTest_7DE71572C4ABE1F1-001\shard-1-001\cores\collection1\data\ does not point to a valid data directory; skipping clean-up of old index directories.
   [junit4]   2> 49266 INFO  (coreLoadExecutor-41-thread-1-processing-n:127.0.0.1:59892_) [n:127.0.0.1:59892_ c:collection1 s:shard2 r:core_node1 x:collection1] o.a.s.c.SolrCore no updateRequestProcessorChain defined as default, creating implicit default
   [junit4]   2> 49270 INFO  (coreLoadExecutor-41-thread-1-processing-n:127.0.0.1:59892_) [n:127.0.0.1:59892_ c:collection1 s:shard2 r:core_node1 x:collection1] o.a.s.h.l.XMLLoader xsltCacheLifetimeSeconds=60
   [junit4]   2> 49272 INFO  (coreLoadExecutor-41-thread-1-processing-n:127.0.0.1:59892_) [n:127.0.0.1:59892_ c:collection1 s:shard2 r:core_node1 x:collection1] o.a.s.h.l.XMLLoader xsltCacheLifetimeSeconds=60
   [junit4]   2> 49273 INFO  (coreLoadExecutor-41-thread-1-processing-n:127.0.0.1:59892_) [n:127.0.0.1:59892_ c:collection1 s:shard2 r:core_node1 x:collection1] o.a.s.h.l.XMLLoader xsltCacheLifetimeSeconds=60
   [junit4]   2> 49276 INFO  (coreLoadExecutor-41-thread-1-processing-n:127.0.0.1:59892_) [n:127.0.0.1:59892_ c:collection1 s:shard2 r:core_node1 x:collection1] o.a.s.h.l.XMLLoader xsltCacheLifetimeSeconds=60
   [junit4]   2> 49278 INFO  (coreLoadExecutor-41-thread-1-processing-n:127.0.0.1:59892_) [n:127.0.0.1:59892_ c:collection1 s:shard2 r:core_node1 x:collection1] o.a.s.c.RequestHandlers Registered paths: /admin/mbeans,standard,,/update/csv,/update/json/docs,/admin/luke,/admin/segments,/get,/admin/system,/replication,/admin/properties,/config,/schema,/admin/plugins,/admin/logging,/update/json,/admin/threads,/admin/ping,/update,/admin/file
   [junit4]   2> 49278 WARN  (coreLoadExecutor-41-thread-1-processing-n:127.0.0.1:59892_) [n:127.0.0.1:59892_ c:collection1 s:shard2 r:core_node1 x:collection1] o.a.s.c.RequestHandlers no default request handler is registered (either '/select' or 'standard')
   [junit4]   2> 49279 INFO  (coreLoadExecutor-41-thread-1-processing-n:127.0.0.1:59892_) [n:127.0.0.1:59892_ c:collection1 s:shard2 r:core_node1 x:collection1] o.a.s.c.SolrCore Using default statsCache cache: org.apache.solr.search.stats.LocalStatsCache
   [junit4]   2> 49280 INFO  (coreLoadExecutor-41-thread-1-processing-n:127.0.0.1:59892_) [n:127.0.0.1:59892_ c:collection1 s:shard2 r:core_node1 x:collection1] o.a.s.u.UpdateHandler Using UpdateLog implementation: org.apache.solr.update.UpdateLog
   [junit4]   2> 49280 INFO  (coreLoadExecutor-41-thread-1-processing-n:127.0.0.1:59892_) [n:127.0.0.1:59892_ c:collection1 s:shard2 r:core_node1 x:collection1] o.a.s.u.UpdateLog Initializing UpdateLog: dataDir= defaultSyncLevel=FLUSH numRecordsToKeep=100 maxNumLogsToKeep=10 numVersionBuckets=65536
   [junit4]   2> 49281 INFO  (coreLoadExecutor-41-thread-1-processing-n:127.0.0.1:59892_) [n:127.0.0.1:59892_ c:collection1 s:shard2 r:core_node1 x:collection1] o.a.s.c.SolrCore Hard AutoCommit: disabled
   [junit4]   2> 49281 INFO  (coreLoadExecutor-41-thread-1-processing-n:127.0.0.1:59892_) [n:127.0.0.1:59892_ c:collection1 s:shard2 r:core_node1 x:collection1] o.a.s.c.SolrCore Soft AutoCommit: disabled
   [junit4]   2> 49282 INFO  (coreLoadExecutor-41-thread-1-processing-n:127.0.0.1:59892_) [n:127.0.0.1:59892_ c:collection1 s:shard2 r:core_node1 x:collection1] o.a.s.c.SolrCore SolrDeletionPolicy.onInit: commits: num=1
   [junit4]   2> 	commit{dir=MockDirectoryWrapper(RAMDirectory@2c61d671 lockFactory=org.apache.lucene.store.SingleInstanceLockFactory@5482c42f),segFN=segments_1,generation=1}
   [junit4]   2> 49282 INFO  (coreLoadExecutor-41-thread-1-processing-n:127.0.0.1:59892_) [n:127.0.0.1:59892_ c:collection1 s:shard2 r:core_node1 x:collection1] o.a.s.c.SolrCore newest commit generation = 1
   [junit4]   2> 49282 INFO  (coreLoadExecutor-41-thread-1-processing-n:127.0.0.1:59892_) [n:127.0.0.1:59892_ c:collection1 s:shard2 r:core_node1 x:collection1] o.a.s.s.SolrIndexSearcher Opening Searcher@2f2a86b9[collection1] main
   [junit4]   2> 49282 INFO  (coreLoadExecutor-41-thread-1-processing-n:127.0.0.1:59892_) [n:127.0.0.1:59892_ c:collection1 s:shard2 r:core_node1 x:collection1] o.a.s.c.c.ZkStateReader Load collection config from:/collections/collection1
   [junit4]   2> 49283 INFO  (coreLoadExecutor-41-thread-1-processing-n:127.0.0.1:59892_) [n:127.0.0.1:59892_ c:collection1 s:shard2 r:core_node1 x:collection1] o.a.s.c.c.ZkStateReader path=/collections/collection1 configName=conf1 specified config exists in ZooKeeper
   [junit4]   2> 49283 INFO  (coreLoadExecutor-41-thread-1-processing-n:127.0.0.1:59892_) [n:127.0.0.1:59892_ c:collection1 s:shard2 r:core_node1 x:collection1] o.a.s.r.ManagedResourceStorage Setting up ZooKeeper-based storage for the RestManager with znodeBase: /configs/conf1
   [junit4]   2> 49284 INFO  (coreLoadExecutor-41-thread-1-processing-n:127.0.0.1:59892_) [n:127.0.0.1:59892_ c:collection1 s:shard2 r:core_node1 x:collection1] o.a.s.r.ManagedResourceStorage Configured ZooKeeperStorageIO with znodeBase: /configs/conf1
   [junit4]   2> 49284 INFO  (coreLoadExecutor-41-thread-1-processing-n:127.0.0.1:59892_) [n:127.0.0.1:59892_ c:collection1 s:shard2 r:core_node1 x:collection1] o.a.s.r.RestManager Initializing RestManager with initArgs: {}
   [junit4]   2> 49284 INFO  (coreLoadExecutor-41-thread-1-processing-n:127.0.0.1:59892_) [n:127.0.0.1:59892_ c:collection1 s:shard2 r:core_node1 x:collection1] o.a.s.r.ManagedResourceStorage Reading _rest_managed.json using ZooKeeperStorageIO:path=/configs/conf1
   [junit4]   2> 49285 INFO  (coreLoadExecutor-41-thread-1-processing-n:127.0.0.1:59892_) [n:127.0.0.1:59892_ c:collection1 s:shard2 r:core_node1 x:collection1] o.a.s.r.ManagedResourceStorage No data found for znode /configs/conf1/_rest_managed.json
   [junit4]   2> 49285 INFO  (coreLoadExecutor-41-thread-1-processing-n:127.0.0.1:59892_) [n:127.0.0.1:59892_ c:collection1 s:shard2 r:core_node1 x:collection1] o.a.s.r.ManagedResourceStorage Loaded null at path _rest_managed.json using ZooKeeperStorageIO:path=/configs/conf1
   [junit4]   2> 49285 INFO  (coreLoadExecutor-41-thread-1-processing-n:127.0.0.1:59892_) [n:127.0.0.1:59892_ c:collection1 s:shard2 r:core_node1 x:collection1] o.a.s.r.RestManager Initializing 0 registered ManagedResources
   [junit4]   2> 49285 INFO  (coreLoadExecutor-41-thread-1-processing-n:127.0.0.1:59892_) [n:127.0.0.1:59892_ c:collection1 s:shard2 r:core_node1 x:collection1] o.a.s.h.ReplicationHandler Commits will be reserved for  10000
   [junit4]   2> 49285 INFO  (coreLoadExecutor-41-thread-1-processing-n:127.0.0.1:59892_) [n:127.0.0.1:59892_ c:collection1 s:shard2 r:core_node1 x:collection1] o.a.s.u.UpdateLog Looking up max value of version field to seed version buckets
   [junit4]   2> 49285 INFO  (searcherExecutor-42-thread-1

[...truncated too long message...]

   [junit4]   2>   "core_node_name":"core_node2",
   [junit4]   2>   "roles":null,
   [junit4]   2>   "base_url":"http://127.0.0.1:60087",
   [junit4]   2>   "node_name":"127.0.0.1:60087_",
   [junit4]   2>   "numShards":"2",
   [junit4]   2>   "state":"down",
   [junit4]   2>   "shard":"shard2",
   [junit4]   2>   "collection":"multicollection1",
   [junit4]   2>   "operation":"state"} current state version: 57
   [junit4]   2> 141038 INFO  (TEST-CloudSolrClientTest.test-seed#[7DE71572C4ABE1F1]) [n:127.0.0.1:60087_ c:checkStateVerCol s:shard3 r:core_node1 x:checkStateVerCol_shard3_replica1] o.a.s.c.SolrCore [checkStateVerCol_shard3_replica1] Closing main searcher on request.
   [junit4]   2> 141038 INFO  (TEST-CloudSolrClientTest.test-seed#[7DE71572C4ABE1F1]) [n:127.0.0.1:60087_ c:checkStateVerCol s:shard3 r:core_node1 x:checkStateVerCol_shard3_replica1] o.a.s.c.CachingDirectoryFactory Closing MockDirectoryFactory - 2 directories currently being tracked
   [junit4]   2> 141039 INFO  (TEST-CloudSolrClientTest.test-seed#[7DE71572C4ABE1F1]) [n:127.0.0.1:60087_ c:checkStateVerCol s:shard3 r:core_node1 x:checkStateVerCol_shard3_replica1] o.a.s.c.CachingDirectoryFactory looking to close C:\Users\JenkinsSlave\workspace\Lucene-Solr-trunk-Windows\solr\build\solr-solrj\test\J1\temp\solr.client.solrj.impl.CloudSolrClientTest_7DE71572C4ABE1F1-001\shard-3-003\cores\checkStateVerCol_shard3_replica1\data\ [CachedDir<<refCount=0;path=C:\Users\JenkinsSlave\workspace\Lucene-Solr-trunk-Windows\solr\build\solr-solrj\test\J1\temp\solr.client.solrj.impl.CloudSolrClientTest_7DE71572C4ABE1F1-001\shard-3-003\cores\checkStateVerCol_shard3_replica1\data\;done=false>>]
   [junit4]   2> 141039 INFO  (TEST-CloudSolrClientTest.test-seed#[7DE71572C4ABE1F1]) [n:127.0.0.1:60087_ c:checkStateVerCol s:shard3 r:core_node1 x:checkStateVerCol_shard3_replica1] o.a.s.c.CachingDirectoryFactory Closing directory: C:\Users\JenkinsSlave\workspace\Lucene-Solr-trunk-Windows\solr\build\solr-solrj\test\J1\temp\solr.client.solrj.impl.CloudSolrClientTest_7DE71572C4ABE1F1-001\shard-3-003\cores\checkStateVerCol_shard3_replica1\data\
   [junit4]   2> 141039 INFO  (TEST-CloudSolrClientTest.test-seed#[7DE71572C4ABE1F1]) [n:127.0.0.1:60087_ c:checkStateVerCol s:shard3 r:core_node1 x:checkStateVerCol_shard3_replica1] o.a.s.c.CachingDirectoryFactory looking to close C:\Users\JenkinsSlave\workspace\Lucene-Solr-trunk-Windows\solr\build\solr-solrj\test\J1\temp\solr.client.solrj.impl.CloudSolrClientTest_7DE71572C4ABE1F1-001\shard-3-003\cores\checkStateVerCol_shard3_replica1\data\index [CachedDir<<refCount=0;path=C:\Users\JenkinsSlave\workspace\Lucene-Solr-trunk-Windows\solr\build\solr-solrj\test\J1\temp\solr.client.solrj.impl.CloudSolrClientTest_7DE71572C4ABE1F1-001\shard-3-003\cores\checkStateVerCol_shard3_replica1\data\index;done=false>>]
   [junit4]   2> 141039 INFO  (TEST-CloudSolrClientTest.test-seed#[7DE71572C4ABE1F1]) [n:127.0.0.1:60087_ c:checkStateVerCol s:shard3 r:core_node1 x:checkStateVerCol_shard3_replica1] o.a.s.c.CachingDirectoryFactory Closing directory: C:\Users\JenkinsSlave\workspace\Lucene-Solr-trunk-Windows\solr\build\solr-solrj\test\J1\temp\solr.client.solrj.impl.CloudSolrClientTest_7DE71572C4ABE1F1-001\shard-3-003\cores\checkStateVerCol_shard3_replica1\data\index
   [junit4]   2> 141039 INFO  (OverseerStateUpdate-94146933596618762-127.0.0.1:60087_-n_0000000003) [n:127.0.0.1:60087_    ] o.a.s.c.o.ReplicaMutator Update state numShards=2 message={
   [junit4]   2>   "core":"multicollection1_shard2_replica2",
   [junit4]   2>   "core_node_name":"core_node2",
   [junit4]   2>   "roles":null,
   [junit4]   2>   "base_url":"http://127.0.0.1:60087",
   [junit4]   2>   "node_name":"127.0.0.1:60087_",
   [junit4]   2>   "numShards":"2",
   [junit4]   2>   "state":"down",
   [junit4]   2>   "shard":"shard2",
   [junit4]   2>   "collection":"multicollection1",
   [junit4]   2>   "operation":"state"}
   [junit4]   2> 141042 INFO  (TEST-CloudSolrClientTest.test-seed#[7DE71572C4ABE1F1]) [n:127.0.0.1:60087_ c:checkStateVerCol s:shard3 r:core_node1 x:checkStateVerCol_shard3_replica1] o.a.s.c.Overseer Overseer (id=94146933596618762-127.0.0.1:60087_-n_0000000003) closing
   [junit4]   2> 141044 INFO  (OverseerStateUpdate-94146933596618762-127.0.0.1:60087_-n_0000000003) [n:127.0.0.1:60087_    ] o.a.s.c.Overseer Overseer Loop exiting : 127.0.0.1:60087_
   [junit4]   2> 141044 INFO  (zkCallback-61-thread-3-processing-n:127.0.0.1:60087_) [n:127.0.0.1:60087_    ] o.a.s.c.DistributedQueue NodeChildrenChanged fired on path /overseer/queue state SyncConnected
   [junit4]   2> 142583 WARN  (zkCallback-61-thread-3-processing-n:127.0.0.1:60087_) [n:127.0.0.1:60087_    ] o.a.s.c.c.ZkStateReader ZooKeeper watch triggered, but Solr cannot talk to ZK
   [junit4]   2> 142584 INFO  (TEST-CloudSolrClientTest.test-seed#[7DE71572C4ABE1F1]) [    ] o.e.j.s.ServerConnector Stopped ServerConnector@28235e85{HTTP/1.1}{127.0.0.1:0}
   [junit4]   2> 142585 INFO  (TEST-CloudSolrClientTest.test-seed#[7DE71572C4ABE1F1]) [    ] o.e.j.s.h.ContextHandler Stopped o.e.j.s.ServletContextHandler@4eb59d79{/,null,UNAVAILABLE}
   [junit4]   2> 142595 INFO  (TEST-CloudSolrClientTest.test-seed#[7DE71572C4ABE1F1]) [n:127.0.0.1:60087_ c:checkStateVerCol s:shard3 r:core_node1 x:checkStateVerCol_shard3_replica1] o.a.s.c.ZkTestServer connecting to 127.0.0.1:60050 60050
   [junit4]   2> 144904 INFO  (Thread-157) [n:127.0.0.1:60034_ c:collection1 s:shard2 r:core_node3 x:collection1] o.a.s.c.ZkTestServer connecting to 127.0.0.1:60050 60050
   [junit4]   2> 144905 WARN  (Thread-157) [n:127.0.0.1:60034_ c:collection1 s:shard2 r:core_node3 x:collection1] o.a.s.c.ZkTestServer Watch limit violations: 
   [junit4]   2> Maximum concurrent create/delete watches above limit:
   [junit4]   2> 
   [junit4]   2> 	11	/solr/aliases.json
   [junit4]   2> 	11	/solr/clusterstate.json
   [junit4]   2> 	4	/solr/configs/conf1
   [junit4]   2> 
   [junit4]   2> Maximum concurrent children watches above limit:
   [junit4]   2> 
   [junit4]   2> 	11	/solr/live_nodes
   [junit4]   2> 	3	/solr/overseer/collection-queue-work
   [junit4]   2> 
   [junit4]   2> NOTE: reproduce with: ant test  -Dtestcase=CloudSolrClientTest -Dtests.method=test -Dtests.seed=7DE71572C4ABE1F1 -Dtests.slow=true -Dtests.locale=hi -Dtests.timezone=Europe/Nicosia -Dtests.asserts=true -Dtests.file.encoding=UTF-8
   [junit4] FAILURE 60.6s J1 | CloudSolrClientTest.test <<<
   [junit4]    > Throwable #1: java.lang.AssertionError: There should be 3 documents because there should be two id=1 docs due to overwrite=false expected:<3> but was:<1>
   [junit4]    > 	at __randomizedtesting.SeedInfo.seed([7DE71572C4ABE1F1:F5B32AA86A578C09]:0)
   [junit4]    > 	at org.apache.solr.client.solrj.impl.CloudSolrClientTest.testOverwriteOption(CloudSolrClientTest.java:160)
   [junit4]    > 	at org.apache.solr.client.solrj.impl.CloudSolrClientTest.test(CloudSolrClientTest.java:118)
   [junit4]    > 	at org.apache.solr.BaseDistributedSearchTestCase$ShardsRepeatRule$ShardsFixedStatement.callStatement(BaseDistributedSearchTestCase.java:960)
   [junit4]    > 	at org.apache.solr.BaseDistributedSearchTestCase$ShardsRepeatRule$ShardsStatement.evaluate(BaseDistributedSearchTestCase.java:935)
   [junit4]    > 	at java.lang.Thread.run(Thread.java:745)
   [junit4]   2> 144949 INFO  (SUITE-CloudSolrClientTest-seed#[7DE71572C4ABE1F1]-worker) [n:127.0.0.1:60087_ c:checkStateVerCol s:shard3 r:core_node1 x:checkStateVerCol_shard3_replica1] o.a.s.SolrTestCaseJ4 ###deleteCore
   [junit4]   2> NOTE: leaving temporary files on disk at: C:\Users\JenkinsSlave\workspace\Lucene-Solr-trunk-Windows\solr\build\solr-solrj\test\J1\temp\solr.client.solrj.impl.CloudSolrClientTest_7DE71572C4ABE1F1-001
   [junit4]   2> NOTE: test params are: codec=Asserting(Lucene53): {_version_=PostingsFormat(name=Memory doPackFST= false), multiDefault=PostingsFormat(name=Asserting), a_t=PostingsFormat(name=Asserting), intDefault=PostingsFormat(name=Memory doPackFST= false), id=PostingsFormat(name=LuceneFixedGap), text=Lucene50(blocksize=128), range_facet_l=PostingsFormat(name=Asserting), timestamp=PostingsFormat(name=Asserting)}, docValues:{}, sim=DefaultSimilarity, locale=hi, timezone=Europe/Nicosia
   [junit4]   2> NOTE: Windows 7 6.1 amd64/Oracle Corporation 1.8.0_45 (64-bit)/cpus=3,threads=1,free=55156264,total=279969792
   [junit4]   2> NOTE: All tests run in this JVM: [LargeVolumeBinaryJettyTest, TestClusteringResponse, SolrExampleStreamingBinaryTest, CloudSolrClientTest]
   [junit4] Completed [32/65] on J1 in 101.34s, 3 tests, 1 failure <<< FAILURES!

[...truncated 109 lines...]
BUILD FAILED
C:\Users\JenkinsSlave\workspace\Lucene-Solr-trunk-Windows\build.xml:526: The following error occurred while executing this line:
C:\Users\JenkinsSlave\workspace\Lucene-Solr-trunk-Windows\build.xml:474: The following error occurred while executing this line:
C:\Users\JenkinsSlave\workspace\Lucene-Solr-trunk-Windows\build.xml:61: The following error occurred while executing this line:
C:\Users\JenkinsSlave\workspace\Lucene-Solr-trunk-Windows\extra-targets.xml:39: The following error occurred while executing this line:
C:\Users\JenkinsSlave\workspace\Lucene-Solr-trunk-Windows\solr\build.xml:243: The following error occurred while executing this line:
C:\Users\JenkinsSlave\workspace\Lucene-Solr-trunk-Windows\solr\common-build.xml:513: The following error occurred while executing this line:
C:\Users\JenkinsSlave\workspace\Lucene-Solr-trunk-Windows\lucene\common-build.xml:1426: The following error occurred while executing this line:
C:\Users\JenkinsSlave\workspace\Lucene-Solr-trunk-Windows\lucene\common-build.xml:981: There were test failures: 65 suites, 459 tests, 1 failure

Total time: 65 minutes 10 seconds
Build step 'Invoke Ant' marked build as failure
Archiving artifacts
Recording test results
Email was triggered for: Failure - Any
Sending email for trigger: Failure - Any



Mime
View raw message