lucene-dev mailing list archives

Site index · List index
Message view « Date » · « Thread »
Top « Date » · « Thread »
From Policeman Jenkins Server <jenk...@thetaphi.de>
Subject [JENKINS-EA] Lucene-Solr-trunk-Linux (64bit/jdk1.8.0_60-ea-b24) - Build # 13667 - Still Failing!
Date Thu, 30 Jul 2015 22:06:01 GMT
Build: http://jenkins.thetaphi.de/job/Lucene-Solr-trunk-Linux/13667/
Java: 64bit/jdk1.8.0_60-ea-b24 -XX:-UseCompressedOops -XX:+UseParallelGC

1 tests failed.
FAILED:  org.apache.solr.cloud.LeaderFailoverAfterPartitionTest.test

Error Message:
Didn't see replicas [core_node1, core_node3] come up within 90000 ms! ClusterState: DocCollection(c8n_1x3_lf)={   "replicationFactor":"3",   "shards":{"shard1":{       "range":"80000000-7fffffff",       "state":"active",       "replicas":{         "core_node1":{           "core":"c8n_1x3_lf_shard1_replica2",           "base_url":"http://127.0.0.1:42710/_tg",           "node_name":"127.0.0.1:42710__tg",           "state":"recovering"},         "core_node2":{           "core":"c8n_1x3_lf_shard1_replica1",           "base_url":"http://127.0.0.1:38967/_tg",           "node_name":"127.0.0.1:38967__tg",           "state":"down"},         "core_node3":{           "core":"c8n_1x3_lf_shard1_replica3",           "base_url":"http://127.0.0.1:57256/_tg",           "node_name":"127.0.0.1:57256__tg",           "state":"active",           "leader":"true"}}}},   "router":{"name":"compositeId"},   "maxShardsPerNode":"1",   "autoAddReplicas":"false"}

Stack Trace:
java.lang.AssertionError: Didn't see replicas [core_node1, core_node3] come up within 90000 ms! ClusterState: DocCollection(c8n_1x3_lf)={
  "replicationFactor":"3",
  "shards":{"shard1":{
      "range":"80000000-7fffffff",
      "state":"active",
      "replicas":{
        "core_node1":{
          "core":"c8n_1x3_lf_shard1_replica2",
          "base_url":"http://127.0.0.1:42710/_tg",
          "node_name":"127.0.0.1:42710__tg",
          "state":"recovering"},
        "core_node2":{
          "core":"c8n_1x3_lf_shard1_replica1",
          "base_url":"http://127.0.0.1:38967/_tg",
          "node_name":"127.0.0.1:38967__tg",
          "state":"down"},
        "core_node3":{
          "core":"c8n_1x3_lf_shard1_replica3",
          "base_url":"http://127.0.0.1:57256/_tg",
          "node_name":"127.0.0.1:57256__tg",
          "state":"active",
          "leader":"true"}}}},
  "router":{"name":"compositeId"},
  "maxShardsPerNode":"1",
  "autoAddReplicas":"false"}
	at __randomizedtesting.SeedInfo.seed([F286CE0F22D44ACD:7AD2F1D58C282735]:0)
	at org.junit.Assert.fail(Assert.java:93)
	at org.apache.solr.cloud.HttpPartitionTest.waitToSeeReplicasActive(HttpPartitionTest.java:565)
	at org.apache.solr.cloud.LeaderFailoverAfterPartitionTest.testRf3WithLeaderFailover(LeaderFailoverAfterPartitionTest.java:178)
	at org.apache.solr.cloud.LeaderFailoverAfterPartitionTest.test(LeaderFailoverAfterPartitionTest.java:51)
	at sun.reflect.NativeMethodAccessorImpl.invoke0(Native Method)
	at sun.reflect.NativeMethodAccessorImpl.invoke(NativeMethodAccessorImpl.java:62)
	at sun.reflect.DelegatingMethodAccessorImpl.invoke(DelegatingMethodAccessorImpl.java:43)
	at java.lang.reflect.Method.invoke(Method.java:497)
	at com.carrotsearch.randomizedtesting.RandomizedRunner.invoke(RandomizedRunner.java:1627)
	at com.carrotsearch.randomizedtesting.RandomizedRunner$6.evaluate(RandomizedRunner.java:836)
	at com.carrotsearch.randomizedtesting.RandomizedRunner$7.evaluate(RandomizedRunner.java:872)
	at com.carrotsearch.randomizedtesting.RandomizedRunner$8.evaluate(RandomizedRunner.java:886)
	at org.apache.solr.BaseDistributedSearchTestCase$ShardsRepeatRule$ShardsFixedStatement.callStatement(BaseDistributedSearchTestCase.java:966)
	at org.apache.solr.BaseDistributedSearchTestCase$ShardsRepeatRule$ShardsStatement.evaluate(BaseDistributedSearchTestCase.java:941)
	at com.carrotsearch.randomizedtesting.rules.SystemPropertiesRestoreRule$1.evaluate(SystemPropertiesRestoreRule.java:57)
	at org.apache.lucene.util.TestRuleSetupTeardownChained$1.evaluate(TestRuleSetupTeardownChained.java:50)
	at org.apache.lucene.util.AbstractBeforeAfterRule$1.evaluate(AbstractBeforeAfterRule.java:46)
	at org.apache.lucene.util.TestRuleThreadAndTestName$1.evaluate(TestRuleThreadAndTestName.java:49)
	at org.apache.lucene.util.TestRuleIgnoreAfterMaxFailures$1.evaluate(TestRuleIgnoreAfterMaxFailures.java:65)
	at org.apache.lucene.util.TestRuleMarkFailure$1.evaluate(TestRuleMarkFailure.java:48)
	at com.carrotsearch.randomizedtesting.rules.StatementAdapter.evaluate(StatementAdapter.java:36)
	at com.carrotsearch.randomizedtesting.ThreadLeakControl$StatementRunner.run(ThreadLeakControl.java:365)
	at com.carrotsearch.randomizedtesting.ThreadLeakControl.forkTimeoutingTask(ThreadLeakControl.java:798)
	at com.carrotsearch.randomizedtesting.ThreadLeakControl$3.evaluate(ThreadLeakControl.java:458)
	at com.carrotsearch.randomizedtesting.RandomizedRunner.runSingleTest(RandomizedRunner.java:845)
	at com.carrotsearch.randomizedtesting.RandomizedRunner$3.evaluate(RandomizedRunner.java:747)
	at com.carrotsearch.randomizedtesting.RandomizedRunner$4.evaluate(RandomizedRunner.java:781)
	at com.carrotsearch.randomizedtesting.RandomizedRunner$5.evaluate(RandomizedRunner.java:792)
	at com.carrotsearch.randomizedtesting.rules.StatementAdapter.evaluate(StatementAdapter.java:36)
	at com.carrotsearch.randomizedtesting.rules.SystemPropertiesRestoreRule$1.evaluate(SystemPropertiesRestoreRule.java:57)
	at org.apache.lucene.util.AbstractBeforeAfterRule$1.evaluate(AbstractBeforeAfterRule.java:46)
	at com.carrotsearch.randomizedtesting.rules.StatementAdapter.evaluate(StatementAdapter.java:36)
	at org.apache.lucene.util.TestRuleStoreClassName$1.evaluate(TestRuleStoreClassName.java:42)
	at com.carrotsearch.randomizedtesting.rules.NoShadowingOrOverridesOnMethodsRule$1.evaluate(NoShadowingOrOverridesOnMethodsRule.java:39)
	at com.carrotsearch.randomizedtesting.rules.NoShadowingOrOverridesOnMethodsRule$1.evaluate(NoShadowingOrOverridesOnMethodsRule.java:39)
	at com.carrotsearch.randomizedtesting.rules.StatementAdapter.evaluate(StatementAdapter.java:36)
	at com.carrotsearch.randomizedtesting.rules.StatementAdapter.evaluate(StatementAdapter.java:36)
	at com.carrotsearch.randomizedtesting.rules.StatementAdapter.evaluate(StatementAdapter.java:36)
	at org.apache.lucene.util.TestRuleAssertionsRequired$1.evaluate(TestRuleAssertionsRequired.java:54)
	at org.apache.lucene.util.TestRuleMarkFailure$1.evaluate(TestRuleMarkFailure.java:48)
	at org.apache.lucene.util.TestRuleIgnoreAfterMaxFailures$1.evaluate(TestRuleIgnoreAfterMaxFailures.java:65)
	at org.apache.lucene.util.TestRuleIgnoreTestSuites$1.evaluate(TestRuleIgnoreTestSuites.java:55)
	at com.carrotsearch.randomizedtesting.rules.StatementAdapter.evaluate(StatementAdapter.java:36)
	at com.carrotsearch.randomizedtesting.ThreadLeakControl$StatementRunner.run(ThreadLeakControl.java:365)
	at java.lang.Thread.run(Thread.java:745)




Build Log:
[...truncated 10192 lines...]
   [junit4] Suite: org.apache.solr.cloud.LeaderFailoverAfterPartitionTest
   [junit4]   2> Creating dataDir: /home/jenkins/workspace/Lucene-Solr-trunk-Linux/solr/build/solr-core/test/J1/temp/solr.cloud.LeaderFailoverAfterPartitionTest_F286CE0F22D44ACD-001/init-core-data-001
   [junit4]   2> 526820 INFO  (SUITE-LeaderFailoverAfterPartitionTest-seed#[F286CE0F22D44ACD]-worker) [    ] o.a.s.BaseDistributedSearchTestCase Setting hostContext system property: /_tg/
   [junit4]   2> 526822 INFO  (TEST-LeaderFailoverAfterPartitionTest.test-seed#[F286CE0F22D44ACD]) [    ] o.a.s.c.ZkTestServer STARTING ZK TEST SERVER
   [junit4]   2> 526823 INFO  (Thread-1819) [    ] o.a.s.c.ZkTestServer client port:0.0.0.0/0.0.0.0:0
   [junit4]   2> 526823 INFO  (Thread-1819) [    ] o.a.s.c.ZkTestServer Starting server
   [junit4]   2> 526923 INFO  (TEST-LeaderFailoverAfterPartitionTest.test-seed#[F286CE0F22D44ACD]) [    ] o.a.s.c.ZkTestServer start zk server on port:58096
   [junit4]   2> 526923 INFO  (TEST-LeaderFailoverAfterPartitionTest.test-seed#[F286CE0F22D44ACD]) [    ] o.a.s.c.c.SolrZkClient Using default ZkCredentialsProvider
   [junit4]   2> 526934 INFO  (TEST-LeaderFailoverAfterPartitionTest.test-seed#[F286CE0F22D44ACD]) [    ] o.a.s.c.c.ConnectionManager Waiting for client to connect to ZooKeeper
   [junit4]   2> 526937 INFO  (zkCallback-512-thread-1) [    ] o.a.s.c.c.ConnectionManager Watcher org.apache.solr.common.cloud.ConnectionManager@38d151df name:ZooKeeperConnection Watcher:127.0.0.1:58096 got event WatchedEvent state:SyncConnected type:None path:null path:null type:None
   [junit4]   2> 526937 INFO  (TEST-LeaderFailoverAfterPartitionTest.test-seed#[F286CE0F22D44ACD]) [    ] o.a.s.c.c.ConnectionManager Client is connected to ZooKeeper
   [junit4]   2> 526937 INFO  (TEST-LeaderFailoverAfterPartitionTest.test-seed#[F286CE0F22D44ACD]) [    ] o.a.s.c.c.SolrZkClient Using default ZkACLProvider
   [junit4]   2> 526937 INFO  (TEST-LeaderFailoverAfterPartitionTest.test-seed#[F286CE0F22D44ACD]) [    ] o.a.s.c.c.SolrZkClient makePath: /solr
   [junit4]   2> 526939 INFO  (TEST-LeaderFailoverAfterPartitionTest.test-seed#[F286CE0F22D44ACD]) [    ] o.a.s.c.c.SolrZkClient Using default ZkCredentialsProvider
   [junit4]   2> 526939 INFO  (TEST-LeaderFailoverAfterPartitionTest.test-seed#[F286CE0F22D44ACD]) [    ] o.a.s.c.c.ConnectionManager Waiting for client to connect to ZooKeeper
   [junit4]   2> 526940 INFO  (zkCallback-513-thread-1) [    ] o.a.s.c.c.ConnectionManager Watcher org.apache.solr.common.cloud.ConnectionManager@abf530a name:ZooKeeperConnection Watcher:127.0.0.1:58096/solr got event WatchedEvent state:SyncConnected type:None path:null path:null type:None
   [junit4]   2> 526941 INFO  (TEST-LeaderFailoverAfterPartitionTest.test-seed#[F286CE0F22D44ACD]) [    ] o.a.s.c.c.ConnectionManager Client is connected to ZooKeeper
   [junit4]   2> 526941 INFO  (TEST-LeaderFailoverAfterPartitionTest.test-seed#[F286CE0F22D44ACD]) [    ] o.a.s.c.c.SolrZkClient Using default ZkACLProvider
   [junit4]   2> 526941 INFO  (TEST-LeaderFailoverAfterPartitionTest.test-seed#[F286CE0F22D44ACD]) [    ] o.a.s.c.c.SolrZkClient makePath: /collections/collection1
   [junit4]   2> 526942 INFO  (TEST-LeaderFailoverAfterPartitionTest.test-seed#[F286CE0F22D44ACD]) [    ] o.a.s.c.c.SolrZkClient makePath: /collections/collection1/shards
   [junit4]   2> 526942 INFO  (TEST-LeaderFailoverAfterPartitionTest.test-seed#[F286CE0F22D44ACD]) [    ] o.a.s.c.c.SolrZkClient makePath: /collections/control_collection
   [junit4]   2> 526943 INFO  (TEST-LeaderFailoverAfterPartitionTest.test-seed#[F286CE0F22D44ACD]) [    ] o.a.s.c.c.SolrZkClient makePath: /collections/control_collection/shards
   [junit4]   2> 526943 INFO  (TEST-LeaderFailoverAfterPartitionTest.test-seed#[F286CE0F22D44ACD]) [    ] o.a.s.c.AbstractZkTestCase put /home/jenkins/workspace/Lucene-Solr-trunk-Linux/solr/core/src/test-files/solr/collection1/conf/solrconfig-tlog.xml to /configs/conf1/solrconfig.xml
   [junit4]   2> 526944 INFO  (TEST-LeaderFailoverAfterPartitionTest.test-seed#[F286CE0F22D44ACD]) [    ] o.a.s.c.c.SolrZkClient makePath: /configs/conf1/solrconfig.xml
   [junit4]   2> 526945 INFO  (TEST-LeaderFailoverAfterPartitionTest.test-seed#[F286CE0F22D44ACD]) [    ] o.a.s.c.AbstractZkTestCase put /home/jenkins/workspace/Lucene-Solr-trunk-Linux/solr/core/src/test-files/solr/collection1/conf/schema.xml to /configs/conf1/schema.xml
   [junit4]   2> 526945 INFO  (TEST-LeaderFailoverAfterPartitionTest.test-seed#[F286CE0F22D44ACD]) [    ] o.a.s.c.c.SolrZkClient makePath: /configs/conf1/schema.xml
   [junit4]   2> 526946 INFO  (TEST-LeaderFailoverAfterPartitionTest.test-seed#[F286CE0F22D44ACD]) [    ] o.a.s.c.AbstractZkTestCase put /home/jenkins/workspace/Lucene-Solr-trunk-Linux/solr/core/src/test-files/solr/collection1/conf/solrconfig.snippet.randomindexconfig.xml to /configs/conf1/solrconfig.snippet.randomindexconfig.xml
   [junit4]   2> 526946 INFO  (TEST-LeaderFailoverAfterPartitionTest.test-seed#[F286CE0F22D44ACD]) [    ] o.a.s.c.c.SolrZkClient makePath: /configs/conf1/solrconfig.snippet.randomindexconfig.xml
   [junit4]   2> 526946 INFO  (TEST-LeaderFailoverAfterPartitionTest.test-seed#[F286CE0F22D44ACD]) [    ] o.a.s.c.AbstractZkTestCase put /home/jenkins/workspace/Lucene-Solr-trunk-Linux/solr/core/src/test-files/solr/collection1/conf/stopwords.txt to /configs/conf1/stopwords.txt
   [junit4]   2> 526947 INFO  (TEST-LeaderFailoverAfterPartitionTest.test-seed#[F286CE0F22D44ACD]) [    ] o.a.s.c.c.SolrZkClient makePath: /configs/conf1/stopwords.txt
   [junit4]   2> 526947 INFO  (TEST-LeaderFailoverAfterPartitionTest.test-seed#[F286CE0F22D44ACD]) [    ] o.a.s.c.AbstractZkTestCase put /home/jenkins/workspace/Lucene-Solr-trunk-Linux/solr/core/src/test-files/solr/collection1/conf/protwords.txt to /configs/conf1/protwords.txt
   [junit4]   2> 526947 INFO  (TEST-LeaderFailoverAfterPartitionTest.test-seed#[F286CE0F22D44ACD]) [    ] o.a.s.c.c.SolrZkClient makePath: /configs/conf1/protwords.txt
   [junit4]   2> 526948 INFO  (TEST-LeaderFailoverAfterPartitionTest.test-seed#[F286CE0F22D44ACD]) [    ] o.a.s.c.AbstractZkTestCase put /home/jenkins/workspace/Lucene-Solr-trunk-Linux/solr/core/src/test-files/solr/collection1/conf/currency.xml to /configs/conf1/currency.xml
   [junit4]   2> 526948 INFO  (TEST-LeaderFailoverAfterPartitionTest.test-seed#[F286CE0F22D44ACD]) [    ] o.a.s.c.c.SolrZkClient makePath: /configs/conf1/currency.xml
   [junit4]   2> 526948 INFO  (TEST-LeaderFailoverAfterPartitionTest.test-seed#[F286CE0F22D44ACD]) [    ] o.a.s.c.AbstractZkTestCase put /home/jenkins/workspace/Lucene-Solr-trunk-Linux/solr/core/src/test-files/solr/collection1/conf/enumsConfig.xml to /configs/conf1/enumsConfig.xml
   [junit4]   2> 526949 INFO  (TEST-LeaderFailoverAfterPartitionTest.test-seed#[F286CE0F22D44ACD]) [    ] o.a.s.c.c.SolrZkClient makePath: /configs/conf1/enumsConfig.xml
   [junit4]   2> 526949 INFO  (TEST-LeaderFailoverAfterPartitionTest.test-seed#[F286CE0F22D44ACD]) [    ] o.a.s.c.AbstractZkTestCase put /home/jenkins/workspace/Lucene-Solr-trunk-Linux/solr/core/src/test-files/solr/collection1/conf/open-exchange-rates.json to /configs/conf1/open-exchange-rates.json
   [junit4]   2> 526949 INFO  (TEST-LeaderFailoverAfterPartitionTest.test-seed#[F286CE0F22D44ACD]) [    ] o.a.s.c.c.SolrZkClient makePath: /configs/conf1/open-exchange-rates.json
   [junit4]   2> 526950 INFO  (TEST-LeaderFailoverAfterPartitionTest.test-seed#[F286CE0F22D44ACD]) [    ] o.a.s.c.AbstractZkTestCase put /home/jenkins/workspace/Lucene-Solr-trunk-Linux/solr/core/src/test-files/solr/collection1/conf/mapping-ISOLatin1Accent.txt to /configs/conf1/mapping-ISOLatin1Accent.txt
   [junit4]   2> 526950 INFO  (TEST-LeaderFailoverAfterPartitionTest.test-seed#[F286CE0F22D44ACD]) [    ] o.a.s.c.c.SolrZkClient makePath: /configs/conf1/mapping-ISOLatin1Accent.txt
   [junit4]   2> 526950 INFO  (TEST-LeaderFailoverAfterPartitionTest.test-seed#[F286CE0F22D44ACD]) [    ] o.a.s.c.AbstractZkTestCase put /home/jenkins/workspace/Lucene-Solr-trunk-Linux/solr/core/src/test-files/solr/collection1/conf/old_synonyms.txt to /configs/conf1/old_synonyms.txt
   [junit4]   2> 526950 INFO  (TEST-LeaderFailoverAfterPartitionTest.test-seed#[F286CE0F22D44ACD]) [    ] o.a.s.c.c.SolrZkClient makePath: /configs/conf1/old_synonyms.txt
   [junit4]   2> 526951 INFO  (TEST-LeaderFailoverAfterPartitionTest.test-seed#[F286CE0F22D44ACD]) [    ] o.a.s.c.AbstractZkTestCase put /home/jenkins/workspace/Lucene-Solr-trunk-Linux/solr/core/src/test-files/solr/collection1/conf/synonyms.txt to /configs/conf1/synonyms.txt
   [junit4]   2> 526951 INFO  (TEST-LeaderFailoverAfterPartitionTest.test-seed#[F286CE0F22D44ACD]) [    ] o.a.s.c.c.SolrZkClient makePath: /configs/conf1/synonyms.txt
   [junit4]   2> 526999 INFO  (TEST-LeaderFailoverAfterPartitionTest.test-seed#[F286CE0F22D44ACD]) [    ] o.a.s.SolrTestCaseJ4 Writing core.properties file to /home/jenkins/workspace/Lucene-Solr-trunk-Linux/solr/build/solr-core/test/J1/temp/solr.cloud.LeaderFailoverAfterPartitionTest_F286CE0F22D44ACD-001/control-001/cores/collection1
   [junit4]   2> 527001 INFO  (TEST-LeaderFailoverAfterPartitionTest.test-seed#[F286CE0F22D44ACD]) [    ] o.e.j.s.Server jetty-9.2.11.v20150529
   [junit4]   2> 527002 INFO  (TEST-LeaderFailoverAfterPartitionTest.test-seed#[F286CE0F22D44ACD]) [    ] o.e.j.s.h.ContextHandler Started o.e.j.s.ServletContextHandler@4e6a1f13{/_tg,null,AVAILABLE}
   [junit4]   2> 527004 INFO  (TEST-LeaderFailoverAfterPartitionTest.test-seed#[F286CE0F22D44ACD]) [    ] o.e.j.s.ServerConnector Started ServerConnector@6e1401e7{HTTP/1.1}{127.0.0.1:40064}
   [junit4]   2> 527004 INFO  (TEST-LeaderFailoverAfterPartitionTest.test-seed#[F286CE0F22D44ACD]) [    ] o.e.j.s.Server Started @528865ms
   [junit4]   2> 527004 INFO  (TEST-LeaderFailoverAfterPartitionTest.test-seed#[F286CE0F22D44ACD]) [    ] o.a.s.c.s.e.JettySolrRunner Jetty properties: {solr.data.dir=/home/jenkins/workspace/Lucene-Solr-trunk-Linux/solr/build/solr-core/test/J1/temp/solr.cloud.LeaderFailoverAfterPartitionTest_F286CE0F22D44ACD-001/tempDir-001/control/data, hostContext=/_tg, hostPort=57256, coreRootDirectory=/home/jenkins/workspace/Lucene-Solr-trunk-Linux/solr/build/solr-core/test/J1/temp/solr.cloud.LeaderFailoverAfterPartitionTest_F286CE0F22D44ACD-001/control-001/cores}
   [junit4]   2> 527005 INFO  (TEST-LeaderFailoverAfterPartitionTest.test-seed#[F286CE0F22D44ACD]) [    ] o.a.s.s.SolrDispatchFilter SolrDispatchFilter.init(): sun.misc.Launcher$AppClassLoader@4e0e2f2a
   [junit4]   2> 527005 INFO  (TEST-LeaderFailoverAfterPartitionTest.test-seed#[F286CE0F22D44ACD]) [    ] o.a.s.c.SolrResourceLoader new SolrResourceLoader for directory: '/home/jenkins/workspace/Lucene-Solr-trunk-Linux/solr/build/solr-core/test/J1/temp/solr.cloud.LeaderFailoverAfterPartitionTest_F286CE0F22D44ACD-001/control-001/'
   [junit4]   2> 527014 INFO  (TEST-LeaderFailoverAfterPartitionTest.test-seed#[F286CE0F22D44ACD]) [    ] o.a.s.c.c.SolrZkClient Using default ZkCredentialsProvider
   [junit4]   2> 527014 INFO  (TEST-LeaderFailoverAfterPartitionTest.test-seed#[F286CE0F22D44ACD]) [    ] o.a.s.c.c.ConnectionManager Waiting for client to connect to ZooKeeper
   [junit4]   2> 527016 INFO  (zkCallback-514-thread-1) [    ] o.a.s.c.c.ConnectionManager Watcher org.apache.solr.common.cloud.ConnectionManager@6af0d4bc name:ZooKeeperConnection Watcher:127.0.0.1:58096/solr got event WatchedEvent state:SyncConnected type:None path:null path:null type:None
   [junit4]   2> 527016 INFO  (TEST-LeaderFailoverAfterPartitionTest.test-seed#[F286CE0F22D44ACD]) [    ] o.a.s.c.c.ConnectionManager Client is connected to ZooKeeper
   [junit4]   2> 527016 INFO  (TEST-LeaderFailoverAfterPartitionTest.test-seed#[F286CE0F22D44ACD]) [    ] o.a.s.c.c.SolrZkClient Using default ZkACLProvider
   [junit4]   2> 527017 INFO  (TEST-LeaderFailoverAfterPartitionTest.test-seed#[F286CE0F22D44ACD]) [    ] o.a.s.s.SolrDispatchFilter Loading solr.xml from SolrHome (not found in ZooKeeper)
   [junit4]   2> 527018 INFO  (TEST-LeaderFailoverAfterPartitionTest.test-seed#[F286CE0F22D44ACD]) [    ] o.a.s.c.SolrXmlConfig Loading container configuration from /home/jenkins/workspace/Lucene-Solr-trunk-Linux/solr/build/solr-core/test/J1/temp/solr.cloud.LeaderFailoverAfterPartitionTest_F286CE0F22D44ACD-001/control-001/solr.xml
   [junit4]   2> 527022 INFO  (TEST-LeaderFailoverAfterPartitionTest.test-seed#[F286CE0F22D44ACD]) [    ] o.a.s.c.CoresLocator Config-defined core root directory: /home/jenkins/workspace/Lucene-Solr-trunk-Linux/solr/build/solr-core/test/J1/temp/solr.cloud.LeaderFailoverAfterPartitionTest_F286CE0F22D44ACD-001/control-001/cores
   [junit4]   2> 527022 INFO  (TEST-LeaderFailoverAfterPartitionTest.test-seed#[F286CE0F22D44ACD]) [    ] o.a.s.c.CoreContainer New CoreContainer 1851356733
   [junit4]   2> 527022 INFO  (TEST-LeaderFailoverAfterPartitionTest.test-seed#[F286CE0F22D44ACD]) [    ] o.a.s.c.CoreContainer Loading cores into CoreContainer [instanceDir=/home/jenkins/workspace/Lucene-Solr-trunk-Linux/solr/build/solr-core/test/J1/temp/solr.cloud.LeaderFailoverAfterPartitionTest_F286CE0F22D44ACD-001/control-001/]
   [junit4]   2> 527022 INFO  (TEST-LeaderFailoverAfterPartitionTest.test-seed#[F286CE0F22D44ACD]) [    ] o.a.s.c.CoreContainer loading shared library: /home/jenkins/workspace/Lucene-Solr-trunk-Linux/solr/build/solr-core/test/J1/temp/solr.cloud.LeaderFailoverAfterPartitionTest_F286CE0F22D44ACD-001/control-001/lib
   [junit4]   2> 527022 WARN  (TEST-LeaderFailoverAfterPartitionTest.test-seed#[F286CE0F22D44ACD]) [    ] o.a.s.c.SolrResourceLoader Can't find (or read) directory to add to classloader: lib (resolved as: /home/jenkins/workspace/Lucene-Solr-trunk-Linux/solr/build/solr-core/test/J1/temp/solr.cloud.LeaderFailoverAfterPartitionTest_F286CE0F22D44ACD-001/control-001/lib).
   [junit4]   2> 527027 INFO  (TEST-LeaderFailoverAfterPartitionTest.test-seed#[F286CE0F22D44ACD]) [    ] o.a.s.h.c.HttpShardHandlerFactory created with socketTimeout : 90000,urlScheme : ,connTimeout : 15000,maxConnectionsPerHost : 20,maxConnections : 10000,corePoolSize : 0,maximumPoolSize : 2147483647,maxThreadIdleTime : 5,sizeOfQueue : -1,fairnessPolicy : false,useRetries : false,
   [junit4]   2> 527028 INFO  (TEST-LeaderFailoverAfterPartitionTest.test-seed#[F286CE0F22D44ACD]) [    ] o.a.s.u.UpdateShardHandler Creating UpdateShardHandler HTTP client with params: socketTimeout=340000&connTimeout=45000&retry=true
   [junit4]   2> 527028 INFO  (TEST-LeaderFailoverAfterPartitionTest.test-seed#[F286CE0F22D44ACD]) [    ] o.a.s.l.LogWatcher SLF4J impl is org.slf4j.impl.Log4jLoggerFactory
   [junit4]   2> 527028 INFO  (TEST-LeaderFailoverAfterPartitionTest.test-seed#[F286CE0F22D44ACD]) [    ] o.a.s.l.LogWatcher Registering Log Listener [Log4j (org.slf4j.impl.Log4jLoggerFactory)]
   [junit4]   2> 527028 INFO  (TEST-LeaderFailoverAfterPartitionTest.test-seed#[F286CE0F22D44ACD]) [    ] o.a.s.c.ZkContainer Zookeeper client=127.0.0.1:58096/solr
   [junit4]   2> 527028 INFO  (TEST-LeaderFailoverAfterPartitionTest.test-seed#[F286CE0F22D44ACD]) [    ] o.a.s.c.ZkController zkHost includes chroot
   [junit4]   2> 527028 INFO  (TEST-LeaderFailoverAfterPartitionTest.test-seed#[F286CE0F22D44ACD]) [    ] o.a.s.c.c.SolrZkClient Using default ZkCredentialsProvider
   [junit4]   2> 527029 INFO  (TEST-LeaderFailoverAfterPartitionTest.test-seed#[F286CE0F22D44ACD]) [    ] o.a.s.c.c.ConnectionManager Waiting for client to connect to ZooKeeper
   [junit4]   2> 527030 INFO  (zkCallback-516-thread-1) [    ] o.a.s.c.c.ConnectionManager Watcher org.apache.solr.common.cloud.ConnectionManager@6b09391d name:ZooKeeperConnection Watcher:127.0.0.1:58096 got event WatchedEvent state:SyncConnected type:None path:null path:null type:None
   [junit4]   2> 527030 INFO  (TEST-LeaderFailoverAfterPartitionTest.test-seed#[F286CE0F22D44ACD]) [    ] o.a.s.c.c.ConnectionManager Client is connected to ZooKeeper
   [junit4]   2> 527031 INFO  (TEST-LeaderFailoverAfterPartitionTest.test-seed#[F286CE0F22D44ACD]) [    ] o.a.s.c.c.SolrZkClient Using default ZkACLProvider
   [junit4]   2> 527032 INFO  (TEST-LeaderFailoverAfterPartitionTest.test-seed#[F286CE0F22D44ACD]) [n:127.0.0.1:57256__tg    ] o.a.s.c.c.ConnectionManager Waiting for client to connect to ZooKeeper
   [junit4]   2> 527034 INFO  (zkCallback-517-thread-1-processing-n:127.0.0.1:57256__tg) [n:127.0.0.1:57256__tg    ] o.a.s.c.c.ConnectionManager Watcher org.apache.solr.common.cloud.ConnectionManager@486fd7d5 name:ZooKeeperConnection Watcher:127.0.0.1:58096/solr got event WatchedEvent state:SyncConnected type:None path:null path:null type:None
   [junit4]   2> 527034 INFO  (TEST-LeaderFailoverAfterPartitionTest.test-seed#[F286CE0F22D44ACD]) [n:127.0.0.1:57256__tg    ] o.a.s.c.c.ConnectionManager Client is connected to ZooKeeper
   [junit4]   2> 527035 INFO  (TEST-LeaderFailoverAfterPartitionTest.test-seed#[F286CE0F22D44ACD]) [n:127.0.0.1:57256__tg    ] o.a.s.c.c.SolrZkClient makePath: /overseer/queue
   [junit4]   2> 527036 INFO  (TEST-LeaderFailoverAfterPartitionTest.test-seed#[F286CE0F22D44ACD]) [n:127.0.0.1:57256__tg    ] o.a.s.c.c.SolrZkClient makePath: /overseer/collection-queue-work
   [junit4]   2> 527037 INFO  (TEST-LeaderFailoverAfterPartitionTest.test-seed#[F286CE0F22D44ACD]) [n:127.0.0.1:57256__tg    ] o.a.s.c.c.SolrZkClient makePath: /overseer/collection-map-running
   [junit4]   2> 527037 INFO  (TEST-LeaderFailoverAfterPartitionTest.test-seed#[F286CE0F22D44ACD]) [n:127.0.0.1:57256__tg    ] o.a.s.c.c.SolrZkClient makePath: /overseer/collection-map-completed
   [junit4]   2> 527038 INFO  (TEST-LeaderFailoverAfterPartitionTest.test-seed#[F286CE0F22D44ACD]) [n:127.0.0.1:57256__tg    ] o.a.s.c.c.SolrZkClient makePath: /overseer/collection-map-failure
   [junit4]   2> 527039 INFO  (TEST-LeaderFailoverAfterPartitionTest.test-seed#[F286CE0F22D44ACD]) [n:127.0.0.1:57256__tg    ] o.a.s.c.c.SolrZkClient makePath: /live_nodes
   [junit4]   2> 527040 INFO  (TEST-LeaderFailoverAfterPartitionTest.test-seed#[F286CE0F22D44ACD]) [n:127.0.0.1:57256__tg    ] o.a.s.c.c.SolrZkClient makePath: /aliases.json
   [junit4]   2> 527040 INFO  (TEST-LeaderFailoverAfterPartitionTest.test-seed#[F286CE0F22D44ACD]) [n:127.0.0.1:57256__tg    ] o.a.s.c.c.SolrZkClient makePath: /clusterstate.json
   [junit4]   2> 527041 INFO  (TEST-LeaderFailoverAfterPartitionTest.test-seed#[F286CE0F22D44ACD]) [n:127.0.0.1:57256__tg    ] o.a.s.c.ZkController Register node as live in ZooKeeper:/live_nodes/127.0.0.1:57256__tg
   [junit4]   2> 527041 INFO  (TEST-LeaderFailoverAfterPartitionTest.test-seed#[F286CE0F22D44ACD]) [n:127.0.0.1:57256__tg    ] o.a.s.c.c.SolrZkClient makePath: /live_nodes/127.0.0.1:57256__tg
   [junit4]   2> 527042 INFO  (TEST-LeaderFailoverAfterPartitionTest.test-seed#[F286CE0F22D44ACD]) [n:127.0.0.1:57256__tg    ] o.a.s.c.c.SolrZkClient makePath: /overseer_elect
   [junit4]   2> 527042 INFO  (TEST-LeaderFailoverAfterPartitionTest.test-seed#[F286CE0F22D44ACD]) [n:127.0.0.1:57256__tg    ] o.a.s.c.c.SolrZkClient makePath: /overseer_elect/election
   [junit4]   2> 527043 INFO  (TEST-LeaderFailoverAfterPartitionTest.test-seed#[F286CE0F22D44ACD]) [n:127.0.0.1:57256__tg    ] o.a.s.c.Overseer Overseer (id=null) closing
   [junit4]   2> 527043 INFO  (TEST-LeaderFailoverAfterPartitionTest.test-seed#[F286CE0F22D44ACD]) [n:127.0.0.1:57256__tg    ] o.a.s.c.LeaderElector Joined leadership election with path: /overseer_elect/election/94259947387420676-127.0.0.1:57256__tg-n_0000000000
   [junit4]   2> 527043 INFO  (TEST-LeaderFailoverAfterPartitionTest.test-seed#[F286CE0F22D44ACD]) [n:127.0.0.1:57256__tg    ] o.a.s.c.OverseerElectionContext I am going to be the leader 127.0.0.1:57256__tg
   [junit4]   2> 527043 INFO  (TEST-LeaderFailoverAfterPartitionTest.test-seed#[F286CE0F22D44ACD]) [n:127.0.0.1:57256__tg    ] o.a.s.c.c.SolrZkClient makePath: /overseer_elect/leader
   [junit4]   2> 527044 INFO  (TEST-LeaderFailoverAfterPartitionTest.test-seed#[F286CE0F22D44ACD]) [n:127.0.0.1:57256__tg    ] o.a.s.c.Overseer Overseer (id=94259947387420676-127.0.0.1:57256__tg-n_0000000000) starting
   [junit4]   2> 527045 INFO  (TEST-LeaderFailoverAfterPartitionTest.test-seed#[F286CE0F22D44ACD]) [n:127.0.0.1:57256__tg    ] o.a.s.c.c.SolrZkClient makePath: /overseer/queue-work
   [junit4]   2> 527047 INFO  (TEST-LeaderFailoverAfterPartitionTest.test-seed#[F286CE0F22D44ACD]) [n:127.0.0.1:57256__tg    ] o.a.s.c.OverseerAutoReplicaFailoverThread Starting OverseerAutoReplicaFailoverThread autoReplicaFailoverWorkLoopDelay=10000 autoReplicaFailoverWaitAfterExpiration=30000 autoReplicaFailoverBadNodeExpiration=60000
   [junit4]   2> 527047 INFO  (TEST-LeaderFailoverAfterPartitionTest.test-seed#[F286CE0F22D44ACD]) [n:127.0.0.1:57256__tg    ] o.a.s.c.c.ZkStateReader Updating cluster state from ZooKeeper... 
   [junit4]   2> 527048 INFO  (OverseerStateUpdate-94259947387420676-127.0.0.1:57256__tg-n_0000000000) [n:127.0.0.1:57256__tg    ] o.a.s.c.Overseer Starting to work on the main queue
   [junit4]   2> 527047 INFO  (OverseerCollectionProcessor-94259947387420676-127.0.0.1:57256__tg-n_0000000000) [n:127.0.0.1:57256__tg    ] o.a.s.c.OverseerCollectionProcessor Process current queue of collection creations
   [junit4]   2> 527050 INFO  (TEST-LeaderFailoverAfterPartitionTest.test-seed#[F286CE0F22D44ACD]) [n:127.0.0.1:57256__tg    ] o.a.s.c.CoreContainer No authentication plugin used.
   [junit4]   2> 527051 INFO  (TEST-LeaderFailoverAfterPartitionTest.test-seed#[F286CE0F22D44ACD]) [n:127.0.0.1:57256__tg    ] o.a.s.c.CoreContainer Security conf doesn't exist. Skipping setup for authorization module.
   [junit4]   2> 527051 INFO  (TEST-LeaderFailoverAfterPartitionTest.test-seed#[F286CE0F22D44ACD]) [n:127.0.0.1:57256__tg    ] o.a.s.c.CoresLocator Looking for core definitions underneath /home/jenkins/workspace/Lucene-Solr-trunk-Linux/solr/build/solr-core/test/J1/temp/solr.cloud.LeaderFailoverAfterPartitionTest_F286CE0F22D44ACD-001/control-001/cores
   [junit4]   2> 527052 INFO  (TEST-LeaderFailoverAfterPartitionTest.test-seed#[F286CE0F22D44ACD]) [n:127.0.0.1:57256__tg    ] o.a.s.c.SolrCore Created CoreDescriptor: {name=collection1, config=solrconfig.xml, transient=false, schema=schema.xml, loadOnStartup=true, configSetProperties=configsetprops.json, instanceDir=/home/jenkins/workspace/Lucene-Solr-trunk-Linux/solr/build/solr-core/test/J1/temp/solr.cloud.LeaderFailoverAfterPartitionTest_F286CE0F22D44ACD-001/control-001/cores/collection1, collection=control_collection, absoluteInstDir=/home/jenkins/workspace/Lucene-Solr-trunk-Linux/solr/build/solr-core/test/J1/temp/solr.cloud.LeaderFailoverAfterPartitionTest_F286CE0F22D44ACD-001/control-001/cores/collection1/, coreNodeName=, dataDir=data/, shard=}
   [junit4]   2> 527052 INFO  (TEST-LeaderFailoverAfterPartitionTest.test-seed#[F286CE0F22D44ACD]) [n:127.0.0.1:57256__tg    ] o.a.s.c.CoresLocator Found core collection1 in /home/jenkins/workspace/Lucene-Solr-trunk-Linux/solr/build/solr-core/test/J1/temp/solr.cloud.LeaderFailoverAfterPartitionTest_F286CE0F22D44ACD-001/control-001/cores/collection1/
   [junit4]   2> 527052 INFO  (TEST-LeaderFailoverAfterPartitionTest.test-seed#[F286CE0F22D44ACD]) [n:127.0.0.1:57256__tg    ] o.a.s.c.CoresLocator Found 1 core definitions
   [junit4]   2> 527053 INFO  (coreLoadExecutor-2595-thread-1-processing-n:127.0.0.1:57256__tg) [n:127.0.0.1:57256__tg c:control_collection   x:collection1] o.a.s.c.ZkController publishing state=down
   [junit4]   2> 527053 INFO  (TEST-LeaderFailoverAfterPartitionTest.test-seed#[F286CE0F22D44ACD]) [n:127.0.0.1:57256__tg    ] o.a.s.s.SolrDispatchFilter user.dir=/home/jenkins/workspace/Lucene-Solr-trunk-Linux/solr/build/solr-core/test/J1
   [junit4]   2> 527053 INFO  (TEST-LeaderFailoverAfterPartitionTest.test-seed#[F286CE0F22D44ACD]) [n:127.0.0.1:57256__tg    ] o.a.s.s.SolrDispatchFilter SolrDispatchFilter.init() done
   [junit4]   2> 527053 INFO  (coreLoadExecutor-2595-thread-1-processing-n:127.0.0.1:57256__tg) [n:127.0.0.1:57256__tg c:control_collection   x:collection1] o.a.s.c.ZkController numShards not found on descriptor - reading it from system property
   [junit4]   2> 527053 INFO  (zkCallback-517-thread-1-processing-n:127.0.0.1:57256__tg) [n:127.0.0.1:57256__tg    ] o.a.s.c.DistributedQueue NodeChildrenChanged fired on path /overseer/queue state SyncConnected
   [junit4]   2> 527053 INFO  (coreLoadExecutor-2595-thread-1-processing-n:127.0.0.1:57256__tg) [n:127.0.0.1:57256__tg c:control_collection   x:collection1] o.a.s.c.ZkController look for our core node name
   [junit4]   2> 527054 INFO  (OverseerStateUpdate-94259947387420676-127.0.0.1:57256__tg-n_0000000000) [n:127.0.0.1:57256__tg    ] o.a.s.c.Overseer processMessage: queueSize: 1, message = {
   [junit4]   2>   "core":"collection1",
   [junit4]   2>   "roles":null,
   [junit4]   2>   "base_url":"http://127.0.0.1:57256/_tg",
   [junit4]   2>   "node_name":"127.0.0.1:57256__tg",
   [junit4]   2>   "numShards":"1",
   [junit4]   2>   "state":"down",
   [junit4]   2>   "shard":null,
   [junit4]   2>   "collection":"control_collection",
   [junit4]   2>   "operation":"state"} current state version: 0
   [junit4]   2> 527054 INFO  (OverseerStateUpdate-94259947387420676-127.0.0.1:57256__tg-n_0000000000) [n:127.0.0.1:57256__tg    ] o.a.s.c.o.ReplicaMutator Update state numShards=1 message={
   [junit4]   2>   "core":"collection1",
   [junit4]   2>   "roles":null,
   [junit4]   2>   "base_url":"http://127.0.0.1:57256/_tg",
   [junit4]   2>   "node_name":"127.0.0.1:57256__tg",
   [junit4]   2>   "numShards":"1",
   [junit4]   2>   "state":"down",
   [junit4]   2>   "shard":null,
   [junit4]   2>   "collection":"control_collection",
   [junit4]   2>   "operation":"state"}
   [junit4]   2> 527054 INFO  (OverseerStateUpdate-94259947387420676-127.0.0.1:57256__tg-n_0000000000) [n:127.0.0.1:57256__tg    ] o.a.s.c.o.ClusterStateMutator building a new cName: control_collection
   [junit4]   2> 527054 INFO  (OverseerStateUpdate-94259947387420676-127.0.0.1:57256__tg-n_0000000000) [n:127.0.0.1:57256__tg    ] o.a.s.c.o.ReplicaMutator Assigning new node to shard shard=shard1
   [junit4]   2> 527055 INFO  (zkCallback-517-thread-1-processing-n:127.0.0.1:57256__tg) [n:127.0.0.1:57256__tg    ] o.a.s.c.c.ZkStateReader A cluster state change: WatchedEvent state:SyncConnected type:NodeDataChanged path:/clusterstate.json, has occurred - updating... (live nodes size: 1)
   [junit4]   2> 527056 INFO  (zkCallback-517-thread-1-processing-n:127.0.0.1:57256__tg) [n:127.0.0.1:57256__tg    ] o.a.s.c.c.ZkStateReader Updated cluster state version to 1
   [junit4]   2> 528054 INFO  (coreLoadExecutor-2595-thread-1-processing-n:127.0.0.1:57256__tg) [n:127.0.0.1:57256__tg c:control_collection   x:collection1] o.a.s.c.ZkController waiting to find shard id in clusterstate for collection1
   [junit4]   2> 528054 INFO  (coreLoadExecutor-2595-thread-1-processing-n:127.0.0.1:57256__tg) [n:127.0.0.1:57256__tg c:control_collection   x:collection1] o.a.s.c.ZkController Check for collection zkNode:control_collection
   [junit4]   2> 528054 INFO  (coreLoadExecutor-2595-thread-1-processing-n:127.0.0.1:57256__tg) [n:127.0.0.1:57256__tg c:control_collection   x:collection1] o.a.s.c.ZkController Collection zkNode exists
   [junit4]   2> 528054 INFO  (coreLoadExecutor-2595-thread-1-processing-n:127.0.0.1:57256__tg) [n:127.0.0.1:57256__tg c:control_collection   x:collection1] o.a.s.c.c.ZkStateReader Load collection config from:/collections/control_collection
   [junit4]   2> 528054 INFO  (coreLoadExecutor-2595-thread-1-processing-n:127.0.0.1:57256__tg) [n:127.0.0.1:57256__tg c:control_collection   x:collection1] o.a.s.c.c.ZkStateReader path=/collections/control_collection configName=conf1 specified config exists in ZooKeeper
   [junit4]   2> 528054 INFO  (coreLoadExecutor-2595-thread-1-processing-n:127.0.0.1:57256__tg) [n:127.0.0.1:57256__tg c:control_collection   x:collection1] o.a.s.c.SolrResourceLoader new SolrResourceLoader for directory: '/home/jenkins/workspace/Lucene-Solr-trunk-Linux/solr/build/solr-core/test/J1/temp/solr.cloud.LeaderFailoverAfterPartitionTest_F286CE0F22D44ACD-001/control-001/cores/collection1/'
   [junit4]   2> 528062 INFO  (coreLoadExecutor-2595-thread-1-processing-n:127.0.0.1:57256__tg) [n:127.0.0.1:57256__tg c:control_collection   x:collection1] o.a.s.c.Config loaded config solrconfig.xml with version 0 
   [junit4]   2> 528065 INFO  (coreLoadExecutor-2595-thread-1-processing-n:127.0.0.1:57256__tg) [n:127.0.0.1:57256__tg c:control_collection   x:collection1] o.a.s.c.SolrConfig current version of requestparams : -1
   [junit4]   2> 528068 INFO  (coreLoadExecutor-2595-thread-1-processing-n:127.0.0.1:57256__tg) [n:127.0.0.1:57256__tg c:control_collection   x:collection1] o.a.s.c.SolrConfig Using Lucene MatchVersion: 6.0.0
   [junit4]   2> 528076 INFO  (coreLoadExecutor-2595-thread-1-processing-n:127.0.0.1:57256__tg) [n:127.0.0.1:57256__tg c:control_collection   x:collection1] o.a.s.c.Config Loaded SolrConfig: solrconfig.xml
   [junit4]   2> 528077 INFO  (coreLoadExecutor-2595-thread-1-processing-n:127.0.0.1:57256__tg) [n:127.0.0.1:57256__tg c:control_collection   x:collection1] o.a.s.s.IndexSchema Reading Solr Schema from /configs/conf1/schema.xml
   [junit4]   2> 528080 INFO  (coreLoadExecutor-2595-thread-1-processing-n:127.0.0.1:57256__tg) [n:127.0.0.1:57256__tg c:control_collection   x:collection1] o.a.s.s.IndexSchema [collection1] Schema name=test
   [junit4]   2> 528176 INFO  (coreLoadExecutor-2595-thread-1-processing-n:127.0.0.1:57256__tg) [n:127.0.0.1:57256__tg c:control_collection   x:collection1] o.a.s.s.OpenExchangeRatesOrgProvider Initialized with rates=open-exchange-rates.json, refreshInterval=1440.
   [junit4]   2> 528180 INFO  (coreLoadExecutor-2595-thread-1-processing-n:127.0.0.1:57256__tg) [n:127.0.0.1:57256__tg c:control_collection   x:collection1] o.a.s.s.IndexSchema default search field in schema is text
   [junit4]   2> 528181 INFO  (coreLoadExecutor-2595-thread-1-processing-n:127.0.0.1:57256__tg) [n:127.0.0.1:57256__tg c:control_collection   x:collection1] o.a.s.s.IndexSchema unique key field: id
   [junit4]   2> 528185 INFO  (coreLoadExecutor-2595-thread-1-processing-n:127.0.0.1:57256__tg) [n:127.0.0.1:57256__tg c:control_collection   x:collection1] o.a.s.s.FileExchangeRateProvider Reloading exchange rates from file currency.xml
   [junit4]   2> 528186 INFO  (coreLoadExecutor-2595-thread-1-processing-n:127.0.0.1:57256__tg) [n:127.0.0.1:57256__tg c:control_collection   x:collection1] o.a.s.s.FileExchangeRateProvider Reloading exchange rates from file currency.xml
   [junit4]   2> 528188 INFO  (coreLoadExecutor-2595-thread-1-processing-n:127.0.0.1:57256__tg) [n:127.0.0.1:57256__tg c:control_collection   x:collection1] o.a.s.s.OpenExchangeRatesOrgProvider Reloading exchange rates from open-exchange-rates.json
   [junit4]   2> 528188 WARN  (coreLoadExecutor-2595-thread-1-processing-n:127.0.0.1:57256__tg) [n:127.0.0.1:57256__tg c:control_collection   x:collection1] o.a.s.s.OpenExchangeRatesOrgProvider Unknown key IMPORTANT NOTE
   [junit4]   2> 528188 WARN  (coreLoadExecutor-2595-thread-1-processing-n:127.0.0.1:57256__tg) [n:127.0.0.1:57256__tg c:control_collection   x:collection1] o.a.s.s.OpenExchangeRatesOrgProvider Expected key, got STRING
   [junit4]   2> 528188 INFO  (coreLoadExecutor-2595-thread-1-processing-n:127.0.0.1:57256__tg) [n:127.0.0.1:57256__tg c:control_collection   x:collection1] o.a.s.s.OpenExchangeRatesOrgProvider Reloading exchange rates from open-exchange-rates.json
   [junit4]   2> 528189 WARN  (coreLoadExecutor-2595-thread-1-processing-n:127.0.0.1:57256__tg) [n:127.0.0.1:57256__tg c:control_collection   x:collection1] o.a.s.s.OpenExchangeRatesOrgProvider Unknown key IMPORTANT NOTE
   [junit4]   2> 528189 WARN  (coreLoadExecutor-2595-thread-1-processing-n:127.0.0.1:57256__tg) [n:127.0.0.1:57256__tg c:control_collection   x:collection1] o.a.s.s.OpenExchangeRatesOrgProvider Expected key, got STRING
   [junit4]   2> 528189 INFO  (coreLoadExecutor-2595-thread-1-processing-n:127.0.0.1:57256__tg) [n:127.0.0.1:57256__tg c:control_collection   x:collection1] o.a.s.c.ConfigSetProperties Did not find ConfigSet properties, assuming default properties: Can't find resource 'configsetprops.json' in classpath or '/configs/conf1', cwd=/home/jenkins/workspace/Lucene-Solr-trunk-Linux/solr/build/solr-core/test/J1
   [junit4]   2> 528189 INFO  (coreLoadExecutor-2595-thread-1-processing-n:127.0.0.1:57256__tg) [n:127.0.0.1:57256__tg c:control_collection   x:collection1] o.a.s.c.CoreContainer Creating SolrCore 'collection1' using configuration from collection control_collection
   [junit4]   2> 528189 INFO  (coreLoadExecutor-2595-thread-1-processing-n:127.0.0.1:57256__tg) [n:127.0.0.1:57256__tg c:control_collection s:shard1 r:core_node1 x:collection1] o.a.s.c.SolrCore org.apache.solr.core.MockDirectoryFactory
   [junit4]   2> 528190 INFO  (coreLoadExecutor-2595-thread-1-processing-n:127.0.0.1:57256__tg) [n:127.0.0.1:57256__tg c:control_collection s:shard1 r:core_node1 x:collection1] o.a.s.c.SolrCore [[collection1] ] Opening new SolrCore at [/home/jenkins/workspace/Lucene-Solr-trunk-Linux/solr/build/solr-core/test/J1/temp/solr.cloud.LeaderFailoverAfterPartitionTest_F286CE0F22D44ACD-001/control-001/cores/collection1/], dataDir=[null]
   [junit4]   2> 528190 INFO  (coreLoadExecutor-2595-thread-1-processing-n:127.0.0.1:57256__tg) [n:127.0.0.1:57256__tg c:control_collection s:shard1 r:core_node1 x:collection1] o.a.s.c.JmxMonitoredMap JMX monitoring is enabled. Adding Solr mbeans to JMX Server: com.sun.jmx.mbeanserver.JmxMBeanServer@7fa2ab10
   [junit4]   2> 528190 INFO  (coreLoadExecutor-2595-thread-1-processing-n:127.0.0.1:57256__tg) [n:127.0.0.1:57256__tg c:control_collection s:shard1 r:core_node1 x:collection1] o.a.s.c.CachingDirectoryFactory return new directory for /home/jenkins/workspace/Lucene-Solr-trunk-Linux/solr/build/solr-core/test/J1/temp/solr.cloud.LeaderFailoverAfterPartitionTest_F286CE0F22D44ACD-001/control-001/cores/collection1/data
   [junit4]   2> 528190 INFO  (coreLoadExecutor-2595-thread-1-processing-n:127.0.0.1:57256__tg) [n:127.0.0.1:57256__tg c:control_collection s:shard1 r:core_node1 x:collection1] o.a.s.c.SolrCore New index directory detected: old=null new=/home/jenkins/workspace/Lucene-Solr-trunk-Linux/solr/build/solr-core/test/J1/temp/solr.cloud.LeaderFailoverAfterPartitionTest_F286CE0F22D44ACD-001/control-001/cores/collection1/data/index/
   [junit4]   2> 528190 WARN  (coreLoadExecutor-2595-thread-1-processing-n:127.0.0.1:57256__tg) [n:127.0.0.1:57256__tg c:control_collection s:shard1 r:core_node1 x:collection1] o.a.s.c.SolrCore [collection1] Solr index directory '/home/jenkins/workspace/Lucene-Solr-trunk-Linux/solr/build/solr-core/test/J1/temp/solr.cloud.LeaderFailoverAfterPartitionTest_F286CE0F22D44ACD-001/control-001/cores/collection1/data/index' doesn't exist. Creating new index...
   [junit4]   2> 528190 INFO  (coreLoadExecutor-2595-thread-1-processing-n:127.0.0.1:57256__tg) [n:127.0.0.1:57256__tg c:control_collection s:shard1 r:core_node1 x:collection1] o.a.s.c.CachingDirectoryFactory return new directory for /home/jenkins/workspace/Lucene-Solr-trunk-Linux/solr/build/solr-core/test/J1/temp/solr.cloud.LeaderFailoverAfterPartitionTest_F286CE0F22D44ACD-001/control-001/cores/collection1/data/index
   [junit4]   2> 528191 INFO  (coreLoadExecutor-2595-thread-1-processing-n:127.0.0.1:57256__tg) [n:127.0.0.1:57256__tg c:control_collection s:shard1 r:core_node1 x:collection1] o.a.s.u.RandomMergePolicy RandomMergePolicy wrapping class org.apache.lucene.index.TieredMergePolicy: [TieredMergePolicy: maxMergeAtOnce=20, maxMergeAtOnceExplicit=19, maxMergedSegmentMB=80.978515625, floorSegmentMB=0.9736328125, forceMergeDeletesPctAllowed=2.1018459194547487, segmentsPerTier=33.0, maxCFSSegmentSizeMB=8.796093022207999E12, noCFSRatio=0.6873790737310346
   [junit4]   2> 528191 INFO  (coreLoadExecutor-2595-thread-1-processing-n:127.0.0.1:57256__tg) [n:127.0.0.1:57256__tg c:control_collection s:shard1 r:core_node1 x:collection1] o.a.s.c.SolrCore SolrDeletionPolicy.onCommit: commits: num=1
   [junit4]   2> 	commit{dir=MockDirectoryWrapper(RAMDirectory@814fa28 lockFactory=org.apache.lucene.store.SingleInstanceLockFactory@28f64c73),segFN=segments_1,generation=1}
   [junit4]   2> 528191 INFO  (coreLoadExecutor-2595-thread-1-processing-n:127.0.0.1:57256__tg) [n:127.0.0.1:57256__tg c:control_collection s:shard1 r:core_node1 x:collection1] o.a.s.c.SolrCore newest commit generation = 1
   [junit4]   2> 528192 INFO  (OldIndexDirectoryCleanupThreadForCore-collection1) [n:127.0.0.1:57256__tg c:control_collection s:shard1 r:core_node1 x:collection1] o.a.s.c.SolrCore Looking for old index directories to cleanup for core collection1 in /home/jenkins/workspace/Lucene-Solr-trunk-Linux/solr/build/solr-core/test/J1/temp/solr.cloud.LeaderFailoverAfterPartitionTest_F286CE0F22D44ACD-001/control-001/cores/collection1/data/
   [junit4]   2> 528192 WARN  (OldIndexDirectoryCleanupThreadForCore-collection1) [n:127.0.0.1:57256__tg c:control_collection s:shard1 r:core_node1 x:collection1] o.a.s.c.DirectoryFactory /home/jenkins/workspace/Lucene-Solr-trunk-Linux/solr/build/solr-core/test/J1/temp/solr.cloud.LeaderFailoverAfterPartitionTest_F286CE0F22D44ACD-001/control-001/cores/collection1/data/ does not point to a valid data directory; skipping clean-up of old index directories.
   [junit4]   2> 528193 INFO  (coreLoadExecutor-2595-thread-1-processing-n:127.0.0.1:57256__tg) [n:127.0.0.1:57256__tg c:control_collection s:shard1 r:core_node1 x:collection1] o.a.s.u.p.UpdateRequestProcessorChain creating updateRequestProcessorChain "nodistrib"
   [junit4]   2> 528194 INFO  (coreLoadExecutor-2595-thread-1-processing-n:127.0.0.1:57256__tg) [n:127.0.0.1:57256__tg c:control_collection s:shard1 r:core_node1 x:collection1] o.a.s.u.p.UpdateRequestProcessorChain creating updateRequestProcessorChain "dedupe"
   [junit4]   2> 528194 INFO  (coreLoadExecutor-2595-thread-1-processing-n:127.0.0.1:57256__tg) [n:127.0.0.1:57256__tg c:control_collection s:shard1 r:core_node1 x:collection1] o.a.s.u.p.UpdateRequestProcessorChain inserting DistributedUpdateProcessorFactory into updateRequestProcessorChain "dedupe"
   [junit4]   2> 528194 INFO  (coreLoadExecutor-2595-thread-1-processing-n:127.0.0.1:57256__tg) [n:127.0.0.1:57256__tg c:control_collection s:shard1 r:core_node1 x:collection1] o.a.s.u.p.UpdateRequestProcessorChain creating updateRequestProcessorChain "stored_sig"
   [junit4]   2> 528194 INFO  (coreLoadExecutor-2595-thread-1-processing-n:127.0.0.1:57256__tg) [n:127.0.0.1:57256__tg c:control_collection s:shard1 r:core_node1 x:collection1] o.a.s.u.p.UpdateRequestProcessorChain inserting DistributedUpdateProcessorFactory into updateRequestProcessorChain "stored_sig"
   [junit4]   2> 528194 INFO  (coreLoadExecutor-2595-thread-1-processing-n:127.0.0.1:57256__tg) [n:127.0.0.1:57256__tg c:control_collection s:shard1 r:core_node1 x:collection1] o.a.s.u.p.UpdateRequestProcessorChain creating updateRequestProcessorChain "distrib-dup-test-chain-explicit"
   [junit4]   2> 528194 INFO  (coreLoadExecutor-2595-thread-1-processing-n:127.0.0.1:57256__tg) [n:127.0.0.1:57256__tg c:control_collection s:shard1 r:core_node1 x:collection1] o.a.s.u.p.UpdateRequestProcessorChain creating updateRequestProcessorChain "distrib-dup-test-chain-implicit"
   [junit4]   2> 528194 INFO  (coreLoadExecutor-2595-thread-1-processing-n:127.0.0.1:57256__tg) [n:127.0.0.1:57256__tg c:control_collection s:shard1 r:core_node1 x:collection1] o.a.s.u.p.UpdateRequestProcessorChain inserting DistributedUpdateProcessorFactory into updateRequestProcessorChain "distrib-dup-test-chain-implicit"
   [junit4]   2> 528194 INFO  (coreLoadExecutor-2595-thread-1-processing-n:127.0.0.1:57256__tg) [n:127.0.0.1:57256__tg c:control_collection s:shard1 r:core_node1 x:collection1] o.a.s.c.SolrCore no updateRequestProcessorChain defined as default, creating implicit default
   [junit4]   2> 528196 INFO  (coreLoadExecutor-2595-thread-1-processing-n:127.0.0.1:57256__tg) [n:127.0.0.1:57256__tg c:control_collection s:shard1 r:core_node1 x:collection1] o.a.s.h.l.XMLLoader xsltCacheLifetimeSeconds=60
   [junit4]   2> 528197 INFO  (coreLoadExecutor-2595-thread-1-processing-n:127.0.0.1:57256__tg) [n:127.0.0.1:57256__tg c:control_collection s:shard1 r:core_node1 x:collection1] o.a.s.h.l.XMLLoader xsltCacheLifetimeSeconds=60
   [junit4]   2> 528198 INFO  (coreLoadExecutor-2595-thread-1-processing-n:127.0.0.1:57256__tg) [n:127.0.0.1:57256__tg c:control_collection s:shard1 r:core_node1 x:collection1] o.a.s.h.l.XMLLoader xsltCacheLifetimeSeconds=60
   [junit4]   2> 528199 INFO  (coreLoadExecutor-2595-thread-1-processing-n:127.0.0.1:57256__tg) [n:127.0.0.1:57256__tg c:control_collection s:shard1 r:core_node1 x:collection1] o.a.s.h.l.XMLLoader xsltCacheLifetimeSeconds=60
   [junit4]   2> 528200 INFO  (coreLoadExecutor-2595-thread-1-processing-n:127.0.0.1:57256__tg) [n:127.0.0.1:57256__tg c:control_collection s:shard1 r:core_node1 x:collection1] o.a.s.c.RequestHandlers Registered paths: /admin/mbeans,standard,/update/csv,/update/json/docs,/admin/luke,/admin/segments,/get,/admin/system,/replication,/admin/properties,/config,/schema,/admin/plugins,/admin/logging,/update/json,/admin/threads,/admin/ping,/update,/admin/file
   [junit4]   2> 528201 INFO  (coreLoadExecutor-2595-thread-1-processing-n:127.0.0.1:57256__tg) [n:127.0.0.1:57256__tg c:control_collection s:shard1 r:core_node1 x:collection1] o.a.s.c.SolrCore Using default statsCache cache: org.apache.solr.search.stats.LocalStatsCache
   [junit4]   2> 528201 INFO  (coreLoadExecutor-2595-thread-1-processing-n:127.0.0.1:57256__tg) [n:127.0.0.1:57256__tg c:control_collection s:shard1 r:core_node1 x:collection1] o.a.s.u.UpdateHandler Using UpdateLog implementation: org.apache.solr.update.UpdateLog
   [junit4]   2> 528201 INFO  (coreLoadExecutor-2595-thread-1-processing-n:127.0.0.1:57256__tg) [n:127.0.0.1:57256__tg c:control_collection s:shard1 r:core_node1 x:collection1] o.a.s.u.UpdateLog Initializing UpdateLog: dataDir= defaultSyncLevel=FLUSH numRecordsToKeep=100 maxNumLogsToKeep=10 numVersionBuckets=65536
   [junit4]   2> 528202 INFO  (coreLoadExecutor-2595-thread-1-processing-n:127.0.0.1:57256__tg) [n:127.0.0.1:57256__tg c:control_collection s:shard1 r:core_node1 x:collection1] o.a.s.c.SolrCore Hard AutoCommit: disabled
   [junit4]   2> 528202 INFO  (coreLoadExecutor-2595-thread-1-processing-n:127.0.0.1:57256__tg) [n:127.0.0.1:57256__tg c:control_collection s:shard1 r:core_node1 x:collection1] o.a.s.c.SolrCore Soft AutoCommit: disabled
   [junit4]   2> 528203 INFO  (coreLoadExecutor-2595-thread-1-processing-n:127.0.0.1:57256__tg) [n:127.0.0.1:57256__tg c:control_collection s:shard1 r:core_node1 x:collection1] o.a.s.u.RandomMergePolicy RandomMergePolicy wrapping class org.apache.lucene.index.TieredMergePolicy: [TieredMergePolicy: maxMergeAtOnce=26, maxMergeAtOnceExplicit=42, maxMergedSegmentMB=84.9287109375, floorSegmentMB=1.3857421875, forceMergeDeletesPctAllowed=23.569411932746107, segmentsPerTier=36.0, maxCFSSegmentSizeMB=8.796093022207999E12, noCFSRatio=0.3017414300016162
   [junit4]   2> 528203 INFO  (coreLoadExecutor-2595-thread-1-processing-n:127.0.0.1:57256__tg) [n:127.0.0.1:57256__tg c:control_collection s:shard1 r:core_node1 x:collection1] o.a.s.c.SolrCore SolrDeletionPolicy.onInit: commits: num=1
   [junit4]   2> 	commit{dir=MockDirectoryWrapper(RAMDirectory@814fa28 lockFactory=org.apache.lucene.store.SingleInstanceLockFactory@28f64c73),segFN=segments_1,generation=1}
   [junit4]   2> 528203 INFO  (coreLoadExecutor-2595-thread-1-processing-n:127.0.0.1:57256__tg) [n:127.0.0.1:57256__tg c:control_collection s:shard1 r:core_node1 x:collection1] o.a.s.c.SolrCore newest commit generation = 1
   [junit4]   2> 528203 INFO  (coreLoadExecutor-2595-thread-1-processing-n:127.0.0.1:57256__tg) [n:127.0.0.1:57256__tg c:control_collection s:shard1 r:core_node1 x:collection1] o.a.s.s.SolrIndexSearcher Opening Searcher@7fdd2edf[collection1] main
   [junit4]   2> 528204 INFO  (coreLoadExecutor-2595-thread-1-processing-n:127.0.0.1:57256__tg) [n:127.0.0.1:57256__tg c:control_collection s:shard1 r:core_node1 x:collection1] o.a.s.c.c.ZkStateReader Load collection config from:/collections/control_collection
   [junit4]   2> 528205 INFO  (coreLoadExecutor-2595-thread-1-processing-n:127.0.0.1:57256__tg) [n:127.0.0.1:57256__tg c:control_collection s:shard1 r:core_node1 x:collection1] o.a.s.c.c.ZkStateReader path=/collections/control_collection configName=conf1 specified config exists in ZooKeeper
   [junit4]   2> 528205 INFO  (coreLoadExecutor-2595-thread-1-processing-n:127.0.0.1:57256__tg) [n:127.0.0.1:57256__tg c:control_collection s:shard1 r:core_node1 x:collection1] o.a.s.r.ManagedResourceStorage Setting up ZooKeeper-based storage for the RestManager with znodeBase: /configs/conf1
   [junit4]   2> 528205 INFO  (coreLoadExecutor-2595-thread-1-processing-n:127.0.0.1:57256__tg) [n:127.0.0.1:57256__tg c:control_collection s:shard1 r:core_node1 x:collection1] o.a.s.r.ManagedResourceStorage Configured ZooKeeperStorageIO with znodeBase: /configs/conf1
   [junit4]   2> 528205 INFO  (coreLoadExecutor-2595-thread-1-processing-n:127.0.0.1:57256__tg) [n:127.0.0.1:57256__tg c:control_collection s:shard1 r:core_node1 x:collection1] o.a.s.r.RestManager Initializing RestManager with initArgs: {}
   [junit4]   2> 528205 INFO  (coreLoadExecutor-2595-thread-1-processing-n:127.0.0.1:57256__tg) [n:127.0.0.1:57256__tg c:control_collection s:shard1 r:core_node1 x:collection1] o.a.s.r.ManagedResourceStorage Reading _rest_managed.json using ZooKeeperStorageIO:path=/configs/conf1
   [junit4]   2> 528205 INFO  (coreLoadExecutor-2595-thread-1-processing-n:127.0.0.1:57256__tg) [n:127.0.0.1:57256__tg c:control_collection s:shard1 r:core_node1 x:collection1] o.a.s.r.ManagedResourceStorage No data found for znode /configs/conf1/_rest_managed.json
   [junit4]   2> 528206 INFO  (coreLoadExecutor-2595-thread-1-processing-n:127.0.0.1:57256__tg) [n:127.0.0.1:57256__tg c:control_collection s:shard1 r:core_node1 x:collection1] o.a.s.r.ManagedResourceStorage Loaded null at path _rest_managed.json using ZooKeeperStorageIO:path=/configs/conf1
   [junit4]   2> 528206 INFO  (coreLoadExecutor-2595-thread-1-processing-n:127.0.0.1:57256__tg) [n:127.0.0.1:57256__tg c:control_collection s:shard1 r:core_node1 x:collection1] o.a.s.r.RestManager Initializing 0 registered ManagedResources
   [junit4]   2> 528206 INFO  (coreLoadExecutor-2595-thread-1-processing-n:127.0.0.1:57256__tg) [n:127.0.0.1:57256__tg c:control_collection s:shard1 r:core_node1 x:collection1] o.a.s.h.ReplicationHandler Commits will be reserved for  10000
   [junit4]   2> 528207 INFO  (searcherExecutor-2596-thread-1-processing-n:127.0.0.1:57256__tg x:collection1 s:shard1 c:control_collection r:core_node1) [n:127.0.0.1:57256__tg c:control_collection s:shard1 r:core_node1 x:collection1] o.a.s.c.SolrCore [collection1] Registered new searcher Searcher@7fdd2edf[collection1] main{ExitableDirectoryReader(UninvertingDirectoryReader())}
   [junit4]   2> 528207 INFO  (coreLoadExecutor-2595-thread-1-processing-n:127.0.0.1:57256__tg) [n:127.0.0.1:57256__tg c:control_collection s:shard1 r:core_node1 x:collection1] o.a.s.u.UpdateLog Looking up max value of version field to seed version buckets
   [junit4]   2> 528207 INFO  (coreLoadExecutor-2595-thread-1-processing-n:127.0.0.1:57256__tg) [n:127.0.0.1:57256__tg c:control_collection s:shard1 r:core_node1 x:collection1] o.a.s.u.VersionInfo Refreshing highest value of _version_ for 65536 version buckets from index
   [junit4]   2> 528207 INFO  (coreLoadExecutor-2595-thread-1-processing-n:127.0.0.1:57256__tg) [n:127.0.0.1:57256__tg c:control_collection s:shard1 r:core_node1 x:collection1] o.a.s.u.VersionInfo No terms found for _version_, cannot seed version bucket highest value from index
   [junit4]   2> 528207 INFO  (coreLoadExecutor-2595-thread-1-processing-n:127.0.0.1:57256__tg) [n:127.0.0.1:57256__tg c:control_collection s:shard1 r:core_node1 x:collection1] o.a.s.u.UpdateLog Could not find max version in index or recent updates, using new clock 1508159159648911360
   [junit4]   2> 528209 INFO  (coreLoadExecutor-2595-thread-1-processing-n:127.0.0.1:57256__tg) [n:127.0.0.1:57256__tg c:control_collection s:shard1 r:core_node1 x:collection1] o.a.s.u.UpdateLog Took 2 ms to seed version buckets with highest version 1508159159648911360
   [junit4]   2> 528209 INFO  (coreLoadExecutor-2595-thread-1-processing-n:127.0.0.1:57256__tg) [n:127.0.0.1:57256__tg c:control_collection s:shard1 r:core_node1 x:collection1] o.a.s.c.ZkController watch zkdir /configs/conf1
   [junit4]   2> 528210 INFO  (coreLoadExecutor-2595-thread-1-processing-n:127.0.0.1:57256__tg) [n:127.0.0.1:57256__tg c:control_collection s:shard1 r:core_node1 x:collection1] o.a.s.c.CoreContainer registering core: collection1
   [junit4]   2> 528210 INFO  (coreZkRegister-2589-thread-1-processing-n:127.0.0.1:57256__tg x:collection1 s:shard1 c:control_collection r:core_node1) [n:127.0.0.1:57256__tg c:control_collection s:shard1 r:core_node1 x:collection1] o.a.s.c.ZkController Register replica - core:collection1 address:http://127.0.0.1:57256/_tg collection:control_collection shard:shard1
   [junit4]   2> 528210 INFO  (coreZkRegister-2589-thread-1-processing-n:127.0.0.1:57256__tg x:collection1 s:shard1 c:control_collection r:core_node1) [n:127.0.0.1:57256__tg c:control_collection s:shard1 r:core_node1 x:collection1] o.a.s.c.c.SolrZkClient makePath: /collections/control_collection/leader_elect/shard1/election
   [junit4]   2> 528212 INFO  (coreZkRegister-2589-thread-1-processing-n:127.0.0.1:57256__tg x:collection1 s:shard1 c:control_collection r:core_node1) [n:127.0.0.1:57256__tg c:control_collection s:shard1 r:core_node1 x:collection1] o.a.s.c.LeaderElector Joined leadership election with path: /collections/control_collection/leader_elect/shard1/election/94259947387420676-core_node1-n_0000000000
   [junit4]   2> 528213 INFO  (coreZkRegister-2589-thread-1-processing-n:127.0.0.1:57256__tg x:collection1 s:shard1 c:control_collection r:core_node1) [n:127.0.0.1:57256__tg c:control_collection s:shard1 r:core_node1 x:collection1] o.a.s.c.ShardLeaderElectionContext Running the leader process for shard shard1
   [junit4]   2> 528214 INFO  (zkCallback-517-thread-1-processing-n:127.0.0.1:57256__tg) [n:127.0.0.1:57256__tg    ] o.a.s.c.DistributedQueue NodeChildrenChanged fired on path /overseer/queue state SyncConnected
   [junit4]   2> 528214 INFO  (coreZkRegister-2589-thread-1-processing-n:127.0.0.1:57256__tg x:collection1 s:shard1 c:control_collection r:core_node1) [n:127.0.0.1:57256__tg c:control_collection s:shard1 r:core_node1 x:collection1] o.a.s.c.ShardLeaderElectionContext Enough replicas found to continue.
   [junit4]   2> 528214 INFO  (coreZkRegister-2589-thread-1-processing-n:127.0.0.1:57256__tg x:collection1 s:shard1 c:control_collection r:core_node1) [n:127.0.0.1:57256__tg c:control_collection s:shard1 r:core_node1 x:collection1] o.a.s.c.ShardLeaderElectionContext I may be the new leader - try and sync
   [junit4]   2> 528214 INFO  (coreZkRegister-2589-thread-1-processing-n:127.0.0.1:57256__tg x:collection1 s:shard1 c:control_collection r:core_node1) [n:127.0.0.1:57256__tg c:control_collection s:shard1 r:core_node1 x:collection1] o.a.s.c.SyncStrategy Sync replicas to http://127.0.0.1:57256/_tg/collection1/
   [junit4]   2> 528214 INFO  (OverseerStateUpdate-94259947387420676-127.0.0.1:57256__tg-n_0000000000) [n:127.0.0.1:57256__tg    ] o.a.s.c.Overseer processMessage: queueSize: 1, message = {
   [junit4]   2>   "operation":"leader",
   [junit4]   2>   "shard":"shard1",
   [junit4]   2>   "collection":"control_collection"} current state version: 1
   [junit4]   2> 528214 INFO  (coreZkRegister-2589-thread-1-processing-n:127.0.0.1:57256__tg x:collection1 s:shard1 c:control_collection r:core_node1) [n:127.0.0.1:57256__tg c:control_collection s:shard1 r:core_node1 x:collection1] o.a.s.c.SyncStrategy Sync Success - now sync replicas to me
   [junit4]   2> 528214 INFO  (coreZkRegister-2589-thread-1-processing-n:127.0.0.1:57256__tg x:collection1 s:shard1 c:control_collection r:core_node1) [n:127.0.0.1:57256__tg c:control_collection s:shard1 r:core_node1 x:collection1] o.a.s.c.SyncStrategy http://127.0.0.1:57256/_tg/collection1/ has no replicas
   [junit4]   2> 528214 INFO  (coreZkRegister-2589-thread-1-processing-n:127.0.0.1:57256__tg x:collection1 s:shard1 c:control_collection r:core_node1) [n:127.0.0.1:57256__tg c:control_collection s:shard1 r:core_node1 x:collection1] o.a.s.c.ShardLeaderElectionContext I am the new leader: http://127.0.0.1:57256/_tg/collection1/ shard1
   [junit4]   2> 528214 INFO  (coreZkRegister-2589-thread-1-processing-n:127.0.0.1:57256__tg x:collection1 s:shard1 c:control_collection r:core_node1) [n:127.0.0.1:57256__tg c:control_collection s:shard1 r:core_node1 x:collection1] o.a.s.c.c.SolrZkClient makePath: /collections/control_collection/leaders/shard1
   [junit4]   2> 528216 INFO  (zkCallback-517-thread-1-processing-n:127.0.0.1:57256__tg) [n:127.0.0.1:57256__tg    ] o.a.s.c.DistributedQueue NodeChildrenChanged fired on path /overseer/queue state SyncConnected
   [junit4]   2> 528216 INFO  (OverseerStateUpdate-94259947387420676-127.0.0.1:57256__tg-n_0000000000) [n:127.0.0.1:57256__tg    ] o.a.s.c.Overseer processMessage: queueSize: 1, message = {
   [junit4]   2>   "operation":"leader",
   [junit4]   2>   "shard":"shard1",
   [junit4]   2>   "collection":"control_collection",
   [junit4]   2>   "base_url":"http://127.0.0.1:57256/_tg",
   [junit4]   2>   "core":"collection1",
   [junit4]   2>   "state":"active"} current state version: 1
   [junit4]   2> 528318 INFO  (zkCallback-517-thread-1-processing-n:127.0.0.1:57256__tg) [n:127.0.0.1:57256__tg    ] o.a.s.c.c.ZkStateReader A cluster state change: WatchedEvent state:SyncConnected type:NodeDataChanged path:/clusterstate.json, has occurred - updating... (live nodes size: 1)
   [junit4]   2> 528318 INFO  (zkCallback-517-thread-1-processing-n:127.0.0.1:57256__tg) [n:127.0.0.1:57256__tg    ] o.a.s.c.c.ZkStateReader Updated cluster state version to 2
   [junit4]   2> 528366 INFO  (coreZkRegister-2589-thread-1-processing-n:127.0.0.1:57256__tg x:collection1 s:shard1 c:control_collection r:core_node1) [n:127.0.0.1:57256__tg c:control_collection s:shard1 r:core_node1 x:collection1] o.a.s.c.ZkController We are http://127.0.0.1:57256/_tg/collection1/ and leader is http://127.0.0.1:57256/_tg/collection1/
   [junit4]   2> 528367 INFO  (coreZkRegister-2589-thread-1-processing-n:127.0.0.1:57256__tg x:collection1 s:shard1 c:control_collection r:core_node1) [n:127.0.0.1:57256__tg c:control_collection s:shard1 r:core_node1 x:collection1] o.a.s.c.ZkController No LogReplay needed for core=collection1 baseURL=http://127.0.0.1:57256/_tg
   [junit4]   2> 528367 INFO  (coreZkRegister-2589-thread-1-processing-n:127.0.0.1:57256__tg x:collection1 s:shard1 c:control_collection r:core_node1) [n:127.0.0.1:57256__tg c:control_collection s:shard1 r:core_node1 x:collection1] o.a.s.c.ZkController I am the leader, no recovery necessary
   [junit4]   2> 528367 INFO  (coreZkRegister-2589-thread-1-processing-n:127.0.0.1:57256__tg x:collection1 s:shard1 c:control_collection r:core_node1) [n:127.0.0.1:57256__tg c:control_collection s:shard1 r:core_node1 x:collection1] o.a.s.c.ZkController publishing state=active
   [junit4]   2> 528367 INFO  (coreZkRegister-2589-thread-1-processing-n:127.0.0.1:57256__tg x:collection1 s:shard1 c:control_collection r:core_node1) [n:127.0.0.1:57256__tg c:control_collection s:shard1 r:core_node1 x:collection1] o.a.s.c.ZkController numShards not found on descriptor - reading it from system property
   [junit4]   2> 528368 INFO  (zkCallback-517-thread-1-processing-n:127.0.0.1:57256__tg) [n:127.0.0.1:57256__tg    ] o.a.s.c.DistributedQueue NodeChildrenChanged fired on path /overseer/queue state SyncConnected
   [junit4]   2> 528369 INFO  (OverseerStateUpdate-94259947387420676-127.0.0.1:57256__tg-n_0000000000) [n:127.0.0.1:57256__tg    ] o.a.s.c.Overseer processMessage: queueSize: 1, message = {
   [junit4]   2>   "core":"collection1",
   [junit4]   2>   "core_node_name":"core_node1",
   [junit4]   2>   "roles":null,
   [junit4]   2>   "base_url":"http://127.0.0.1:57256/_tg",
   [junit4]   2>   "node_name":"127.0.0.1:57256__tg",
   [junit4]   2>   "numShards":"1",
   [junit4]   2>   "state":"active",
   [junit4]   2>   "shard":"shard1",
   [junit4]   2>   "collection":"control_collection",
   [junit4]   2>   "operation":"state"} current state version: 2
   [junit4]   2> 528369 INFO  (OverseerStateUpdate-94259947387420676-127.0.0.1:57256__tg-n_0000000000) [n:127.0.0.1:57256__tg    ] o.a.s.c.o.ReplicaMutator Update state numShards=1 message={
   [junit4]   2>   "core":"collection1",
   [junit4]   2>   "core_node_name":"core_node1",
   [junit4]   2>   "roles":null,
   [junit4]   2>   "base_url":"http://127.0.0.1:57256/_tg",
   [junit4]   2>   "node_name":"127.0.0.1:57256__tg",
   [junit4]   2>   "numShards":"1",
   [junit4]   2>   "state":"active",
   [junit4]   2>   "shard":"shard1",
   [junit4]   2>   "collection":"control_collection",
   [junit4]   2>   "operation":"state"}
   [junit4]   2> 528471 INFO  (zkCallback-517-thread-1-processing-n:127.0.0.1:57256__tg) [n:127.0.0.1:57256__tg    ] o.a.s.c.c.ZkStateReader A cluster state change: WatchedEvent state:SyncConnected type:NodeDataChanged path:/clusterstate.json, has occurred - updating... (live nodes size: 1)
   [junit4]   2> 528475 INFO  (zkCallback-517-thread-1-processing-n:127.0.0.1:57256__tg) [n:127.0.0.1:57256__tg    ] o.a.s.c.c.ZkStateReader Updated cluster state version to 3
   [junit4]   2> 528556 INFO  (TEST-LeaderFailoverAfterPartitionTest.test-seed#[F286CE0F22D44ACD]) [    ] o.a.s.c.c.SolrZkClient Using default ZkCredentialsProvider
   [junit4]   2> 528571 INFO  (TEST-LeaderFailoverAfterPartitionTest.test-seed#[F286CE0F22D44ACD]) [    ] o.a.s.c.c.ConnectionManager Waiting for client to connect to ZooKeeper
   [junit4]   2> 528584 INFO  (zkCallback-519-thread-1) [    ] o.a.s.c.c.ConnectionManager Watcher org.apache.solr.common.cloud.ConnectionManager@315d9b45 name:ZooKeeperConnection Watcher:127.0.0.1:58096/solr got event WatchedEvent state:SyncConnected type:None path:null path:null type:None
   [junit4]   2> 528584 INFO  (TEST-LeaderFailoverAfterPartitionTest.test-seed#[F286CE0F22D44ACD]) [    ] o.a.s.c.c.ConnectionManager Client is connected to ZooKeeper
   [junit4]   2> 528585 INFO  (TEST-LeaderFailoverAfterPartitionTest.test-seed#[F286CE0F22D44ACD]) [    ] o.a.s.c.c.SolrZkClient Using default ZkACLProvider
   [junit4]   2> 528585 INFO  (TEST-LeaderFailoverAfterPartitionTest.test-seed#[F286CE0F22D44ACD]) [    ] o.a.s.c.c.ZkStateReader Updating cluster state from ZooKeeper... 
   [junit4]   2> 528587 INFO  (TEST-LeaderFailoverAfterPartitionTest.test-seed#[F286CE0F22D44ACD]) [    ] o.a.s.c.ChaosMonkey monkey: init - expire sessions:false cause connection loss:false
   [junit4]   2> 528587 INFO  (TEST-LeaderFailoverAfterPartitionTest.test-seed#[F286CE0F22D44ACD]) [    ] o.a.s.c.AbstractFullDistribZkTestBase Creating collection1 with stateFormat=2
   [junit4]   2> 528587 INFO  (TEST-LeaderFailoverAfterPartitionTest.test-seed#[F286CE0F22D44ACD]) [    ] o.a.s.c.c.SolrZkClient Using default ZkCredentialsProvider
   [junit4]   2> 528611 INFO  (TEST-LeaderFailoverAfterPartitionTest.test-seed#[F286CE0F22D44ACD]) [    ] o.a.s.c.c.ConnectionManager Waiting for client to connect to ZooKeeper
   [junit4]   2> 528614 INFO  (zkCallback-520-thread-1) [    ] o.a.s.c.c.ConnectionManager Watcher org.apache.solr.common.cloud.ConnectionManager@53971479 name:ZooKeeperConnection Watcher:127.0.0.1:58096/solr got event WatchedEvent state:SyncConnected type:None path:null path:null type:None
   [junit4]   2> 528614 INFO  (TEST-LeaderFailoverAfterPartitionTest.test-seed#[F286CE0F22D44ACD]) [    ] o.a.s.c.c.ConnectionManager Client is connected to ZooKeeper
   [junit4]   2> 528614 INFO  (TEST-LeaderFailoverAfterPartitionTest.test-seed#[F286CE0F22D44ACD]) [    ] o.a.s.c.c.SolrZkClient Using default ZkACLProvider
   [junit4]   2> 528616 INFO  (zkCallback-517-thread-1-processing-n:127.0.0.1:57256__tg) [n:127.0.0.1:57256__tg    ] o.a.s.c.DistributedQueue NodeChildrenChanged fired on path /overseer/queue state SyncConnected
   [junit4]   2> 528617 INFO  (OverseerStateUpdate-94259947387420676-127.0.0.1:57256__tg-n_0000000000) [n:127.0.0.1:57256__tg    ] o.a.s.c.Overseer processMessage: queueSize: 1, message = {
   [junit4]   2>   "operation":"create",
   [junit4]   2>   "name":"collection1",
   [junit4]   2>   "numShards":"2",
   [junit4]   2>   "stateFormat":"2"} current state version: 3
   [junit4]   2> 528617 INFO  (OverseerStateUpdate-94259947387420676-127.0.0.1:57256__tg-n_0000000000) [n:127.0.0.1:57256__tg    ] o.a.s.c.o.ClusterStateMutator building a new cName: collection1
   [junit4]   2> 528678 INFO  (TEST-LeaderFailoverAfterPartitionTest.test-seed#[F286CE0F22D44ACD]) [    ] o.a.s.SolrTestCaseJ4 Writing core.properties file to /home/jenkins/workspace/Lucene-Solr-trunk-Linux/solr/build/solr-core/test/J1/temp/solr.cloud.LeaderFailoverAfterPartitionTest_F286CE0F22D44ACD-001/shard-1-001/cores/collection1
   [junit4]   2> 528679 INFO  (TEST-LeaderFailoverAfterPartitionTest.test-seed#[F286CE0F22D44ACD]) [    ] o.a.s.c.AbstractFullDistribZkTestBase create jetty 1 in directory /home/jenkins/workspace/Lucene-Solr-trunk-Linux/solr/build/solr-core/test/J1/temp/solr.cloud.LeaderFailoverAfterPartitionTest_F286CE0F22D44ACD-001/shard-1-001
   [junit4]   2> 528680 INFO  (TEST-LeaderFailoverAfterPartitionTest.test-seed#[F286CE0F22D44ACD]) [    ] o.e.j.s.Server jetty-9.2.11.v20150529
   [junit4]   2> 528680 INFO  (TEST-LeaderFailoverAfterPartitionTest.test-seed#[F286CE0F22D44ACD]) [    ] o.e.j.s.h.ContextHandler Started o.e.j.s.ServletContextHandler@3cd59fec{/_tg,null,AVAILABLE}
   [junit4]   2> 528681 INFO  (TEST-LeaderFailoverAfterPartitionTest.test-seed#[F286CE0F22D44ACD]) [    ] o.e.j.s.ServerConnector Started ServerConnector@20c04996{HTTP/1.1}{127.0.0.1:37737}
   [junit4]   2> 528681 INFO  (TEST-LeaderFailoverAfterPartitionTest.test-seed#[F286CE0F22D44ACD]) [    ] o.e.j.s.Server Started @530542ms
   [junit4]   2> 528681 INFO  (TEST-LeaderFailoverAfterPartitionTest.test-seed#[F286CE0F22D44ACD]) [    ] o.a.s.c.s.e.JettySolrRunner Jetty properties: {solr.data.dir=/home/jenkins/workspace/Lucene-Solr-trunk-Linux/solr/build/solr-core/test/J1/temp/solr.cloud.LeaderFailoverAfterPartitionTest_F286CE0F22D44ACD-001/tempDir-001/jetty1, solrconfig=solrconfig.xml, hostContext=/_tg, hostPort=38967, coreRootDirectory=/home/jenkins/workspace/Lucene-Solr-trunk-Linux/solr/build/solr-core/test/J1/temp/solr.cloud.LeaderFailoverAfterPartitionTest_F286CE0F22D44ACD-001/shard-1-001/cores}
   [junit4]   2> 528684 INFO  (TEST-LeaderFailoverAfterPartitionTest.test-seed#[F286CE0F22D44ACD]) [    ] o.a.s.s.SolrDispatchFilter SolrDispatchFilter.init(): sun.misc.Launcher$AppClassLoader@4e0e2f2a
   [junit4]   2> 528684 INFO  (TEST-LeaderFailoverAfterPartitionTest.test-seed#[F286CE0F22D44ACD]) [    ] o.a.s.c.SolrResourceLoader new SolrResourceLoader for directory: '/home/jenkins/workspace/Lucene-Solr-trunk-Linux/solr/build/solr-core/test/J1/temp/solr.cloud.LeaderFailoverAfterPartitionTest_F286CE0F22D44ACD-001/shard-1-001/'
   [junit4]   2> 528693 INFO  (TEST-LeaderFailoverAfterPartitionTest.test-seed#[F286CE0F22D44ACD]) [    ] o.a.s.c.c.SolrZkClient Using default ZkCredentialsProvider
   [junit4]   2> 528712 INFO  (TEST-LeaderFailoverAfterPartitionTest.test-seed#[F286CE0F22D44ACD]) [    ] o.a.s.c.c.ConnectionManager Waiting for client to connect to ZooKeeper
   [junit4]   2> 528713 INFO  (zkCallback-521-thread-1) [    ] o.a.s.c.c.ConnectionManager Watcher org.apache.solr.common.cloud.ConnectionManager@6beb93e0 name:ZooKeeperConnection Watcher:127.0.0.1:58096/solr got event WatchedEvent state:SyncConnected type:None path:null path:null type:None
   [junit4]   2> 528713 INFO  (TEST-LeaderFailoverAfterPartitionTest.test-seed#[F286CE0F22D44ACD]) [    ] o.a.s.c.c.ConnectionManager Client is connected to ZooKeeper
   [junit4]   2> 528713 INFO  (TEST-LeaderFailoverAfterPartitionTest.test-seed#[F286CE0F22D44ACD]) [    ] o.a.s.c.c.SolrZkClient Using default ZkACLProvider
   [junit4]   2> 528714 INFO  (TEST-LeaderFailoverAfterPartitionTest.test-seed#[F286CE0F22D44ACD]) [    ] o.a.s.s.SolrDispatchFilter Loading solr.xml from SolrHome (not found in ZooKeeper)
   [junit4]   2> 528715 INFO  (TEST-LeaderFailoverAfterPartitionTest.test-seed#[F286CE0F22D44ACD]) [    ] o.a.s.c.SolrXmlConfig Loading container configuration from /home/jenkins/workspace/Lucene-Solr-trunk-Linux/solr/build/solr-core/test/J1/temp/solr.cloud.LeaderFailoverAfterPartitionTest_F286CE0F22D44ACD-001/shard-1-001/solr.xml
   [junit4]   2> 528718 INFO  (TEST-LeaderFailoverAfterPartitionTest.test-seed#[F286CE0F22D44ACD]) [    ] o.a.s.c.CoresLocator Config-defined core root directory: /home/jenkins/workspace/Lucene-Solr-trunk-Linux/solr/build/solr-core/test/J1/temp/solr.cloud.LeaderFailoverAfterPartitionTest_F286CE0F22D44ACD-001/shard-1-001/cores
   [junit4]   2> 528718 INFO  (TEST-LeaderFailoverAfterPartitionTest.test-seed#[F286CE0F22D44ACD]) [    ] o.a.s.c.CoreContainer New CoreContainer 210166715
   [junit4]   2> 528718 INFO  (TEST-LeaderFailoverAfterPartitionTest.test-seed#[F286CE0F22D44ACD]) [    ] o.a.s.c.CoreContainer Loading cores into CoreContainer [instanceDir=/home/jenkins/workspace/Lucene-Solr-trunk-Linux/solr/build/solr-core/test/J1/temp/solr.cloud.LeaderFailoverAfterPartitionTest_F286CE0F22D44ACD-001/shard-1-001/]
   [junit4]   2> 528718 INFO  (TEST-LeaderFailoverAfterPartitionTest.test-seed#[F286CE0F22D44ACD]) [    ] o.a.s.c.CoreContainer loading shared library: /home/jenkins/workspace/Lucene-Solr-trunk-Linux/solr/build/solr-core/test/J1/temp/solr.cloud.LeaderFailoverAfterPartitionTest_F286CE0F22D44ACD-001/shard-1-001/lib
   [junit4]   2> 528719 WARN  (TEST-LeaderFailoverAfterPartitionTest.test-seed#[F286CE0F22D44ACD]) [    ] o.a.s.c.SolrResourceLoader Can't find (or read) directory to add to classloader: lib (resolved as: /home/jenkins/workspace/Lucene-Solr-trunk-Linux/solr/build/solr-core/test/J1/temp/solr.cloud.LeaderFailoverAfterPartitionTest_F286CE0F22D44ACD-001/shard-1-001/lib).
   [junit4]   2> 528719 INFO  (OverseerStateUpdate-94259947387420676-127.0.0.1:57256__tg-n_0000000000) [n:127.0.0.1:57256__tg    ] o.a.s.c.o.ZkStateWriter going to create_collection /collections/collection1/state.json
   [junit4]   2> 528719 INFO  (zkCallback-519-thread-1) [    ] o.a.s.c.c.ZkStateReader A cluster state change: WatchedEvent state:SyncConnected type:NodeDataChanged path:/clusterstate.json, has occurred - updating... (live nodes size: 1)
   [junit4]   2> 528719 INFO  (zkCallback-517-thread-1-processing-n:127.0.0.1:57256__tg) [n:127.0.0.1:57256__tg    ] o.a.s.c.c.ZkStateReader A cluster state change: WatchedEvent state:SyncConnected type:NodeDataChanged path:/clusterstate.json, has occurred - updating... (live nodes size: 1)
   [junit4]   2> 528721 INFO  (zkCallback-519-thread-1) [    ] o.a.s.c.c.ZkStateReader Updated cluster state version to 4
   [junit4]   2> 528721 INFO  (zkCallback-517-thread-1-processing-n:127.0.0.1:57256__tg) [n:127.0.0.1:57256__tg    ] o.a.s.c.c.ZkStateReader Updated cluster state version to 4
   [junit4]   2> 528724 INFO  (TEST-LeaderFailoverAfterPartitionTest.test-seed#[F286CE0F22D44ACD]) [    ] o.a.s.h.c.HttpShardHandlerFactory created with socketTimeout : 90000,urlScheme : ,connTimeout : 15000,maxConnectionsPerHost : 20,maxConnections : 10000,corePoolSize : 0,maximumPoolSize : 2147483647,maxThreadIdleTime : 5,sizeOfQueue : -1,fairnessPolicy : false,useRetries : false,
   [junit4]   2> 528725 INFO  (TEST-LeaderFailoverAfterPartitionTest.test-seed#[F286CE0F22D44ACD]) [    ] o.a.s.u.UpdateShardHandler Creating UpdateShardHandler HTTP client with params: socketTimeout=340000&connTimeout=45000&retry=true
   [junit4]   2> 528725 INFO  (TEST-LeaderFailoverAfterPartitionTest.test-seed#[F286CE0F22D44ACD]) [    ] o.a.s.l.LogWatcher SLF4J impl is org.slf4j.impl.Log4jLoggerFactory
   [junit4]   2> 528725 INFO  (TEST-LeaderFailoverAfterPartitionTest.test-seed#[F286CE0F22D44ACD]) [    ] o.a.s.l.LogWatcher Registering Log Listener [Log4j (org.slf4j.impl.Log4jLoggerFactory)]
   [junit4]   2> 528725 INFO  (TEST-LeaderFailoverAfterPartitionTest.test-seed#[F286CE0F22D44ACD]) [    ] o.a.s.c.ZkContainer Zookeeper client=127.0.0.1:58096/solr
   [junit4]   2> 528725 INFO  (TEST-LeaderFailoverAfterPartitionTest.test-seed#[F286CE0F22D44ACD]) [    ] o.a.s.c.ZkController zkHost includes chroot
   [junit4]   2> 528725 INFO  (TEST-LeaderFailoverAfterPartitionTest.test-seed#[F286CE0F22D44ACD]) [    ] o.a.s.c.c.SolrZkClient Using default ZkCredentialsProvider
   [junit4]   2> 528726 INFO  (TEST-LeaderFailoverAfterPartitionTest.test-seed#[F286CE0F22D44ACD]) [    ] o.a.s.c.c.ConnectionManager Waiting for client to connect to ZooKeeper
   [junit4]   2> 528728 INFO  (zkCallback-523-thread-1) [    ] o.a.s.c.c.ConnectionManager Watcher org.apache.solr.common.cloud.ConnectionManager@113fa259 name:ZooKeeperConnection Watcher:127.0.0.1:58096 got event WatchedEvent state:SyncConnected type:None path:null path:null type:None
   [junit4]   2> 528728 INFO  (TEST-LeaderFailoverAfterPartitionTest.test-seed#[F286CE0F22D44ACD]) [    ] o.a.s.c.c.ConnectionManager Client is connected to ZooKeeper
   [junit4]   2> 528728 INFO  (TEST-LeaderFailoverAfterPartitionTest.test-seed#[F286CE0F22D44ACD]) [    ] o.a.s.c.c.SolrZkClient Using default ZkACLProvider
   [junit4]   2> 528730 INFO  (TEST-LeaderFailoverAfterPartitionTest.test-seed#[F286CE0F22D44ACD]) [n:127.0.0.1:38967__tg    ] o.a.s.c.c.ConnectionManager Waiting for client to connect to ZooKeeper
   [junit4]   2> 528731 INFO  (zkCallback-524-thread-1-processing-n:127.0.0.1:38967__tg) [n:127.0.0.1:38967__tg    ] o.a.s.c.c.ConnectionManager Watcher org.apache.solr.common.cloud.ConnectionManager@61293c14 name:ZooKeeperConnection Watcher:127.0.0.1:58096/solr got event WatchedEvent state:SyncConnected type:None path:null path:null type:None
   [junit4]   2> 528732 INFO  (TEST-LeaderFailoverAfterPartitionTest.test-seed#[F286CE0F22D44ACD]) [n:127.0.0.1:38967__tg    ] o.a.s.c.c.ConnectionManager Client is connected to ZooKeeper
   [junit4]   2> 528734 INFO  (TEST-LeaderFailoverAfterPartitionTest.test-seed#[F286CE0F22D44ACD]) [n:127.0.0.1:38967__tg    ] o.a.s.c.c.ZkStateReader Updating cluster state from ZooKeeper... 
   [junit4]   2> 529740 INFO  (TEST-LeaderFailoverAfterPartitionTest.test-seed#[F286CE0F22D44ACD]) [n:127.0.0.1:38967__tg    ] o.a.s.c.ZkController Register node as live in ZooKeeper:/live_nodes/127.0.0.1:38967__tg
   [junit4]   2> 529741 INFO  (TEST-LeaderFailoverAfterPartitionTest.test-seed#[F286CE0F22D44ACD]) [n:127.0.0.1:38967__tg    ] o.a.s.c.c.SolrZkClient makePath: /live_nodes/127.0.0.1:38967__tg
   [junit4]   2> 529743 INFO  (TEST-LeaderFailoverAfterPartitionTest.test-seed#[F286CE0F22D44ACD]) [n:127.0.0.1:38967__tg    ] o.a.s.c.Overseer Overseer (id=null) closing
   [junit4]   2> 529743 INFO  (TEST-LeaderFailoverAfterPartitionTest.test-seed#[F286CE0F22D44ACD]) [n:127.0.0.1:38967__tg    ] o.a.s.c.LeaderElector Joined leadership election with path: /overseer_elect/election/94259947387420681-127.0.0.1:38967__tg-n_0000000001
   [junit4]   2> 529744 INFO  (TEST-LeaderFailoverAfterPartitionTest.test-seed#[F286CE0F22D44ACD]) [n:127.0.0.1:38967__tg    ] o.a.s.c.LeaderElector Watching path /overseer_elect/election/94259947387420676-127.0.0.1:57256__tg-n_0000000000 to know if I could be the leader
   [junit4]   2> 529744 INFO  (TEST-LeaderFailoverAfterPartitionTest.test-seed#[F286CE0F22D44ACD]) [n:127.0.0.1:38967__tg    ] o.a.s.c.CoreContainer No authentication plugin used.
   [junit4]   2> 529745 INFO  (TEST-LeaderFailoverAfterPartitionTest.test-seed#[F286CE0F22D44ACD]) [n:127.0.0.1:38967__tg    ] o.a.s.c.CoreContainer Security conf doesn't exist. Skipping setup for authorization module.
   [junit4]   2> 529745 INFO  (TEST-LeaderFailoverAfterPartitionTest.test-seed#[F286CE0F22D44ACD]) [n:127.0.0.1:38967__tg    ] o.a.s.c.CoresLocator Looking for core definitions underneath /home/jenkins/workspace/Lucene-Solr-trunk-Linux/solr/build/solr-core/test/J1/temp/solr.cloud.LeaderFailoverAfterPartitionTest_F286CE0F22D44ACD-001/shard-1-001/cores
   [junit4]   2> 529746 INFO  (TEST-LeaderFailoverAfterPartitionTest.test-seed#[F286CE0F22D44ACD]) [n:127.0.0.1:38967__tg    ] o.a.s.c.SolrCore Created CoreDescriptor: {name=collection1, config=solrconfig.xml, transient=false, schema=schema.xml, loadOnStartup=true, configSetProperties=configsetprops.json, instanceDir=/home/jenkins/workspace/Lucene-Solr-trunk-Linux/solr/build/solr-core/test/J1/temp/solr.cloud.LeaderFailoverAfterPartitionTest_F286CE0F22D44ACD-001/shard-1-001/cores/collection1, collection=collection1, absoluteInstDir=/home/jenkins/workspace/Lucene-Solr-trunk-Linux/solr/build/solr-core/test/J1/temp/solr.cloud.LeaderFailoverAfterPartitionTest_F286CE0F22D44ACD-001/shard-1-001/cores/collection1/, coreNodeName=, dataDir=data/, shard=}
   [junit4]   2> 529746 INFO  (TEST-LeaderFailoverAfterPartitionTest.test-seed#[F286CE0F22D44ACD]) [n:127.0.0.1:38967__tg    ] o.a.s.c.CoresLocator Found core collection1 in /home/jenkins/workspace/Lucene-Solr-trunk-Linux/solr/build/solr-core/test/J1/temp/solr.cloud.LeaderFailoverAfterPartitionTest_F286CE0F22D44ACD-001/shard-1-001/cores/collection1/
   [junit4]   2> 529746 INFO  (TEST-LeaderFailoverAfterPartitionTest.test-seed#[F286CE0F22D44ACD]) [n:127.0.0.1:38967__tg    ] o.a.s.c.CoresLocator Found 1 core definitions
   [junit4]   2> 529753 INFO  (TEST-LeaderFailoverAfterPartitionTest.test-seed#[F286CE0F22D44ACD]) [n:127.0.0.1:38967__tg    ] o.a.s.s.SolrDispatchFilter user.dir=/home/jenkins/workspace/Lucene-Solr-trunk-Linux/solr/build/solr-core/test/J1
   [junit4]   2> 529753 INFO  (TEST-LeaderFailoverAfterPartitionTest.test-seed#[F286CE0F22D44ACD]) [n:127.0.0.1:38967__tg    ] o.a.s.s.SolrDispatchFilter SolrDispatchFilter.init() done
   [junit4]   2> 529756 INFO  (coreLoadExecutor-2606-thread-1-processing-n:127.0.0.1:38967__tg) [n:127.0.0.1:38967__tg c:collection1   x:collection1] o.a.s.c.ZkController publishing state=down
   [junit4]   2> 529756 INFO  (coreLoadExecutor-2606-thread-1-processing-n:127.0.0.1:38967__tg) [n:127.0.0.1:38967__tg c:collection1   x:collection1] o.a.s.c.ZkController numShards not found on descriptor - reading it from system property
   [junit4]   2> 529760 INFO  (zkCallback-517-thread-1-processing-n:127.0.0.1:57256__tg) [n:127.0.0.1:57256__tg    ] o.a.s.c.DistributedQueue NodeChildrenChanged fired on path /overseer/queue state SyncConnected
   [junit4]   2> 529760 INFO  (OverseerStateUpdate-94259947387420676-127.0.0.1:57256__tg-n_0000000000) [n:127.0.0.1:57256__tg    ] o.a.s.c.Overseer processMessage: queueSize: 1, message = {
   [junit4]   2>   "core":"collection1",
   [junit4]   2>   "roles":null,
   [junit4]   2>   "base_url":"http://127.0.0.1:38967/_tg",
   [junit4]   2>   "node_name":"127.0.0.1:38967__tg",
   [junit4]   2>   "numShards":"2",
   [junit4]   2>   "state":"down",
   [junit4]   2>   "shard":null,
   [junit4]   2>   "collection":"collection1",
   [junit4]   2>   "operation":"state"} current state version: 4
   [junit4]   2> 529761 INFO  (coreLoadExecutor-2606-thread-1-processing-n:127.0.0.1:38967__tg) [n:127.0.0.1:38967__tg c:collection1   x:collection1] o.a.s.c.ZkController Registering watch for external collection collection1
   [junit4]   2> 529761 INFO  (OverseerStateUpdate-94259947387420676-127.0.0.1:57256__tg-n_0000000000) [n:127.0.0.1:57256__tg    ] o.a.s.c.o.ReplicaMutator Update state numShards=2 message={
   [junit4]   2>   "core":"collection1",
   [junit4]   2>   "roles":null,
   [junit4]   2>   "base_url":"http://127.0.0.1:38967/_tg",
   [junit4]   2>   "node_name":"127.0.0.1:38967__tg",
   [junit4]   2>   "numShards":"2",
   [junit4]   2>   "state":"down",
   [junit4]   2>   "shard":null,
   [junit4]   2>   "collection":"collection1",
   [junit4]   2>   "operation":"state"}
   [junit4]   2> 529761 INFO  (OverseerStateUpdate-94259947387420676-127.0.0.1:57256__tg-n_0000000000) [n:127.0.0.1:57256__tg    ] o.a.s.c.o.ReplicaMutator Collection already exists with numShards=2
   [junit4]   2> 529761 INFO  (OverseerStateUpdate-94259947387420676-127.0.0.1:57256__tg-n_0000000000) [n:127.0.0.1:57256__tg    ] o.a.s.c.o.ReplicaMutator Assigning new node to shard shard=shard2
   [junit4]   2> 529762 INFO  (coreLoadExecutor-2606-thread-1-processing-n:127.0.0.1:38967__tg) [n:127.0.0.1:38967__tg c:collection1   x:collection1] o.a.s.c.c.ZkStateReader addZkWatch collection1
   [junit4]   2> 529763 INFO  (coreLoadExecutor-2606-thread-1-processing-n:127.0.0.1:38967__tg) [n:127.0.0.1:38967__tg c:collection1   x:collection1] o.a.s.c.c.ZkStateReader Updating collection state at /collections/collection1/state.json from ZooKeeper... 
   [junit4]   2> 529764 INFO  (coreLoadExecutor-2606-thread-1-processing-n:127.0.0.1:38967__tg) [n:127.0.0.1:38967__tg c:collection1   x:collection1] o.a.s.c.c.ZkStateReader Updating data for collection1 to ver 0 
   [junit4]   2> 529764 INFO  (coreLoadExecutor-2606-thread-1-processing-n:127.0.0.1:38967__tg) [n:127.0.0.1:38967__tg c:collection1   x:collection1] o.a.s.c.ZkController look for our core node name
   [junit4]   2> 529863 INFO  (OverseerStateUpdate-94259947387420676-127.0.0.1:57256__tg-n_0000000000) [n:127.0.0.1:57256__tg    ] o.a.s.c.o.ZkStateWriter going to update_collection /collections/collection1/state.json version: 0
   [junit4]   2> 529863 INFO  (zkCallback-524-thread-1-processing-n:127.0.0.1:38967__tg) [n:127.0.0.1:38967__tg    ] o.a.s.c.c.ZkStateReader A cluster state change: WatchedEvent state:SyncConnected type:NodeDataChanged path:/collections/collection1/state.json for collection collection1 has occurred - updating... (live nodes size: 2)
   [junit4]   2> 529864 INFO  (zkCallback-524-thread-1-processing-n:127.0.0.1:38967__tg) [n:127.0.0.1:38967__tg    ] o.a.s.c.c.ZkStateReader Updating data for collection1 to ver 1 
   [junit4]   2> 530765 INFO  (coreLoadExecutor-2606-thread-1-processing-n:127.0.0.1:38967__tg) [n:127.0.0.1:38967__tg c:collection1   x:collection1] o.a.s.c.ZkController waiting to find shard id in clusterstate for collection1
   [junit4]   2> 530765 INFO  (coreLoadExecutor-2606-thread-1-processing-n:127.0.0.1:38967__tg) [n:127.0.0.1:38967__tg c:collection1   x:collection1] o.a.s.c.ZkController Check for collection zkNode:collection1
   [junit4]   2> 530765 INFO  (coreLoadExecutor-2606-thread-1-processing-n:127.0.0.1:38967__tg) [n:127.0.0.1:38967__tg c:collection1   x:collection1] o.a.s.c.ZkController Collection zkNode exists
   [junit4]   2> 530765 INFO  (coreLoadExecutor-2606-thread-1-processing-n:127.0.0.1:38967__tg) [n:127.0.0.1:38967__tg c:collection1   x:collection1] o.a.s.c.c.ZkStateReader Load collection config from:/collections/collection1
   [junit4]   2> 530766 INFO  (coreLoadExecutor-2606-thread-1-processing-n:127.0.0.1:38967__tg) [n:127.0.0.1:38967__tg c:collection1   x:collection1] o.a.s.c.c.ZkStateReader path=/collections/collection1 configName=conf1 specified config exists in ZooKeeper
   [junit4]   2> 530766 INFO  (coreLoadExecutor-2606-thread-1-processing-n:127.0.0.1:38967__tg) [n:127.0.0.1:38967__tg c:collection1   x:collection1] o.a.s.c.SolrResourceLoader new SolrResourceLoader for directory: '/home/jenkins/workspace/Lucene-Solr-trunk-Linux/solr/build/solr-core/test/J1/temp/solr.cloud.LeaderFailoverAfterPartitionTest_F286CE0F22D44ACD-001/shard-1-001/cores/collection1/'
   [junit4]   2> 530775 INFO  (coreLoadExecutor-2606-thread-1-processing-n:127.0.0.1:38967__tg) [n:127.0.0.1:38967__tg c:collection1   x:collection1] o.a.s.c.Config loaded config solrconfig.xml with version 0 
   [junit4]   2> 530779 INFO  (coreLoadExecutor-2606-thread-1-processing-n:127.0.0.1:38967__tg) [n:127.0.0.1:38967__tg c:collection1   x:collection1] o.a.s.c.SolrConfig current version of requestparams : -1
   [junit4]   2> 530786 INFO  (coreLoadExecutor-2606-thread-1-processing-n:127.0.0.1:38967__tg) [n:127.0.0.1:38967__tg c:collection1   x:collection1] o.a.s.c.SolrConfig Using Lucene MatchVersion: 6.0.0
   [junit4]   2> 530796 INFO  (coreLoadExecutor-2606-thread-1-processing-n:127.0.0.1:38967__tg) [n:127.0.0.1:38967__tg c:collection1   x:collection1] o.a.s.c.Config Loaded SolrConfig: solrconfig.xml
   [junit4]   2> 530797 INFO  (coreLoadExecutor-2606-thread-1-processing-n:127.0.0.1:38967__tg) [n:127.0.0.1:38967__tg c:collection1   x:collection1] o.a.s.s.IndexSchema Reading Solr Schema from /configs/conf1/schema.xml
   [junit4]   2> 530802 INFO  (coreLoadExecutor-2606-thread-1-processing-n:127.0.0.1:38967__tg) [n:127.0.0.1:38967__tg c:collection1   x:collection1] o.a.s.s.IndexSchema [collection1] Schema name=test
   [junit4]   2> 530930 INFO  (coreLoadExecutor-2606-thread-1-processing-n:127.0.0.1:38967__tg) [n:127.0.0.1:38967__tg c:collection1   x:collection1] o.a.s.s.OpenExchangeRatesOrgProvider Initialized with rates=open-exchange-rates.json, refreshInterval=1440.
   [junit4]   2> 530946 INFO  (coreLoadExecutor-2606-thread-1-processing-n:127.0.0.1:38967__tg) [n:127.0.0.1:38967__tg c:collection1   x:collection1] o.a.s.s.IndexSchema default search field in schema is text
   [junit4]   2> 530947 INFO  (coreLoadExecutor-2606-thread-1-processing-n:127.0.0.1:38967__tg) [n:127.0.0.1:38967__tg c:collection1   x:collection1] o.a.s.s.IndexSchema unique key field: id
   [junit4]   2> 530960 INFO  (coreLoadExecutor-2606-thread-1-processing-n:127.0.0.1:38967__tg) [n:127.0.0.1:38967__tg c:collection1   x:collection1] o.a.s.s.FileExchangeRateProvider Reloading exchange rates from file currency.xml
   [junit4]   2> 530962 INFO  (coreLoadExecutor-2606-thread-1-processing-n:127.0.0.1:38967__tg) [n:127.0.0.1:38967__tg c:collection1   x:collection1] o.a.s.s.FileExchangeRateProvider Reloading exchange rates from file currency.xml
   [junit4]   2> 530965 INFO  (coreLoadExecutor-2606-thread-1-processing-n:127.0.0.1:38967__tg) [n:127.0.0.1:38967__tg c:collection1   x:collection1] o.a.s.s.OpenExchangeRatesOrgProvider Reloading exchange rates from open-exchange-rates.json
   [junit4]   2> 530965 WARN  (coreLoadExecutor-2606-thread-1-processing-n:127.0.0.1:38967__tg) [n:127.0.0.1:38967__tg c:collection1   x:collection1] o.a.s.s.OpenExchangeRatesOrgProvider Unknown key IMPORTANT NOTE
   [junit4]   2> 530966 WARN  (coreLoadExecutor-2606-thread-1-processing-n:127.0.0.1:38967__tg) [n:127.0.0.1:38967__tg c:collection1   x:collection1] o.a.s.s.OpenExchangeRatesOrgProvider Expected key, got STRING
   [junit4]   2> 530966 INFO  (coreLoadExecutor-2606-thread-1-processing-n:127.0.0.1:38967__tg) [n:127.0.0.1:38967__tg c:collection1   x:collection1] o.a.s.s.OpenExchangeRatesOrgProvider Reloading exchange rates from open-exchange-rates.json
   [junit4]   2> 530966 WARN  (coreLoadExecutor-2606-thread-1-processing-n:127.0.0.1:38967__tg) [n:127.0.0.1:38967__tg c:collection1   x:collection1] o.a.s.s.OpenExchangeRatesOrgProvid

[...truncated too long message...]

ute(SolrZkClient.java:388)
   [junit4]   2> 	at org.apache.solr.common.cloud.SolrZkClient$9.execute(SolrZkClient.java:385)
   [junit4]   2> 	at org.apache.solr.common.cloud.ZkCmdExecutor.retryOperation(ZkCmdExecutor.java:61)
   [junit4]   2> 	at org.apache.solr.common.cloud.SolrZkClient.create(SolrZkClient.java:385)
   [junit4]   2> 	at org.apache.solr.cloud.Overseer.createOverseerNode(Overseer.java:929)
   [junit4]   2> 	... 20 more
   [junit4]   2> 682026 INFO  (TEST-LeaderFailoverAfterPartitionTest.test-seed#[F286CE0F22D44ACD]) [    ] o.e.j.s.ServerConnector Stopped ServerConnector@7ccc8c2f{HTTP/1.1}{127.0.0.1:0}
   [junit4]   2> 682026 INFO  (TEST-LeaderFailoverAfterPartitionTest.test-seed#[F286CE0F22D44ACD]) [    ] o.e.j.s.h.ContextHandler Stopped o.e.j.s.ServletContextHandler@a0d177d{/_tg,null,UNAVAILABLE}
   [junit4]   2> 682028 INFO  (TEST-LeaderFailoverAfterPartitionTest.test-seed#[F286CE0F22D44ACD]) [n:127.0.0.1:42710__tg c:c8n_1x3_lf s:shard1 r:core_node1 x:c8n_1x3_lf_shard1_replica2] o.a.s.c.ZkTestServer connecting to 127.0.0.1:58096 58096
   [junit4]   2> 682055 INFO  (Thread-1819) [    ] o.a.s.c.ZkTestServer connecting to 127.0.0.1:58096 58096
   [junit4]   2> 682057 WARN  (Thread-1819) [    ] o.a.s.c.ZkTestServer Watch limit violations: 
   [junit4]   2> Maximum concurrent create/delete watches above limit:
   [junit4]   2> 
   [junit4]   2> 	5	/solr/aliases.json
   [junit4]   2> 	5	/solr/clusterstate.json
   [junit4]   2> 	4	/solr/configs/conf1
   [junit4]   2> 	3	/solr/collections/c8n_1x3_lf/state.json
   [junit4]   2> 	3	/solr/collections/collection1/state.json
   [junit4]   2> 
   [junit4]   2> Maximum concurrent data watches above limit:
   [junit4]   2> 
   [junit4]   2> 	2	/solr/overseer_elect/election/94259947387420676-127.0.0.1:57256__tg-n_0000000000
   [junit4]   2> 
   [junit4]   2> Maximum concurrent children watches above limit:
   [junit4]   2> 
   [junit4]   2> 	5	/solr/live_nodes
   [junit4]   2> 	3	/solr/overseer/queue
   [junit4]   2> 	3	/solr/overseer/collection-queue-work
   [junit4]   2> 
   [junit4]   2> 682058 WARN  (TEST-LeaderFailoverAfterPartitionTest.test-seed#[F286CE0F22D44ACD]) [n:127.0.0.1:42710__tg c:c8n_1x3_lf s:shard1 r:core_node1 x:c8n_1x3_lf_shard1_replica2] o.a.s.c.SocketProxy Closing 3 connections to: http://127.0.0.1:56504/_tg, target: http://127.0.0.1:53808/_tg
   [junit4]   2> 682058 WARN  (TEST-LeaderFailoverAfterPartitionTest.test-seed#[F286CE0F22D44ACD]) [n:127.0.0.1:42710__tg c:c8n_1x3_lf s:shard1 r:core_node1 x:c8n_1x3_lf_shard1_replica2] o.a.s.c.SocketProxy Closing 0 connections to: http://127.0.0.1:38967/_tg, target: http://127.0.0.1:37737/_tg
   [junit4]   2> 682058 WARN  (TEST-LeaderFailoverAfterPartitionTest.test-seed#[F286CE0F22D44ACD]) [n:127.0.0.1:42710__tg c:c8n_1x3_lf s:shard1 r:core_node1 x:c8n_1x3_lf_shard1_replica2] o.a.s.c.SocketProxy Closing 5 connections to: http://127.0.0.1:57256/_tg, target: http://127.0.0.1:40064/_tg
   [junit4]   2> 682058 WARN  (TEST-LeaderFailoverAfterPartitionTest.test-seed#[F286CE0F22D44ACD]) [n:127.0.0.1:42710__tg c:c8n_1x3_lf s:shard1 r:core_node1 x:c8n_1x3_lf_shard1_replica2] o.a.s.c.SocketProxy Closing 2 connections to: http://127.0.0.1:42710/_tg, target: http://127.0.0.1:49332/_tg
   [junit4]   2> NOTE: reproduce with: ant test  -Dtestcase=LeaderFailoverAfterPartitionTest -Dtests.method=test -Dtests.seed=F286CE0F22D44ACD -Dtests.multiplier=3 -Dtests.slow=true -Dtests.locale=ro_RO -Dtests.timezone=Chile/Continental -Dtests.asserts=true -Dtests.file.encoding=UTF-8
   [junit4] FAILURE  155s J1 | LeaderFailoverAfterPartitionTest.test <<<
   [junit4]    > Throwable #1: java.lang.AssertionError: Didn't see replicas [core_node1, core_node3] come up within 90000 ms! ClusterState: DocCollection(c8n_1x3_lf)={
   [junit4]    >   "replicationFactor":"3",
   [junit4]    >   "shards":{"shard1":{
   [junit4]    >       "range":"80000000-7fffffff",
   [junit4]    >       "state":"active",
   [junit4]    >       "replicas":{
   [junit4]    >         "core_node1":{
   [junit4]    >           "core":"c8n_1x3_lf_shard1_replica2",
   [junit4]    >           "base_url":"http://127.0.0.1:42710/_tg",
   [junit4]    >           "node_name":"127.0.0.1:42710__tg",
   [junit4]    >           "state":"recovering"},
   [junit4]    >         "core_node2":{
   [junit4]    >           "core":"c8n_1x3_lf_shard1_replica1",
   [junit4]    >           "base_url":"http://127.0.0.1:38967/_tg",
   [junit4]    >           "node_name":"127.0.0.1:38967__tg",
   [junit4]    >           "state":"down"},
   [junit4]    >         "core_node3":{
   [junit4]    >           "core":"c8n_1x3_lf_shard1_replica3",
   [junit4]    >           "base_url":"http://127.0.0.1:57256/_tg",
   [junit4]    >           "node_name":"127.0.0.1:57256__tg",
   [junit4]    >           "state":"active",
   [junit4]    >           "leader":"true"}}}},
   [junit4]    >   "router":{"name":"compositeId"},
   [junit4]    >   "maxShardsPerNode":"1",
   [junit4]    >   "autoAddReplicas":"false"}
   [junit4]    > 	at __randomizedtesting.SeedInfo.seed([F286CE0F22D44ACD:7AD2F1D58C282735]:0)
   [junit4]    > 	at org.apache.solr.cloud.HttpPartitionTest.waitToSeeReplicasActive(HttpPartitionTest.java:565)
   [junit4]    > 	at org.apache.solr.cloud.LeaderFailoverAfterPartitionTest.testRf3WithLeaderFailover(LeaderFailoverAfterPartitionTest.java:178)
   [junit4]    > 	at org.apache.solr.cloud.LeaderFailoverAfterPartitionTest.test(LeaderFailoverAfterPartitionTest.java:51)
   [junit4]    > 	at org.apache.solr.BaseDistributedSearchTestCase$ShardsRepeatRule$ShardsFixedStatement.callStatement(BaseDistributedSearchTestCase.java:966)
   [junit4]    > 	at org.apache.solr.BaseDistributedSearchTestCase$ShardsRepeatRule$ShardsStatement.evaluate(BaseDistributedSearchTestCase.java:941)
   [junit4]    > 	at java.lang.Thread.run(Thread.java:745)
   [junit4]   2> 682063 INFO  (SUITE-LeaderFailoverAfterPartitionTest-seed#[F286CE0F22D44ACD]-worker) [n:127.0.0.1:42710__tg c:c8n_1x3_lf s:shard1 r:core_node1 x:c8n_1x3_lf_shard1_replica2] o.a.s.SolrTestCaseJ4 ###deleteCore
   [junit4]   2> NOTE: leaving temporary files on disk at: /home/jenkins/workspace/Lucene-Solr-trunk-Linux/solr/build/solr-core/test/J1/temp/solr.cloud.LeaderFailoverAfterPartitionTest_F286CE0F22D44ACD-001
   [junit4]   2> Jul 30, 2015 9:46:49 PM com.carrotsearch.randomizedtesting.ThreadLeakControl checkThreadLeaks
   [junit4]   2> WARNING: Will linger awaiting termination of 1 leaked thread(s).
   [junit4]   2> NOTE: test params are: codec=Asserting(Lucene53): {range_facet_l_dv=PostingsFormat(name=Memory doPackFST= false), _version_=PostingsFormat(name=Asserting), multiDefault=PostingsFormat(name=LuceneFixedGap), a_t=PostingsFormat(name=LuceneFixedGap), intDefault=PostingsFormat(name=Asserting), id=PostingsFormat(name=Memory doPackFST= false), range_facet_i_dv=PostingsFormat(name=LuceneFixedGap), text=TestBloomFilteredLucenePostings(BloomFilteringPostingsFormat(Lucene50(blocksize=128))), range_facet_l=PostingsFormat(name=LuceneFixedGap), timestamp=PostingsFormat(name=LuceneFixedGap)}, docValues:{range_facet_l_dv=DocValuesFormat(name=Asserting), range_facet_i_dv=DocValuesFormat(name=Lucene50), timestamp=DocValuesFormat(name=Lucene50)}, sim=RandomSimilarityProvider(queryNorm=false,coord=yes): {}, locale=ro_RO, timezone=Chile/Continental
   [junit4]   2> NOTE: Linux 3.16.0-44-generic amd64/Oracle Corporation 1.8.0_60-ea (64-bit)/cpus=12,threads=1,free=166030320,total=526385152
   [junit4]   2> NOTE: All tests run in this JVM: [TestAddFieldRealTimeGet, TestCollectionAPI, TestManagedSchemaFieldTypeResource, DistanceFunctionTest, TestRandomRequestDistribution, HdfsNNFailoverTest, TestDistributedGrouping, TestFileDictionaryLookup, TestReloadAndDeleteDocs, TestAtomicUpdateErrorCases, DocValuesMultiTest, TestPHPSerializedResponseWriter, ExitableDirectoryReaderTest, TestCoreDiscovery, TestDistributedMissingSort, CollectionsAPIDistributedZkTest, SuggesterTSTTest, TestFuzzyAnalyzedSuggestions, RAMDirectoryFactoryTest, HdfsUnloadDistributedZkTest, HdfsChaosMonkeySafeLeaderTest, BufferStoreTest, TestIntervalFaceting, TestSolrCloudWithKerberosAlt, DocumentBuilderTest, DistributedQueueTest, TestWriterPerf, SolrPluginUtilsTest, TestNRTOpen, BlockCacheTest, TestLMJelinekMercerSimilarityFactory, EnumFieldTest, FacetPivotSmallTest, TestManagedSchema, CustomCollectionTest, TestScoreJoinQPScore, EchoParamsTest, SliceStateTest, BadComponentTest, TestDistributedStatsComponentCardinality, TestDistribDocBasedVersion, StatelessScriptUpdateProcessorFactoryTest, SolrCloudExampleTest, TestConfigReload, CurrencyFieldOpenExchangeTest, TestLMDirichletSimilarityFactory, CdcrUpdateLogTest, TestStressVersions, ZkControllerTest, LeaderFailoverAfterPartitionTest]
   [junit4] Completed [214/528] on J1 in 156.02s, 1 test, 1 failure <<< FAILURES!

[...truncated 980 lines...]
BUILD FAILED
/home/jenkins/workspace/Lucene-Solr-trunk-Linux/build.xml:717: The following error occurred while executing this line:
/home/jenkins/workspace/Lucene-Solr-trunk-Linux/build.xml:661: The following error occurred while executing this line:
/home/jenkins/workspace/Lucene-Solr-trunk-Linux/build.xml:59: The following error occurred while executing this line:
/home/jenkins/workspace/Lucene-Solr-trunk-Linux/solr/build.xml:230: The following error occurred while executing this line:
/home/jenkins/workspace/Lucene-Solr-trunk-Linux/solr/common-build.xml:518: The following error occurred while executing this line:
/home/jenkins/workspace/Lucene-Solr-trunk-Linux/lucene/common-build.xml:1429: The following error occurred while executing this line:
/home/jenkins/workspace/Lucene-Solr-trunk-Linux/lucene/common-build.xml:984: There were test failures: 528 suites, 2081 tests, 1 failure, 61 ignored (26 assumptions)

Total time: 47 minutes 32 seconds
Build step 'Invoke Ant' marked build as failure
Archiving artifacts
Recording test results
Email was triggered for: Failure - Any
Sending email for trigger: Failure - Any



Mime
View raw message