lucene-dev mailing list archives

Site index · List index
Message view « Date » · « Thread »
Top « Date » · « Thread »
From Policeman Jenkins Server <jenk...@thetaphi.de>
Subject [JENKINS] Lucene-Solr-trunk-Linux (32bit/jdk1.9.0-ea-b60) - Build # 13300 - Still Failing!
Date Thu, 02 Jul 2015 22:34:53 GMT
Build: http://jenkins.thetaphi.de/job/Lucene-Solr-trunk-Linux/13300/
Java: 32bit/jdk1.9.0-ea-b60 -client -XX:+UseParallelGC

1 tests failed.
FAILED:  org.apache.solr.search.TestSearcherReuse.test

Error Message:
expected same:<Searcher@3338ea[collection1] main{ExitableDirectoryReader(UninvertingDirectoryReader(Uninverting(_0(6.0.0):C3)))}>
was not:<Searcher@13fe8b4[collection1] main{ExitableDirectoryReader(UninvertingDirectoryReader(Uninverting(_0(6.0.0):C3)))}>

Stack Trace:
java.lang.AssertionError: expected same:<Searcher@3338ea[collection1] main{ExitableDirectoryReader(UninvertingDirectoryReader(Uninverting(_0(6.0.0):C3)))}>
was not:<Searcher@13fe8b4[collection1] main{ExitableDirectoryReader(UninvertingDirectoryReader(Uninverting(_0(6.0.0):C3)))}>
	at __randomizedtesting.SeedInfo.seed([CC5AB3F3C829A23C:440E8C2966D5CFC4]:0)
	at org.junit.Assert.fail(Assert.java:93)
	at org.junit.Assert.failNotSame(Assert.java:641)
	at org.junit.Assert.assertSame(Assert.java:580)
	at org.junit.Assert.assertSame(Assert.java:593)
	at org.apache.solr.search.TestSearcherReuse.assertSearcherHasNotChanged(TestSearcherReuse.java:247)
	at org.apache.solr.search.TestSearcherReuse.test(TestSearcherReuse.java:117)
	at sun.reflect.NativeMethodAccessorImpl.invoke0(Native Method)
	at sun.reflect.NativeMethodAccessorImpl.invoke(NativeMethodAccessorImpl.java:62)
	at sun.reflect.DelegatingMethodAccessorImpl.invoke(DelegatingMethodAccessorImpl.java:43)
	at java.lang.reflect.Method.invoke(Method.java:502)
	at com.carrotsearch.randomizedtesting.RandomizedRunner.invoke(RandomizedRunner.java:1627)
	at com.carrotsearch.randomizedtesting.RandomizedRunner$6.evaluate(RandomizedRunner.java:836)
	at com.carrotsearch.randomizedtesting.RandomizedRunner$7.evaluate(RandomizedRunner.java:872)
	at com.carrotsearch.randomizedtesting.RandomizedRunner$8.evaluate(RandomizedRunner.java:886)
	at com.carrotsearch.randomizedtesting.rules.SystemPropertiesRestoreRule$1.evaluate(SystemPropertiesRestoreRule.java:57)
	at org.apache.lucene.util.TestRuleSetupTeardownChained$1.evaluate(TestRuleSetupTeardownChained.java:50)
	at org.apache.lucene.util.AbstractBeforeAfterRule$1.evaluate(AbstractBeforeAfterRule.java:46)
	at org.apache.lucene.util.TestRuleThreadAndTestName$1.evaluate(TestRuleThreadAndTestName.java:49)
	at org.apache.lucene.util.TestRuleIgnoreAfterMaxFailures$1.evaluate(TestRuleIgnoreAfterMaxFailures.java:65)
	at org.apache.lucene.util.TestRuleMarkFailure$1.evaluate(TestRuleMarkFailure.java:48)
	at com.carrotsearch.randomizedtesting.rules.StatementAdapter.evaluate(StatementAdapter.java:36)
	at com.carrotsearch.randomizedtesting.ThreadLeakControl$StatementRunner.run(ThreadLeakControl.java:365)
	at com.carrotsearch.randomizedtesting.ThreadLeakControl.forkTimeoutingTask(ThreadLeakControl.java:798)
	at com.carrotsearch.randomizedtesting.ThreadLeakControl$3.evaluate(ThreadLeakControl.java:458)
	at com.carrotsearch.randomizedtesting.RandomizedRunner.runSingleTest(RandomizedRunner.java:845)
	at com.carrotsearch.randomizedtesting.RandomizedRunner$3.evaluate(RandomizedRunner.java:747)
	at com.carrotsearch.randomizedtesting.RandomizedRunner$4.evaluate(RandomizedRunner.java:781)
	at com.carrotsearch.randomizedtesting.RandomizedRunner$5.evaluate(RandomizedRunner.java:792)
	at com.carrotsearch.randomizedtesting.rules.StatementAdapter.evaluate(StatementAdapter.java:36)
	at com.carrotsearch.randomizedtesting.rules.SystemPropertiesRestoreRule$1.evaluate(SystemPropertiesRestoreRule.java:57)
	at org.apache.lucene.util.AbstractBeforeAfterRule$1.evaluate(AbstractBeforeAfterRule.java:46)
	at com.carrotsearch.randomizedtesting.rules.StatementAdapter.evaluate(StatementAdapter.java:36)
	at org.apache.lucene.util.TestRuleStoreClassName$1.evaluate(TestRuleStoreClassName.java:42)
	at com.carrotsearch.randomizedtesting.rules.NoShadowingOrOverridesOnMethodsRule$1.evaluate(NoShadowingOrOverridesOnMethodsRule.java:39)
	at com.carrotsearch.randomizedtesting.rules.NoShadowingOrOverridesOnMethodsRule$1.evaluate(NoShadowingOrOverridesOnMethodsRule.java:39)
	at com.carrotsearch.randomizedtesting.rules.StatementAdapter.evaluate(StatementAdapter.java:36)
	at com.carrotsearch.randomizedtesting.rules.StatementAdapter.evaluate(StatementAdapter.java:36)
	at com.carrotsearch.randomizedtesting.rules.StatementAdapter.evaluate(StatementAdapter.java:36)
	at org.apache.lucene.util.TestRuleAssertionsRequired$1.evaluate(TestRuleAssertionsRequired.java:54)
	at org.apache.lucene.util.TestRuleMarkFailure$1.evaluate(TestRuleMarkFailure.java:48)
	at org.apache.lucene.util.TestRuleIgnoreAfterMaxFailures$1.evaluate(TestRuleIgnoreAfterMaxFailures.java:65)
	at org.apache.lucene.util.TestRuleIgnoreTestSuites$1.evaluate(TestRuleIgnoreTestSuites.java:55)
	at com.carrotsearch.randomizedtesting.rules.StatementAdapter.evaluate(StatementAdapter.java:36)
	at com.carrotsearch.randomizedtesting.ThreadLeakControl$StatementRunner.run(ThreadLeakControl.java:365)
	at java.lang.Thread.run(Thread.java:745)




Build Log:
[...truncated 9683 lines...]
   [junit4] Suite: org.apache.solr.search.TestSearcherReuse
   [junit4]   2> Creating dataDir: /home/jenkins/workspace/Lucene-Solr-trunk-Linux/solr/build/solr-core/test/J2/temp/solr.search.TestSearcherReuse_CC5AB3F3C829A23C-001/init-core-data-001
   [junit4]   2> 400067 INFO  (SUITE-TestSearcherReuse-seed#[CC5AB3F3C829A23C]-worker)
[    ] o.a.s.SolrTestCaseJ4 Randomized ssl (true) and clientAuth (true)
   [junit4]   2> 400069 INFO  (SUITE-TestSearcherReuse-seed#[CC5AB3F3C829A23C]-worker)
[    ] o.a.s.SolrTestCaseJ4 ####initCore
   [junit4]   2> 400069 INFO  (SUITE-TestSearcherReuse-seed#[CC5AB3F3C829A23C]-worker)
[    ] o.a.s.c.SolrResourceLoader new SolrResourceLoader for directory: '/home/jenkins/workspace/Lucene-Solr-trunk-Linux/solr/build/solr-core/test/J2/temp/solr.search.TestSearcherReuse_CC5AB3F3C829A23C-001/tempDir-001/collection1/'
   [junit4]   2> 400084 INFO  (SUITE-TestSearcherReuse-seed#[CC5AB3F3C829A23C]-worker)
[    ] o.a.s.c.SolrConfig current version of requestparams : -1
   [junit4]   2> 400087 INFO  (SUITE-TestSearcherReuse-seed#[CC5AB3F3C829A23C]-worker)
[    ] o.a.s.c.SolrConfig Using Lucene MatchVersion: 6.0.0
   [junit4]   2> 400092 INFO  (SUITE-TestSearcherReuse-seed#[CC5AB3F3C829A23C]-worker)
[    ] o.a.s.c.Config Loaded SolrConfig: solrconfig-managed-schema.xml
   [junit4]   2> 400093 INFO  (SUITE-TestSearcherReuse-seed#[CC5AB3F3C829A23C]-worker)
[    ] o.a.s.s.ManagedIndexSchemaFactory The schema is configured as managed, but managed
schema resource managed-schema not found - loading non-managed schema schema-id-and-version-fields-only.xml
instead
   [junit4]   2> 400093 INFO  (SUITE-TestSearcherReuse-seed#[CC5AB3F3C829A23C]-worker)
[    ] o.a.s.s.IndexSchema Reading Solr Schema from /home/jenkins/workspace/Lucene-Solr-trunk-Linux/solr/build/solr-core/test/J2/temp/solr.search.TestSearcherReuse_CC5AB3F3C829A23C-001/tempDir-001/collection1/conf/schema-id-and-version-fields-only.xml
   [junit4]   2> 400095 INFO  (SUITE-TestSearcherReuse-seed#[CC5AB3F3C829A23C]-worker)
[    ] o.a.s.s.IndexSchema [null] Schema name=id-and-version-fields-only
   [junit4]   2> 400097 INFO  (SUITE-TestSearcherReuse-seed#[CC5AB3F3C829A23C]-worker)
[    ] o.a.s.s.IndexSchema unique key field: id
   [junit4]   2> 400097 INFO  (SUITE-TestSearcherReuse-seed#[CC5AB3F3C829A23C]-worker)
[    ] o.a.s.s.IndexSchema Upgraded to managed schema at /home/jenkins/workspace/Lucene-Solr-trunk-Linux/solr/build/solr-core/test/J2/temp/solr.search.TestSearcherReuse_CC5AB3F3C829A23C-001/tempDir-001/collection1/conf/managed-schema
   [junit4]   2> 400126 INFO  (SUITE-TestSearcherReuse-seed#[CC5AB3F3C829A23C]-worker)
[    ] o.a.s.s.ManagedIndexSchemaFactory After upgrading to managed schema, renamed the non-managed
schema /home/jenkins/workspace/Lucene-Solr-trunk-Linux/solr/build/solr-core/test/J2/temp/solr.search.TestSearcherReuse_CC5AB3F3C829A23C-001/tempDir-001/collection1/conf/schema-id-and-version-fields-only.xml
to /home/jenkins/workspace/Lucene-Solr-trunk-Linux/solr/build/solr-core/test/J2/temp/solr.search.TestSearcherReuse_CC5AB3F3C829A23C-001/tempDir-001/collection1/conf/schema-id-and-version-fields-only.xml.bak
   [junit4]   2> 400126 INFO  (SUITE-TestSearcherReuse-seed#[CC5AB3F3C829A23C]-worker)
[    ] o.a.s.c.SolrResourceLoader JNDI not configured for solr (NoInitialContextEx)
   [junit4]   2> 400126 INFO  (SUITE-TestSearcherReuse-seed#[CC5AB3F3C829A23C]-worker)
[    ] o.a.s.c.SolrResourceLoader using system property solr.solr.home: /home/jenkins/workspace/Lucene-Solr-trunk-Linux/solr/build/solr-core/test/J2/temp/solr.search.TestSearcherReuse_CC5AB3F3C829A23C-001/tempDir-001
   [junit4]   2> 400126 INFO  (SUITE-TestSearcherReuse-seed#[CC5AB3F3C829A23C]-worker)
[    ] o.a.s.c.SolrResourceLoader new SolrResourceLoader for directory: '/home/jenkins/workspace/Lucene-Solr-trunk-Linux/solr/build/solr-core/test/J2/temp/solr.search.TestSearcherReuse_CC5AB3F3C829A23C-001/tempDir-001/'
   [junit4]   2> 400138 INFO  (SUITE-TestSearcherReuse-seed#[CC5AB3F3C829A23C]-worker)
[    ] o.a.s.c.CoreContainer New CoreContainer 23923339
   [junit4]   2> 400138 INFO  (SUITE-TestSearcherReuse-seed#[CC5AB3F3C829A23C]-worker)
[    ] o.a.s.c.CoreContainer Loading cores into CoreContainer [instanceDir=/home/jenkins/workspace/Lucene-Solr-trunk-Linux/solr/build/solr-core/test/J2/temp/solr.search.TestSearcherReuse_CC5AB3F3C829A23C-001/tempDir-001/]
   [junit4]   2> 400138 INFO  (SUITE-TestSearcherReuse-seed#[CC5AB3F3C829A23C]-worker)
[    ] o.a.s.c.CoreContainer loading shared library: /home/jenkins/workspace/Lucene-Solr-trunk-Linux/solr/build/solr-core/test/J2/temp/solr.search.TestSearcherReuse_CC5AB3F3C829A23C-001/tempDir-001/lib
   [junit4]   2> 400138 WARN  (SUITE-TestSearcherReuse-seed#[CC5AB3F3C829A23C]-worker)
[    ] o.a.s.c.SolrResourceLoader Can't find (or read) directory to add to classloader: lib
(resolved as: /home/jenkins/workspace/Lucene-Solr-trunk-Linux/solr/build/solr-core/test/J2/temp/solr.search.TestSearcherReuse_CC5AB3F3C829A23C-001/tempDir-001/lib).
   [junit4]   2> 400143 INFO  (SUITE-TestSearcherReuse-seed#[CC5AB3F3C829A23C]-worker)
[    ] o.a.s.h.c.HttpShardHandlerFactory created with socketTimeout : 600000,connTimeout :
60000,maxConnectionsPerHost : 20,maxConnections : 10000,corePoolSize : 0,maximumPoolSize :
2147483647,maxThreadIdleTime : 5,sizeOfQueue : -1,fairnessPolicy : false,useRetries : false,
   [junit4]   2> 400147 INFO  (SUITE-TestSearcherReuse-seed#[CC5AB3F3C829A23C]-worker)
[    ] o.a.s.u.UpdateShardHandler Creating UpdateShardHandler HTTP client with params: socketTimeout=30000&connTimeout=30000&retry=true
   [junit4]   2> 400149 INFO  (SUITE-TestSearcherReuse-seed#[CC5AB3F3C829A23C]-worker)
[    ] o.a.s.l.LogWatcher SLF4J impl is org.slf4j.impl.Log4jLoggerFactory
   [junit4]   2> 400149 INFO  (SUITE-TestSearcherReuse-seed#[CC5AB3F3C829A23C]-worker)
[    ] o.a.s.l.LogWatcher Registering Log Listener [Log4j (org.slf4j.impl.Log4jLoggerFactory)]
   [junit4]   2> 400149 INFO  (SUITE-TestSearcherReuse-seed#[CC5AB3F3C829A23C]-worker)
[    ] o.a.s.c.CoreContainer No authentication plugin used.
   [junit4]   2> 400150 INFO  (SUITE-TestSearcherReuse-seed#[CC5AB3F3C829A23C]-worker)
[    ] o.a.s.c.SolrCore Created CoreDescriptor: {name=collection1, config=solrconfig-managed-schema.xml,
transient=false, schema=managed-schema, loadOnStartup=true, instanceDir=collection1, collection=collection1,
absoluteInstDir=/home/jenkins/workspace/Lucene-Solr-trunk-Linux/solr/build/solr-core/test/J2/temp/solr.search.TestSearcherReuse_CC5AB3F3C829A23C-001/tempDir-001/collection1/,
dataDir=/home/jenkins/workspace/Lucene-Solr-trunk-Linux/solr/build/solr-core/test/J2/temp/solr.search.TestSearcherReuse_CC5AB3F3C829A23C-001/init-core-data-001,
shard=shard1}
   [junit4]   2> 400150 INFO  (coreLoadExecutor-1106-thread-1) [    ] o.a.s.c.SolrResourceLoader
new SolrResourceLoader for directory: '/home/jenkins/workspace/Lucene-Solr-trunk-Linux/solr/build/solr-core/test/J2/temp/solr.search.TestSearcherReuse_CC5AB3F3C829A23C-001/tempDir-001/collection1/'
   [junit4]   2> 400169 INFO  (coreLoadExecutor-1106-thread-1) [    ] o.a.s.c.SolrConfig
current version of requestparams : -1
   [junit4]   2> 400173 INFO  (coreLoadExecutor-1106-thread-1) [    ] o.a.s.c.SolrConfig
Using Lucene MatchVersion: 6.0.0
   [junit4]   2> 400182 INFO  (coreLoadExecutor-1106-thread-1) [    ] o.a.s.c.Config Loaded
SolrConfig: solrconfig-managed-schema.xml
   [junit4]   2> 400182 INFO  (coreLoadExecutor-1106-thread-1) [    ] o.a.s.s.IndexSchema
Reading Solr Schema from /home/jenkins/workspace/Lucene-Solr-trunk-Linux/solr/build/solr-core/test/J2/temp/solr.search.TestSearcherReuse_CC5AB3F3C829A23C-001/tempDir-001/collection1/conf/managed-schema
   [junit4]   2> 400184 INFO  (coreLoadExecutor-1106-thread-1) [    ] o.a.s.s.IndexSchema
[collection1] Schema name=id-and-version-fields-only
   [junit4]   2> 400186 INFO  (coreLoadExecutor-1106-thread-1) [    ] o.a.s.s.IndexSchema
unique key field: id
   [junit4]   2> 400187 INFO  (coreLoadExecutor-1106-thread-1) [    ] o.a.s.c.CoreContainer
Creating SolrCore 'collection1' using configuration from instancedir /home/jenkins/workspace/Lucene-Solr-trunk-Linux/solr/build/solr-core/test/J2/temp/solr.search.TestSearcherReuse_CC5AB3F3C829A23C-001/tempDir-001/collection1/
   [junit4]   2> 400187 INFO  (coreLoadExecutor-1106-thread-1) [    x:collection1] o.a.s.c.SolrCore
solr.NRTCachingDirectoryFactory
   [junit4]   2> 400187 INFO  (coreLoadExecutor-1106-thread-1) [    x:collection1] o.a.s.c.SolrCore
[[collection1] ] Opening new SolrCore at [/home/jenkins/workspace/Lucene-Solr-trunk-Linux/solr/build/solr-core/test/J2/temp/solr.search.TestSearcherReuse_CC5AB3F3C829A23C-001/tempDir-001/collection1/],
dataDir=[null]
   [junit4]   2> 400187 INFO  (coreLoadExecutor-1106-thread-1) [    x:collection1] o.a.s.c.SolrCore
JMX monitoring not detected for core: collection1
   [junit4]   2> 400187 INFO  (coreLoadExecutor-1106-thread-1) [    x:collection1] o.a.s.c.CachingDirectoryFactory
return new directory for /home/jenkins/workspace/Lucene-Solr-trunk-Linux/solr/build/solr-core/test/J2/temp/solr.search.TestSearcherReuse_CC5AB3F3C829A23C-001/init-core-data-001
   [junit4]   2> 400188 INFO  (coreLoadExecutor-1106-thread-1) [    x:collection1] o.a.s.c.SolrCore
New index directory detected: old=null new=/home/jenkins/workspace/Lucene-Solr-trunk-Linux/solr/build/solr-core/test/J2/temp/solr.search.TestSearcherReuse_CC5AB3F3C829A23C-001/init-core-data-001/index/
   [junit4]   2> 400188 WARN  (coreLoadExecutor-1106-thread-1) [    x:collection1] o.a.s.c.SolrCore
[collection1] Solr index directory '/home/jenkins/workspace/Lucene-Solr-trunk-Linux/solr/build/solr-core/test/J2/temp/solr.search.TestSearcherReuse_CC5AB3F3C829A23C-001/init-core-data-001/index'
doesn't exist. Creating new index...
   [junit4]   2> 400188 INFO  (coreLoadExecutor-1106-thread-1) [    x:collection1] o.a.s.c.CachingDirectoryFactory
return new directory for /home/jenkins/workspace/Lucene-Solr-trunk-Linux/solr/build/solr-core/test/J2/temp/solr.search.TestSearcherReuse_CC5AB3F3C829A23C-001/init-core-data-001/index
   [junit4]   2> 400189 INFO  (coreLoadExecutor-1106-thread-1) [    x:collection1] o.a.s.u.RandomMergePolicy
RandomMergePolicy wrapping class org.apache.lucene.index.LogByteSizeMergePolicy: [LogByteSizeMergePolicy:
minMergeSize=1677721, mergeFactor=26, maxMergeSize=2147483648, maxMergeSizeForForcedMerge=9223372036854775807,
calibrateSizeByDeletes=false, maxMergeDocs=2147483647, maxCFSSegmentSizeMB=2.181640625, noCFSRatio=1.0]
   [junit4]   2> 400225 INFO  (coreLoadExecutor-1106-thread-1) [    x:collection1] o.a.s.c.SolrCore
SolrDeletionPolicy.onCommit: commits: num=1
   [junit4]   2> 	commit{dir=NRTCachingDirectory(NIOFSDirectory@/home/jenkins/workspace/Lucene-Solr-trunk-Linux/solr/build/solr-core/test/J2/temp/solr.search.TestSearcherReuse_CC5AB3F3C829A23C-001/init-core-data-001/index
lockFactory=org.apache.lucene.store.SingleInstanceLockFactory@6fc815; maxCacheMB=48.0 maxMergeSizeMB=4.0),segFN=segments_1,generation=1}
   [junit4]   2> 400225 INFO  (coreLoadExecutor-1106-thread-1) [    x:collection1] o.a.s.c.SolrCore
newest commit generation = 1
   [junit4]   2> 400225 INFO  (OldIndexDirectoryCleanupThreadForCore-collection1) [   
x:collection1] o.a.s.c.SolrCore Looking for old index directories to cleanup for core collection1
in /home/jenkins/workspace/Lucene-Solr-trunk-Linux/solr/build/solr-core/test/J2/temp/solr.search.TestSearcherReuse_CC5AB3F3C829A23C-001/init-core-data-001/
   [junit4]   2> 400227 INFO  (coreLoadExecutor-1106-thread-1) [    x:collection1] o.a.s.c.SolrCore
no updateRequestProcessorChain defined as default, creating implicit default
   [junit4]   2> 400227 WARN  (coreLoadExecutor-1106-thread-1) [    x:collection1] o.a.s.c.RequestHandlers
INVALID paramSet a in requestHandler {type = requestHandler,name = /dump,class = DumpRequestHandler,args
= {defaults={a=A,b=B}}}
   [junit4]   2> 400229 INFO  (coreLoadExecutor-1106-thread-1) [    x:collection1] o.a.s.h.l.XMLLoader
xsltCacheLifetimeSeconds=60
   [junit4]   2> 400230 INFO  (coreLoadExecutor-1106-thread-1) [    x:collection1] o.a.s.h.l.XMLLoader
xsltCacheLifetimeSeconds=60
   [junit4]   2> 400230 INFO  (coreLoadExecutor-1106-thread-1) [    x:collection1] o.a.s.h.l.XMLLoader
xsltCacheLifetimeSeconds=60
   [junit4]   2> 400231 INFO  (coreLoadExecutor-1106-thread-1) [    x:collection1] o.a.s.h.l.XMLLoader
xsltCacheLifetimeSeconds=60
   [junit4]   2> 400232 INFO  (coreLoadExecutor-1106-thread-1) [    x:collection1] o.a.s.c.RequestHandlers
Registered paths: /admin/mbeans,standard,/dump,/update/csv,/update/json/docs,/admin/luke,/admin/segments,/get,/admin/system,/replication,/admin/properties,/config,/schema,/admin/plugins,/admin/logging,/update/json,/admin/threads,/admin/ping,/update,/admin/file
   [junit4]   2> 400233 INFO  (coreLoadExecutor-1106-thread-1) [    x:collection1] o.a.s.c.SolrCore
Using default statsCache cache: org.apache.solr.search.stats.LocalStatsCache
   [junit4]   2> 400233 INFO  (coreLoadExecutor-1106-thread-1) [    x:collection1] o.a.s.c.SolrCore
Hard AutoCommit: disabled
   [junit4]   2> 400233 INFO  (coreLoadExecutor-1106-thread-1) [    x:collection1] o.a.s.c.SolrCore
Soft AutoCommit: disabled
   [junit4]   2> 400234 INFO  (coreLoadExecutor-1106-thread-1) [    x:collection1] o.a.s.u.RandomMergePolicy
RandomMergePolicy wrapping class org.apache.lucene.index.TieredMergePolicy: [TieredMergePolicy:
maxMergeAtOnce=49, maxMergeAtOnceExplicit=23, maxMergedSegmentMB=66.0712890625, floorSegmentMB=2.0166015625,
forceMergeDeletesPctAllowed=6.854035073222937, segmentsPerTier=27.0, maxCFSSegmentSizeMB=8.796093022207999E12,
noCFSRatio=0.0
   [junit4]   2> 400234 INFO  (coreLoadExecutor-1106-thread-1) [    x:collection1] o.a.s.c.SolrCore
SolrDeletionPolicy.onInit: commits: num=1
   [junit4]   2> 	commit{dir=NRTCachingDirectory(NIOFSDirectory@/home/jenkins/workspace/Lucene-Solr-trunk-Linux/solr/build/solr-core/test/J2/temp/solr.search.TestSearcherReuse_CC5AB3F3C829A23C-001/init-core-data-001/index
lockFactory=org.apache.lucene.store.SingleInstanceLockFactory@6fc815; maxCacheMB=48.0 maxMergeSizeMB=4.0),segFN=segments_1,generation=1}
   [junit4]   2> 400234 INFO  (coreLoadExecutor-1106-thread-1) [    x:collection1] o.a.s.c.SolrCore
newest commit generation = 1
   [junit4]   2> 400234 INFO  (coreLoadExecutor-1106-thread-1) [    x:collection1] o.a.s.s.SolrIndexSearcher
Opening Searcher@900ff9[collection1] main
   [junit4]   2> 400235 INFO  (coreLoadExecutor-1106-thread-1) [    x:collection1] o.a.s.r.ManagedResourceStorage
File-based storage initialized to use dir: /home/jenkins/workspace/Lucene-Solr-trunk-Linux/solr/build/solr-core/test/J2/temp/solr.search.TestSearcherReuse_CC5AB3F3C829A23C-001/tempDir-001/collection1/conf
   [junit4]   2> 400235 INFO  (coreLoadExecutor-1106-thread-1) [    x:collection1] o.a.s.r.RestManager
Initializing RestManager with initArgs: {storageDir=/home/jenkins/workspace/Lucene-Solr-trunk-Linux/solr/build/solr-core/test/J2/temp/solr.search.TestSearcherReuse_CC5AB3F3C829A23C-001/tempDir-001/collection1/conf}
   [junit4]   2> 400235 INFO  (coreLoadExecutor-1106-thread-1) [    x:collection1] o.a.s.r.ManagedResourceStorage
Reading _rest_managed.json using file:dir=/home/jenkins/workspace/Lucene-Solr-trunk-Linux/solr/build/solr-core/test/J2/temp/solr.search.TestSearcherReuse_CC5AB3F3C829A23C-001/tempDir-001/collection1/conf
   [junit4]   2> 400235 INFO  (coreLoadExecutor-1106-thread-1) [    x:collection1] o.a.s.r.RestManager
Initializing 0 registered ManagedResources
   [junit4]   2> 400235 INFO  (coreLoadExecutor-1106-thread-1) [    x:collection1] o.a.s.h.ReplicationHandler
Commits will be reserved for  10000
   [junit4]   2> 400236 INFO  (coreLoadExecutor-1106-thread-1) [    x:collection1] o.a.s.c.CoreContainer
registering core: collection1
   [junit4]   2> 400236 INFO  (searcherExecutor-1107-thread-1-processing-x:collection1)
[    x:collection1] o.a.s.c.SolrCore [collection1] Registered new searcher Searcher@900ff9[collection1]
main{ExitableDirectoryReader(UninvertingDirectoryReader())}
   [junit4]   2> 400236 INFO  (SUITE-TestSearcherReuse-seed#[CC5AB3F3C829A23C]-worker)
[    ] o.a.s.SolrTestCaseJ4 ####initCore end
   [junit4]   2> 400238 INFO  (TEST-TestSearcherReuse.test-seed#[CC5AB3F3C829A23C]) [ 
  ] o.a.s.SolrTestCaseJ4 ###Starting test
   [junit4]   2> 400239 INFO  (TEST-TestSearcherReuse.test-seed#[CC5AB3F3C829A23C]) [ 
  ] o.a.s.u.p.LogUpdateProcessor [collection1] webapp=null path=null params={} {add=[1]} 0
0
   [junit4]   2> 400240 INFO  (TEST-TestSearcherReuse.test-seed#[CC5AB3F3C829A23C]) [ 
  ] o.a.s.u.p.LogUpdateProcessor [collection1] webapp=null path=null params={} {add=[2]} 0
0
   [junit4]   2> 400241 INFO  (TEST-TestSearcherReuse.test-seed#[CC5AB3F3C829A23C]) [ 
  ] o.a.s.u.p.LogUpdateProcessor [collection1] webapp=null path=null params={} {add=[3]} 0
0
   [junit4]   2> 400241 INFO  (TEST-TestSearcherReuse.test-seed#[CC5AB3F3C829A23C]) [ 
  ] o.a.s.u.UpdateHandler start commit{,optimize=false,openSearcher=true,waitSearcher=true,expungeDeletes=false,softCommit=false,prepareCommit=false}
   [junit4]   2> 400374 INFO  (TEST-TestSearcherReuse.test-seed#[CC5AB3F3C829A23C]) [ 
  ] o.a.s.c.SolrCore SolrDeletionPolicy.onCommit: commits: num=2
   [junit4]   2> 	commit{dir=NRTCachingDirectory(NIOFSDirectory@/home/jenkins/workspace/Lucene-Solr-trunk-Linux/solr/build/solr-core/test/J2/temp/solr.search.TestSearcherReuse_CC5AB3F3C829A23C-001/init-core-data-001/index
lockFactory=org.apache.lucene.store.SingleInstanceLockFactory@6fc815; maxCacheMB=48.0 maxMergeSizeMB=4.0),segFN=segments_1,generation=1}
   [junit4]   2> 	commit{dir=NRTCachingDirectory(NIOFSDirectory@/home/jenkins/workspace/Lucene-Solr-trunk-Linux/solr/build/solr-core/test/J2/temp/solr.search.TestSearcherReuse_CC5AB3F3C829A23C-001/init-core-data-001/index
lockFactory=org.apache.lucene.store.SingleInstanceLockFactory@6fc815; maxCacheMB=48.0 maxMergeSizeMB=4.0),segFN=segments_2,generation=2}
   [junit4]   2> 400375 INFO  (TEST-TestSearcherReuse.test-seed#[CC5AB3F3C829A23C]) [ 
  ] o.a.s.c.SolrCore newest commit generation = 2
   [junit4]   2> 400376 INFO  (TEST-TestSearcherReuse.test-seed#[CC5AB3F3C829A23C]) [ 
  ] o.a.s.s.SolrIndexSearcher Opening Searcher@3338ea[collection1] main
   [junit4]   2> 400377 INFO  (TEST-TestSearcherReuse.test-seed#[CC5AB3F3C829A23C]) [ 
  ] o.a.s.u.UpdateHandler end_commit_flush
   [junit4]   2> 400377 INFO  (searcherExecutor-1107-thread-1) [    ] o.a.s.c.SolrCore
[collection1] Registered new searcher Searcher@3338ea[collection1] main{ExitableDirectoryReader(UninvertingDirectoryReader(Uninverting(_0(6.0.0):C3)))}
   [junit4]   2> 400377 INFO  (TEST-TestSearcherReuse.test-seed#[CC5AB3F3C829A23C]) [ 
  ] o.a.s.u.p.LogUpdateProcessor [collection1] webapp=null path=null params={} {commit=} 0
136
   [junit4]   2> 400377 INFO  (TEST-TestSearcherReuse.test-seed#[CC5AB3F3C829A23C]) [ 
  ] o.a.s.u.UpdateHandler start commit{,optimize=false,openSearcher=true,waitSearcher=true,expungeDeletes=false,softCommit=false,prepareCommit=false}
   [junit4]   2> 400377 INFO  (TEST-TestSearcherReuse.test-seed#[CC5AB3F3C829A23C]) [ 
  ] o.a.s.u.UpdateHandler No uncommitted changes. Skipping IW.commit.
   [junit4]   2> 400378 INFO  (TEST-TestSearcherReuse.test-seed#[CC5AB3F3C829A23C]) [ 
  ] o.a.s.c.SolrCore SolrIndexSearcher has not changed - not re-opening: org.apache.solr.search.SolrIndexSearcher
   [junit4]   2> 400378 INFO  (TEST-TestSearcherReuse.test-seed#[CC5AB3F3C829A23C]) [ 
  ] o.a.s.u.UpdateHandler end_commit_flush
   [junit4]   2> 400378 INFO  (TEST-TestSearcherReuse.test-seed#[CC5AB3F3C829A23C]) [ 
  ] o.a.s.u.p.LogUpdateProcessor [collection1] webapp=null path=null params={} {commit=} 0
0
   [junit4]   2> 400379 INFO  (TEST-TestSearcherReuse.test-seed#[CC5AB3F3C829A23C]) [ 
  ] o.a.s.c.S.Request [collection1] webapp=null path=null params={q=*:*&qt=standard&start=0&rows=20&version=2.2}
hits=3 status=0 QTime=0 
   [junit4]   2> 400380 INFO  (TEST-TestSearcherReuse.test-seed#[CC5AB3F3C829A23C]) [ 
  ] o.a.s.u.UpdateHandler start commit{,optimize=false,openSearcher=true,waitSearcher=true,expungeDeletes=false,softCommit=false,prepareCommit=false}
   [junit4]   2> 400380 INFO  (TEST-TestSearcherReuse.test-seed#[CC5AB3F3C829A23C]) [ 
  ] o.a.s.u.UpdateHandler No uncommitted changes. Skipping IW.commit.
   [junit4]   2> 400380 INFO  (TEST-TestSearcherReuse.test-seed#[CC5AB3F3C829A23C]) [ 
  ] o.a.s.c.SolrCore SolrIndexSearcher has not changed - not re-opening: org.apache.solr.search.SolrIndexSearcher
   [junit4]   2> 400380 INFO  (TEST-TestSearcherReuse.test-seed#[CC5AB3F3C829A23C]) [ 
  ] o.a.s.u.UpdateHandler end_commit_flush
   [junit4]   2> 400380 INFO  (TEST-TestSearcherReuse.test-seed#[CC5AB3F3C829A23C]) [ 
  ] o.a.s.u.p.LogUpdateProcessor [collection1] webapp=null path=null params={} {commit=} 0
0
   [junit4]   2> 400381 INFO  (TEST-TestSearcherReuse.test-seed#[CC5AB3F3C829A23C]) [ 
  ] o.a.s.u.UpdateHandler start commit{,optimize=false,openSearcher=true,waitSearcher=true,expungeDeletes=false,softCommit=false,prepareCommit=false}
   [junit4]   2> 400381 INFO  (TEST-TestSearcherReuse.test-seed#[CC5AB3F3C829A23C]) [ 
  ] o.a.s.u.UpdateHandler No uncommitted changes. Skipping IW.commit.
   [junit4]   2> 400381 INFO  (TEST-TestSearcherReuse.test-seed#[CC5AB3F3C829A23C]) [ 
  ] o.a.s.c.SolrCore SolrIndexSearcher has not changed - not re-opening: org.apache.solr.search.SolrIndexSearcher
   [junit4]   2> 400381 INFO  (TEST-TestSearcherReuse.test-seed#[CC5AB3F3C829A23C]) [ 
  ] o.a.s.u.UpdateHandler end_commit_flush
   [junit4]   2> 400381 INFO  (TEST-TestSearcherReuse.test-seed#[CC5AB3F3C829A23C]) [ 
  ] o.a.s.u.p.LogUpdateProcessor [collection1] webapp=null path=null params={} {commit=} 0
0
   [junit4]   2> 400382 INFO  (TEST-TestSearcherReuse.test-seed#[CC5AB3F3C829A23C]) [ 
  ] o.a.s.u.UpdateHandler start commit{,optimize=false,openSearcher=true,waitSearcher=true,expungeDeletes=false,softCommit=true,prepareCommit=false}
   [junit4]   2> 400382 INFO  (TEST-TestSearcherReuse.test-seed#[CC5AB3F3C829A23C]) [ 
  ] o.a.s.c.SolrCore SolrIndexSearcher has not changed - not re-opening: org.apache.solr.search.SolrIndexSearcher
   [junit4]   2> 400382 INFO  (TEST-TestSearcherReuse.test-seed#[CC5AB3F3C829A23C]) [ 
  ] o.a.s.u.UpdateHandler end_commit_flush
   [junit4]   2> 400382 INFO  (TEST-TestSearcherReuse.test-seed#[CC5AB3F3C829A23C]) [ 
  ] o.a.s.u.p.LogUpdateProcessor [collection1] webapp=null path=null params={} {commit=} 0
0
   [junit4]   2> 400383 INFO  (TEST-TestSearcherReuse.test-seed#[CC5AB3F3C829A23C]) [ 
  ] o.a.s.u.UpdateHandler start commit{,optimize=false,openSearcher=true,waitSearcher=true,expungeDeletes=false,softCommit=true,prepareCommit=false}
   [junit4]   2> 400383 INFO  (TEST-TestSearcherReuse.test-seed#[CC5AB3F3C829A23C]) [ 
  ] o.a.s.c.SolrCore SolrIndexSearcher has not changed - not re-opening: org.apache.solr.search.SolrIndexSearcher
   [junit4]   2> 400383 INFO  (TEST-TestSearcherReuse.test-seed#[CC5AB3F3C829A23C]) [ 
  ] o.a.s.u.UpdateHandler end_commit_flush
   [junit4]   2> 400383 INFO  (TEST-TestSearcherReuse.test-seed#[CC5AB3F3C829A23C]) [ 
  ] o.a.s.u.p.LogUpdateProcessor [collection1] webapp=null path=null params={} {commit=} 0
0
   [junit4]   2> 400384 INFO  (TEST-TestSearcherReuse.test-seed#[CC5AB3F3C829A23C]) [ 
  ] o.a.s.u.p.LogUpdateProcessor [collection1] webapp=null path=null params={} {deleteByQuery=id:match_no_documents}
0 0
   [junit4]   2> 400385 INFO  (TEST-TestSearcherReuse.test-seed#[CC5AB3F3C829A23C]) [ 
  ] o.a.s.u.UpdateHandler start commit{,optimize=false,openSearcher=true,waitSearcher=true,expungeDeletes=false,softCommit=false,prepareCommit=false}
   [junit4]   2> 400410 INFO  (TEST-TestSearcherReuse.test-seed#[CC5AB3F3C829A23C]) [ 
  ] o.a.s.c.SolrCore SolrDeletionPolicy.onCommit: commits: num=2
   [junit4]   2> 	commit{dir=NRTCachingDirectory(NIOFSDirectory@/home/jenkins/workspace/Lucene-Solr-trunk-Linux/solr/build/solr-core/test/J2/temp/solr.search.TestSearcherReuse_CC5AB3F3C829A23C-001/init-core-data-001/index
lockFactory=org.apache.lucene.store.SingleInstanceLockFactory@6fc815; maxCacheMB=48.0 maxMergeSizeMB=4.0),segFN=segments_2,generation=2}
   [junit4]   2> 	commit{dir=NRTCachingDirectory(NIOFSDirectory@/home/jenkins/workspace/Lucene-Solr-trunk-Linux/solr/build/solr-core/test/J2/temp/solr.search.TestSearcherReuse_CC5AB3F3C829A23C-001/init-core-data-001/index
lockFactory=org.apache.lucene.store.SingleInstanceLockFactory@6fc815; maxCacheMB=48.0 maxMergeSizeMB=4.0),segFN=segments_3,generation=3}
   [junit4]   2> 400410 INFO  (TEST-TestSearcherReuse.test-seed#[CC5AB3F3C829A23C]) [ 
  ] o.a.s.c.SolrCore newest commit generation = 3
   [junit4]   2> 400410 INFO  (TEST-TestSearcherReuse.test-seed#[CC5AB3F3C829A23C]) [ 
  ] o.a.s.s.SolrIndexSearcher Opening Searcher@13fe8b4[collection1] main
   [junit4]   2> 400411 INFO  (TEST-TestSearcherReuse.test-seed#[CC5AB3F3C829A23C]) [ 
  ] o.a.s.u.UpdateHandler end_commit_flush
   [junit4]   2> 400411 INFO  (searcherExecutor-1107-thread-1) [    ] o.a.s.c.SolrCore
[collection1] Registered new searcher Searcher@13fe8b4[collection1] main{ExitableDirectoryReader(UninvertingDirectoryReader(Uninverting(_0(6.0.0):C3)))}
   [junit4]   2> 400411 INFO  (TEST-TestSearcherReuse.test-seed#[CC5AB3F3C829A23C]) [ 
  ] o.a.s.u.p.LogUpdateProcessor [collection1] webapp=null path=null params={} {commit=} 0
26
   [junit4]   2> 400412 INFO  (TEST-TestSearcherReuse.test-seed#[CC5AB3F3C829A23C]) [ 
  ] o.a.s.SolrTestCaseJ4 ###Ending test
   [junit4]   2> 400412 INFO  (TEST-TestSearcherReuse.test-seed#[CC5AB3F3C829A23C]) [ 
  ] o.a.s.c.SolrCore [collection1] REMOVING ALL DOCUMENTS FROM INDEX
   [junit4]   2> 400412 INFO  (TEST-TestSearcherReuse.test-seed#[CC5AB3F3C829A23C]) [ 
  ] o.a.s.u.p.LogUpdateProcessor [collection1] webapp=null path=null params={} {deleteByQuery=*:*}
0 0
   [junit4]   2> 400412 INFO  (TEST-TestSearcherReuse.test-seed#[CC5AB3F3C829A23C]) [ 
  ] o.a.s.u.UpdateHandler start commit{,optimize=false,openSearcher=true,waitSearcher=true,expungeDeletes=false,softCommit=false,prepareCommit=false}
   [junit4]   2> 400431 INFO  (TEST-TestSearcherReuse.test-seed#[CC5AB3F3C829A23C]) [ 
  ] o.a.s.c.SolrCore SolrDeletionPolicy.onCommit: commits: num=2
   [junit4]   2> 	commit{dir=NRTCachingDirectory(NIOFSDirectory@/home/jenkins/workspace/Lucene-Solr-trunk-Linux/solr/build/solr-core/test/J2/temp/solr.search.TestSearcherReuse_CC5AB3F3C829A23C-001/init-core-data-001/index
lockFactory=org.apache.lucene.store.SingleInstanceLockFactory@6fc815; maxCacheMB=48.0 maxMergeSizeMB=4.0),segFN=segments_3,generation=3}
   [junit4]   2> 	commit{dir=NRTCachingDirectory(NIOFSDirectory@/home/jenkins/workspace/Lucene-Solr-trunk-Linux/solr/build/solr-core/test/J2/temp/solr.search.TestSearcherReuse_CC5AB3F3C829A23C-001/init-core-data-001/index
lockFactory=org.apache.lucene.store.SingleInstanceLockFactory@6fc815; maxCacheMB=48.0 maxMergeSizeMB=4.0),segFN=segments_4,generation=4}
   [junit4]   2> 400431 INFO  (TEST-TestSearcherReuse.test-seed#[CC5AB3F3C829A23C]) [ 
  ] o.a.s.c.SolrCore newest commit generation = 4
   [junit4]   2> 400432 INFO  (TEST-TestSearcherReuse.test-seed#[CC5AB3F3C829A23C]) [ 
  ] o.a.s.s.SolrIndexSearcher Opening Searcher@198ef96[collection1] main
   [junit4]   2> 400432 INFO  (TEST-TestSearcherReuse.test-seed#[CC5AB3F3C829A23C]) [ 
  ] o.a.s.u.UpdateHandler end_commit_flush
   [junit4]   2> 400432 INFO  (searcherExecutor-1107-thread-1) [    ] o.a.s.c.SolrCore
[collection1] Registered new searcher Searcher@198ef96[collection1] main{ExitableDirectoryReader(UninvertingDirectoryReader())}
   [junit4]   2> 400432 INFO  (TEST-TestSearcherReuse.test-seed#[CC5AB3F3C829A23C]) [ 
  ] o.a.s.u.p.LogUpdateProcessor [collection1] webapp=null path=null params={} {commit=} 0
19
   [junit4]   2> NOTE: reproduce with: ant test  -Dtestcase=TestSearcherReuse -Dtests.method=test
-Dtests.seed=CC5AB3F3C829A23C -Dtests.multiplier=3 -Dtests.slow=true -Dtests.locale=da -Dtests.timezone=America/Argentina/ComodRivadavia
-Dtests.asserts=true -Dtests.file.encoding=UTF-8
   [junit4] FAILURE 0.20s J2 | TestSearcherReuse.test <<<
   [junit4]    > Throwable #1: java.lang.AssertionError: expected same:<Searcher@3338ea[collection1]
main{ExitableDirectoryReader(UninvertingDirectoryReader(Uninverting(_0(6.0.0):C3)))}> was
not:<Searcher@13fe8b4[collection1] main{ExitableDirectoryReader(UninvertingDirectoryReader(Uninverting(_0(6.0.0):C3)))}>
   [junit4]    > 	at __randomizedtesting.SeedInfo.seed([CC5AB3F3C829A23C:440E8C2966D5CFC4]:0)
   [junit4]    > 	at org.apache.solr.search.TestSearcherReuse.assertSearcherHasNotChanged(TestSearcherReuse.java:247)
   [junit4]    > 	at org.apache.solr.search.TestSearcherReuse.test(TestSearcherReuse.java:117)
   [junit4]    > 	at java.lang.Thread.run(Thread.java:745)
   [junit4]   2> 400437 INFO  (SUITE-TestSearcherReuse-seed#[CC5AB3F3C829A23C]-worker)
[    ] o.a.s.SolrTestCaseJ4 ###deleteCore
   [junit4]   2> 400437 INFO  (SUITE-TestSearcherReuse-seed#[CC5AB3F3C829A23C]-worker)
[    ] o.a.s.c.CoreContainer Shutting down CoreContainer instance=23923339
   [junit4]   2> 400438 INFO  (SUITE-TestSearcherReuse-seed#[CC5AB3F3C829A23C]-worker)
[    x:collection1] o.a.s.c.SolrCore [collection1]  CLOSING SolrCore org.apache.solr.core.SolrCore@1df6a66
   [junit4]   2> 400438 INFO  (SUITE-TestSearcherReuse-seed#[CC5AB3F3C829A23C]-worker)
[    x:collection1] o.a.s.u.UpdateHandler closing DirectUpdateHandler2{commits=8,autocommits=0,soft
autocommits=0,optimizes=0,rollbacks=0,expungeDeletes=0,docsPending=0,adds=0,deletesById=0,deletesByQuery=0,errors=0,cumulative_adds=3,cumulative_deletesById=0,cumulative_deletesByQuery=2,cumulative_errors=0}
   [junit4]   2> 400438 INFO  (SUITE-TestSearcherReuse-seed#[CC5AB3F3C829A23C]-worker)
[    x:collection1] o.a.s.u.SolrCoreState Closing SolrCoreState
   [junit4]   2> 400438 INFO  (SUITE-TestSearcherReuse-seed#[CC5AB3F3C829A23C]-worker)
[    x:collection1] o.a.s.u.DefaultSolrCoreState SolrCoreState ref count has reached 0 - closing
IndexWriter
   [junit4]   2> 400438 INFO  (SUITE-TestSearcherReuse-seed#[CC5AB3F3C829A23C]-worker)
[    x:collection1] o.a.s.u.DefaultSolrCoreState closing IndexWriter with IndexWriterCloser
   [junit4]   2> 400439 INFO  (SUITE-TestSearcherReuse-seed#[CC5AB3F3C829A23C]-worker)
[    x:collection1] o.a.s.c.SolrCore [collection1] Closing main searcher on request.
   [junit4]   2> 400439 INFO  (SUITE-TestSearcherReuse-seed#[CC5AB3F3C829A23C]-worker)
[    x:collection1] o.a.s.c.CachingDirectoryFactory Closing NRTCachingDirectoryFactory - 2
directories currently being tracked
   [junit4]   2> 400439 INFO  (SUITE-TestSearcherReuse-seed#[CC5AB3F3C829A23C]-worker)
[    x:collection1] o.a.s.c.CachingDirectoryFactory looking to close /home/jenkins/workspace/Lucene-Solr-trunk-Linux/solr/build/solr-core/test/J2/temp/solr.search.TestSearcherReuse_CC5AB3F3C829A23C-001/init-core-data-001
[CachedDir<<refCount=0;path=/home/jenkins/workspace/Lucene-Solr-trunk-Linux/solr/build/solr-core/test/J2/temp/solr.search.TestSearcherReuse_CC5AB3F3C829A23C-001/init-core-data-001;done=false>>]
   [junit4]   2> 400439 INFO  (SUITE-TestSearcherReuse-seed#[CC5AB3F3C829A23C]-worker)
[    x:collection1] o.a.s.c.CachingDirectoryFactory Closing directory: /home/jenkins/workspace/Lucene-Solr-trunk-Linux/solr/build/solr-core/test/J2/temp/solr.search.TestSearcherReuse_CC5AB3F3C829A23C-001/init-core-data-001
   [junit4]   2> 400439 INFO  (SUITE-TestSearcherReuse-seed#[CC5AB3F3C829A23C]-worker)
[    x:collection1] o.a.s.c.CachingDirectoryFactory looking to close /home/jenkins/workspace/Lucene-Solr-trunk-Linux/solr/build/solr-core/test/J2/temp/solr.search.TestSearcherReuse_CC5AB3F3C829A23C-001/init-core-data-001/index
[CachedDir<<refCount=0;path=/home/jenkins/workspace/Lucene-Solr-trunk-Linux/solr/build/solr-core/test/J2/temp/solr.search.TestSearcherReuse_CC5AB3F3C829A23C-001/init-core-data-001/index;done=false>>]
   [junit4]   2> 400439 INFO  (SUITE-TestSearcherReuse-seed#[CC5AB3F3C829A23C]-worker)
[    x:collection1] o.a.s.c.CachingDirectoryFactory Closing directory: /home/jenkins/workspace/Lucene-Solr-trunk-Linux/solr/build/solr-core/test/J2/temp/solr.search.TestSearcherReuse_CC5AB3F3C829A23C-001/init-core-data-001/index
   [junit4]   2> NOTE: leaving temporary files on disk at: /home/jenkins/workspace/Lucene-Solr-trunk-Linux/solr/build/solr-core/test/J2/temp/solr.search.TestSearcherReuse_CC5AB3F3C829A23C-001
   [junit4]   2> NOTE: test params are: codec=Asserting(Lucene53): {}, docValues:{}, sim=DefaultSimilarity,
locale=da, timezone=America/Argentina/ComodRivadavia
   [junit4]   2> NOTE: Linux 3.13.0-54-generic i386/Oracle Corporation 1.9.0-ea (32-bit)/cpus=12,threads=1,free=64000184,total=268173312
   [junit4]   2> NOTE: All tests run in this JVM: [StatsComponentTest, TestLRUStatsCache,
TestHashQParserPlugin, SolrCoreCheckLockOnStartupTest, TestFieldCollectionResource, HdfsBasicDistributedZk2Test,
TestDefaultSimilarityFactory, DistributedQueryComponentCustomSortTest, TestFastOutputStream,
DOMUtilTest, TestSystemIdResolver, TestSmileRequest, AddBlockUpdateTest, UnloadDistributedZkTest,
TestReqParamsAPI, BasicDistributedZk2Test, AutoCommitTest, DeleteReplicaTest, HdfsDirectoryTest,
DistributedVersionInfoTest, OverseerCollectionProcessorTest, TestSolrXml, TestXIncludeConfig,
TestStressReorder, DirectUpdateHandlerOptimizeTest, SOLR749Test, HdfsSyncSliceTest, TestUniqueKeyFieldResource,
TestCursorMarkWithoutUniqueKey, TestAuthorizationFramework, CoreMergeIndexesAdminHandlerTest,
RegexBoostProcessorTest, TestRemoveLastDynamicCopyField, AtomicUpdatesTest, CircularListTest,
LeaderInitiatedRecoveryOnCommitTest, TestUtils, TestManagedResource, TestQueryUtils, SimpleFacetsTest,
DistributedDebugComponentTest, PluginInfoTest, SynonymTokenizerTest, TestExtendedDismaxParser,
XsltUpdateRequestHandlerTest, PathHierarchyTokenizerFactoryTest, TestSearcherReuse]
   [junit4] Completed [147/514] on J2 in 0.39s, 1 test, 1 failure <<< FAILURES!

[...truncated 1129 lines...]
BUILD FAILED
/home/jenkins/workspace/Lucene-Solr-trunk-Linux/build.xml:526: The following error occurred
while executing this line:
/home/jenkins/workspace/Lucene-Solr-trunk-Linux/build.xml:474: The following error occurred
while executing this line:
/home/jenkins/workspace/Lucene-Solr-trunk-Linux/build.xml:61: The following error occurred
while executing this line:
/home/jenkins/workspace/Lucene-Solr-trunk-Linux/extra-targets.xml:39: The following error
occurred while executing this line:
/home/jenkins/workspace/Lucene-Solr-trunk-Linux/solr/build.xml:230: The following error occurred
while executing this line:
/home/jenkins/workspace/Lucene-Solr-trunk-Linux/solr/common-build.xml:513: The following error
occurred while executing this line:
/home/jenkins/workspace/Lucene-Solr-trunk-Linux/lucene/common-build.xml:1426: The following
error occurred while executing this line:
/home/jenkins/workspace/Lucene-Solr-trunk-Linux/lucene/common-build.xml:981: There were test
failures: 514 suites, 2021 tests, 1 failure, 59 ignored (25 assumptions)

Total time: 44 minutes 53 seconds
Build step 'Invoke Ant' marked build as failure
Archiving artifacts
Recording test results
Email was triggered for: Failure - Any
Sending email for trigger: Failure - Any



Mime
View raw message