lucene-dev mailing list archives

Site index · List index
Message view « Date » · « Thread »
Top « Date » · « Thread »
From Apache Jenkins Server <jenk...@builds.apache.org>
Subject [JENKINS] Lucene-Solr-Tests-5.x-Java7 - Build # 3380 - Failure
Date Tue, 28 Jul 2015 04:14:44 GMT
Build: https://builds.apache.org/job/Lucene-Solr-Tests-5.x-Java7/3380/

2 tests failed.
REGRESSION:  org.apache.solr.schema.TestCloudManagedSchemaConcurrent.test

Error Message:
Test abandoned because suite timeout was reached.

Stack Trace:
java.lang.Exception: Test abandoned because suite timeout was reached.
	at __randomizedtesting.SeedInfo.seed([5F4841A657CAAAF0]:0)


FAILED:  junit.framework.TestSuite.org.apache.solr.schema.TestCloudManagedSchemaConcurrent

Error Message:
Suite timeout exceeded (>= 7200000 msec).

Stack Trace:
java.lang.Exception: Suite timeout exceeded (>= 7200000 msec).
	at __randomizedtesting.SeedInfo.seed([5F4841A657CAAAF0]:0)




Build Log:
[...truncated 11661 lines...]
   [junit4] Suite: org.apache.solr.schema.TestCloudManagedSchemaConcurrent
   [junit4]   2> Creating dataDir: /x1/jenkins/jenkins-slave/workspace/Lucene-Solr-Tests-5.x-Java7/solr/build/solr-core/test/J0/temp/solr.schema.TestCloudManagedSchemaConcurrent_5F4841A657CAAAF0-001/init-core-data-001
   [junit4]   2> 848500 INFO  (SUITE-TestCloudManagedSchemaConcurrent-seed#[5F4841A657CAAAF0]-worker) [    ] o.a.s.SolrTestCaseJ4 Randomized ssl (true) and clientAuth (false)
   [junit4]   2> 848501 INFO  (SUITE-TestCloudManagedSchemaConcurrent-seed#[5F4841A657CAAAF0]-worker) [    ] o.a.s.BaseDistributedSearchTestCase Setting hostContext system property: /
   [junit4]   2> 848505 INFO  (TEST-TestCloudManagedSchemaConcurrent.test-seed#[5F4841A657CAAAF0]) [    ] o.a.s.c.ZkTestServer STARTING ZK TEST SERVER
   [junit4]   2> 848506 INFO  (Thread-2361) [    ] o.a.s.c.ZkTestServer client port:0.0.0.0/0.0.0.0:0
   [junit4]   2> 848506 INFO  (Thread-2361) [    ] o.a.s.c.ZkTestServer Starting server
   [junit4]   2> 848606 INFO  (TEST-TestCloudManagedSchemaConcurrent.test-seed#[5F4841A657CAAAF0]) [    ] o.a.s.c.ZkTestServer start zk server on port:59496
   [junit4]   2> 848606 INFO  (TEST-TestCloudManagedSchemaConcurrent.test-seed#[5F4841A657CAAAF0]) [    ] o.a.s.c.c.SolrZkClient Using default ZkCredentialsProvider
   [junit4]   2> 848607 INFO  (TEST-TestCloudManagedSchemaConcurrent.test-seed#[5F4841A657CAAAF0]) [    ] o.a.s.c.c.ConnectionManager Waiting for client to connect to ZooKeeper
   [junit4]   2> 848610 INFO  (zkCallback-696-thread-1) [    ] o.a.s.c.c.ConnectionManager Watcher org.apache.solr.common.cloud.ConnectionManager@699e842a name:ZooKeeperConnection Watcher:127.0.0.1:59496 got event WatchedEvent state:SyncConnected type:None path:null path:null type:None
   [junit4]   2> 848610 INFO  (TEST-TestCloudManagedSchemaConcurrent.test-seed#[5F4841A657CAAAF0]) [    ] o.a.s.c.c.ConnectionManager Client is connected to ZooKeeper
   [junit4]   2> 848611 INFO  (TEST-TestCloudManagedSchemaConcurrent.test-seed#[5F4841A657CAAAF0]) [    ] o.a.s.c.c.SolrZkClient Using default ZkACLProvider
   [junit4]   2> 848611 INFO  (TEST-TestCloudManagedSchemaConcurrent.test-seed#[5F4841A657CAAAF0]) [    ] o.a.s.c.c.SolrZkClient makePath: /solr
   [junit4]   2> 848620 INFO  (TEST-TestCloudManagedSchemaConcurrent.test-seed#[5F4841A657CAAAF0]) [    ] o.a.s.c.c.SolrZkClient Using default ZkCredentialsProvider
   [junit4]   2> 848621 INFO  (TEST-TestCloudManagedSchemaConcurrent.test-seed#[5F4841A657CAAAF0]) [    ] o.a.s.c.c.ConnectionManager Waiting for client to connect to ZooKeeper
   [junit4]   2> 848622 INFO  (zkCallback-697-thread-1) [    ] o.a.s.c.c.ConnectionManager Watcher org.apache.solr.common.cloud.ConnectionManager@64effc50 name:ZooKeeperConnection Watcher:127.0.0.1:59496/solr got event WatchedEvent state:SyncConnected type:None path:null path:null type:None
   [junit4]   2> 848623 INFO  (TEST-TestCloudManagedSchemaConcurrent.test-seed#[5F4841A657CAAAF0]) [    ] o.a.s.c.c.ConnectionManager Client is connected to ZooKeeper
   [junit4]   2> 848623 INFO  (TEST-TestCloudManagedSchemaConcurrent.test-seed#[5F4841A657CAAAF0]) [    ] o.a.s.c.c.SolrZkClient Using default ZkACLProvider
   [junit4]   2> 848623 INFO  (TEST-TestCloudManagedSchemaConcurrent.test-seed#[5F4841A657CAAAF0]) [    ] o.a.s.c.c.SolrZkClient makePath: /collections/collection1
   [junit4]   2> 848626 INFO  (TEST-TestCloudManagedSchemaConcurrent.test-seed#[5F4841A657CAAAF0]) [    ] o.a.s.c.c.SolrZkClient makePath: /collections/collection1/shards
   [junit4]   2> 848628 INFO  (TEST-TestCloudManagedSchemaConcurrent.test-seed#[5F4841A657CAAAF0]) [    ] o.a.s.c.c.SolrZkClient makePath: /collections/control_collection
   [junit4]   2> 848630 INFO  (TEST-TestCloudManagedSchemaConcurrent.test-seed#[5F4841A657CAAAF0]) [    ] o.a.s.c.c.SolrZkClient makePath: /collections/control_collection/shards
   [junit4]   2> 848634 INFO  (TEST-TestCloudManagedSchemaConcurrent.test-seed#[5F4841A657CAAAF0]) [    ] o.a.s.c.AbstractZkTestCase put /x1/jenkins/jenkins-slave/workspace/Lucene-Solr-Tests-5.x-Java7/solr/core/src/test-files/solr/collection1/conf/solrconfig-managed-schema.xml to /configs/conf1/solrconfig.xml
   [junit4]   2> 848634 INFO  (TEST-TestCloudManagedSchemaConcurrent.test-seed#[5F4841A657CAAAF0]) [    ] o.a.s.c.c.SolrZkClient makePath: /configs/conf1/solrconfig.xml
   [junit4]   2> 848637 INFO  (TEST-TestCloudManagedSchemaConcurrent.test-seed#[5F4841A657CAAAF0]) [    ] o.a.s.c.AbstractZkTestCase put /x1/jenkins/jenkins-slave/workspace/Lucene-Solr-Tests-5.x-Java7/solr/core/src/test-files/solr/collection1/conf/schema.xml to /configs/conf1/schema.xml
   [junit4]   2> 848637 INFO  (TEST-TestCloudManagedSchemaConcurrent.test-seed#[5F4841A657CAAAF0]) [    ] o.a.s.c.c.SolrZkClient makePath: /configs/conf1/schema.xml
   [junit4]   2> 848640 INFO  (TEST-TestCloudManagedSchemaConcurrent.test-seed#[5F4841A657CAAAF0]) [    ] o.a.s.c.AbstractZkTestCase put /x1/jenkins/jenkins-slave/workspace/Lucene-Solr-Tests-5.x-Java7/solr/core/src/test-files/solr/collection1/conf/solrconfig.snippet.randomindexconfig.xml to /configs/conf1/solrconfig.snippet.randomindexconfig.xml
   [junit4]   2> 848640 INFO  (TEST-TestCloudManagedSchemaConcurrent.test-seed#[5F4841A657CAAAF0]) [    ] o.a.s.c.c.SolrZkClient makePath: /configs/conf1/solrconfig.snippet.randomindexconfig.xml
   [junit4]   2> 848642 INFO  (TEST-TestCloudManagedSchemaConcurrent.test-seed#[5F4841A657CAAAF0]) [    ] o.a.s.c.AbstractZkTestCase put /x1/jenkins/jenkins-slave/workspace/Lucene-Solr-Tests-5.x-Java7/solr/core/src/test-files/solr/collection1/conf/stopwords.txt to /configs/conf1/stopwords.txt
   [junit4]   2> 848642 INFO  (TEST-TestCloudManagedSchemaConcurrent.test-seed#[5F4841A657CAAAF0]) [    ] o.a.s.c.c.SolrZkClient makePath: /configs/conf1/stopwords.txt
   [junit4]   2> 848644 INFO  (TEST-TestCloudManagedSchemaConcurrent.test-seed#[5F4841A657CAAAF0]) [    ] o.a.s.c.AbstractZkTestCase put /x1/jenkins/jenkins-slave/workspace/Lucene-Solr-Tests-5.x-Java7/solr/core/src/test-files/solr/collection1/conf/protwords.txt to /configs/conf1/protwords.txt
   [junit4]   2> 848645 INFO  (TEST-TestCloudManagedSchemaConcurrent.test-seed#[5F4841A657CAAAF0]) [    ] o.a.s.c.c.SolrZkClient makePath: /configs/conf1/protwords.txt
   [junit4]   2> 848647 INFO  (TEST-TestCloudManagedSchemaConcurrent.test-seed#[5F4841A657CAAAF0]) [    ] o.a.s.c.AbstractZkTestCase put /x1/jenkins/jenkins-slave/workspace/Lucene-Solr-Tests-5.x-Java7/solr/core/src/test-files/solr/collection1/conf/currency.xml to /configs/conf1/currency.xml
   [junit4]   2> 848647 INFO  (TEST-TestCloudManagedSchemaConcurrent.test-seed#[5F4841A657CAAAF0]) [    ] o.a.s.c.c.SolrZkClient makePath: /configs/conf1/currency.xml
   [junit4]   2> 848649 INFO  (TEST-TestCloudManagedSchemaConcurrent.test-seed#[5F4841A657CAAAF0]) [    ] o.a.s.c.AbstractZkTestCase put /x1/jenkins/jenkins-slave/workspace/Lucene-Solr-Tests-5.x-Java7/solr/core/src/test-files/solr/collection1/conf/enumsConfig.xml to /configs/conf1/enumsConfig.xml
   [junit4]   2> 848649 INFO  (TEST-TestCloudManagedSchemaConcurrent.test-seed#[5F4841A657CAAAF0]) [    ] o.a.s.c.c.SolrZkClient makePath: /configs/conf1/enumsConfig.xml
   [junit4]   2> 848651 INFO  (TEST-TestCloudManagedSchemaConcurrent.test-seed#[5F4841A657CAAAF0]) [    ] o.a.s.c.AbstractZkTestCase put /x1/jenkins/jenkins-slave/workspace/Lucene-Solr-Tests-5.x-Java7/solr/core/src/test-files/solr/collection1/conf/open-exchange-rates.json to /configs/conf1/open-exchange-rates.json
   [junit4]   2> 848651 INFO  (TEST-TestCloudManagedSchemaConcurrent.test-seed#[5F4841A657CAAAF0]) [    ] o.a.s.c.c.SolrZkClient makePath: /configs/conf1/open-exchange-rates.json
   [junit4]   2> 848653 INFO  (TEST-TestCloudManagedSchemaConcurrent.test-seed#[5F4841A657CAAAF0]) [    ] o.a.s.c.AbstractZkTestCase put /x1/jenkins/jenkins-slave/workspace/Lucene-Solr-Tests-5.x-Java7/solr/core/src/test-files/solr/collection1/conf/mapping-ISOLatin1Accent.txt to /configs/conf1/mapping-ISOLatin1Accent.txt
   [junit4]   2> 848653 INFO  (TEST-TestCloudManagedSchemaConcurrent.test-seed#[5F4841A657CAAAF0]) [    ] o.a.s.c.c.SolrZkClient makePath: /configs/conf1/mapping-ISOLatin1Accent.txt
   [junit4]   2> 848655 INFO  (TEST-TestCloudManagedSchemaConcurrent.test-seed#[5F4841A657CAAAF0]) [    ] o.a.s.c.AbstractZkTestCase put /x1/jenkins/jenkins-slave/workspace/Lucene-Solr-Tests-5.x-Java7/solr/core/src/test-files/solr/collection1/conf/old_synonyms.txt to /configs/conf1/old_synonyms.txt
   [junit4]   2> 848655 INFO  (TEST-TestCloudManagedSchemaConcurrent.test-seed#[5F4841A657CAAAF0]) [    ] o.a.s.c.c.SolrZkClient makePath: /configs/conf1/old_synonyms.txt
   [junit4]   2> 848657 INFO  (TEST-TestCloudManagedSchemaConcurrent.test-seed#[5F4841A657CAAAF0]) [    ] o.a.s.c.AbstractZkTestCase put /x1/jenkins/jenkins-slave/workspace/Lucene-Solr-Tests-5.x-Java7/solr/core/src/test-files/solr/collection1/conf/synonyms.txt to /configs/conf1/synonyms.txt
   [junit4]   2> 848657 INFO  (TEST-TestCloudManagedSchemaConcurrent.test-seed#[5F4841A657CAAAF0]) [    ] o.a.s.c.c.SolrZkClient makePath: /configs/conf1/synonyms.txt
   [junit4]   2> 848660 INFO  (TEST-TestCloudManagedSchemaConcurrent.test-seed#[5F4841A657CAAAF0]) [    ] o.a.s.c.c.SolrZkClient Using default ZkCredentialsProvider
   [junit4]   2> 848660 INFO  (TEST-TestCloudManagedSchemaConcurrent.test-seed#[5F4841A657CAAAF0]) [    ] o.a.s.c.c.ConnectionManager Waiting for client to connect to ZooKeeper
   [junit4]   2> 848661 INFO  (zkCallback-698-thread-1) [    ] o.a.s.c.c.ConnectionManager Watcher org.apache.solr.common.cloud.ConnectionManager@2febbdb0 name:ZooKeeperConnection Watcher:127.0.0.1:59496/solr got event WatchedEvent state:SyncConnected type:None path:null path:null type:None
   [junit4]   2> 848661 INFO  (TEST-TestCloudManagedSchemaConcurrent.test-seed#[5F4841A657CAAAF0]) [    ] o.a.s.c.c.ConnectionManager Client is connected to ZooKeeper
   [junit4]   2> 848662 INFO  (TEST-TestCloudManagedSchemaConcurrent.test-seed#[5F4841A657CAAAF0]) [    ] o.a.s.c.c.SolrZkClient Using default ZkACLProvider
   [junit4]   2> 848948 INFO  (TEST-TestCloudManagedSchemaConcurrent.test-seed#[5F4841A657CAAAF0]) [    ] o.a.s.SolrTestCaseJ4 Writing core.properties file to /x1/jenkins/jenkins-slave/workspace/Lucene-Solr-Tests-5.x-Java7/solr/build/solr-core/test/J0/temp/solr.schema.TestCloudManagedSchemaConcurrent_5F4841A657CAAAF0-001/control-001/cores/collection1
   [junit4]   2> 848950 INFO  (TEST-TestCloudManagedSchemaConcurrent.test-seed#[5F4841A657CAAAF0]) [    ] o.e.j.s.Server jetty-9.2.11.v20150529
   [junit4]   2> 848953 INFO  (TEST-TestCloudManagedSchemaConcurrent.test-seed#[5F4841A657CAAAF0]) [    ] o.e.j.s.h.ContextHandler Started o.e.j.s.ServletContextHandler@6bd0e33a{/,null,AVAILABLE}
   [junit4]   2> 848957 INFO  (TEST-TestCloudManagedSchemaConcurrent.test-seed#[5F4841A657CAAAF0]) [    ] o.e.j.s.ServerConnector Started ServerConnector@1d4f9af5{SSL-http/1.1}{127.0.0.1:40951}
   [junit4]   2> 848957 INFO  (TEST-TestCloudManagedSchemaConcurrent.test-seed#[5F4841A657CAAAF0]) [    ] o.e.j.s.Server Started @852062ms
   [junit4]   2> 848958 INFO  (TEST-TestCloudManagedSchemaConcurrent.test-seed#[5F4841A657CAAAF0]) [    ] o.a.s.c.s.e.JettySolrRunner Jetty properties: {hostPort=40951, solr.data.dir=/x1/jenkins/jenkins-slave/workspace/Lucene-Solr-Tests-5.x-Java7/solr/build/solr-core/test/J0/temp/solr.schema.TestCloudManagedSchemaConcurrent_5F4841A657CAAAF0-001/tempDir-001/control/data, hostContext=/, coreRootDirectory=/x1/jenkins/jenkins-slave/workspace/Lucene-Solr-Tests-5.x-Java7/solr/build/solr-core/test/J0/temp/solr.schema.TestCloudManagedSchemaConcurrent_5F4841A657CAAAF0-001/control-001/cores}
   [junit4]   2> 848959 INFO  (TEST-TestCloudManagedSchemaConcurrent.test-seed#[5F4841A657CAAAF0]) [    ] o.a.s.s.SolrDispatchFilter SolrDispatchFilter.init(): sun.misc.Launcher$AppClassLoader@1fe91485
   [junit4]   2> 848959 INFO  (TEST-TestCloudManagedSchemaConcurrent.test-seed#[5F4841A657CAAAF0]) [    ] o.a.s.c.SolrResourceLoader new SolrResourceLoader for directory: '/x1/jenkins/jenkins-slave/workspace/Lucene-Solr-Tests-5.x-Java7/solr/build/solr-core/test/J0/temp/solr.schema.TestCloudManagedSchemaConcurrent_5F4841A657CAAAF0-001/control-001/'
   [junit4]   2> 848975 INFO  (TEST-TestCloudManagedSchemaConcurrent.test-seed#[5F4841A657CAAAF0]) [    ] o.a.s.c.SolrXmlConfig Loading container configuration from /x1/jenkins/jenkins-slave/workspace/Lucene-Solr-Tests-5.x-Java7/solr/build/solr-core/test/J0/temp/solr.schema.TestCloudManagedSchemaConcurrent_5F4841A657CAAAF0-001/control-001/solr.xml
   [junit4]   2> 848989 INFO  (TEST-TestCloudManagedSchemaConcurrent.test-seed#[5F4841A657CAAAF0]) [    ] o.a.s.c.CoresLocator Config-defined core root directory: /x1/jenkins/jenkins-slave/workspace/Lucene-Solr-Tests-5.x-Java7/solr/build/solr-core/test/J0/temp/solr.schema.TestCloudManagedSchemaConcurrent_5F4841A657CAAAF0-001/control-001/cores
   [junit4]   2> 848990 INFO  (TEST-TestCloudManagedSchemaConcurrent.test-seed#[5F4841A657CAAAF0]) [    ] o.a.s.c.CoreContainer New CoreContainer 2074205876
   [junit4]   2> 848990 INFO  (TEST-TestCloudManagedSchemaConcurrent.test-seed#[5F4841A657CAAAF0]) [    ] o.a.s.c.CoreContainer Loading cores into CoreContainer [instanceDir=/x1/jenkins/jenkins-slave/workspace/Lucene-Solr-Tests-5.x-Java7/solr/build/solr-core/test/J0/temp/solr.schema.TestCloudManagedSchemaConcurrent_5F4841A657CAAAF0-001/control-001/]
   [junit4]   2> 848990 INFO  (TEST-TestCloudManagedSchemaConcurrent.test-seed#[5F4841A657CAAAF0]) [    ] o.a.s.c.CoreContainer loading shared library: /x1/jenkins/jenkins-slave/workspace/Lucene-Solr-Tests-5.x-Java7/solr/build/solr-core/test/J0/temp/solr.schema.TestCloudManagedSchemaConcurrent_5F4841A657CAAAF0-001/control-001/lib
   [junit4]   2> 848990 WARN  (TEST-TestCloudManagedSchemaConcurrent.test-seed#[5F4841A657CAAAF0]) [    ] o.a.s.c.SolrResourceLoader Can't find (or read) directory to add to classloader: lib (resolved as: /x1/jenkins/jenkins-slave/workspace/Lucene-Solr-Tests-5.x-Java7/solr/build/solr-core/test/J0/temp/solr.schema.TestCloudManagedSchemaConcurrent_5F4841A657CAAAF0-001/control-001/lib).
   [junit4]   2> 848998 INFO  (TEST-TestCloudManagedSchemaConcurrent.test-seed#[5F4841A657CAAAF0]) [    ] o.a.s.h.c.HttpShardHandlerFactory created with socketTimeout : 90000,urlScheme : ,connTimeout : 15000,maxConnectionsPerHost : 20,maxConnections : 10000,corePoolSize : 0,maximumPoolSize : 2147483647,maxThreadIdleTime : 5,sizeOfQueue : -1,fairnessPolicy : false,useRetries : false,
   [junit4]   2> 849000 INFO  (TEST-TestCloudManagedSchemaConcurrent.test-seed#[5F4841A657CAAAF0]) [    ] o.a.s.u.UpdateShardHandler Creating UpdateShardHandler HTTP client with params: socketTimeout=340000&connTimeout=45000&retry=true
   [junit4]   2> 849001 INFO  (TEST-TestCloudManagedSchemaConcurrent.test-seed#[5F4841A657CAAAF0]) [    ] o.a.s.l.LogWatcher SLF4J impl is org.slf4j.impl.Log4jLoggerFactory
   [junit4]   2> 849002 INFO  (TEST-TestCloudManagedSchemaConcurrent.test-seed#[5F4841A657CAAAF0]) [    ] o.a.s.l.LogWatcher Registering Log Listener [Log4j (org.slf4j.impl.Log4jLoggerFactory)]
   [junit4]   2> 849002 INFO  (TEST-TestCloudManagedSchemaConcurrent.test-seed#[5F4841A657CAAAF0]) [    ] o.a.s.c.ZkContainer Zookeeper client=127.0.0.1:59496/solr
   [junit4]   2> 849002 INFO  (TEST-TestCloudManagedSchemaConcurrent.test-seed#[5F4841A657CAAAF0]) [    ] o.a.s.c.ZkController zkHost includes chroot
   [junit4]   2> 849002 INFO  (TEST-TestCloudManagedSchemaConcurrent.test-seed#[5F4841A657CAAAF0]) [    ] o.a.s.c.c.SolrZkClient Using default ZkCredentialsProvider
   [junit4]   2> 849011 INFO  (TEST-TestCloudManagedSchemaConcurrent.test-seed#[5F4841A657CAAAF0]) [    ] o.a.s.c.c.ConnectionManager Waiting for client to connect to ZooKeeper
   [junit4]   2> 849014 INFO  (zkCallback-700-thread-1) [    ] o.a.s.c.c.ConnectionManager Watcher org.apache.solr.common.cloud.ConnectionManager@77dbf4ba name:ZooKeeperConnection Watcher:127.0.0.1:59496 got event WatchedEvent state:SyncConnected type:None path:null path:null type:None
   [junit4]   2> 849015 INFO  (TEST-TestCloudManagedSchemaConcurrent.test-seed#[5F4841A657CAAAF0]) [    ] o.a.s.c.c.ConnectionManager Client is connected to ZooKeeper
   [junit4]   2> 849016 INFO  (TEST-TestCloudManagedSchemaConcurrent.test-seed#[5F4841A657CAAAF0]) [    ] o.a.s.c.c.SolrZkClient Using default ZkACLProvider
   [junit4]   2> 849029 INFO  (TEST-TestCloudManagedSchemaConcurrent.test-seed#[5F4841A657CAAAF0]) [n:127.0.0.1:40951_    ] o.a.s.c.c.ConnectionManager Waiting for client to connect to ZooKeeper
   [junit4]   2> 849039 INFO  (zkCallback-701-thread-1-processing-n:127.0.0.1:40951_) [n:127.0.0.1:40951_    ] o.a.s.c.c.ConnectionManager Watcher org.apache.solr.common.cloud.ConnectionManager@2525f956 name:ZooKeeperConnection Watcher:127.0.0.1:59496/solr got event WatchedEvent state:SyncConnected type:None path:null path:null type:None
   [junit4]   2> 849039 INFO  (TEST-TestCloudManagedSchemaConcurrent.test-seed#[5F4841A657CAAAF0]) [n:127.0.0.1:40951_    ] o.a.s.c.c.ConnectionManager Client is connected to ZooKeeper
   [junit4]   2> 849047 INFO  (TEST-TestCloudManagedSchemaConcurrent.test-seed#[5F4841A657CAAAF0]) [n:127.0.0.1:40951_    ] o.a.s.c.c.SolrZkClient makePath: /overseer/queue
   [junit4]   2> 849049 INFO  (TEST-TestCloudManagedSchemaConcurrent.test-seed#[5F4841A657CAAAF0]) [n:127.0.0.1:40951_    ] o.a.s.c.c.SolrZkClient makePath: /overseer/collection-queue-work
   [junit4]   2> 849052 INFO  (TEST-TestCloudManagedSchemaConcurrent.test-seed#[5F4841A657CAAAF0]) [n:127.0.0.1:40951_    ] o.a.s.c.c.SolrZkClient makePath: /overseer/collection-map-running
   [junit4]   2> 849054 INFO  (TEST-TestCloudManagedSchemaConcurrent.test-seed#[5F4841A657CAAAF0]) [n:127.0.0.1:40951_    ] o.a.s.c.c.SolrZkClient makePath: /overseer/collection-map-completed
   [junit4]   2> 849057 INFO  (TEST-TestCloudManagedSchemaConcurrent.test-seed#[5F4841A657CAAAF0]) [n:127.0.0.1:40951_    ] o.a.s.c.c.SolrZkClient makePath: /overseer/collection-map-failure
   [junit4]   2> 849059 INFO  (TEST-TestCloudManagedSchemaConcurrent.test-seed#[5F4841A657CAAAF0]) [n:127.0.0.1:40951_    ] o.a.s.c.c.SolrZkClient makePath: /live_nodes
   [junit4]   2> 849061 INFO  (TEST-TestCloudManagedSchemaConcurrent.test-seed#[5F4841A657CAAAF0]) [n:127.0.0.1:40951_    ] o.a.s.c.c.SolrZkClient makePath: /aliases.json
   [junit4]   2> 849062 INFO  (TEST-TestCloudManagedSchemaConcurrent.test-seed#[5F4841A657CAAAF0]) [n:127.0.0.1:40951_    ] o.a.s.c.c.SolrZkClient makePath: /clusterstate.json
   [junit4]   2> 849062 INFO  (TEST-TestCloudManagedSchemaConcurrent.test-seed#[5F4841A657CAAAF0]) [n:127.0.0.1:40951_    ] o.a.s.c.ZkController Register node as live in ZooKeeper:/live_nodes/127.0.0.1:40951_
   [junit4]   2> 849063 INFO  (TEST-TestCloudManagedSchemaConcurrent.test-seed#[5F4841A657CAAAF0]) [n:127.0.0.1:40951_    ] o.a.s.c.c.SolrZkClient makePath: /live_nodes/127.0.0.1:40951_
   [junit4]   2> 849064 INFO  (TEST-TestCloudManagedSchemaConcurrent.test-seed#[5F4841A657CAAAF0]) [n:127.0.0.1:40951_    ] o.a.s.c.c.SolrZkClient makePath: /overseer_elect
   [junit4]   2> 849068 INFO  (TEST-TestCloudManagedSchemaConcurrent.test-seed#[5F4841A657CAAAF0]) [n:127.0.0.1:40951_    ] o.a.s.c.c.SolrZkClient makePath: /overseer_elect/election
   [junit4]   2> 849070 INFO  (TEST-TestCloudManagedSchemaConcurrent.test-seed#[5F4841A657CAAAF0]) [n:127.0.0.1:40951_    ] o.a.s.c.Overseer Overseer (id=null) closing
   [junit4]   2> 849071 INFO  (TEST-TestCloudManagedSchemaConcurrent.test-seed#[5F4841A657CAAAF0]) [n:127.0.0.1:40951_    ] o.a.s.c.LeaderElector Joined leadership election with path: /overseer_elect/election/94243996755427332-127.0.0.1:40951_-n_0000000000
   [junit4]   2> 849072 INFO  (TEST-TestCloudManagedSchemaConcurrent.test-seed#[5F4841A657CAAAF0]) [n:127.0.0.1:40951_    ] o.a.s.c.OverseerElectionContext I am going to be the leader 127.0.0.1:40951_
   [junit4]   2> 849072 INFO  (TEST-TestCloudManagedSchemaConcurrent.test-seed#[5F4841A657CAAAF0]) [n:127.0.0.1:40951_    ] o.a.s.c.c.SolrZkClient makePath: /overseer_elect/leader
   [junit4]   2> 849074 INFO  (TEST-TestCloudManagedSchemaConcurrent.test-seed#[5F4841A657CAAAF0]) [n:127.0.0.1:40951_    ] o.a.s.c.Overseer Overseer (id=94243996755427332-127.0.0.1:40951_-n_0000000000) starting
   [junit4]   2> 849078 INFO  (TEST-TestCloudManagedSchemaConcurrent.test-seed#[5F4841A657CAAAF0]) [n:127.0.0.1:40951_    ] o.a.s.c.c.SolrZkClient makePath: /overseer/queue-work
   [junit4]   2> 849087 INFO  (TEST-TestCloudManagedSchemaConcurrent.test-seed#[5F4841A657CAAAF0]) [n:127.0.0.1:40951_    ] o.a.s.c.OverseerAutoReplicaFailoverThread Starting OverseerAutoReplicaFailoverThread autoReplicaFailoverWorkLoopDelay=10000 autoReplicaFailoverWaitAfterExpiration=30000 autoReplicaFailoverBadNodeExpiration=60000
   [junit4]   2> 849089 INFO  (OverseerCollectionProcessor-94243996755427332-127.0.0.1:40951_-n_0000000000) [n:127.0.0.1:40951_    ] o.a.s.c.OverseerCollectionProcessor Process current queue of collection creations
   [junit4]   2> 849091 INFO  (OverseerStateUpdate-94243996755427332-127.0.0.1:40951_-n_0000000000) [n:127.0.0.1:40951_    ] o.a.s.c.Overseer Starting to work on the main queue
   [junit4]   2> 849094 INFO  (TEST-TestCloudManagedSchemaConcurrent.test-seed#[5F4841A657CAAAF0]) [n:127.0.0.1:40951_    ] o.a.s.c.c.ZkStateReader Updating cluster state from ZooKeeper... 
   [junit4]   2> 849106 INFO  (TEST-TestCloudManagedSchemaConcurrent.test-seed#[5F4841A657CAAAF0]) [n:127.0.0.1:40951_    ] o.a.s.c.CoreContainer No authentication plugin used.
   [junit4]   2> 849113 INFO  (TEST-TestCloudManagedSchemaConcurrent.test-seed#[5F4841A657CAAAF0]) [n:127.0.0.1:40951_    ] o.a.s.c.CoreContainer Security conf doesn't exist. Skipping setup for authorization module.
   [junit4]   2> 849114 INFO  (TEST-TestCloudManagedSchemaConcurrent.test-seed#[5F4841A657CAAAF0]) [n:127.0.0.1:40951_    ] o.a.s.c.CoresLocator Looking for core definitions underneath /x1/jenkins/jenkins-slave/workspace/Lucene-Solr-Tests-5.x-Java7/solr/build/solr-core/test/J0/temp/solr.schema.TestCloudManagedSchemaConcurrent_5F4841A657CAAAF0-001/control-001/cores
   [junit4]   2> 849115 INFO  (TEST-TestCloudManagedSchemaConcurrent.test-seed#[5F4841A657CAAAF0]) [n:127.0.0.1:40951_    ] o.a.s.c.SolrCore Created CoreDescriptor: {dataDir=data/, loadOnStartup=true, config=solrconfig.xml, coreNodeName=, absoluteInstDir=/x1/jenkins/jenkins-slave/workspace/Lucene-Solr-Tests-5.x-Java7/solr/build/solr-core/test/J0/temp/solr.schema.TestCloudManagedSchemaConcurrent_5F4841A657CAAAF0-001/control-001/cores/collection1/, collection=control_collection, shard=, name=collection1, instanceDir=/x1/jenkins/jenkins-slave/workspace/Lucene-Solr-Tests-5.x-Java7/solr/build/solr-core/test/J0/temp/solr.schema.TestCloudManagedSchemaConcurrent_5F4841A657CAAAF0-001/control-001/cores/collection1, transient=false, configSetProperties=configsetprops.json, schema=schema.xml}
   [junit4]   2> 849115 INFO  (TEST-TestCloudManagedSchemaConcurrent.test-seed#[5F4841A657CAAAF0]) [n:127.0.0.1:40951_    ] o.a.s.c.CoresLocator Found core collection1 in /x1/jenkins/jenkins-slave/workspace/Lucene-Solr-Tests-5.x-Java7/solr/build/solr-core/test/J0/temp/solr.schema.TestCloudManagedSchemaConcurrent_5F4841A657CAAAF0-001/control-001/cores/collection1/
   [junit4]   2> 849115 INFO  (TEST-TestCloudManagedSchemaConcurrent.test-seed#[5F4841A657CAAAF0]) [n:127.0.0.1:40951_    ] o.a.s.c.CoresLocator Found 1 core definitions
   [junit4]   2> 849117 INFO  (coreLoadExecutor-2540-thread-1-processing-n:127.0.0.1:40951_) [n:127.0.0.1:40951_ c:control_collection   x:collection1] o.a.s.c.ZkController publishing state=down
   [junit4]   2> 849117 INFO  (coreLoadExecutor-2540-thread-1-processing-n:127.0.0.1:40951_) [n:127.0.0.1:40951_ c:control_collection   x:collection1] o.a.s.c.ZkController numShards not found on descriptor - reading it from system property
   [junit4]   2> 849121 INFO  (coreLoadExecutor-2540-thread-1-processing-n:127.0.0.1:40951_) [n:127.0.0.1:40951_ c:control_collection   x:collection1] o.a.s.c.ZkController look for our core node name
   [junit4]   2> 849122 INFO  (zkCallback-701-thread-1-processing-n:127.0.0.1:40951_) [n:127.0.0.1:40951_    ] o.a.s.c.DistributedQueue NodeChildrenChanged fired on path /overseer/queue state SyncConnected
   [junit4]   2> 849122 INFO  (TEST-TestCloudManagedSchemaConcurrent.test-seed#[5F4841A657CAAAF0]) [n:127.0.0.1:40951_    ] o.a.s.s.SolrDispatchFilter user.dir=/x1/jenkins/jenkins-slave/workspace/Lucene-Solr-Tests-5.x-Java7/solr/build/solr-core/test/J0
   [junit4]   2> 849122 INFO  (TEST-TestCloudManagedSchemaConcurrent.test-seed#[5F4841A657CAAAF0]) [n:127.0.0.1:40951_    ] o.a.s.s.SolrDispatchFilter SolrDispatchFilter.init() done
   [junit4]   2> 849123 INFO  (OverseerStateUpdate-94243996755427332-127.0.0.1:40951_-n_0000000000) [n:127.0.0.1:40951_    ] o.a.s.c.Overseer processMessage: queueSize: 1, message = {
   [junit4]   2>   "shard":null,
   [junit4]   2>   "numShards":"1",
   [junit4]   2>   "core":"collection1",
   [junit4]   2>   "base_url":"https://127.0.0.1:40951",
   [junit4]   2>   "collection":"control_collection",
   [junit4]   2>   "node_name":"127.0.0.1:40951_",
   [junit4]   2>   "roles":null,
   [junit4]   2>   "state":"down",
   [junit4]   2>   "operation":"state"} current state version: 0
   [junit4]   2> 849123 INFO  (OverseerStateUpdate-94243996755427332-127.0.0.1:40951_-n_0000000000) [n:127.0.0.1:40951_    ] o.a.s.c.o.ReplicaMutator Update state numShards=1 message={
   [junit4]   2>   "shard":null,
   [junit4]   2>   "numShards":"1",
   [junit4]   2>   "core":"collection1",
   [junit4]   2>   "base_url":"https://127.0.0.1:40951",
   [junit4]   2>   "collection":"control_collection",
   [junit4]   2>   "node_name":"127.0.0.1:40951_",
   [junit4]   2>   "roles":null,
   [junit4]   2>   "state":"down",
   [junit4]   2>   "operation":"state"}
   [junit4]   2> 849123 INFO  (OverseerStateUpdate-94243996755427332-127.0.0.1:40951_-n_0000000000) [n:127.0.0.1:40951_    ] o.a.s.c.o.ClusterStateMutator building a new cName: control_collection
   [junit4]   2> 849124 INFO  (OverseerStateUpdate-94243996755427332-127.0.0.1:40951_-n_0000000000) [n:127.0.0.1:40951_    ] o.a.s.c.o.ReplicaMutator Assigning new node to shard shard=shard1
   [junit4]   2> 849125 INFO  (zkCallback-701-thread-1-processing-n:127.0.0.1:40951_) [n:127.0.0.1:40951_    ] o.a.s.c.c.ZkStateReader A cluster state change: WatchedEvent state:SyncConnected type:NodeDataChanged path:/clusterstate.json, has occurred - updating... (live nodes size: 1)
   [junit4]   2> 849137 INFO  (zkCallback-701-thread-1-processing-n:127.0.0.1:40951_) [n:127.0.0.1:40951_    ] o.a.s.c.c.ZkStateReader Updated cluster state version to 1
   [junit4]   2> 850121 INFO  (coreLoadExecutor-2540-thread-1-processing-n:127.0.0.1:40951_) [n:127.0.0.1:40951_ c:control_collection   x:collection1] o.a.s.c.ZkController waiting to find shard id in clusterstate for collection1
   [junit4]   2> 850122 INFO  (coreLoadExecutor-2540-thread-1-processing-n:127.0.0.1:40951_) [n:127.0.0.1:40951_ c:control_collection   x:collection1] o.a.s.c.ZkController Check for collection zkNode:control_collection
   [junit4]   2> 850122 INFO  (coreLoadExecutor-2540-thread-1-processing-n:127.0.0.1:40951_) [n:127.0.0.1:40951_ c:control_collection   x:collection1] o.a.s.c.ZkController Collection zkNode exists
   [junit4]   2> 850122 INFO  (coreLoadExecutor-2540-thread-1-processing-n:127.0.0.1:40951_) [n:127.0.0.1:40951_ c:control_collection   x:collection1] o.a.s.c.c.ZkStateReader Load collection config from:/collections/control_collection
   [junit4]   2> 850123 INFO  (coreLoadExecutor-2540-thread-1-processing-n:127.0.0.1:40951_) [n:127.0.0.1:40951_ c:control_collection   x:collection1] o.a.s.c.c.ZkStateReader path=/collections/control_collection configName=conf1 specified config exists in ZooKeeper
   [junit4]   2> 850123 INFO  (coreLoadExecutor-2540-thread-1-processing-n:127.0.0.1:40951_) [n:127.0.0.1:40951_ c:control_collection   x:collection1] o.a.s.c.SolrResourceLoader new SolrResourceLoader for directory: '/x1/jenkins/jenkins-slave/workspace/Lucene-Solr-Tests-5.x-Java7/solr/build/solr-core/test/J0/temp/solr.schema.TestCloudManagedSchemaConcurrent_5F4841A657CAAAF0-001/control-001/cores/collection1/'
   [junit4]   2> 850138 INFO  (coreLoadExecutor-2540-thread-1-processing-n:127.0.0.1:40951_) [n:127.0.0.1:40951_ c:control_collection   x:collection1] o.a.s.c.Config loaded config solrconfig.xml with version 0 
   [junit4]   2> 850150 INFO  (coreLoadExecutor-2540-thread-1-processing-n:127.0.0.1:40951_) [n:127.0.0.1:40951_ c:control_collection   x:collection1] o.a.s.c.SolrConfig current version of requestparams : -1
   [junit4]   2> 850173 INFO  (coreLoadExecutor-2540-thread-1-processing-n:127.0.0.1:40951_) [n:127.0.0.1:40951_ c:control_collection   x:collection1] o.a.s.c.SolrConfig Using Lucene MatchVersion: 5.3.0
   [junit4]   2> 850201 INFO  (coreLoadExecutor-2540-thread-1-processing-n:127.0.0.1:40951_) [n:127.0.0.1:40951_ c:control_collection   x:collection1] o.a.s.c.Config Loaded SolrConfig: solrconfig.xml
   [junit4]   2> 850204 INFO  (coreLoadExecutor-2540-thread-1-processing-n:127.0.0.1:40951_) [n:127.0.0.1:40951_ c:control_collection   x:collection1] o.a.s.s.ManagedIndexSchemaFactory The schema is configured as managed, but managed schema resource managed-schema not found - loading non-managed schema schema.xml instead
   [junit4]   2> 850205 INFO  (coreLoadExecutor-2540-thread-1-processing-n:127.0.0.1:40951_) [n:127.0.0.1:40951_ c:control_collection   x:collection1] o.a.s.s.IndexSchema Reading Solr Schema from /configs/conf1/schema.xml
   [junit4]   2> 850212 INFO  (coreLoadExecutor-2540-thread-1-processing-n:127.0.0.1:40951_) [n:127.0.0.1:40951_ c:control_collection   x:collection1] o.a.s.s.IndexSchema [collection1] Schema name=test
   [junit4]   2> 850476 INFO  (coreLoadExecutor-2540-thread-1-processing-n:127.0.0.1:40951_) [n:127.0.0.1:40951_ c:control_collection   x:collection1] o.a.s.s.OpenExchangeRatesOrgProvider Initialized with rates=open-exchange-rates.json, refreshInterval=1440.
   [junit4]   2> 850484 INFO  (coreLoadExecutor-2540-thread-1-processing-n:127.0.0.1:40951_) [n:127.0.0.1:40951_ c:control_collection   x:collection1] o.a.s.s.IndexSchema default search field in schema is text
   [junit4]   2> 850486 INFO  (coreLoadExecutor-2540-thread-1-processing-n:127.0.0.1:40951_) [n:127.0.0.1:40951_ c:control_collection   x:collection1] o.a.s.s.IndexSchema unique key field: id
   [junit4]   2> 850516 INFO  (coreLoadExecutor-2540-thread-1-processing-n:127.0.0.1:40951_) [n:127.0.0.1:40951_ c:control_collection   x:collection1] o.a.s.s.FileExchangeRateProvider Reloading exchange rates from file currency.xml
   [junit4]   2> 850519 INFO  (coreLoadExecutor-2540-thread-1-processing-n:127.0.0.1:40951_) [n:127.0.0.1:40951_ c:control_collection   x:collection1] o.a.s.s.FileExchangeRateProvider Reloading exchange rates from file currency.xml
   [junit4]   2> 850522 INFO  (coreLoadExecutor-2540-thread-1-processing-n:127.0.0.1:40951_) [n:127.0.0.1:40951_ c:control_collection   x:collection1] o.a.s.s.OpenExchangeRatesOrgProvider Reloading exchange rates from open-exchange-rates.json
   [junit4]   2> 850522 WARN  (coreLoadExecutor-2540-thread-1-processing-n:127.0.0.1:40951_) [n:127.0.0.1:40951_ c:control_collection   x:collection1] o.a.s.s.OpenExchangeRatesOrgProvider Unknown key IMPORTANT NOTE
   [junit4]   2> 850523 WARN  (coreLoadExecutor-2540-thread-1-processing-n:127.0.0.1:40951_) [n:127.0.0.1:40951_ c:control_collection   x:collection1] o.a.s.s.OpenExchangeRatesOrgProvider Expected key, got STRING
   [junit4]   2> 850523 INFO  (coreLoadExecutor-2540-thread-1-processing-n:127.0.0.1:40951_) [n:127.0.0.1:40951_ c:control_collection   x:collection1] o.a.s.s.OpenExchangeRatesOrgProvider Reloading exchange rates from open-exchange-rates.json
   [junit4]   2> 850523 WARN  (coreLoadExecutor-2540-thread-1-processing-n:127.0.0.1:40951_) [n:127.0.0.1:40951_ c:control_collection   x:collection1] o.a.s.s.OpenExchangeRatesOrgProvider Unknown key IMPORTANT NOTE
   [junit4]   2> 850523 WARN  (coreLoadExecutor-2540-thread-1-processing-n:127.0.0.1:40951_) [n:127.0.0.1:40951_ c:control_collection   x:collection1] o.a.s.s.OpenExchangeRatesOrgProvider Expected key, got STRING
   [junit4]   2> 850526 INFO  (coreLoadExecutor-2540-thread-1-processing-n:127.0.0.1:40951_) [n:127.0.0.1:40951_ c:control_collection   x:collection1] o.a.s.s.IndexSchema Created and persisted managed schema znode at /configs/conf1/managed-schema
   [junit4]   2> 850528 INFO  (coreLoadExecutor-2540-thread-1-processing-n:127.0.0.1:40951_) [n:127.0.0.1:40951_ c:control_collection   x:collection1] o.a.s.c.c.SolrZkClient makePath: /configs/conf1/schema.xml.bak
   [junit4]   2> 850531 INFO  (coreLoadExecutor-2540-thread-1-processing-n:127.0.0.1:40951_) [n:127.0.0.1:40951_ c:control_collection   x:collection1] o.a.s.s.ManagedIndexSchemaFactory After upgrading to managed schema in ZooKeeper, renamed the non-managed schema /configs/conf1/schema.xml to /configs/conf1/schema.xml.bak
   [junit4]   2> 850532 INFO  (coreLoadExecutor-2540-thread-1-processing-n:127.0.0.1:40951_) [n:127.0.0.1:40951_ c:control_collection   x:collection1] o.a.s.c.ConfigSetProperties Did not find ConfigSet properties, assuming default properties: Can't find resource 'configsetprops.json' in classpath or '/configs/conf1', cwd=/x1/jenkins/jenkins-slave/workspace/Lucene-Solr-Tests-5.x-Java7/solr/build/solr-core/test/J0
   [junit4]   2> 850532 INFO  (coreLoadExecutor-2540-thread-1-processing-n:127.0.0.1:40951_) [n:127.0.0.1:40951_ c:control_collection   x:collection1] o.a.s.c.CoreContainer Creating SolrCore 'collection1' using configuration from collection control_collection
   [junit4]   2> 850532 INFO  (coreLoadExecutor-2540-thread-1-processing-n:127.0.0.1:40951_) [n:127.0.0.1:40951_ c:control_collection s:shard1 r:core_node1 x:collection1] o.a.s.c.SolrCore solr.NRTCachingDirectoryFactory
   [junit4]   2> 850533 INFO  (coreLoadExecutor-2540-thread-1-processing-n:127.0.0.1:40951_) [n:127.0.0.1:40951_ c:control_collection s:shard1 r:core_node1 x:collection1] o.a.s.c.SolrCore [[collection1] ] Opening new SolrCore at [/x1/jenkins/jenkins-slave/workspace/Lucene-Solr-Tests-5.x-Java7/solr/build/solr-core/test/J0/temp/solr.schema.TestCloudManagedSchemaConcurrent_5F4841A657CAAAF0-001/control-001/cores/collection1/], dataDir=[null]
   [junit4]   2> 850533 INFO  (coreLoadExecutor-2540-thread-1-processing-n:127.0.0.1:40951_) [n:127.0.0.1:40951_ c:control_collection s:shard1 r:core_node1 x:collection1] o.a.s.c.SolrCore JMX monitoring not detected for core: collection1
   [junit4]   2> 850533 INFO  (coreLoadExecutor-2540-thread-1-processing-n:127.0.0.1:40951_) [n:127.0.0.1:40951_ c:control_collection s:shard1 r:core_node1 x:collection1] o.a.s.c.CachingDirectoryFactory return new directory for /x1/jenkins/jenkins-slave/workspace/Lucene-Solr-Tests-5.x-Java7/solr/build/solr-core/test/J0/temp/solr.schema.TestCloudManagedSchemaConcurrent_5F4841A657CAAAF0-001/control-001/cores/collection1/data
   [junit4]   2> 850534 INFO  (coreLoadExecutor-2540-thread-1-processing-n:127.0.0.1:40951_) [n:127.0.0.1:40951_ c:control_collection s:shard1 r:core_node1 x:collection1] o.a.s.c.SolrCore New index directory detected: old=null new=/x1/jenkins/jenkins-slave/workspace/Lucene-Solr-Tests-5.x-Java7/solr/build/solr-core/test/J0/temp/solr.schema.TestCloudManagedSchemaConcurrent_5F4841A657CAAAF0-001/control-001/cores/collection1/data/index/
   [junit4]   2> 850534 WARN  (coreLoadExecutor-2540-thread-1-processing-n:127.0.0.1:40951_) [n:127.0.0.1:40951_ c:control_collection s:shard1 r:core_node1 x:collection1] o.a.s.c.SolrCore [collection1] Solr index directory '/x1/jenkins/jenkins-slave/workspace/Lucene-Solr-Tests-5.x-Java7/solr/build/solr-core/test/J0/temp/solr.schema.TestCloudManagedSchemaConcurrent_5F4841A657CAAAF0-001/control-001/cores/collection1/data/index' doesn't exist. Creating new index...
   [junit4]   2> 850534 INFO  (coreLoadExecutor-2540-thread-1-processing-n:127.0.0.1:40951_) [n:127.0.0.1:40951_ c:control_collection s:shard1 r:core_node1 x:collection1] o.a.s.c.CachingDirectoryFactory return new directory for /x1/jenkins/jenkins-slave/workspace/Lucene-Solr-Tests-5.x-Java7/solr/build/solr-core/test/J0/temp/solr.schema.TestCloudManagedSchemaConcurrent_5F4841A657CAAAF0-001/control-001/cores/collection1/data/index
   [junit4]   2> 850535 INFO  (coreLoadExecutor-2540-thread-1-processing-n:127.0.0.1:40951_) [n:127.0.0.1:40951_ c:control_collection s:shard1 r:core_node1 x:collection1] o.a.s.u.RandomMergePolicy RandomMergePolicy wrapping class org.apache.lucene.index.TieredMergePolicy: [TieredMergePolicy: maxMergeAtOnce=34, maxMergeAtOnceExplicit=49, maxMergedSegmentMB=46.841796875, floorSegmentMB=0.2734375, forceMergeDeletesPctAllowed=12.66018454847548, segmentsPerTier=45.0, maxCFSSegmentSizeMB=8.796093022207999E12, noCFSRatio=0.7262694029607902
   [junit4]   2> 850551 INFO  (coreLoadExecutor-2540-thread-1-processing-n:127.0.0.1:40951_) [n:127.0.0.1:40951_ c:control_collection s:shard1 r:core_node1 x:collection1] o.a.s.c.SolrCore SolrDeletionPolicy.onCommit: commits: num=1
   [junit4]   2> 	commit{dir=NRTCachingDirectory(MMapDirectory@/x1/jenkins/jenkins-slave/workspace/Lucene-Solr-Tests-5.x-Java7/solr/build/solr-core/test/J0/temp/solr.schema.TestCloudManagedSchemaConcurrent_5F4841A657CAAAF0-001/control-001/cores/collection1/data/index lockFactory=org.apache.lucene.store.SingleInstanceLockFactory@60ad907c; maxCacheMB=48.0 maxMergeSizeMB=4.0),segFN=segments_1,generation=1}
   [junit4]   2> 850551 INFO  (coreLoadExecutor-2540-thread-1-processing-n:127.0.0.1:40951_) [n:127.0.0.1:40951_ c:control_collection s:shard1 r:core_node1 x:collection1] o.a.s.c.SolrCore newest commit generation = 1
   [junit4]   2> 850552 INFO  (OldIndexDirectoryCleanupThreadForCore-collection1) [n:127.0.0.1:40951_ c:control_collection s:shard1 r:core_node1 x:collection1] o.a.s.c.SolrCore Looking for old index directories to cleanup for core collection1 in /x1/jenkins/jenkins-slave/workspace/Lucene-Solr-Tests-5.x-Java7/solr/build/solr-core/test/J0/temp/solr.schema.TestCloudManagedSchemaConcurrent_5F4841A657CAAAF0-001/control-001/cores/collection1/data/
   [junit4]   2> 850554 INFO  (coreLoadExecutor-2540-thread-1-processing-n:127.0.0.1:40951_) [n:127.0.0.1:40951_ c:control_collection s:shard1 r:core_node1 x:collection1] o.a.s.c.SolrCore no updateRequestProcessorChain defined as default, creating implicit default
   [junit4]   2> 850554 WARN  (coreLoadExecutor-2540-thread-1-processing-n:127.0.0.1:40951_) [n:127.0.0.1:40951_ c:control_collection s:shard1 r:core_node1 x:collection1] o.a.s.c.RequestHandlers INVALID paramSet a in requestHandler {type = requestHandler,name = /dump,class = DumpRequestHandler,args = {defaults={a=A,b=B}}}
   [junit4]   2> 850557 INFO  (coreLoadExecutor-2540-thread-1-processing-n:127.0.0.1:40951_) [n:127.0.0.1:40951_ c:control_collection s:shard1 r:core_node1 x:collection1] o.a.s.h.l.XMLLoader xsltCacheLifetimeSeconds=60
   [junit4]   2> 850558 INFO  (coreLoadExecutor-2540-thread-1-processing-n:127.0.0.1:40951_) [n:127.0.0.1:40951_ c:control_collection s:shard1 r:core_node1 x:collection1] o.a.s.h.l.XMLLoader xsltCacheLifetimeSeconds=60
   [junit4]   2> 850559 INFO  (coreLoadExecutor-2540-thread-1-processing-n:127.0.0.1:40951_) [n:127.0.0.1:40951_ c:control_collection s:shard1 r:core_node1 x:collection1] o.a.s.h.l.XMLLoader xsltCacheLifetimeSeconds=60
   [junit4]   2> 850561 INFO  (coreLoadExecutor-2540-thread-1-processing-n:127.0.0.1:40951_) [n:127.0.0.1:40951_ c:control_collection s:shard1 r:core_node1 x:collection1] o.a.s.h.l.XMLLoader xsltCacheLifetimeSeconds=60
   [junit4]   2> 850562 INFO  (coreLoadExecutor-2540-thread-1-processing-n:127.0.0.1:40951_) [n:127.0.0.1:40951_ c:control_collection s:shard1 r:core_node1 x:collection1] o.a.s.c.RequestHandlers Registered paths: /replication,/dump,/update/json,/admin/luke,/admin/ping,/admin/system,/admin/properties,/admin/segments,/update/csv,/schema,/get,/admin/logging,/admin/file,/update,standard,/admin/mbeans,/config,/update/json/docs,/admin/threads,/admin/plugins
   [junit4]   2> 850564 INFO  (coreLoadExecutor-2540-thread-1-processing-n:127.0.0.1:40951_) [n:127.0.0.1:40951_ c:control_collection s:shard1 r:core_node1 x:collection1] o.a.s.c.SolrCore Using default statsCache cache: org.apache.solr.search.stats.LocalStatsCache
   [junit4]   2> 850565 INFO  (coreLoadExecutor-2540-thread-1-processing-n:127.0.0.1:40951_) [n:127.0.0.1:40951_ c:control_collection s:shard1 r:core_node1 x:collection1] o.a.s.u.UpdateHandler Using UpdateLog implementation: org.apache.solr.update.UpdateLog
   [junit4]   2> 850565 INFO  (coreLoadExecutor-2540-thread-1-processing-n:127.0.0.1:40951_) [n:127.0.0.1:40951_ c:control_collection s:shard1 r:core_node1 x:collection1] o.a.s.u.UpdateLog Initializing UpdateLog: dataDir= defaultSyncLevel=FLUSH numRecordsToKeep=100 maxNumLogsToKeep=10 numVersionBuckets=65536
   [junit4]   2> 850565 INFO  (coreLoadExecutor-2540-thread-1-processing-n:127.0.0.1:40951_) [n:127.0.0.1:40951_ c:control_collection s:shard1 r:core_node1 x:collection1] o.a.s.c.SolrCore Hard AutoCommit: disabled
   [junit4]   2> 850566 INFO  (coreLoadExecutor-2540-thread-1-processing-n:127.0.0.1:40951_) [n:127.0.0.1:40951_ c:control_collection s:shard1 r:core_node1 x:collection1] o.a.s.c.SolrCore Soft AutoCommit: disabled
   [junit4]   2> 850566 INFO  (coreLoadExecutor-2540-thread-1-processing-n:127.0.0.1:40951_) [n:127.0.0.1:40951_ c:control_collection s:shard1 r:core_node1 x:collection1] o.a.s.u.RandomMergePolicy RandomMergePolicy wrapping class org.apache.lucene.index.TieredMergePolicy: [TieredMergePolicy: maxMergeAtOnce=17, maxMergeAtOnceExplicit=50, maxMergedSegmentMB=95.21875, floorSegmentMB=0.7880859375, forceMergeDeletesPctAllowed=25.793465386267666, segmentsPerTier=11.0, maxCFSSegmentSizeMB=8.796093022207999E12, noCFSRatio=0.6234196133069113
   [junit4]   2> 850567 INFO  (coreLoadExecutor-2540-thread-1-processing-n:127.0.0.1:40951_) [n:127.0.0.1:40951_ c:control_collection s:shard1 r:core_node1 x:collection1] o.a.s.c.SolrCore SolrDeletionPolicy.onInit: commits: num=1
   [junit4]   2> 	commit{dir=NRTCachingDirectory(MMapDirectory@/x1/jenkins/jenkins-slave/workspace/Lucene-Solr-Tests-5.x-Java7/solr/build/solr-core/test/J0/temp/solr.schema.TestCloudManagedSchemaConcurrent_5F4841A657CAAAF0-001/control-001/cores/collection1/data/index lockFactory=org.apache.lucene.store.SingleInstanceLockFactory@60ad907c; maxCacheMB=48.0 maxMergeSizeMB=4.0),segFN=segments_1,generation=1}
   [junit4]   2> 850567 INFO  (coreLoadExecutor-2540-thread-1-processing-n:127.0.0.1:40951_) [n:127.0.0.1:40951_ c:control_collection s:shard1 r:core_node1 x:collection1] o.a.s.c.SolrCore newest commit generation = 1
   [junit4]   2> 850567 INFO  (coreLoadExecutor-2540-thread-1-processing-n:127.0.0.1:40951_) [n:127.0.0.1:40951_ c:control_collection s:shard1 r:core_node1 x:collection1] o.a.s.s.SolrIndexSearcher Opening Searcher@36619c6e[collection1] main
   [junit4]   2> 850567 INFO  (coreLoadExecutor-2540-thread-1-processing-n:127.0.0.1:40951_) [n:127.0.0.1:40951_ c:control_collection s:shard1 r:core_node1 x:collection1] o.a.s.c.c.ZkStateReader Load collection config from:/collections/control_collection
   [junit4]   2> 850568 INFO  (coreLoadExecutor-2540-thread-1-processing-n:127.0.0.1:40951_) [n:127.0.0.1:40951_ c:control_collection s:shard1 r:core_node1 x:collection1] o.a.s.c.c.ZkStateReader path=/collections/control_collection configName=conf1 specified config exists in ZooKeeper
   [junit4]   2> 850568 INFO  (coreLoadExecutor-2540-thread-1-processing-n:127.0.0.1:40951_) [n:127.0.0.1:40951_ c:control_collection s:shard1 r:core_node1 x:collection1] o.a.s.r.ManagedResourceStorage Setting up ZooKeeper-based storage for the RestManager with znodeBase: /configs/conf1
   [junit4]   2> 850569 INFO  (coreLoadExecutor-2540-thread-1-processing-n:127.0.0.1:40951_) [n:127.0.0.1:40951_ c:control_collection s:shard1 r:core_node1 x:collection1] o.a.s.r.ManagedResourceStorage Configured ZooKeeperStorageIO with znodeBase: /configs/conf1
   [junit4]   2> 850569 INFO  (coreLoadExecutor-2540-thread-1-processing-n:127.0.0.1:40951_) [n:127.0.0.1:40951_ c:control_collection s:shard1 r:core_node1 x:collection1] o.a.s.r.RestManager Initializing RestManager with initArgs: {}
   [junit4]   2> 850569 INFO  (coreLoadExecutor-2540-thread-1-processing-n:127.0.0.1:40951_) [n:127.0.0.1:40951_ c:control_collection s:shard1 r:core_node1 x:collection1] o.a.s.r.ManagedResourceStorage Reading _rest_managed.json using ZooKeeperStorageIO:path=/configs/conf1
   [junit4]   2> 850570 INFO  (coreLoadExecutor-2540-thread-1-processing-n:127.0.0.1:40951_) [n:127.0.0.1:40951_ c:control_collection s:shard1 r:core_node1 x:collection1] o.a.s.r.ManagedResourceStorage No data found for znode /configs/conf1/_rest_managed.json
   [junit4]   2> 850570 INFO  (coreLoadExecutor-2540-thread-1-processing-n:127.0.0.1:40951_) [n:127.0.0.1:40951_ c:control_collection s:shard1 r:core_node1 x:collection1] o.a.s.r.ManagedResourceStorage Loaded null at path _rest_managed.json using ZooKeeperStorageIO:path=/configs/conf1
   [junit4]   2> 850570 INFO  (coreLoadExecutor-2540-thread-1-processing-n:127.0.0.1:40951_) [n:127.0.0.1:40951_ c:control_collection s:shard1 r:core_node1 x:collection1] o.a.s.r.RestManager Initializing 0 registered ManagedResources
   [junit4]   2> 850570 INFO  (coreLoadExecutor-2540-thread-1-processing-n:127.0.0.1:40951_) [n:127.0.0.1:40951_ c:control_collection s:shard1 r:core_node1 x:collection1] o.a.s.s.ZkIndexSchemaReader Creating ZooKeeper watch for the managed schema at /configs/conf1/managed-schema
   [junit4]   2> 850571 INFO  (coreLoadExecutor-2540-thread-1-processing-n:127.0.0.1:40951_) [n:127.0.0.1:40951_ c:control_collection s:shard1 r:core_node1 x:collection1] o.a.s.h.ReplicationHandler Commits will be reserved for  10000
   [junit4]   2> 850571 INFO  (coreLoadExecutor-2540-thread-1-processing-n:127.0.0.1:40951_) [n:127.0.0.1:40951_ c:control_collection s:shard1 r:core_node1 x:collection1] o.a.s.u.UpdateLog Looking up max value of version field to seed version buckets
   [junit4]   2> 850571 INFO  (searcherExecutor-2541-thread-1-processing-r:core_node1 s:shard1 x:collection1 c:control_collection n:127.0.0.1:40951_) [n:127.0.0.1:40951_ c:control_collection s:shard1 r:core_node1 x:collection1] o.a.s.c.SolrCore [collection1] Registered new searcher Searcher@36619c6e[collection1] main{ExitableDirectoryReader(UninvertingDirectoryReader())}
   [junit4]   2> 850571 INFO  (coreLoadExecutor-2540-thread-1-processing-n:127.0.0.1:40951_) [n:127.0.0.1:40951_ c:control_collection s:shard1 r:core_node1 x:collection1] o.a.s.u.VersionInfo Refreshing highest value of _version_ for 65536 version buckets from index
   [junit4]   2> 850571 INFO  (coreLoadExecutor-2540-thread-1-processing-n:127.0.0.1:40951_) [n:127.0.0.1:40951_ c:control_collection s:shard1 r:core_node1 x:collection1] o.a.s.u.VersionInfo No terms found for _version_, cannot seed version bucket highest value from index
   [junit4]   2> 850571 INFO  (coreLoadExecutor-2540-thread-1-processing-n:127.0.0.1:40951_) [n:127.0.0.1:40951_ c:control_collection s:shard1 r:core_node1 x:collection1] o.a.s.u.UpdateLog Could not find max version in index or recent updates, using new clock 1507903950251098112
   [junit4]   2> 850574 INFO  (coreLoadExecutor-2540-thread-1-processing-n:127.0.0.1:40951_) [n:127.0.0.1:40951_ c:control_collection s:shard1 r:core_node1 x:collection1] o.a.s.u.UpdateLog Took 3 ms to seed version buckets with highest version 1507903950251098112
   [junit4]   2> 850574 INFO  (coreLoadExecutor-2540-thread-1-processing-n:127.0.0.1:40951_) [n:127.0.0.1:40951_ c:control_collection s:shard1 r:core_node1 x:collection1] o.a.s.c.ZkController watch zkdir /configs/conf1
   [junit4]   2> 850575 INFO  (coreLoadExecutor-2540-thread-1-processing-n:127.0.0.1:40951_) [n:127.0.0.1:40951_ c:control_collection s:shard1 r:core_node1 x:collection1] o.a.s.c.CoreContainer registering core: collection1
   [junit4]   2> 850575 INFO  (coreZkRegister-2534-thread-1-processing-r:core_node1 s:shard1 x:collection1 c:control_collection n:127.0.0.1:40951_) [n:127.0.0.1:40951_ c:control_collection s:shard1 r:core_node1 x:collection1] o.a.s.c.ZkController Register replica - core:collection1 address:https://127.0.0.1:40951 collection:control_collection shard:shard1
   [junit4]   2> 850576 INFO  (coreZkRegister-2534-thread-1-processing-r:core_node1 s:shard1 x:collection1 c:control_collection n:127.0.0.1:40951_) [n:127.0.0.1:40951_ c:control_collection s:shard1 r:core_node1 x:collection1] o.a.s.c.c.SolrZkClient makePath: /collections/control_collection/leader_elect/shard1/election
   [junit4]   2> 850580 INFO  (coreZkRegister-2534-thread-1-processing-r:core_node1 s:shard1 x:collection1 c:control_collection n:127.0.0.1:40951_) [n:127.0.0.1:40951_ c:control_collection s:shard1 r:core_node1 x:collection1] o.a.s.c.LeaderElector Joined leadership election with path: /collections/control_collection/leader_elect/shard1/election/94243996755427332-core_node1-n_0000000000
   [junit4]   2> 850581 INFO  (coreZkRegister-2534-thread-1-processing-r:core_node1 s:shard1 x:collection1 c:control_collection n:127.0.0.1:40951_) [n:127.0.0.1:40951_ c:control_collection s:shard1 r:core_node1 x:collection1] o.a.s.c.ShardLeaderElectionContext Running the leader process for shard shard1
   [junit4]   2> 850582 INFO  (zkCallback-701-thread-1-processing-n:127.0.0.1:40951_) [n:127.0.0.1:40951_    ] o.a.s.c.DistributedQueue NodeChildrenChanged fired on path /overseer/queue state SyncConnected
   [junit4]   2> 850582 INFO  (coreZkRegister-2534-thread-1-processing-r:core_node1 s:shard1 x:collection1 c:control_collection n:127.0.0.1:40951_) [n:127.0.0.1:40951_ c:control_collection s:shard1 r:core_node1 x:collection1] o.a.s.c.ShardLeaderElectionContext Enough replicas found to continue.
   [junit4]   2> 850583 INFO  (coreZkRegister-2534-thread-1-processing-r:core_node1 s:shard1 x:collection1 c:control_collection n:127.0.0.1:40951_) [n:127.0.0.1:40951_ c:control_collection s:shard1 r:core_node1 x:collection1] o.a.s.c.ShardLeaderElectionContext I may be the new leader - try and sync
   [junit4]   2> 850583 INFO  (coreZkRegister-2534-thread-1-processing-r:core_node1 s:shard1 x:collection1 c:control_collection n:127.0.0.1:40951_) [n:127.0.0.1:40951_ c:control_collection s:shard1 r:core_node1 x:collection1] o.a.s.c.SyncStrategy Sync replicas to https://127.0.0.1:40951/collection1/
   [junit4]   2> 850583 INFO  (coreZkRegister-2534-thread-1-processing-r:core_node1 s:shard1 x:collection1 c:control_collection n:127.0.0.1:40951_) [n:127.0.0.1:40951_ c:control_collection s:shard1 r:core_node1 x:collection1] o.a.s.c.SyncStrategy Sync Success - now sync replicas to me
   [junit4]   2> 850583 INFO  (coreZkRegister-2534-thread-1-processing-r:core_node1 s:shard1 x:collection1 c:control_collection n:127.0.0.1:40951_) [n:127.0.0.1:40951_ c:control_collection s:shard1 r:core_node1 x:collection1] o.a.s.c.SyncStrategy https://127.0.0.1:40951/collection1/ has no replicas
   [junit4]   2> 850583 INFO  (coreZkRegister-2534-thread-1-processing-r:core_node1 s:shard1 x:collection1 c:control_collection n:127.0.0.1:40951_) [n:127.0.0.1:40951_ c:control_collection s:shard1 r:core_node1 x:collection1] o.a.s.c.ShardLeaderElectionContext I am the new leader: https://127.0.0.1:40951/collection1/ shard1
   [junit4]   2> 850583 INFO  (OverseerStateUpdate-94243996755427332-127.0.0.1:40951_-n_0000000000) [n:127.0.0.1:40951_    ] o.a.s.c.Overseer processMessage: queueSize: 1, message = {
   [junit4]   2>   "operation":"leader",
   [junit4]   2>   "shard":"shard1",
   [junit4]   2>   "collection":"control_collection"} current state version: 1
   [junit4]   2> 850583 INFO  (coreZkRegister-2534-thread-1-processing-r:core_node1 s:shard1 x:collection1 c:control_collection n:127.0.0.1:40951_) [n:127.0.0.1:40951_ c:control_collection s:shard1 r:core_node1 x:collection1] o.a.s.c.c.SolrZkClient makePath: /collections/control_collection/leaders/shard1
   [junit4]   2> 850590 INFO  (zkCallback-701-thread-1-processing-n:127.0.0.1:40951_) [n:127.0.0.1:40951_    ] o.a.s.c.DistributedQueue NodeChildrenChanged fired on path /overseer/queue state SyncConnected
   [junit4]   2> 850591 INFO  (OverseerStateUpdate-94243996755427332-127.0.0.1:40951_-n_0000000000) [n:127.0.0.1:40951_    ] o.a.s.c.Overseer processMessage: queueSize: 1, message = {
   [junit4]   2>   "operation":"leader",
   [junit4]   2>   "shard":"shard1",
   [junit4]   2>   "collection":"control_collection",
   [junit4]   2>   "base_url":"https://127.0.0.1:40951",
   [junit4]   2>   "core":"collection1",
   [junit4]   2>   "state":"active"} current state version: 1
   [junit4]   2> 850626 INFO  (TEST-TestCloudManagedSchemaConcurrent.test-seed#[5F4841A657CAAAF0]) [    ] o.a.s.c.c.SolrZkClient Using default ZkCredentialsProvider
   [junit4]   2> 850627 INFO  (TEST-TestCloudManagedSchemaConcurrent.test-seed#[5F4841A657CAAAF0]) [    ] o.a.s.c.c.ConnectionManager Waiting for client to connect to ZooKeeper
   [junit4]   2> 850628 INFO  (zkCallback-703-thread-1) [    ] o.a.s.c.c.ConnectionManager Watcher org.apache.solr.common.cloud.ConnectionManager@a461ca2 name:ZooKeeperConnection Watcher:127.0.0.1:59496/solr got event WatchedEvent state:SyncConnected type:None path:null path:null type:None
   [junit4]   2> 850629 INFO  (TEST-TestCloudManagedSchemaConcurrent.test-seed#[5F4841A657CAAAF0]) [    ] o.a.s.c.c.ConnectionManager Client is connected to ZooKeeper
   [junit4]   2> 850629 INFO  (TEST-TestCloudManagedSchemaConcurrent.test-seed#[5F4841A657CAAAF0]) [    ] o.a.s.c.c.SolrZkClient Using default ZkACLProvider
   [junit4]   2> 850629 INFO  (TEST-TestCloudManagedSchemaConcurrent.test-seed#[5F4841A657CAAAF0]) [    ] o.a.s.c.c.ZkStateReader Updating cluster state from ZooKeeper... 
   [junit4]   2> 850632 INFO  (TEST-TestCloudManagedSchemaConcurrent.test-seed#[5F4841A657CAAAF0]) [    ] o.a.s.c.ChaosMonkey monkey: init - expire sessions:false cause connection loss:false
   [junit4]   2> 850701 INFO  (zkCallback-701-thread-1-processing-n:127.0.0.1:40951_) [n:127.0.0.1:40951_    ] o.a.s.c.c.ZkStateReader A cluster state change: WatchedEvent state:SyncConnected type:NodeDataChanged path:/clusterstate.json, has occurred - updating... (live nodes size: 1)
   [junit4]   2> 850701 INFO  (zkCallback-703-thread-1) [    ] o.a.s.c.c.ZkStateReader A cluster state change: WatchedEvent state:SyncConnected type:NodeDataChanged path:/clusterstate.json, has occurred - updating... (live nodes size: 1)
   [junit4]   2> 850703 INFO  (zkCallback-701-thread-1-processing-n:127.0.0.1:40951_) [n:127.0.0.1:40951_    ] o.a.s.c.c.ZkStateReader Updated cluster state version to 2
   [junit4]   2> 850704 INFO  (zkCallback-703-thread-1) [    ] o.a.s.c.c.ZkStateReader Updated cluster state version to 2
   [junit4]   2> 850741 INFO  (coreZkRegister-2534-thread-1-processing-r:core_node1 s:shard1 x:collection1 c:control_collection n:127.0.0.1:40951_) [n:127.0.0.1:40951_ c:control_collection s:shard1 r:core_node1 x:collection1] o.a.s.c.ZkController We are https://127.0.0.1:40951/collection1/ and leader is https://127.0.0.1:40951/collection1/
   [junit4]   2> 850742 INFO  (coreZkRegister-2534-thread-1-processing-r:core_node1 s:shard1 x:collection1 c:control_collection n:127.0.0.1:40951_) [n:127.0.0.1:40951_ c:control_collection s:shard1 r:core_node1 x:collection1] o.a.s.c.ZkController No LogReplay needed for core=collection1 baseURL=https://127.0.0.1:40951
   [junit4]   2> 850742 INFO  (coreZkRegister-2534-thread-1-processing-r:core_node1 s:shard1 x:collection1 c:control_collection n:127.0.0.1:40951_) [n:127.0.0.1:40951_ c:control_collection s:shard1 r:core_node1 x:collection1] o.a.s.c.ZkController I am the leader, no recovery necessary
   [junit4]   2> 850742 INFO  (coreZkRegister-2534-thread-1-processing-r:core_node1 s:shard1 x:collection1 c:control_collection n:127.0.0.1:40951_) [n:127.0.0.1:40951_ c:control_collection s:shard1 r:core_node1 x:collection1] o.a.s.c.ZkController publishing state=active
   [junit4]   2> 850742 INFO  (coreZkRegister-2534-thread-1-processing-r:core_node1 s:shard1 x:collection1 c:control_collection n:127.0.0.1:40951_) [n:127.0.0.1:40951_ c:control_collection s:shard1 r:core_node1 x:collection1] o.a.s.c.ZkController numShards not found on descriptor - reading it from system property
   [junit4]   2> 850743 INFO  (zkCallback-701-thread-1-processing-n:127.0.0.1:40951_) [n:127.0.0.1:40951_    ] o.a.s.c.DistributedQueue NodeChildrenChanged fired on path /overseer/queue state SyncConnected
   [junit4]   2> 850744 INFO  (OverseerStateUpdate-94243996755427332-127.0.0.1:40951_-n_0000000000) [n:127.0.0.1:40951_    ] o.a.s.c.Overseer processMessage: queueSize: 1, message = {
   [junit4]   2>   "shard":"shard1",
   [junit4]   2>   "numShards":"4",
   [junit4]   2>   "core":"collection1",
   [junit4]   2>   "base_url":"https://127.0.0.1:40951",
   [junit4]   2>   "collection":"control_collection",
   [junit4]   2>   "node_name":"127.0.0.1:40951_",
   [junit4]   2>   "core_node_name":"core_node1",
   [junit4]   2>   "roles":null,
   [junit4]   2>   "state":"active",
   [junit4]   2>   "operation":"state"} current state version: 2
   [junit4]   2> 850746 INFO  (OverseerStateUpdate-94243996755427332-127.0.0.1:40951_-n_0000000000) [n:127.0.0.1:40951_    ] o.a.s.c.o.ReplicaMutator Update state numShards=4 message={
   [junit4]   2>   "shard":"shard1",
   [junit4]   2>   "numShards":"4",
   [junit4]   2>   "core":"collection1",
   [junit4]   2>   "base_url":"https://127.0.0.1:40951",
   [junit4]   2>   "collection":"control_collection",
   [junit4]   2>   "node_name":"127.0.0.1:40951_",
   [junit4]   2>   "core_node_name":"core_node1",
   [junit4]   2>   "roles":null,
   [junit4]   2>   "state":"active",
   [junit4]   2>   "operation":"state"}
   [junit4]   2> 850850 INFO  (zkCallback-703-thread-1) [    ] o.a.s.c.c.ZkStateReader A cluster state change: WatchedEvent state:SyncConnected type:NodeDataChanged path:/clusterstate.json, has occurred - updating... (live nodes size: 1)
   [junit4]   2> 850850 INFO  (zkCallback-701-thread-1-processing-n:127.0.0.1:40951_) [n:127.0.0.1:40951_    ] o.a.s.c.c.ZkStateReader A cluster state change: WatchedEvent state:SyncConnected type:NodeDataChanged path:/clusterstate.json, has occurred - updating... (live nodes size: 1)
   [junit4]   2> 850851 INFO  (zkCallback-703-thread-1) [    ] o.a.s.c.c.ZkStateReader Updated cluster state version to 3
   [junit4]   2> 850851 INFO  (zkCallback-701-thread-1-processing-n:127.0.0.1:40951_) [n:127.0.0.1:40951_    ] o.a.s.c.c.ZkStateReader Updated cluster state version to 3
   [junit4]   2> 850930 INFO  (TEST-TestCloudManagedSchemaConcurrent.test-seed#[5F4841A657CAAAF0]) [    ] o.a.s.SolrTestCaseJ4 Writing core.properties file to /x1/jenkins/jenkins-slave/workspace/Lucene-Solr-Tests-5.x-Java7/solr/build/solr-core/test/J0/temp/solr.schema.TestCloudManagedSchemaConcurrent_5F4841A657CAAAF0-001/shard-1-001/cores/collection1
   [junit4]   2> 850930 INFO  (TEST-TestCloudManagedSchemaConcurrent.test-seed#[5F4841A657CAAAF0]) [    ] o.a.s.c.AbstractFullDistribZkTestBase create jetty 1 in directory /x1/jenkins/jenkins-slave/workspace/Lucene-Solr-Tests-5.x-Java7/solr/build/solr-core/test/J0/temp/solr.schema.TestCloudManagedSchemaConcurrent_5F4841A657CAAAF0-001/shard-1-001
   [junit4]   2> 850931 INFO  (TEST-TestCloudManagedSchemaConcurrent.test-seed#[5F4841A657CAAAF0]) [    ] o.e.j.s.Server jetty-9.2.11.v20150529
   [junit4]   2> 850933 INFO  (TEST-TestCloudManagedSchemaConcurrent.test-seed#[5F4841A657CAAAF0]) [    ] o.e.j.s.h.ContextHandler Started o.e.j.s.ServletContextHandler@47d38c4d{/,null,AVAILABLE}
   [junit4]   2> 850936 INFO  (TEST-TestCloudManagedSchemaConcurrent.test-seed#[5F4841A657CAAAF0]) [    ] o.e.j.s.ServerConnector Started ServerConnector@2dc12ec8{SSL-http/1.1}{127.0.0.1:47079}
   [junit4]   2> 850936 INFO  (TEST-TestCloudManagedSchemaConcurrent.test-seed#[5F4841A657CAAAF0]) [    ] o.e.j.s.Server Started @854041ms
   [junit4]   2> 850936 INFO  (TEST-TestCloudManagedSchemaConcurrent.test-seed#[5F4841A657CAAAF0]) [    ] o.a.s.c.s.e.JettySolrRunner Jetty properties: {solrconfig=solrconfig.xml, hostPort=47079, hostContext=/, solr.data.dir=/x1/jenkins/jenkins-slave/workspace/Lucene-Solr-Tests-5.x-Java7/solr/build/solr-core/test/J0/temp/solr.schema.TestCloudManagedSchemaConcurrent_5F4841A657CAAAF0-001/tempDir-001/jetty1, coreRootDirectory=/x1/jenkins/jenkins-slave/workspace/Lucene-Solr-Tests-5.x-Java7/solr/build/solr-core/test/J0/../../../../../../../../../../x1/jenkins/jenkins-slave/workspace/Lucene-Solr-Tests-5.x-Java7/solr/build/solr-core/test/J0/temp/solr.schema.TestCloudManagedSchemaConcurrent_5F4841A657CAAAF0-001/shard-1-001/cores}
   [junit4]   2> 850938 INFO  (TEST-TestCloudManagedSchemaConcurrent.test-seed#[5F4841A657CAAAF0]) [    ] o.a.s.s.SolrDispatchFilter SolrDispatchFilter.init(): sun.misc.Launcher$AppClassLoader@1fe91485
   [junit4]   2> 850938 INFO  (TEST-TestCloudManagedSchemaConcurrent.test-seed#[5F4841A657CAAAF0]) [    ] o.a.s.c.SolrResourceLoader new SolrResourceLoader for directory: '/x1/jenkins/jenkins-slave/workspace/Lucene-Solr-Tests-5.x-Java7/solr/build/solr-core/test/J0/../../../../../../../../../../x1/jenkins/jenkins-slave/workspace/Lucene-Solr-Tests-5.x-Java7/solr/build/solr-core/test/J0/temp/solr.schema.TestCloudManagedSchemaConcurrent_5F4841A657CAAAF0-001/shard-1-001/'
   [junit4]   2> 850954 INFO  (TEST-TestCloudManagedSchemaConcurrent.test-seed#[5F4841A657CAAAF0]) [    ] o.a.s.c.SolrXmlConfig Loading container configuration from /x1/jenkins/jenkins-slave/workspace/Lucene-Solr-Tests-5.x-Java7/solr/build/solr-core/test/J0/../../../../../../../../../../x1/jenkins/jenkins-slave/workspace/Lucene-Solr-Tests-5.x-Java7/solr/build/solr-core/test/J0/temp/solr.schema.TestCloudManagedSchemaConcurrent_5F4841A657CAAAF0-001/shard-1-001/solr.xml
   [junit4]   2> 850968 INFO  (TEST-TestCloudManagedSchemaConcurrent.test-seed#[5F4841A657CAAAF0]) [    ] o.a.s.c.CoresLocator Config-defined core root directory: /x1/jenkins/jenkins-slave/workspace/Lucene-Solr-Tests-5.x-Java7/solr/build/solr-core/test/J0/../../../../../../../../../../x1/jenkins/jenkins-slave/workspace/Lucene-Solr-Tests-5.x-Java7/solr/build/solr-core/test/J0/temp/solr.schema.TestCloudManagedSchemaConcurrent_5F4841A657CAAAF0-001/shard-1-001/cores
   [junit4]   2> 850968 INFO  (TEST-TestCloudManagedSchemaConcurrent.test-seed#[5F4841A657CAAAF0]) [    ] o.a.s.c.CoreContainer New CoreContainer 788333729
   [junit4]   2> 850968 INFO  (TEST-TestCloudManagedSchemaConcurrent.test-seed#[5F4841A657CAAAF0]) [    ] o.a.s.c.CoreContainer Loading cores into CoreContainer [instanceDir=/x1/jenkins/jenkins-slave/workspace/Lucene-Solr-Tests-5.x-Java7/solr/build/solr-core/test/J0/../../../../../../../../../../x1/jenkins/jenkins-slave/workspace/Lucene-Solr-Tests-5.x-Java7/solr/build/solr-core/test/J0/temp/solr.schema.TestCloudManagedSchemaConcurrent_5F4841A657CAAAF0-001/shard-1-001/]
   [junit4]   2> 850968 INFO  (TEST-TestCloudManagedSchemaConcurrent.test-seed#[5F4841A657CAAAF0]) [    ] o.a.s.c.CoreContainer loading shared library: /x1/jenkins/jenkins-slave/workspace/Lucene-Solr-Tests-5.x-Java7/solr/build/solr-core/test/J0/../../../../../../../../../../x1/jenkins/jenkins-slave/workspace/Lucene-Solr-Tests-5.x-Java7/solr/build/solr-core/test/J0/temp/solr.schema.TestCloudManagedSchemaConcurrent_5F4841A657CAAAF0-001/shard-1-001/lib
   [junit4]   2> 850969 WARN  (TEST-TestCloudManagedSchemaConcurrent.test-seed#[5F4841A657CAAAF0]) [    ] o.a.s.c.SolrResourceLoader Can't find (or read) directory to add to classloader: lib (resolved as: /x1/jenkins/jenkins-slave/workspace/Lucene-Solr-Tests-5.x-Java7/solr/build/solr-core/test/J0/../../../../../../../../../../x1/jenkins/jenkins-slave/workspace/Lucene-Solr-Tests-5.x-Java7/solr/build/solr-core/test/J0/temp/solr.schema.TestCloudManagedSchemaConcurrent_5F4841A657CAAAF0-001/shard-1-001/lib).
   [junit4]   2> 850977 INFO  (TEST-TestCloudManagedSchemaConcurrent.test-seed#[5F4841A657CAAAF0]) [    ] o.a.s.h.c.HttpShardHandlerFactory created with socketTimeout : 90000,urlScheme : ,connTimeout : 15000,maxConnectionsPerHost : 20,maxConnections : 10000,corePoolSize : 0,maximumPoolSize : 2147483647,maxThreadIdleTime : 5,sizeOfQueue : -1,fairnessPolicy : false,useRetries : false,
   [junit4]   2> 850979 INFO  (TEST-TestCloudManagedSchemaConcurrent.test-seed#[5F4841A657CAAAF0]) [    ] o.a.s.u.UpdateShardHandler Creating UpdateShardHandler HTTP client with params: socketTimeout=340000&connTimeout=45000&retry=true
   [junit4]   2> 850981 INFO  (TEST-TestCloudManagedSchemaConcurrent.test-seed#[5F4841A657CAAAF0]) [    ] o.a.s.l.LogWatcher SLF4J impl is org.slf4j.impl.Log4jLoggerFactory
   [junit4]   2> 850981 INFO  (TEST-TestCloudManagedSchemaConcurrent.test-seed#[5F4841A657CAAAF0]) [    ] o.a.s.l.LogWatcher Registering Log Listener [Log4j (org.slf4j.impl.Log4jLoggerFactory)]
   [junit4]   2> 850981 INFO  (TEST-TestCloudManagedSchemaConcurrent.test-seed#[5F4841A657CAAAF0]) [    ] o.a.s.c.ZkContainer Zookeeper client=127.0.0.1:59496/solr
   [junit4]   2> 850981 INFO  (TEST-TestCloudManagedSchemaConcurrent.test-seed#[5F4841A657CAAAF0]) [    ] o.a.s.c.ZkController zkHost includes chroot
   [junit4]   2> 850981 INFO  (TEST-TestCloudManagedSchemaConcurrent.test-seed#[5F4841A657CAAAF0]) [    ] o.a.s.c.c.SolrZkClient Using default ZkCredentialsProvider
   [junit4]   2> 850982 INFO  (TEST-TestCloudManagedSchemaConcurrent.test-seed#[5F4841A657CAAAF0]) [    ] o.a.s.c.c.ConnectionManager Waiting for client to connect to ZooKeeper
   [junit4]   2> 850983 INFO  (zkCallback-705-thread-1) [    ] o.a.s.c.c.ConnectionManager Watcher org.apache.solr.common.cloud.ConnectionManager@1a5a300f name:ZooKeeperConnection Watcher:127.0.0.1:59496 got event WatchedEvent state:SyncConnected type:None path:null path:null type:None
   [junit4]   2> 850983 INFO  (TEST-TestCloudManagedSchemaConcurrent.test-seed#[5F4841A657CAAAF0]) [    ] o.a.s.c.c.ConnectionManager Client is connected to ZooKeeper
   [junit4]   2> 850984 INFO  (TEST-TestCloudManagedSchemaConcurrent.test-seed#[5F4841A657CAAAF0]) [    ] o.a.s.c.c.SolrZkClient Using default ZkACLProvider
   [junit4]   2> 850985 INFO  (TEST-TestCloudManagedSchemaConcurrent.test-seed#[5F4841A657CAAAF0]) [n:127.0.0.1:47079_    ] o.a.s.c.c.ConnectionManager Waiting for client to connect to ZooKeeper
   [junit4]   2> 850987 INFO  (zkCallback-706-thread-1-processing-n:127.0.0.1:47079_) [n:127.0.0.1:47079_    ] o.a.s.c.c.ConnectionManager Watcher org.apache.solr.common.cloud.ConnectionManager@20c2f59 name:ZooKeeperConnection Watcher:127.0.0.1:59496/solr got event WatchedEvent state:SyncConnected type:None path:null path:null type:None
   [junit4]   2> 850987 INFO  (TEST-TestCloudManagedSchemaConcurrent.test-seed#[5F4841A657CAAAF0]) [n:127.0.0.1:47079_    ] o.a.s.c.c.ConnectionManager Client is connected to ZooKeeper
   [junit4]   2> 850991 INFO  (TEST-TestCloudManagedSchemaConcurrent.test-seed#[5F4841A657CAAAF0]) [n:127.0.0.1:47079_    ] o.a.s.c.c.ZkStateReader Updating cluster state from ZooKeeper... 
   [junit4]   2> 851995 INFO  (TEST-TestCloudManagedSchemaConcurrent.test-seed#[5F4841A657CAAAF0]) [n:127.0.0.1:47079_    ] o.a.s.c.ZkController Register node as live in ZooKeeper:/live_nodes/127.0.0.1:47079_
   [junit4]   2> 851996 INFO  (TEST-TestCloudManagedSchemaConcurrent.test-seed#[5F4841A657CAAAF0]) [n:127.0.0.1:47079_    ] o.a.s.c.c.SolrZkClient makePath: /live_nodes/127.0.0.1:47079_
   [junit4]   2> 851999 INFO  (TEST-TestCloudManagedSchemaConcurrent.test-seed#[5F4841A657CAAAF0]) [n:127.0.0.1:47079_    ] o.a.s.c.Overseer Overseer (id=null) closing
   [junit4]   2> 852000 INFO  (TEST-TestCloudManagedSchemaConcurrent.test-seed#[5F4841A657CAAAF0]) [n:127.0.0.1:47079_    ] o.a.s.c.LeaderElector Joined leadership election with path: /overseer_elect/election/94243996755427335-127.0.0.1:47079_-n_0000000001
   [junit4]   2> 852000 INFO  (TEST-TestCloudManagedSchemaConcurrent.test-seed#[5F4841A657CAAAF0]) [n:127.0.0.1:47079_    ] o.a.s.c.LeaderElector Watching path /overseer_elect/election/94243996755427332-127.0.0.1:40951_-n_0000000000 to know if I could be the leader
   [junit4]   2> 852001 INFO  (TEST-TestCloudManagedSchemaConcurrent.test-seed#[5F4841A657CAAAF0]) [n:127.0.0.1:47079_    ] o.a.s.c.CoreContainer No authentication plugin used.
   [junit4]   2> 852001 INFO  (TEST-TestCloudManagedSchemaConcurrent.test-seed#[5F4841A657CAAAF0]) [n:127.0.0.1:47079_    ] o.a.s.c.CoreContainer Security conf doesn't exist. Skipping setup for authorization module.
   [junit4]   2> 852002 INFO  (TEST-TestCloudManagedSchemaConcurrent.test-seed#[5F4841A657CAAAF0]) [n:127.0.0.1:47079_    ] o.a.s.c.CoresLocator Looking for core definitions underneath /x1/jenkins/jenkins-slave/workspace/Lucene-Solr-Tests-5.x-Java7/solr/build/solr-core/test/J0/../../../../../../../../../../x1/jenkins/jenkins-slave/workspace/Lucene-Solr-Tests-5.x-Java7/solr/build/solr-core/test/J0/temp/solr.schema.TestCloudManagedSchemaConcurrent_5F4841A657CAAAF0-001/shard-1-001/cores
   [junit4]   2> 852003 INFO  (TEST-TestCloudManagedSchemaConcurrent.test-seed#[5F4841A657CAAAF0]) [n:127.0.0.1:47079_    ] o.a.s.c.SolrCore Created CoreDescriptor: {coreNodeName=, dataDir=data/, absoluteInstDir=/x1/jenkins/jenkins-slave/workspace/Lucene-Solr-Tests-5.x-Java7/solr/build/solr-core/test/J0/../../../../../../../../../../x1/jenkins/jenkins-slave/workspace/Lucene-Solr-Tests-5.x-Java7/solr/build/solr-core/test/J0/temp/solr.schema.TestCloudManagedSchemaConcurrent_5F4841A657CAAAF0-001/shard-1-001/cores/collection1/, name=collection1, collection=collection1, configSetProperties=configsetprops.json, schema=schema.xml, instanceDir=/x1/jenkins/jenkins-slave/workspace/Lucene-Solr-Tests-5.x-Java7/solr/build/solr-core/test/J0/../../../../../../../../../../x1/jenkins/jenkins-slave/workspace/Lucene-Solr-Tests-5.x-Java7/solr/build/solr-core/test/J0/temp/solr.schema.TestCloudManagedSchemaConcurrent_5F4841A657CAAAF0-001/shard-1-001/cores/collection1, loadOnStartup=true, transient=false, shard=, config=solrconfig.xml}
   [junit4]   2> 852003 INFO  (TEST-TestCloudManagedSchemaConcurrent.test-seed#[5F4841A657CAAAF0]) [n:127.0.0.1:47079_    ] o.a.s.c.CoresLocator Found core collection1 in /x1/jenkins/jenkins-slave/workspace/Lucene-Solr-Tests-5.x-Java7/solr/build/solr-core/test/J0/../../../../../../../../../../x1/jenkins/jenkins-slave/workspace/Lucene-Solr-Tests-5.x-Java7/solr/build/solr-core/test/J0/temp/solr.schema.TestCloudManagedSchemaConcurrent_5F4841A657CAAAF0-001/shard-1-001/cores/collection1/
   [junit4]   2> 852004 INFO  (TEST-TestCloudManagedSchemaConcurrent.test-seed#[5F4841A657CAAAF0]) [n:127.0.0.1:47079_    ] o.a.s.c.CoresLocator Found 1 core definitions
   [junit4]   2> 852004 INFO  (TEST-TestCloudManagedSchemaConcurrent.test-seed#[5F4841A657CAAAF0]) [n:127.0.0.1:47079_    ] o.a.s.s.SolrDispatchFilter user.dir=/x1/jenkins/jenkins-slave/workspace/Lucene-Solr-Tests-5.x-Java7/solr/build/solr-core/test/J0
   [junit4]   2> 852005 INFO  (coreLoadExecutor-2551-thread-1-processing-n:127.0.0.1:47079_) [n:127.0.0.1:47079_ c:collection1   x:collection1] o.a.s.c.ZkController publishing state=down
   [junit4]   2> 852005 INFO  (coreLoadExecutor-2551-thread-1-processing-n:127.0.0.1:47079_) [n:127.0.0.1:47079_ c:collection1   x:collection1] o.a.s.c.ZkController numShards not found on descriptor - reading it from system property
   [junit4]   2> 852005 INFO  (TEST-TestCloudManagedSchemaConcurrent.test-seed#[5F4841A657CAAAF0]) [n:127.0.0.1:47079_    ] o.a.s.s.SolrDispatchFilter SolrDispatchFilter.init() done
   [junit4]   2> 852006 INFO  (zkCallback-701-thread-1-processing-n:127.0.0.1:40951_) [n:127.0.0.1:40951_    ] o.a.s.c.DistributedQueue NodeChildrenChanged fired on path /overseer/queue state SyncConnected
   [junit4]   2> 852006 INFO  (coreLoadExecutor-2551-thread-1-processing-n:127.0.0.1:47079_) [n:127.0.0.1:47079_ c:collection1   x:collection1] o.a.s.c.ZkController look for our core node name
   [junit4]   2> 852006 INFO  (OverseerStateUpdate-94243996755427332-127.0.0.1:40951_-n_0000000000) [n:127.0.0.1:40951_    ] o.a.s.c.Overseer processMessage: queueSize: 1, message = {
   [junit4]   2>   "shard":null,
   [junit4]   2>   "numShards":"4",
   [junit4]   2>   "core":"collection1",
   [junit4]   2>   "base_url":"https://127.0.0.1:47079",
   [junit4]   2>   "collection":"collection1",
   [junit4]   2>   "node_name":"127.0.0.1:47079_",
   [junit4]   2>   "roles":null,
   [junit4]   2>   "state":"down",
   [junit4]   2>   "operation":"state"} current state version: 3
   [junit4]   2> 852007 INFO  (OverseerStateUpdate-94243996755427332-127.0.0.1:40951_-n_0000000000) [n:127.0.0.1:40951_    ] o.a.s.c.o.ReplicaMutator Update state numShards=4 message={
   [junit4]   2>   "shard":null,
   [junit4]   2>   "numShards":"4",
   [junit4]   2>   "core":"collection1",
   [junit4]   2>   "base_url":"https://127.0.0.1:47079",
   [junit4]   2>   "collection":"collection1",
   [junit4]   2>   "node_name":"127.0.0.1:47079_",
   [junit4]   2>   "roles":null,
   [junit4]   2>   "state":"down",
   [junit4]   2>   "operation":"state"}
   [junit4]   2> 852007 INFO  (OverseerStateUpdate-94243996755427332-127.0.0.1:40951_-n_0000000000) [n:127.0.0.1:40951_    ] o.a.s.c.o.ClusterStateMutator building a new cName: collection1
   [junit4]   2> 852007 INFO  (OverseerStateUpdate-94243996755427332-127.0.0.1:40951_-n_0000000000) [n:127.0.0.1:40951_    ] o.a.s.c.o.ReplicaMutator Assigning new node to shard shard=shard3
   [junit4]   2> 852110 INFO  (zkCallback-703-thread-1) [    ] o.a.s.c.c.ZkStateReader A cluster state change: WatchedEvent state:SyncConnected type:NodeDataChanged path:/clusterstate.json, has occurred - updating... (live nodes size: 2)
   [junit4]   2> 852110 INFO  (zkCallback-701-thread-1-processing-n:127.0.0.1:40951_) [n:127.0.0.1:40951_    ] o.a.s.c.c.ZkStateReader A cluster state change: WatchedEvent state:SyncConnected type:NodeDataChanged path:/clusterstate.json, has occurred - updating... (live nodes size: 2)
   [junit4]   2> 852110 INFO  (zkCallback-706-thread-1-processing-n:127.0.0.1:47079_) [n:127.0.0.1:47079_    ] o.a.s.c.c.ZkStateReader A cluster state change: WatchedEvent state:SyncConnected type:NodeDataChanged path:/clusterstate.json, has occurred - updating... (live nodes size: 2)
   [junit4]   2> 852112 INFO  (zkCallback-703-thread-1) [    ] o.a.s.c.c.ZkStateReader Updated cluster state version to 4
   [junit4]   2> 852112 INFO  (zkCallback-706-thread-1-processing-n:127.0.0.1:47079_) [n:127.0.0.1:47079_    ] o.a.s.c.c.ZkStateReader Updated cluster state version to 4
   [junit4]   2> 852112 INFO  (zkCallback-701-thread-1-processing-n:127.0.0.1:40951_) [n:127.0.0.1:40951_    ] o.a.s.c.c.ZkStateReader Updated cluster state version to 4
   [junit4]   2> 853007 INFO  (coreLoadExecutor-2551-thread-1-processing-n:127.0.0.1:47079_) [n:127.0.0.1:47079_ c:collection1   x:collection1] o.a.s.c.ZkController waiting to find shard id in clusterstate for collection1
   [junit4]   2> 853007 INFO  (coreLoadExecutor-2551-thread-1-processing-n:127.0.0.1:47079_) [n:127.0.0.1:47079_ c:collection1   x:collection1] o.a.s.c.ZkController Check for collection zkNode:collection1
   [junit4]   2> 853007 INFO  (coreLoadExecutor-2551-thread-1-processing-n:127.0.0.1:47079_) [n:127.0.0.1:47079_ c:collection1   x:collection1] o.a.s.c.ZkController Collection zkNode exists
   [junit4]   2> 853008 INFO  (coreLoadExecutor-2551-thread-1-processing-n:127.0.0.1:47079_) [n:127.0.0.1:47079_ c:collection1   x:collection1] o.a.s.c.c.ZkStateReader Load collection config from:/collections/collection1
   [junit4]   2> 853008 INFO  (coreLoadExecutor-2551-thread-1-processing-n:127.0.0.1:47079_) [n:127.0.0.1:47079_ c:collection1   x:collection1] o.a.s.c.c.ZkStateReader path=/collections/collection1 configName=conf1 specified config exists in ZooKeeper
   [junit4]   2> 853008 INFO  (coreLoadExecutor-2551-thread-1-processing-n:127.0.0.1:47079_) [n:127.0.0.1:47079_ c:collection1   x:collection1] o.a.s.c.SolrResourceLoader new SolrResourceLoader for directory: '/x1/jenkins/jenkins-slave/workspace/Lucene-Solr-Tests-5.x-Java7/solr/build/solr-core/test/J0/../../../../../../../../../../x1/jenkins/jenkins-slave/workspace/Lucene-Solr-Tests-5.x-Java7/solr/build/solr-core/test/J0/temp/solr.schema.TestCloudManagedSchemaConcurrent_5F4841A657CAAAF0-001/shard-1-001/cores/collection1/'
   [junit4]   2> 853022 INFO  (coreLoadExecutor-2551-thread-1-processing-n:127.0.0.1:47079_) [n:127.0.0.1:47079_ c:collection1   x:collection1] o.a.s.c.Config loaded config solrconfig.xml with version 0 
   [junit4]   2> 853027 INFO  (coreLoadExecutor-2551-thread-1-processing-n:127.0.0.1:47079_) [n:127.0.0.1:47079_ c:collection1   x:collection1] o.a.s.c.SolrConfig current version of requestparams : -1
   [junit4]   2> 853039 INFO  (coreLoadExecutor-2551-thread-1-processing-n:127.0.0.1:47079_) [n:127.0.0.1:47079_ c:collection1   x:collection1] o.a.s.c.SolrConfig Using Lucene MatchVersion: 5.3.0
   [junit4]   2> 853064 INFO  (coreLoadExecutor-2551-thread-1-processing-n:127.0.0.1:47079_) [n:127.0.0.1:47079_ c:collection1   x:collection1] o.a.s.c.Config Loaded SolrConfig: solrconfig.xml
   [junit4]   2> 853065 INFO  (coreLoadExecutor-2551-thread-1-processing-n:127.0.0.1:47079_) [n:127.0.0.1:47079_ c:collection1   x:collection1] o.a.s.s.IndexSchema Reading Solr Schema from /configs/conf1/managed-schema
   [junit4]   2> 853071 INFO  (coreLoadExecutor-2551-thread-1-processing-n:127.0.0.1:47079_) [n:127.0.0.1:47079_ c:collection1   x:collection1] o.a.s.s.IndexSchema [collection1] Schema name=test
   [junit4]   2> 853316 INFO  (coreLoadExecutor-2551-thread-1-processing-n:127.0.0.1:47079_) [n:127.0.0.1:47079_ c:collection1   x:collection1] o.a.s.s.OpenExchangeRatesOrgProvider Initialized with rates=open-exchange-rates.json, refreshInterval=1440.
   [junit4]   2> 853323 INFO  (coreLoadExecutor-2551-thread-1-processing-n:127.0.0.1:47079_) [n:127.0.0.1:47079_ c:collection1   x:collection1] o.a.s.s.IndexSchema default search field in schema is text
   [junit4]   2> 853325 INFO  (coreLoadExecutor-2551-thread-1-processing-n:127.0.0.1:47079_) [n:127.0.0.1:47079_ c:collection1   x:collection1] o.a.s.s.IndexSchema unique key field: id
   [junit4]   2> 853335 INFO  (coreLoadExecutor-2551-thread-1-processing-n:127.0.0.1:47079_) [n:127.0.0.1:47079_ c:collection1   x:collection1] o.a.s.s.FileExchangeRateProvider Reloading exchange rates from file currency.xml
   [junit4]   2> 853337 INFO  (coreLoadExecutor-2551-thread-1-processing-n:127.0.0.1:47079_) [n:127.0.0.1:47079_ c:collection1   x:collection1] o.a.s.s.FileExchangeRateProvider Reloading exchange rates from file currency.xml
   [junit4]   2> 853344 INFO  (coreLoadExecutor-2551-thread-1-processing-n:127.0.0.1:47079_) [n:127.0.0.1:47079_ c:collection1   x:collection1] o.a.s.s.OpenExchangeRatesOrgProvider Reloading exchange rates from open-exchange-rates.json
   [junit4]   2> 853344 WARN  (coreLoadExecutor-2551-thread-1-processing-n:127.0.0.1:47079_) [n:127.0.0.1:47079_ c:collection1   x:collection1] o.a.s.s.OpenExchangeRatesOrgProvider Unknown key IMPORTANT NOTE
   [junit4]   2> 853345 WARN  (coreLoadExecutor-2551-thread-1-processing-n:127.0.0.1:47079_) [n:127.0.0.1:47079_ c:collection1   x:collection1] o.a.s.s.OpenExchangeRatesOrgProvider Expected key, got STRING
   [junit4]   2> 853345 INFO  (coreLoadExecutor-2551-thread-1-processing-n:127.0.0.1:47079_) [n:127.0.0.1:47079_ c:collection1   x:collection1] o.a.s.s.OpenExchangeRatesOrgProvider Reloading exchange rates from open-exchange-rates.json
   [junit4]   2> 853345 WARN  (coreLoadExecutor-2551-thread-1-processing-n:127.0.0.1:47079_) [n:127.0.0.1:47079_ c:collection1   x:collection1] o.a.s.s.OpenExchangeRatesOrgProvider Unknown key IMPORTANT NOTE
   [junit4]   2> 853345 WARN  (coreLoadExecutor-2551-thread-1-processing-n:127.0.0.1:47079_) [n:127.0.0.1:47079_ c:collection1   x:collection1] o.a.s.s.OpenExchangeRatesOrgProvider Expected key, got STRING
   [junit4]   2> 853348 INFO  (coreLoadExecutor-2551-thread-1-processing-n:127.0.0.1:47079_) [n:127.0.0.1:47079_ c:collection1   x:collection1] o.a.s.c.ConfigSetProperties Did not find ConfigSet properties, assuming default properties: Can't find resource 'configsetprops.json' in classpath or '/configs/conf1', cwd=/x1/jenkins/jenkins-slave/workspace/Lucene-Solr-Tests-5.x-Java7/solr/build/solr-core/test/J0
   [junit4]   2> 853348 INFO  (coreLoadExecutor-2551-thread-1-processing-n:127.0.0.1:47079_) [n:127.0.0.1:47079_ c:collection1   x:collection1] o.a.s.c.CoreContainer Creating SolrCore 'collection1' using configuration from collection collection1
   [junit4]   2> 853348 INFO  (coreLoadExecutor-2551-thread-1-processing-n:127.0.0.1:47079_) [n:127.0.0.1:47079_ c:collection1 s:shard3 r:core_node1 x:collection1] o.a.s.c.SolrCore solr.NRTCachingDirectoryFactory
   [junit4]   2> 853349 INFO  (coreLoadExecutor-2551-thread-1-processing-n:127.0.0.1:47079_) [n:127.0.0.1:47079_ c:collection1 s:shard3 r:core_node1 x:collection1] o.a.s.c.SolrCore [[collection1] ] Opening new SolrCore at [/x1/jenkins/jenkins-slave/workspace/Lucene-Solr-Tests-5.x-Java7/solr/build/solr-core/test/J0/../../../../../../../../../../x1/jenkins/jenkins-slave/workspace/Lucene-Solr-Tests-5.x-Java7/solr/build/solr-core/test/J0/temp/solr.schema.TestCloudManagedSchemaConcurrent_5F4841A657CAAAF0-001/shard-1-001/cores/collection1/], dataDir=[null]
   [junit4]   2> 853349 INFO  (coreLoadExecutor-2551-thread-1-processing-n:127.0.0.1:47079_) [n:127.0.0.1:47079_ c:collection1 s:shard3 r:core_node1 x:collection1] o.a.s.c.SolrCore JMX monitoring not detected for core: collection1
   [junit4]   2> 853349 INFO  (coreLoadExecutor-2551-thread-1-processing-n:127.0.0.1:47079_) [n:127.0.0.1:47079_ c:collection1 s:shard3 r:core_node1 x:collection1] o.a.s.c.CachingDirectoryFactory return new directory for /x1/jenkins/jenkins-slave/workspace/Lucene-Solr-Tests-5.x-Java7/solr/build/solr-core/test/J0/temp/solr.schema.TestCloudManagedSchemaConcurrent_5F4841A657CAAAF0-001/shard-1-001/cores/collection1/data
   [junit4]   2> 853350 INFO  (coreLoadExecutor-2551-thread-1-processing-n:127.0.0.1:47079_) [n:127.0.0.1:47079_ c:collection1 s:shard3 r:core_node1 x:collection1] o.a.s.c.SolrCore New index directory detected: old=null new=/x1/jenkins/jenkins-slave/workspace/Lucene-Solr-Tests-5.x-Java7/solr/build/solr-core/test/J0/temp/solr.schema.TestCloudManagedSchemaConcurrent_5F4841A657CAAAF0-001/shard-1-001/cores/collection1/data/index/
   [junit4]   2> 853350 WARN  (coreLoadExecutor-2551-thread-1-processing-n:127.0.0.1:47079_) [n:127.0.0.1:47079_ c:collection1 s:shard3 r:core_node1 x:collection1] o.a.s.c.SolrCore [collection1] Solr index directory '/x1/jenkins/jenkins-slave/workspace/Lucene-Solr-Tests-5.x-Java7/solr/build/solr-core/test/J0/temp/solr.schema.TestCloudManagedSchemaConcurrent_5F4841A657CAAAF0-001/shard-1-001/cores/collection1/data/index' doesn't exist. Creating new index...
   [junit4]   2> 853350 INFO  (coreLoadExecutor-2551-thread-1-processing-n:127.0.0.1:47079_) [n:127.0.0.1:47079_ c:collection1 s:shard3 r:core_node1 x:collection1] o.a.s.c.CachingDirectoryFactory return new directory for /x1/jenkins/jenkins-slave/workspace/Lucene-Solr-Tests-5.x-Java7/solr/build/solr-core/test/J0/temp/solr.schema.TestCloudManagedSchemaConcurrent_5F4841A657CAAAF0-001/shard-1-001/cores/collection1/data/index
   [junit4]   2> 853351 INFO  (coreLoadExecutor-2551-thread-1-processing-n:127.0.0.1:47079_) [n:127.0.0.1:47079_ c:collection1 s:shard3 r:core_node1 x:collection1] o.a.s.u.RandomMergePolicy RandomMergePolicy wrapping class org.apache.lucene.index.TieredMergePolicy: [TieredMergePolicy: maxMergeAtOnce=34, maxMergeAtOnceExplicit=49, maxMergedSegmentMB=46.841796875, floorSegmentMB=0.2734375, forceMergeDeletesPctAllowed=12.66018454847548, segmentsPerTier=45.0, maxCFSSegmentSizeMB=8.796093022207999E12, noCFSRatio=0.7262694029607902
   [junit4]   2> 853355 INFO  (coreLoadExecutor-2551-thread-1-processing-n:127.0.0.1:47079_) [n:127.0.0.1:47079_ c:collection1 s:shard3 r:core_node1 x:collection1] o.a.s.c.SolrCore SolrDeletionPolicy.onCommit: commits: num=1
   [junit4]   2> 	commit{dir=NRTCachingDirectory(MMapDirectory@/x1/jenkins/jenkins-slave/workspace/Lucene-Solr-Tests-5.x-Java7/solr/build/solr-core/test/J0/temp/solr.schema.TestCloudManagedSchemaConcurrent_5F4841A657CAAAF0-001/shard-1-001/cores/collection1/data/index lockFactory=org.apache.lucene.store.SingleInstanceLockFactory@7fcf3e7; maxCacheMB=48.0 maxMergeSizeMB=4.0),segFN=segments_1,generation=1}
   [junit4]   2> 853355 INFO  (coreLoadExecutor-2551-thread-1-processing-n:127.0.0.1:47079_) [n:127.0.0.1:47079_ c:collection1 s:shard3 r:core_node1 x:collection1] o.a.s.c.SolrCore newest commit generation = 1
   [junit4]   2> 853356 INFO  (OldIndexDirectoryCleanupThreadForCore-collection1) [n:127.0.0.1:47079_ c:collection1 s:shard3 r:core_node1 x:collection1] o.a.s.c.SolrCore Looking for old index directories to cleanup for core collection1 in /x1/jenkins/jenkins-slave/workspace/Lucene-Solr-Tests-5.x-Java7/solr/build/solr-core/test/J0/temp/solr.schema.TestCloudManagedSchemaConcurrent_5F4841A657CAAAF0-001/shard-1-001/cores/collection1/data/
   [junit4]   2> 853357 INFO  (coreLoadExecutor-2551-thread-1-processing-n:127.0.0.1:47079_) [n:127.0.0.1:47079_ c:collection1 s:shard3 r:core_node1 x:collection1] o.a.s.c.SolrCore no updateRequestProcessorChain defined as default, creating implicit default
   [junit4]   2> 853358 WARN  (coreLoadExecutor-2551-thread-1-processing-n:127.0.0.1:47079_) [n:127.0.0.1:47079_ c:collection1 s:shard3 r:core_node1 x:collection1] o.a.s.c.RequestHandlers INVALID paramSet a in requestHandler {type = requestHandler,name = /dump,class = DumpRequestHandler,args = {defaults={a=A,b=B}}}
   [junit4]   2> 853361 INFO  (coreLoadExecutor-2551-thread-1-processing-n:127.0.0.1:47079_) [n:127.0.0.1:47079_ c:collection1 s:shard3 r:core_node1 x:collection1] o.a.s.h.l.XMLLoader xsltCacheLifetimeSeconds=60
   [junit4]   2> 853362 INFO  (coreLoadExecutor-2551-thread-1-processing-n:127.0.0.1:47079_) [n:127.0.0.1:47079_ c:collection1 s:shard3 r:core_node1 x:collection1] o.a.s.h.l.XMLLoader xsltCacheLifetimeSeconds=60
   [junit4]   2> 853363 INFO  (coreLoadExecutor-2551-thread-1-processing-n:127.0.0.1:47079_) [n:127.0.0.1:47079_ c:collection1 s:shard3 r:core_node1 x:collection1] o.a.s.h.l.XMLLoader xsltCacheLifetimeSeconds=60
   [junit4]   2> 853364 INFO  (coreLoadExecutor-2551-thread-1-processing-n:127.0.0.1:47079_) [n:127.0.0.1:47079_ c:collection1 s:shard3 r:core_node1 x:collection1] o.a.s.h.l.XMLLoader xsltCacheLifetimeSeconds=60
   [junit4]   2> 853366 INFO  (coreLoadExecutor-2551-thread-1-processing-n:127.0.0.1:47079_) [n:127.0.0.1:47079_ c:collection1 s:shard3 r:core_node1 x:collection1] o.a.s.c.RequestHandlers Registered paths: /replication,/dump,/update/json,/admin/luke,/admin/ping,/admin/system,/admin/properties,/admin/segments,/update/csv,/schema,/get,/admin/logging,/admin/file,/update,standard,/admin/mbeans,/config,/update/json/docs,/admin/threads,/admin/plugins
   [junit4]   2> 853367 INFO  (coreLoadExecutor-2551-thread-1-processing-n:127.0.0.1:47079_) [n:127.0.0.1:47079_ c:collection1 s:shard3 r:core_node1 x:collection1] o.a.s.c.SolrCore Using default statsCache cache: org.apache.solr.search.stats.LocalStatsCache
   [junit4]   2> 853368 INFO  (coreLoadExecutor-2551-thread-1-processing-n:127.0.0.1:47079_) [n:127.0.0.1:47079_ c:collection1 s:shard3 r:core_node1 x:collection1] o.a.s.u.UpdateHandler Using UpdateLog implementation: org.apache.solr.update.UpdateLog
   [junit4]   2> 853368 INFO  (coreLoadExecutor-2551-thread-1-processing-n:127.0.0.1:47079_) [n:127.0.0.1:47079_ c:collection1 s:shard3 r:core_node1 x:collection1] o.a.s.u.UpdateLog Initializing UpdateLog: dataDir= defaultSyncLevel=FLUSH numRecordsToKeep=100 maxNumLogsToKeep=10 numVersionBuckets=65536
   [junit4]   2> 853368 INFO  (coreLoadExecutor-2551-thread-1-processing-n:127.0.0.1:47079_) [n:127.0.0.1:47079_ c:collection1 s:shard3 r:core_node1 x:collection1] o.a.s.c.SolrCore Hard AutoCommit: disabled
   [junit4]   2> 853368 INFO  (coreLoadExecutor-2551-thread-1-processing-n:127.0.0.1:47079_) [n:127.0.0.1:47079_ c:collection1 s:shard3 r:core_node1 x:collection1] o.a.s.c.SolrCore Soft AutoCommit: disabled
   [junit4]   2> 853369 INFO  (coreLoadExecutor-2551-thread-1-processing-n:127.0.0.1:47079_) [n:127.0.0.1:47079_ c:collection1 s:shard3 r:core_node1 x:collection1] o.a.s.u.RandomMergePolicy RandomMergePolicy wrapping class org.apache.lucene.index.TieredMergePolicy: [TieredMergePolicy: maxMergeAtOnce=17, maxMergeAtOnceExplicit=50, maxMergedSegmentMB=95.21875, floorSegmentMB=0.7880859375, forceMergeDeletesPctAllowed=25.793465386267666, segmentsPerTier=11.0, maxCFSSegmentSizeMB=8.796093022207999E12, noCFSRatio=0.6234196133069113
   [junit4]   2> 853370 INFO  (coreLoadExecutor-2551-thread-1-processing-n:127.0.0.1:47079_) [n:127.0.0.1:47079_ c:collection1 s

[...truncated too long message...]

.thread.QueuedThreadPool.runJob(QueuedThreadPool.java:635)
   [junit4]   2>         at org.eclipse.jetty.util.thread.QueuedThreadPool$3.run(QueuedThreadPool.java:555)
   [junit4]   2>         at java.lang.Thread.run(Thread.java:745)
   [junit4]   2>   43) Thread[id=5792, name=Scheduler-1176460891, state=WAITING, group=TGRP-TestCloudManagedSchemaConcurrent]
   [junit4]   2>         at sun.misc.Unsafe.park(Native Method)
   [junit4]   2>         at java.util.concurrent.locks.LockSupport.park(LockSupport.java:186)
   [junit4]   2>         at java.util.concurrent.locks.AbstractQueuedSynchronizer$ConditionObject.await(AbstractQueuedSynchronizer.java:2043)
   [junit4]   2>         at java.util.concurrent.ScheduledThreadPoolExecutor$DelayedWorkQueue.take(ScheduledThreadPoolExecutor.java:1079)
   [junit4]   2>         at java.util.concurrent.ScheduledThreadPoolExecutor$DelayedWorkQueue.take(ScheduledThreadPoolExecutor.java:807)
   [junit4]   2>         at java.util.concurrent.ThreadPoolExecutor.getTask(ThreadPoolExecutor.java:1068)
   [junit4]   2>         at java.util.concurrent.ThreadPoolExecutor.runWorker(ThreadPoolExecutor.java:1130)
   [junit4]   2>         at java.util.concurrent.ThreadPoolExecutor$Worker.run(ThreadPoolExecutor.java:615)
   [junit4]   2>         at java.lang.Thread.run(Thread.java:745)
   [junit4]   2>   44) Thread[id=5802, name=Scheduler-429611867, state=WAITING, group=TGRP-TestCloudManagedSchemaConcurrent]
   [junit4]   2>         at sun.misc.Unsafe.park(Native Method)
   [junit4]   2>         at java.util.concurrent.locks.LockSupport.park(LockSupport.java:186)
   [junit4]   2>         at java.util.concurrent.locks.AbstractQueuedSynchronizer$ConditionObject.await(AbstractQueuedSynchronizer.java:2043)
   [junit4]   2>         at java.util.concurrent.ScheduledThreadPoolExecutor$DelayedWorkQueue.take(ScheduledThreadPoolExecutor.java:1079)
   [junit4]   2>         at java.util.concurrent.ScheduledThreadPoolExecutor$DelayedWorkQueue.take(ScheduledThreadPoolExecutor.java:807)
   [junit4]   2>         at java.util.concurrent.ThreadPoolExecutor.getTask(ThreadPoolExecutor.java:1068)
   [junit4]   2>         at java.util.concurrent.ThreadPoolExecutor.runWorker(ThreadPoolExecutor.java:1130)
   [junit4]   2>         at java.util.concurrent.ThreadPoolExecutor$Worker.run(ThreadPoolExecutor.java:615)
   [junit4]   2>         at java.lang.Thread.run(Thread.java:745)
   [junit4]   2>   45) Thread[id=5745, name=Scheduler-1208500528, state=TIMED_WAITING, group=TGRP-TestCloudManagedSchemaConcurrent]
   [junit4]   2>         at sun.misc.Unsafe.park(Native Method)
   [junit4]   2>         at java.util.concurrent.locks.LockSupport.parkNanos(LockSupport.java:226)
   [junit4]   2>         at java.util.concurrent.locks.AbstractQueuedSynchronizer$ConditionObject.awaitNanos(AbstractQueuedSynchronizer.java:2082)
   [junit4]   2>         at java.util.concurrent.ScheduledThreadPoolExecutor$DelayedWorkQueue.take(ScheduledThreadPoolExecutor.java:1090)
   [junit4]   2>         at java.util.concurrent.ScheduledThreadPoolExecutor$DelayedWorkQueue.take(ScheduledThreadPoolExecutor.java:807)
   [junit4]   2>         at java.util.concurrent.ThreadPoolExecutor.getTask(ThreadPoolExecutor.java:1068)
   [junit4]   2>         at java.util.concurrent.ThreadPoolExecutor.runWorker(ThreadPoolExecutor.java:1130)
   [junit4]   2>         at java.util.concurrent.ThreadPoolExecutor$Worker.run(ThreadPoolExecutor.java:615)
   [junit4]   2>         at java.lang.Thread.run(Thread.java:745)
   [junit4]   2>   46) Thread[id=5800, name=Scheduler-1136343959, state=WAITING, group=TGRP-TestCloudManagedSchemaConcurrent]
   [junit4]   2>         at sun.misc.Unsafe.park(Native Method)
   [junit4]   2>         at java.util.concurrent.locks.LockSupport.park(LockSupport.java:186)
   [junit4]   2>         at java.util.concurrent.locks.AbstractQueuedSynchronizer$ConditionObject.await(AbstractQueuedSynchronizer.java:2043)
   [junit4]   2>         at java.util.concurrent.ScheduledThreadPoolExecutor$DelayedWorkQueue.take(ScheduledThreadPoolExecutor.java:1079)
   [junit4]   2>         at java.util.concurrent.ScheduledThreadPoolExecutor$DelayedWorkQueue.take(ScheduledThreadPoolExecutor.java:807)
   [junit4]   2>         at java.util.concurrent.ThreadPoolExecutor.getTask(ThreadPoolExecutor.java:1068)
   [junit4]   2>         at java.util.concurrent.ThreadPoolExecutor.runWorker(ThreadPoolExecutor.java:1130)
   [junit4]   2>         at java.util.concurrent.ThreadPoolExecutor$Worker.run(ThreadPoolExecutor.java:615)
   [junit4]   2>         at java.lang.Thread.run(Thread.java:745)
   [junit4]   2>   47) Thread[id=5717, name=Scheduler-761241316, state=TIMED_WAITING, group=TGRP-TestCloudManagedSchemaConcurrent]
   [junit4]   2>         at sun.misc.Unsafe.park(Native Method)
   [junit4]   2>         at java.util.concurrent.locks.LockSupport.parkNanos(LockSupport.java:226)
   [junit4]   2>         at java.util.concurrent.locks.AbstractQueuedSynchronizer$ConditionObject.awaitNanos(AbstractQueuedSynchronizer.java:2082)
   [junit4]   2>         at java.util.concurrent.ScheduledThreadPoolExecutor$DelayedWorkQueue.take(ScheduledThreadPoolExecutor.java:1090)
   [junit4]   2>         at java.util.concurrent.ScheduledThreadPoolExecutor$DelayedWorkQueue.take(ScheduledThreadPoolExecutor.java:807)
   [junit4]   2>         at java.util.concurrent.ThreadPoolExecutor.getTask(ThreadPoolExecutor.java:1068)
   [junit4]   2>         at java.util.concurrent.ThreadPoolExecutor.runWorker(ThreadPoolExecutor.java:1130)
   [junit4]   2>         at java.util.concurrent.ThreadPoolExecutor$Worker.run(ThreadPoolExecutor.java:615)
   [junit4]   2>         at java.lang.Thread.run(Thread.java:745)
   [junit4]   2> NOTE: test params are: codec=Asserting(Lucene53): {}, docValues:{}, sim=DefaultSimilarity, locale=ar_JO, timezone=Navajo
   [junit4]   2> NOTE: Linux 3.13.0-52-generic amd64/Oracle Corporation 1.7.0_72 (64-bit)/cpus=4,threads=85,free=275660544,total=525860864
   [junit4]   2> NOTE: All tests run in this JVM: [TestConfig, DistributedSuggestComponentTest, HdfsBasicDistributedZkTest, TestUpdate, TestBinaryField, PeerSyncTest, BigEndianAscendingWordSerializerTest, TestStandardQParsers, MBeansHandlerTest, TestSweetSpotSimilarityFactory, TestDistributedSearch, TestJmxMonitoredMap, HighlighterConfigTest, ClusterStateTest, TestPhraseSuggestions, TestRandomFaceting, DistribDocExpirationUpdateProcessorTest, HdfsLockFactoryTest, TestCSVLoader, TestIBSimilarityFactory, IndexSchemaTest, PingRequestHandlerTest, TestLazyCores, PrimitiveFieldTypeTest, TestOrdValues, TestMissingGroups, RollingRestartTest, JavabinLoaderTest, RulesTest, TestIndexingPerformance, TestReRankQParserPlugin, TestSerializedLuceneMatchVersion, SolrIndexConfigTest, TestFunctionQuery, AnalyticsQueryTest, DistributedSpellCheckComponentTest, TestRemoteStreaming, DeleteLastCustomShardedReplicaTest, TestObjectReleaseTracker, SignatureUpdateProcessorFactoryTest, TestNRTOpen, SolrCloudExampleTest, TestShardHandlerFactory, TestNamedUpdateProcessors, TestManagedResource, TestStressLucene, AnalysisErrorHandlingTest, TestCustomSort, TestPostingsSolrHighlighter, HighlighterTest, TestMiniSolrCloudCluster, TestEmbeddedSolrServerConstructors, MultiTermTest, TestAnalyzeInfixSuggestions, DocValuesMissingTest, TestReversedWildcardFilterFactory, DistribCursorPagingTest, UUIDFieldTest, SchemaVersionSpecificBehaviorTest, DefaultValueUpdateProcessorTest, TestJmxIntegration, DebugComponentTest, TestSortingResponseWriter, URLClassifyProcessorTest, TestCustomDocTransformer, TestManagedSchemaFieldResource, TestCollationFieldDocValues, DateFieldTest, SolrCoreTest, SuggesterFSTTest, TestImplicitCoreProperties, TestRebalanceLeaders, FastVectorHighlighterTest, SyncSliceTest, TestSolrDeletionPolicy1, TestUniqueKeyFieldResource, TermsComponentTest, DistributedFacetPivotLargeTest, DistributedFacetPivotSmallAdvancedTest, TestCloudManagedSchemaConcurrent]
   [junit4]   2> NOTE: reproduce with: ant test  -Dtestcase=TestCloudManagedSchemaConcurrent -Dtests.seed=5F4841A657CAAAF0 -Dtests.multiplier=2 -Dtests.slow=true -Dtests.locale=ar_JO -Dtests.timezone=Navajo -Dtests.asserts=true -Dtests.file.encoding=UTF-8
   [junit4] ERROR   0.00s J0 | TestCloudManagedSchemaConcurrent (suite) <<<
   [junit4]    > Throwable #1: java.lang.Exception: Suite timeout exceeded (>= 7200000 msec).
   [junit4]    > 	at __randomizedtesting.SeedInfo.seed([5F4841A657CAAAF0]:0)
   [junit4] Completed [517/518] on J0 in 7224.44s, 1 test, 2 errors <<< FAILURES!

[...truncated 15 lines...]
BUILD FAILED
/x1/jenkins/jenkins-slave/workspace/Lucene-Solr-Tests-5.x-Java7/build.xml:727: The following error occurred while executing this line:
/x1/jenkins/jenkins-slave/workspace/Lucene-Solr-Tests-5.x-Java7/build.xml:671: The following error occurred while executing this line:
/x1/jenkins/jenkins-slave/workspace/Lucene-Solr-Tests-5.x-Java7/build.xml:59: The following error occurred while executing this line:
/x1/jenkins/jenkins-slave/workspace/Lucene-Solr-Tests-5.x-Java7/solr/build.xml:227: The following error occurred while executing this line:
/x1/jenkins/jenkins-slave/workspace/Lucene-Solr-Tests-5.x-Java7/solr/common-build.xml:516: The following error occurred while executing this line:
/x1/jenkins/jenkins-slave/workspace/Lucene-Solr-Tests-5.x-Java7/lucene/common-build.xml:1447: The following error occurred while executing this line:
/x1/jenkins/jenkins-slave/workspace/Lucene-Solr-Tests-5.x-Java7/lucene/common-build.xml:1002: There were test failures: 518 suites, 2055 tests, 1 suite-level error, 1 error, 62 ignored (26 assumptions)

Total time: 161 minutes 44 seconds
Build step 'Invoke Ant' marked build as failure
Archiving artifacts
Sending artifact delta relative to Lucene-Solr-Tests-5.x-Java7 #3379
Archived 4 artifacts
Archive block size is 32768
Received 0 blocks and 855462848 bytes
Compression is 0.0%
Took 2 min 16 sec
Recording test results
Email was triggered for: Failure
Sending email for trigger: Failure



Mime
View raw message