lucene-dev mailing list archives

Site index · List index
Message view « Date » · « Thread »
Top « Date » · « Thread »
From Apache Jenkins Server <jenk...@builds.apache.org>
Subject [JENKINS] Lucene-Solr-NightlyTests-5.x - Build # 892 - Still Failing
Date Sat, 04 Jul 2015 17:53:03 GMT
Build: https://builds.apache.org/job/Lucene-Solr-NightlyTests-5.x/892/

6 tests failed.
FAILED:  junit.framework.TestSuite.org.apache.solr.cloud.SolrCloudExampleTest

Error Message:
ERROR: SolrIndexSearcher opens=28 closes=27

Stack Trace:
java.lang.AssertionError: ERROR: SolrIndexSearcher opens=28 closes=27
	at __randomizedtesting.SeedInfo.seed([CF40E7B32033B482]:0)
	at org.junit.Assert.fail(Assert.java:93)
	at org.apache.solr.SolrTestCaseJ4.endTrackingSearchers(SolrTestCaseJ4.java:472)
	at org.apache.solr.SolrTestCaseJ4.afterClass(SolrTestCaseJ4.java:232)
	at sun.reflect.GeneratedMethodAccessor37.invoke(Unknown Source)
	at sun.reflect.DelegatingMethodAccessorImpl.invoke(DelegatingMethodAccessorImpl.java:43)
	at java.lang.reflect.Method.invoke(Method.java:606)
	at com.carrotsearch.randomizedtesting.RandomizedRunner.invoke(RandomizedRunner.java:1627)
	at com.carrotsearch.randomizedtesting.RandomizedRunner$5.evaluate(RandomizedRunner.java:799)
	at com.carrotsearch.randomizedtesting.rules.StatementAdapter.evaluate(StatementAdapter.java:36)
	at com.carrotsearch.randomizedtesting.rules.SystemPropertiesRestoreRule$1.evaluate(SystemPropertiesRestoreRule.java:57)
	at org.apache.lucene.util.AbstractBeforeAfterRule$1.evaluate(AbstractBeforeAfterRule.java:46)
	at com.carrotsearch.randomizedtesting.rules.StatementAdapter.evaluate(StatementAdapter.java:36)
	at org.apache.lucene.util.TestRuleStoreClassName$1.evaluate(TestRuleStoreClassName.java:42)
	at com.carrotsearch.randomizedtesting.rules.NoShadowingOrOverridesOnMethodsRule$1.evaluate(NoShadowingOrOverridesOnMethodsRule.java:39)
	at com.carrotsearch.randomizedtesting.rules.NoShadowingOrOverridesOnMethodsRule$1.evaluate(NoShadowingOrOverridesOnMethodsRule.java:39)
	at com.carrotsearch.randomizedtesting.rules.StatementAdapter.evaluate(StatementAdapter.java:36)
	at com.carrotsearch.randomizedtesting.rules.StatementAdapter.evaluate(StatementAdapter.java:36)
	at com.carrotsearch.randomizedtesting.rules.StatementAdapter.evaluate(StatementAdapter.java:36)
	at org.apache.lucene.util.TestRuleAssertionsRequired$1.evaluate(TestRuleAssertionsRequired.java:54)
	at org.apache.lucene.util.TestRuleMarkFailure$1.evaluate(TestRuleMarkFailure.java:48)
	at org.apache.lucene.util.TestRuleIgnoreAfterMaxFailures$1.evaluate(TestRuleIgnoreAfterMaxFailures.java:65)
	at org.apache.lucene.util.TestRuleIgnoreTestSuites$1.evaluate(TestRuleIgnoreTestSuites.java:55)
	at com.carrotsearch.randomizedtesting.rules.StatementAdapter.evaluate(StatementAdapter.java:36)
	at com.carrotsearch.randomizedtesting.ThreadLeakControl$StatementRunner.run(ThreadLeakControl.java:365)
	at java.lang.Thread.run(Thread.java:745)


FAILED:  junit.framework.TestSuite.org.apache.solr.cloud.SolrCloudExampleTest

Error Message:
1 thread leaked from SUITE scope at org.apache.solr.cloud.SolrCloudExampleTest:     1) Thread[id=60284, name=searcherExecutor-4762-thread-1, state=WAITING, group=TGRP-SolrCloudExampleTest]         at sun.misc.Unsafe.park(Native Method)         at java.util.concurrent.locks.LockSupport.park(LockSupport.java:186)         at java.util.concurrent.locks.AbstractQueuedSynchronizer$ConditionObject.await(AbstractQueuedSynchronizer.java:2043)         at java.util.concurrent.LinkedBlockingQueue.take(LinkedBlockingQueue.java:442)         at java.util.concurrent.ThreadPoolExecutor.getTask(ThreadPoolExecutor.java:1068)         at java.util.concurrent.ThreadPoolExecutor.runWorker(ThreadPoolExecutor.java:1130)         at java.util.concurrent.ThreadPoolExecutor$Worker.run(ThreadPoolExecutor.java:615)         at java.lang.Thread.run(Thread.java:745)

Stack Trace:
com.carrotsearch.randomizedtesting.ThreadLeakError: 1 thread leaked from SUITE scope at org.apache.solr.cloud.SolrCloudExampleTest: 
   1) Thread[id=60284, name=searcherExecutor-4762-thread-1, state=WAITING, group=TGRP-SolrCloudExampleTest]
        at sun.misc.Unsafe.park(Native Method)
        at java.util.concurrent.locks.LockSupport.park(LockSupport.java:186)
        at java.util.concurrent.locks.AbstractQueuedSynchronizer$ConditionObject.await(AbstractQueuedSynchronizer.java:2043)
        at java.util.concurrent.LinkedBlockingQueue.take(LinkedBlockingQueue.java:442)
        at java.util.concurrent.ThreadPoolExecutor.getTask(ThreadPoolExecutor.java:1068)
        at java.util.concurrent.ThreadPoolExecutor.runWorker(ThreadPoolExecutor.java:1130)
        at java.util.concurrent.ThreadPoolExecutor$Worker.run(ThreadPoolExecutor.java:615)
        at java.lang.Thread.run(Thread.java:745)
	at __randomizedtesting.SeedInfo.seed([CF40E7B32033B482]:0)


FAILED:  junit.framework.TestSuite.org.apache.solr.cloud.SolrCloudExampleTest

Error Message:
There are still zombie threads that couldn't be terminated:    1) Thread[id=60284, name=searcherExecutor-4762-thread-1, state=WAITING, group=TGRP-SolrCloudExampleTest]         at sun.misc.Unsafe.park(Native Method)         at java.util.concurrent.locks.LockSupport.park(LockSupport.java:186)         at java.util.concurrent.locks.AbstractQueuedSynchronizer$ConditionObject.await(AbstractQueuedSynchronizer.java:2043)         at java.util.concurrent.LinkedBlockingQueue.take(LinkedBlockingQueue.java:442)         at java.util.concurrent.ThreadPoolExecutor.getTask(ThreadPoolExecutor.java:1068)         at java.util.concurrent.ThreadPoolExecutor.runWorker(ThreadPoolExecutor.java:1130)         at java.util.concurrent.ThreadPoolExecutor$Worker.run(ThreadPoolExecutor.java:615)         at java.lang.Thread.run(Thread.java:745)

Stack Trace:
com.carrotsearch.randomizedtesting.ThreadLeakError: There are still zombie threads that couldn't be terminated:
   1) Thread[id=60284, name=searcherExecutor-4762-thread-1, state=WAITING, group=TGRP-SolrCloudExampleTest]
        at sun.misc.Unsafe.park(Native Method)
        at java.util.concurrent.locks.LockSupport.park(LockSupport.java:186)
        at java.util.concurrent.locks.AbstractQueuedSynchronizer$ConditionObject.await(AbstractQueuedSynchronizer.java:2043)
        at java.util.concurrent.LinkedBlockingQueue.take(LinkedBlockingQueue.java:442)
        at java.util.concurrent.ThreadPoolExecutor.getTask(ThreadPoolExecutor.java:1068)
        at java.util.concurrent.ThreadPoolExecutor.runWorker(ThreadPoolExecutor.java:1130)
        at java.util.concurrent.ThreadPoolExecutor$Worker.run(ThreadPoolExecutor.java:615)
        at java.lang.Thread.run(Thread.java:745)
	at __randomizedtesting.SeedInfo.seed([CF40E7B32033B482]:0)


FAILED:  junit.framework.TestSuite.org.apache.solr.cloud.ChaosMonkeyNothingIsSafeTest

Error Message:
ERROR: SolrIndexSearcher opens=44 closes=43

Stack Trace:
java.lang.AssertionError: ERROR: SolrIndexSearcher opens=44 closes=43
	at __randomizedtesting.SeedInfo.seed([CF40E7B32033B482]:0)
	at org.junit.Assert.fail(Assert.java:93)
	at org.apache.solr.SolrTestCaseJ4.endTrackingSearchers(SolrTestCaseJ4.java:472)
	at org.apache.solr.SolrTestCaseJ4.afterClass(SolrTestCaseJ4.java:232)
	at sun.reflect.GeneratedMethodAccessor39.invoke(Unknown Source)
	at sun.reflect.DelegatingMethodAccessorImpl.invoke(DelegatingMethodAccessorImpl.java:43)
	at java.lang.reflect.Method.invoke(Method.java:606)
	at com.carrotsearch.randomizedtesting.RandomizedRunner.invoke(RandomizedRunner.java:1627)
	at com.carrotsearch.randomizedtesting.RandomizedRunner$5.evaluate(RandomizedRunner.java:799)
	at com.carrotsearch.randomizedtesting.rules.StatementAdapter.evaluate(StatementAdapter.java:36)
	at com.carrotsearch.randomizedtesting.rules.SystemPropertiesRestoreRule$1.evaluate(SystemPropertiesRestoreRule.java:57)
	at org.apache.lucene.util.AbstractBeforeAfterRule$1.evaluate(AbstractBeforeAfterRule.java:46)
	at com.carrotsearch.randomizedtesting.rules.StatementAdapter.evaluate(StatementAdapter.java:36)
	at org.apache.lucene.util.TestRuleStoreClassName$1.evaluate(TestRuleStoreClassName.java:42)
	at com.carrotsearch.randomizedtesting.rules.NoShadowingOrOverridesOnMethodsRule$1.evaluate(NoShadowingOrOverridesOnMethodsRule.java:39)
	at com.carrotsearch.randomizedtesting.rules.NoShadowingOrOverridesOnMethodsRule$1.evaluate(NoShadowingOrOverridesOnMethodsRule.java:39)
	at com.carrotsearch.randomizedtesting.rules.StatementAdapter.evaluate(StatementAdapter.java:36)
	at com.carrotsearch.randomizedtesting.rules.StatementAdapter.evaluate(StatementAdapter.java:36)
	at com.carrotsearch.randomizedtesting.rules.StatementAdapter.evaluate(StatementAdapter.java:36)
	at org.apache.lucene.util.TestRuleAssertionsRequired$1.evaluate(TestRuleAssertionsRequired.java:54)
	at org.apache.lucene.util.TestRuleMarkFailure$1.evaluate(TestRuleMarkFailure.java:48)
	at org.apache.lucene.util.TestRuleIgnoreAfterMaxFailures$1.evaluate(TestRuleIgnoreAfterMaxFailures.java:65)
	at org.apache.lucene.util.TestRuleIgnoreTestSuites$1.evaluate(TestRuleIgnoreTestSuites.java:55)
	at com.carrotsearch.randomizedtesting.rules.StatementAdapter.evaluate(StatementAdapter.java:36)
	at com.carrotsearch.randomizedtesting.ThreadLeakControl$StatementRunner.run(ThreadLeakControl.java:365)
	at java.lang.Thread.run(Thread.java:745)


FAILED:  junit.framework.TestSuite.org.apache.solr.cloud.ChaosMonkeyNothingIsSafeTest

Error Message:
2 threads leaked from SUITE scope at org.apache.solr.cloud.ChaosMonkeyNothingIsSafeTest:     1) Thread[id=1266, name=qtp1868655190-1266, state=WAITING, group=TGRP-ChaosMonkeyNothingIsSafeTest]         at java.lang.Object.wait(Native Method)         at java.lang.Object.wait(Object.java:503)         at org.apache.solr.client.solrj.impl.ConcurrentUpdateSolrClient.blockUntilFinished(ConcurrentUpdateSolrClient.java:404)         at org.apache.solr.update.StreamingSolrClients.blockUntilFinished(StreamingSolrClients.java:103)         at org.apache.solr.update.SolrCmdDistributor.blockAndDoRetries(SolrCmdDistributor.java:231)         at org.apache.solr.update.SolrCmdDistributor.finish(SolrCmdDistributor.java:89)         at org.apache.solr.update.processor.DistributedUpdateProcessor.doFinish(DistributedUpdateProcessor.java:782)         at org.apache.solr.update.processor.DistributedUpdateProcessor.finish(DistributedUpdateProcessor.java:1649)         at org.apache.solr.update.processor.LogUpdateProcessor.finish(LogUpdateProcessorFactory.java:183)         at org.apache.solr.handler.ContentStreamHandlerBase.handleRequestBody(ContentStreamHandlerBase.java:83)         at org.apache.solr.handler.RequestHandlerBase.handleRequest(RequestHandlerBase.java:143)         at org.apache.solr.core.SolrCore.execute(SolrCore.java:2058)         at org.apache.solr.servlet.HttpSolrCall.execute(HttpSolrCall.java:648)         at org.apache.solr.servlet.HttpSolrCall.call(HttpSolrCall.java:452)         at org.apache.solr.servlet.SolrDispatchFilter.doFilter(SolrDispatchFilter.java:227)         at org.apache.solr.servlet.SolrDispatchFilter.doFilter(SolrDispatchFilter.java:196)         at org.eclipse.jetty.servlet.ServletHandler$CachedChain.doFilter(ServletHandler.java:1652)         at org.apache.solr.client.solrj.embedded.JettySolrRunner$DebugFilter.doFilter(JettySolrRunner.java:106)         at org.eclipse.jetty.servlet.ServletHandler$CachedChain.doFilter(ServletHandler.java:1652)         at org.eclipse.jetty.servlets.UserAgentFilter.doFilter(UserAgentFilter.java:83)         at org.eclipse.jetty.servlets.GzipFilter.doFilter(GzipFilter.java:300)         at org.eclipse.jetty.servlet.ServletHandler$CachedChain.doFilter(ServletHandler.java:1652)         at org.eclipse.jetty.servlet.ServletHandler.doHandle(ServletHandler.java:585)         at org.eclipse.jetty.server.session.SessionHandler.doHandle(SessionHandler.java:221)         at org.eclipse.jetty.server.handler.ContextHandler.doHandle(ContextHandler.java:1127)         at org.eclipse.jetty.servlet.ServletHandler.doScope(ServletHandler.java:515)         at org.eclipse.jetty.server.session.SessionHandler.doScope(SessionHandler.java:185)         at org.eclipse.jetty.server.handler.ContextHandler.doScope(ContextHandler.java:1061)         at org.eclipse.jetty.server.handler.ScopedHandler.handle(ScopedHandler.java:141)         at org.eclipse.jetty.server.handler.HandlerWrapper.handle(HandlerWrapper.java:97)         at org.eclipse.jetty.server.Server.handle(Server.java:499)         at org.eclipse.jetty.server.HttpChannel.handle(HttpChannel.java:310)         at org.eclipse.jetty.server.HttpConnection.onFillable(HttpConnection.java:257)         at org.eclipse.jetty.io.AbstractConnection$2.run(AbstractConnection.java:540)         at org.eclipse.jetty.util.thread.QueuedThreadPool.runJob(QueuedThreadPool.java:635)         at org.eclipse.jetty.util.thread.QueuedThreadPool$3.run(QueuedThreadPool.java:555)         at java.lang.Thread.run(Thread.java:745)    2) Thread[id=1280, name=searcherExecutor-548-thread-1, state=WAITING, group=TGRP-ChaosMonkeyNothingIsSafeTest]         at sun.misc.Unsafe.park(Native Method)         at java.util.concurrent.locks.LockSupport.park(LockSupport.java:186)         at java.util.concurrent.locks.AbstractQueuedSynchronizer$ConditionObject.await(AbstractQueuedSynchronizer.java:2043)         at java.util.concurrent.LinkedBlockingQueue.take(LinkedBlockingQueue.java:442)         at java.util.concurrent.ThreadPoolExecutor.getTask(ThreadPoolExecutor.java:1068)         at java.util.concurrent.ThreadPoolExecutor.runWorker(ThreadPoolExecutor.java:1130)         at java.util.concurrent.ThreadPoolExecutor$Worker.run(ThreadPoolExecutor.java:615)         at java.lang.Thread.run(Thread.java:745)

Stack Trace:
com.carrotsearch.randomizedtesting.ThreadLeakError: 2 threads leaked from SUITE scope at org.apache.solr.cloud.ChaosMonkeyNothingIsSafeTest: 
   1) Thread[id=1266, name=qtp1868655190-1266, state=WAITING, group=TGRP-ChaosMonkeyNothingIsSafeTest]
        at java.lang.Object.wait(Native Method)
        at java.lang.Object.wait(Object.java:503)
        at org.apache.solr.client.solrj.impl.ConcurrentUpdateSolrClient.blockUntilFinished(ConcurrentUpdateSolrClient.java:404)
        at org.apache.solr.update.StreamingSolrClients.blockUntilFinished(StreamingSolrClients.java:103)
        at org.apache.solr.update.SolrCmdDistributor.blockAndDoRetries(SolrCmdDistributor.java:231)
        at org.apache.solr.update.SolrCmdDistributor.finish(SolrCmdDistributor.java:89)
        at org.apache.solr.update.processor.DistributedUpdateProcessor.doFinish(DistributedUpdateProcessor.java:782)
        at org.apache.solr.update.processor.DistributedUpdateProcessor.finish(DistributedUpdateProcessor.java:1649)
        at org.apache.solr.update.processor.LogUpdateProcessor.finish(LogUpdateProcessorFactory.java:183)
        at org.apache.solr.handler.ContentStreamHandlerBase.handleRequestBody(ContentStreamHandlerBase.java:83)
        at org.apache.solr.handler.RequestHandlerBase.handleRequest(RequestHandlerBase.java:143)
        at org.apache.solr.core.SolrCore.execute(SolrCore.java:2058)
        at org.apache.solr.servlet.HttpSolrCall.execute(HttpSolrCall.java:648)
        at org.apache.solr.servlet.HttpSolrCall.call(HttpSolrCall.java:452)
        at org.apache.solr.servlet.SolrDispatchFilter.doFilter(SolrDispatchFilter.java:227)
        at org.apache.solr.servlet.SolrDispatchFilter.doFilter(SolrDispatchFilter.java:196)
        at org.eclipse.jetty.servlet.ServletHandler$CachedChain.doFilter(ServletHandler.java:1652)
        at org.apache.solr.client.solrj.embedded.JettySolrRunner$DebugFilter.doFilter(JettySolrRunner.java:106)
        at org.eclipse.jetty.servlet.ServletHandler$CachedChain.doFilter(ServletHandler.java:1652)
        at org.eclipse.jetty.servlets.UserAgentFilter.doFilter(UserAgentFilter.java:83)
        at org.eclipse.jetty.servlets.GzipFilter.doFilter(GzipFilter.java:300)
        at org.eclipse.jetty.servlet.ServletHandler$CachedChain.doFilter(ServletHandler.java:1652)
        at org.eclipse.jetty.servlet.ServletHandler.doHandle(ServletHandler.java:585)
        at org.eclipse.jetty.server.session.SessionHandler.doHandle(SessionHandler.java:221)
        at org.eclipse.jetty.server.handler.ContextHandler.doHandle(ContextHandler.java:1127)
        at org.eclipse.jetty.servlet.ServletHandler.doScope(ServletHandler.java:515)
        at org.eclipse.jetty.server.session.SessionHandler.doScope(SessionHandler.java:185)
        at org.eclipse.jetty.server.handler.ContextHandler.doScope(ContextHandler.java:1061)
        at org.eclipse.jetty.server.handler.ScopedHandler.handle(ScopedHandler.java:141)
        at org.eclipse.jetty.server.handler.HandlerWrapper.handle(HandlerWrapper.java:97)
        at org.eclipse.jetty.server.Server.handle(Server.java:499)
        at org.eclipse.jetty.server.HttpChannel.handle(HttpChannel.java:310)
        at org.eclipse.jetty.server.HttpConnection.onFillable(HttpConnection.java:257)
        at org.eclipse.jetty.io.AbstractConnection$2.run(AbstractConnection.java:540)
        at org.eclipse.jetty.util.thread.QueuedThreadPool.runJob(QueuedThreadPool.java:635)
        at org.eclipse.jetty.util.thread.QueuedThreadPool$3.run(QueuedThreadPool.java:555)
        at java.lang.Thread.run(Thread.java:745)
   2) Thread[id=1280, name=searcherExecutor-548-thread-1, state=WAITING, group=TGRP-ChaosMonkeyNothingIsSafeTest]
        at sun.misc.Unsafe.park(Native Method)
        at java.util.concurrent.locks.LockSupport.park(LockSupport.java:186)
        at java.util.concurrent.locks.AbstractQueuedSynchronizer$ConditionObject.await(AbstractQueuedSynchronizer.java:2043)
        at java.util.concurrent.LinkedBlockingQueue.take(LinkedBlockingQueue.java:442)
        at java.util.concurrent.ThreadPoolExecutor.getTask(ThreadPoolExecutor.java:1068)
        at java.util.concurrent.ThreadPoolExecutor.runWorker(ThreadPoolExecutor.java:1130)
        at java.util.concurrent.ThreadPoolExecutor$Worker.run(ThreadPoolExecutor.java:615)
        at java.lang.Thread.run(Thread.java:745)
	at __randomizedtesting.SeedInfo.seed([CF40E7B32033B482]:0)


FAILED:  org.apache.solr.cloud.CollectionsAPIDistributedZkTest.test

Error Message:
Error from server at http://127.0.0.1:42945/q_nne: Error CREATEing SolrCore 'halfcollection_shard1_replica1': Error reading cluster properties Caused by: KeeperErrorCode = Session expired for /clusterprops.json

Stack Trace:
org.apache.solr.client.solrj.impl.HttpSolrClient$RemoteSolrException: Error from server at http://127.0.0.1:42945/q_nne: Error CREATEing SolrCore 'halfcollection_shard1_replica1': Error reading cluster properties Caused by: KeeperErrorCode = Session expired for /clusterprops.json
	at org.apache.solr.client.solrj.impl.HttpSolrClient.executeMethod(HttpSolrClient.java:560)
	at org.apache.solr.client.solrj.impl.HttpSolrClient.request(HttpSolrClient.java:234)
	at org.apache.solr.client.solrj.impl.HttpSolrClient.request(HttpSolrClient.java:226)
	at org.apache.solr.client.solrj.SolrClient.request(SolrClient.java:1220)
	at org.apache.solr.cloud.CollectionsAPIDistributedZkTest.makeRequest(CollectionsAPIDistributedZkTest.java:301)
	at org.apache.solr.cloud.CollectionsAPIDistributedZkTest.testErrorHandling(CollectionsAPIDistributedZkTest.java:418)
	at org.apache.solr.cloud.CollectionsAPIDistributedZkTest.test(CollectionsAPIDistributedZkTest.java:168)
	at sun.reflect.NativeMethodAccessorImpl.invoke0(Native Method)
	at sun.reflect.NativeMethodAccessorImpl.invoke(NativeMethodAccessorImpl.java:57)
	at sun.reflect.DelegatingMethodAccessorImpl.invoke(DelegatingMethodAccessorImpl.java:43)
	at java.lang.reflect.Method.invoke(Method.java:606)
	at com.carrotsearch.randomizedtesting.RandomizedRunner.invoke(RandomizedRunner.java:1627)
	at com.carrotsearch.randomizedtesting.RandomizedRunner$6.evaluate(RandomizedRunner.java:836)
	at com.carrotsearch.randomizedtesting.RandomizedRunner$7.evaluate(RandomizedRunner.java:872)
	at com.carrotsearch.randomizedtesting.RandomizedRunner$8.evaluate(RandomizedRunner.java:886)
	at org.apache.solr.BaseDistributedSearchTestCase$ShardsRepeatRule$ShardsFixedStatement.callStatement(BaseDistributedSearchTestCase.java:960)
	at org.apache.solr.BaseDistributedSearchTestCase$ShardsRepeatRule$ShardsStatement.evaluate(BaseDistributedSearchTestCase.java:935)
	at com.carrotsearch.randomizedtesting.rules.SystemPropertiesRestoreRule$1.evaluate(SystemPropertiesRestoreRule.java:57)
	at org.apache.lucene.util.TestRuleSetupTeardownChained$1.evaluate(TestRuleSetupTeardownChained.java:50)
	at org.apache.lucene.util.AbstractBeforeAfterRule$1.evaluate(AbstractBeforeAfterRule.java:46)
	at org.apache.lucene.util.TestRuleThreadAndTestName$1.evaluate(TestRuleThreadAndTestName.java:49)
	at org.apache.lucene.util.TestRuleIgnoreAfterMaxFailures$1.evaluate(TestRuleIgnoreAfterMaxFailures.java:65)
	at org.apache.lucene.util.TestRuleMarkFailure$1.evaluate(TestRuleMarkFailure.java:48)
	at com.carrotsearch.randomizedtesting.rules.StatementAdapter.evaluate(StatementAdapter.java:36)
	at com.carrotsearch.randomizedtesting.ThreadLeakControl$StatementRunner.run(ThreadLeakControl.java:365)
	at com.carrotsearch.randomizedtesting.ThreadLeakControl.forkTimeoutingTask(ThreadLeakControl.java:798)
	at com.carrotsearch.randomizedtesting.ThreadLeakControl$3.evaluate(ThreadLeakControl.java:458)
	at com.carrotsearch.randomizedtesting.RandomizedRunner.runSingleTest(RandomizedRunner.java:845)
	at com.carrotsearch.randomizedtesting.RandomizedRunner$3.evaluate(RandomizedRunner.java:747)
	at com.carrotsearch.randomizedtesting.RandomizedRunner$4.evaluate(RandomizedRunner.java:781)
	at com.carrotsearch.randomizedtesting.RandomizedRunner$5.evaluate(RandomizedRunner.java:792)
	at com.carrotsearch.randomizedtesting.rules.StatementAdapter.evaluate(StatementAdapter.java:36)
	at com.carrotsearch.randomizedtesting.rules.SystemPropertiesRestoreRule$1.evaluate(SystemPropertiesRestoreRule.java:57)
	at org.apache.lucene.util.AbstractBeforeAfterRule$1.evaluate(AbstractBeforeAfterRule.java:46)
	at com.carrotsearch.randomizedtesting.rules.StatementAdapter.evaluate(StatementAdapter.java:36)
	at org.apache.lucene.util.TestRuleStoreClassName$1.evaluate(TestRuleStoreClassName.java:42)
	at com.carrotsearch.randomizedtesting.rules.NoShadowingOrOverridesOnMethodsRule$1.evaluate(NoShadowingOrOverridesOnMethodsRule.java:39)
	at com.carrotsearch.randomizedtesting.rules.NoShadowingOrOverridesOnMethodsRule$1.evaluate(NoShadowingOrOverridesOnMethodsRule.java:39)
	at com.carrotsearch.randomizedtesting.rules.StatementAdapter.evaluate(StatementAdapter.java:36)
	at com.carrotsearch.randomizedtesting.rules.StatementAdapter.evaluate(StatementAdapter.java:36)
	at com.carrotsearch.randomizedtesting.rules.StatementAdapter.evaluate(StatementAdapter.java:36)
	at org.apache.lucene.util.TestRuleAssertionsRequired$1.evaluate(TestRuleAssertionsRequired.java:54)
	at org.apache.lucene.util.TestRuleMarkFailure$1.evaluate(TestRuleMarkFailure.java:48)
	at org.apache.lucene.util.TestRuleIgnoreAfterMaxFailures$1.evaluate(TestRuleIgnoreAfterMaxFailures.java:65)
	at org.apache.lucene.util.TestRuleIgnoreTestSuites$1.evaluate(TestRuleIgnoreTestSuites.java:55)
	at com.carrotsearch.randomizedtesting.rules.StatementAdapter.evaluate(StatementAdapter.java:36)
	at com.carrotsearch.randomizedtesting.ThreadLeakControl$StatementRunner.run(ThreadLeakControl.java:365)
	at java.lang.Thread.run(Thread.java:745)




Build Log:
[...truncated 10413 lines...]
   [junit4] Suite: org.apache.solr.cloud.ChaosMonkeyNothingIsSafeTest
   [junit4]   2> Creating dataDir: /x1/jenkins/jenkins-slave/workspace/Lucene-Solr-NightlyTests-5.x/solr/build/solr-core/test/J0/temp/solr.cloud.ChaosMonkeyNothingIsSafeTest_CF40E7B32033B482-001/init-core-data-001
   [junit4]   2> 228395 INFO  (SUITE-ChaosMonkeyNothingIsSafeTest-seed#[CF40E7B32033B482]-worker) [    ] o.a.s.BaseDistributedSearchTestCase Setting hostContext system property: /lo_i/j
   [junit4]   2> 228400 INFO  (TEST-ChaosMonkeyNothingIsSafeTest.test-seed#[CF40E7B32033B482]) [    ] o.a.s.c.ZkTestServer STARTING ZK TEST SERVER
   [junit4]   2> 228400 INFO  (Thread-607) [    ] o.a.s.c.ZkTestServer client port:0.0.0.0/0.0.0.0:0
   [junit4]   2> 228400 INFO  (Thread-607) [    ] o.a.s.c.ZkTestServer Starting server
   [junit4]   2> 228500 INFO  (TEST-ChaosMonkeyNothingIsSafeTest.test-seed#[CF40E7B32033B482]) [    ] o.a.s.c.ZkTestServer start zk server on port:33751
   [junit4]   2> 228501 INFO  (TEST-ChaosMonkeyNothingIsSafeTest.test-seed#[CF40E7B32033B482]) [    ] o.a.s.c.c.SolrZkClient Using default ZkCredentialsProvider
   [junit4]   2> 228501 INFO  (TEST-ChaosMonkeyNothingIsSafeTest.test-seed#[CF40E7B32033B482]) [    ] o.a.s.c.c.ConnectionManager Waiting for client to connect to ZooKeeper
   [junit4]   2> 228504 INFO  (zkCallback-106-thread-1) [    ] o.a.s.c.c.ConnectionManager Watcher org.apache.solr.common.cloud.ConnectionManager@7b38a706 name:ZooKeeperConnection Watcher:127.0.0.1:33751 got event WatchedEvent state:SyncConnected type:None path:null path:null type:None
   [junit4]   2> 228504 INFO  (TEST-ChaosMonkeyNothingIsSafeTest.test-seed#[CF40E7B32033B482]) [    ] o.a.s.c.c.ConnectionManager Client is connected to ZooKeeper
   [junit4]   2> 228505 INFO  (TEST-ChaosMonkeyNothingIsSafeTest.test-seed#[CF40E7B32033B482]) [    ] o.a.s.c.c.SolrZkClient Using default ZkACLProvider
   [junit4]   2> 228505 INFO  (TEST-ChaosMonkeyNothingIsSafeTest.test-seed#[CF40E7B32033B482]) [    ] o.a.s.c.c.SolrZkClient makePath: /solr
   [junit4]   2> 228514 INFO  (TEST-ChaosMonkeyNothingIsSafeTest.test-seed#[CF40E7B32033B482]) [    ] o.a.s.c.c.SolrZkClient Using default ZkCredentialsProvider
   [junit4]   2> 228515 INFO  (TEST-ChaosMonkeyNothingIsSafeTest.test-seed#[CF40E7B32033B482]) [    ] o.a.s.c.c.ConnectionManager Waiting for client to connect to ZooKeeper
   [junit4]   2> 228518 INFO  (zkCallback-107-thread-1) [    ] o.a.s.c.c.ConnectionManager Watcher org.apache.solr.common.cloud.ConnectionManager@517b314a name:ZooKeeperConnection Watcher:127.0.0.1:33751/solr got event WatchedEvent state:SyncConnected type:None path:null path:null type:None
   [junit4]   2> 228519 INFO  (TEST-ChaosMonkeyNothingIsSafeTest.test-seed#[CF40E7B32033B482]) [    ] o.a.s.c.c.ConnectionManager Client is connected to ZooKeeper
   [junit4]   2> 228519 INFO  (TEST-ChaosMonkeyNothingIsSafeTest.test-seed#[CF40E7B32033B482]) [    ] o.a.s.c.c.SolrZkClient Using default ZkACLProvider
   [junit4]   2> 228519 INFO  (TEST-ChaosMonkeyNothingIsSafeTest.test-seed#[CF40E7B32033B482]) [    ] o.a.s.c.c.SolrZkClient makePath: /collections/collection1
   [junit4]   2> 228522 INFO  (TEST-ChaosMonkeyNothingIsSafeTest.test-seed#[CF40E7B32033B482]) [    ] o.a.s.c.c.SolrZkClient makePath: /collections/collection1/shards
   [junit4]   2> 228523 INFO  (TEST-ChaosMonkeyNothingIsSafeTest.test-seed#[CF40E7B32033B482]) [    ] o.a.s.c.c.SolrZkClient makePath: /collections/control_collection
   [junit4]   2> 228524 INFO  (TEST-ChaosMonkeyNothingIsSafeTest.test-seed#[CF40E7B32033B482]) [    ] o.a.s.c.c.SolrZkClient makePath: /collections/control_collection/shards
   [junit4]   2> 228526 INFO  (TEST-ChaosMonkeyNothingIsSafeTest.test-seed#[CF40E7B32033B482]) [    ] o.a.s.c.AbstractZkTestCase put /x1/jenkins/jenkins-slave/workspace/Lucene-Solr-NightlyTests-5.x/solr/core/src/test-files/solr/collection1/conf/solrconfig-tlog.xml to /configs/conf1/solrconfig.xml
   [junit4]   2> 228526 INFO  (TEST-ChaosMonkeyNothingIsSafeTest.test-seed#[CF40E7B32033B482]) [    ] o.a.s.c.c.SolrZkClient makePath: /configs/conf1/solrconfig.xml
   [junit4]   2> 228528 INFO  (TEST-ChaosMonkeyNothingIsSafeTest.test-seed#[CF40E7B32033B482]) [    ] o.a.s.c.AbstractZkTestCase put /x1/jenkins/jenkins-slave/workspace/Lucene-Solr-NightlyTests-5.x/solr/core/src/test-files/solr/collection1/conf/schema15.xml to /configs/conf1/schema.xml
   [junit4]   2> 228529 INFO  (TEST-ChaosMonkeyNothingIsSafeTest.test-seed#[CF40E7B32033B482]) [    ] o.a.s.c.c.SolrZkClient makePath: /configs/conf1/schema.xml
   [junit4]   2> 228530 INFO  (TEST-ChaosMonkeyNothingIsSafeTest.test-seed#[CF40E7B32033B482]) [    ] o.a.s.c.AbstractZkTestCase put /x1/jenkins/jenkins-slave/workspace/Lucene-Solr-NightlyTests-5.x/solr/core/src/test-files/solr/collection1/conf/solrconfig.snippet.randomindexconfig.xml to /configs/conf1/solrconfig.snippet.randomindexconfig.xml
   [junit4]   2> 228531 INFO  (TEST-ChaosMonkeyNothingIsSafeTest.test-seed#[CF40E7B32033B482]) [    ] o.a.s.c.c.SolrZkClient makePath: /configs/conf1/solrconfig.snippet.randomindexconfig.xml
   [junit4]   2> 228532 INFO  (TEST-ChaosMonkeyNothingIsSafeTest.test-seed#[CF40E7B32033B482]) [    ] o.a.s.c.AbstractZkTestCase put /x1/jenkins/jenkins-slave/workspace/Lucene-Solr-NightlyTests-5.x/solr/core/src/test-files/solr/collection1/conf/stopwords.txt to /configs/conf1/stopwords.txt
   [junit4]   2> 228532 INFO  (TEST-ChaosMonkeyNothingIsSafeTest.test-seed#[CF40E7B32033B482]) [    ] o.a.s.c.c.SolrZkClient makePath: /configs/conf1/stopwords.txt
   [junit4]   2> 228534 INFO  (TEST-ChaosMonkeyNothingIsSafeTest.test-seed#[CF40E7B32033B482]) [    ] o.a.s.c.AbstractZkTestCase put /x1/jenkins/jenkins-slave/workspace/Lucene-Solr-NightlyTests-5.x/solr/core/src/test-files/solr/collection1/conf/protwords.txt to /configs/conf1/protwords.txt
   [junit4]   2> 228534 INFO  (TEST-ChaosMonkeyNothingIsSafeTest.test-seed#[CF40E7B32033B482]) [    ] o.a.s.c.c.SolrZkClient makePath: /configs/conf1/protwords.txt
   [junit4]   2> 228535 INFO  (TEST-ChaosMonkeyNothingIsSafeTest.test-seed#[CF40E7B32033B482]) [    ] o.a.s.c.AbstractZkTestCase put /x1/jenkins/jenkins-slave/workspace/Lucene-Solr-NightlyTests-5.x/solr/core/src/test-files/solr/collection1/conf/currency.xml to /configs/conf1/currency.xml
   [junit4]   2> 228535 INFO  (TEST-ChaosMonkeyNothingIsSafeTest.test-seed#[CF40E7B32033B482]) [    ] o.a.s.c.c.SolrZkClient makePath: /configs/conf1/currency.xml
   [junit4]   2> 228537 INFO  (TEST-ChaosMonkeyNothingIsSafeTest.test-seed#[CF40E7B32033B482]) [    ] o.a.s.c.AbstractZkTestCase put /x1/jenkins/jenkins-slave/workspace/Lucene-Solr-NightlyTests-5.x/solr/core/src/test-files/solr/collection1/conf/enumsConfig.xml to /configs/conf1/enumsConfig.xml
   [junit4]   2> 228537 INFO  (TEST-ChaosMonkeyNothingIsSafeTest.test-seed#[CF40E7B32033B482]) [    ] o.a.s.c.c.SolrZkClient makePath: /configs/conf1/enumsConfig.xml
   [junit4]   2> 228539 INFO  (TEST-ChaosMonkeyNothingIsSafeTest.test-seed#[CF40E7B32033B482]) [    ] o.a.s.c.AbstractZkTestCase put /x1/jenkins/jenkins-slave/workspace/Lucene-Solr-NightlyTests-5.x/solr/core/src/test-files/solr/collection1/conf/open-exchange-rates.json to /configs/conf1/open-exchange-rates.json
   [junit4]   2> 228540 INFO  (TEST-ChaosMonkeyNothingIsSafeTest.test-seed#[CF40E7B32033B482]) [    ] o.a.s.c.c.SolrZkClient makePath: /configs/conf1/open-exchange-rates.json
   [junit4]   2> 228541 INFO  (TEST-ChaosMonkeyNothingIsSafeTest.test-seed#[CF40E7B32033B482]) [    ] o.a.s.c.AbstractZkTestCase put /x1/jenkins/jenkins-slave/workspace/Lucene-Solr-NightlyTests-5.x/solr/core/src/test-files/solr/collection1/conf/mapping-ISOLatin1Accent.txt to /configs/conf1/mapping-ISOLatin1Accent.txt
   [junit4]   2> 228541 INFO  (TEST-ChaosMonkeyNothingIsSafeTest.test-seed#[CF40E7B32033B482]) [    ] o.a.s.c.c.SolrZkClient makePath: /configs/conf1/mapping-ISOLatin1Accent.txt
   [junit4]   2> 228543 INFO  (TEST-ChaosMonkeyNothingIsSafeTest.test-seed#[CF40E7B32033B482]) [    ] o.a.s.c.AbstractZkTestCase put /x1/jenkins/jenkins-slave/workspace/Lucene-Solr-NightlyTests-5.x/solr/core/src/test-files/solr/collection1/conf/old_synonyms.txt to /configs/conf1/old_synonyms.txt
   [junit4]   2> 228543 INFO  (TEST-ChaosMonkeyNothingIsSafeTest.test-seed#[CF40E7B32033B482]) [    ] o.a.s.c.c.SolrZkClient makePath: /configs/conf1/old_synonyms.txt
   [junit4]   2> 228545 INFO  (TEST-ChaosMonkeyNothingIsSafeTest.test-seed#[CF40E7B32033B482]) [    ] o.a.s.c.AbstractZkTestCase put /x1/jenkins/jenkins-slave/workspace/Lucene-Solr-NightlyTests-5.x/solr/core/src/test-files/solr/collection1/conf/synonyms.txt to /configs/conf1/synonyms.txt
   [junit4]   2> 228545 INFO  (TEST-ChaosMonkeyNothingIsSafeTest.test-seed#[CF40E7B32033B482]) [    ] o.a.s.c.c.SolrZkClient makePath: /configs/conf1/synonyms.txt
   [junit4]   2> 228828 INFO  (TEST-ChaosMonkeyNothingIsSafeTest.test-seed#[CF40E7B32033B482]) [    ] o.a.s.SolrTestCaseJ4 Writing core.properties file to /x1/jenkins/jenkins-slave/workspace/Lucene-Solr-NightlyTests-5.x/solr/build/solr-core/test/J0/temp/solr.cloud.ChaosMonkeyNothingIsSafeTest_CF40E7B32033B482-001/control-001/cores/collection1
   [junit4]   2> 228830 INFO  (TEST-ChaosMonkeyNothingIsSafeTest.test-seed#[CF40E7B32033B482]) [    ] o.e.j.s.Server jetty-9.2.11.v20150529
   [junit4]   2> 228831 INFO  (TEST-ChaosMonkeyNothingIsSafeTest.test-seed#[CF40E7B32033B482]) [    ] o.e.j.s.h.ContextHandler Started o.e.j.s.ServletContextHandler@675afa21{/lo_i/j,null,AVAILABLE}
   [junit4]   2> 228834 INFO  (TEST-ChaosMonkeyNothingIsSafeTest.test-seed#[CF40E7B32033B482]) [    ] o.e.j.s.ServerConnector Started ServerConnector@477af36b{HTTP/1.1}{127.0.0.1:48831}
   [junit4]   2> 228834 INFO  (TEST-ChaosMonkeyNothingIsSafeTest.test-seed#[CF40E7B32033B482]) [    ] o.e.j.s.Server Started @231760ms
   [junit4]   2> 228834 INFO  (TEST-ChaosMonkeyNothingIsSafeTest.test-seed#[CF40E7B32033B482]) [    ] o.a.s.c.s.e.JettySolrRunner Jetty properties: {hostPort=48831, hostContext=/lo_i/j, coreRootDirectory=/x1/jenkins/jenkins-slave/workspace/Lucene-Solr-NightlyTests-5.x/solr/build/solr-core/test/J0/../../../../../../../../../../x1/jenkins/jenkins-slave/workspace/Lucene-Solr-NightlyTests-5.x/solr/build/solr-core/test/J0/temp/solr.cloud.ChaosMonkeyNothingIsSafeTest_CF40E7B32033B482-001/control-001/cores, solr.data.dir=/x1/jenkins/jenkins-slave/workspace/Lucene-Solr-NightlyTests-5.x/solr/build/solr-core/test/J0/temp/solr.cloud.ChaosMonkeyNothingIsSafeTest_CF40E7B32033B482-001/tempDir-001/control/data}
   [junit4]   2> 228835 INFO  (TEST-ChaosMonkeyNothingIsSafeTest.test-seed#[CF40E7B32033B482]) [    ] o.a.s.s.SolrDispatchFilter SolrDispatchFilter.init(): sun.misc.Launcher$AppClassLoader@1fe91485
   [junit4]   2> 228835 INFO  (TEST-ChaosMonkeyNothingIsSafeTest.test-seed#[CF40E7B32033B482]) [    ] o.a.s.c.SolrResourceLoader new SolrResourceLoader for directory: '/x1/jenkins/jenkins-slave/workspace/Lucene-Solr-NightlyTests-5.x/solr/build/solr-core/test/J0/../../../../../../../../../../x1/jenkins/jenkins-slave/workspace/Lucene-Solr-NightlyTests-5.x/solr/build/solr-core/test/J0/temp/solr.cloud.ChaosMonkeyNothingIsSafeTest_CF40E7B32033B482-001/control-001/'
   [junit4]   2> 228851 INFO  (TEST-ChaosMonkeyNothingIsSafeTest.test-seed#[CF40E7B32033B482]) [    ] o.a.s.c.SolrXmlConfig Loading container configuration from /x1/jenkins/jenkins-slave/workspace/Lucene-Solr-NightlyTests-5.x/solr/build/solr-core/test/J0/../../../../../../../../../../x1/jenkins/jenkins-slave/workspace/Lucene-Solr-NightlyTests-5.x/solr/build/solr-core/test/J0/temp/solr.cloud.ChaosMonkeyNothingIsSafeTest_CF40E7B32033B482-001/control-001/solr.xml
   [junit4]   2> 228865 INFO  (TEST-ChaosMonkeyNothingIsSafeTest.test-seed#[CF40E7B32033B482]) [    ] o.a.s.c.CoresLocator Config-defined core root directory: /x1/jenkins/jenkins-slave/workspace/Lucene-Solr-NightlyTests-5.x/solr/build/solr-core/test/J0/../../../../../../../../../../x1/jenkins/jenkins-slave/workspace/Lucene-Solr-NightlyTests-5.x/solr/build/solr-core/test/J0/temp/solr.cloud.ChaosMonkeyNothingIsSafeTest_CF40E7B32033B482-001/control-001/cores
   [junit4]   2> 228866 INFO  (TEST-ChaosMonkeyNothingIsSafeTest.test-seed#[CF40E7B32033B482]) [    ] o.a.s.c.CoreContainer New CoreContainer 2018341539
   [junit4]   2> 228866 INFO  (TEST-ChaosMonkeyNothingIsSafeTest.test-seed#[CF40E7B32033B482]) [    ] o.a.s.c.CoreContainer Loading cores into CoreContainer [instanceDir=/x1/jenkins/jenkins-slave/workspace/Lucene-Solr-NightlyTests-5.x/solr/build/solr-core/test/J0/../../../../../../../../../../x1/jenkins/jenkins-slave/workspace/Lucene-Solr-NightlyTests-5.x/solr/build/solr-core/test/J0/temp/solr.cloud.ChaosMonkeyNothingIsSafeTest_CF40E7B32033B482-001/control-001/]
   [junit4]   2> 228866 INFO  (TEST-ChaosMonkeyNothingIsSafeTest.test-seed#[CF40E7B32033B482]) [    ] o.a.s.c.CoreContainer loading shared library: /x1/jenkins/jenkins-slave/workspace/Lucene-Solr-NightlyTests-5.x/solr/build/solr-core/test/J0/../../../../../../../../../../x1/jenkins/jenkins-slave/workspace/Lucene-Solr-NightlyTests-5.x/solr/build/solr-core/test/J0/temp/solr.cloud.ChaosMonkeyNothingIsSafeTest_CF40E7B32033B482-001/control-001/lib
   [junit4]   2> 228866 WARN  (TEST-ChaosMonkeyNothingIsSafeTest.test-seed#[CF40E7B32033B482]) [    ] o.a.s.c.SolrResourceLoader Can't find (or read) directory to add to classloader: lib (resolved as: /x1/jenkins/jenkins-slave/workspace/Lucene-Solr-NightlyTests-5.x/solr/build/solr-core/test/J0/../../../../../../../../../../x1/jenkins/jenkins-slave/workspace/Lucene-Solr-NightlyTests-5.x/solr/build/solr-core/test/J0/temp/solr.cloud.ChaosMonkeyNothingIsSafeTest_CF40E7B32033B482-001/control-001/lib).
   [junit4]   2> 228874 INFO  (TEST-ChaosMonkeyNothingIsSafeTest.test-seed#[CF40E7B32033B482]) [    ] o.a.s.h.c.HttpShardHandlerFactory created with socketTimeout : 90000,urlScheme : ,connTimeout : 15000,maxConnectionsPerHost : 20,maxConnections : 10000,corePoolSize : 0,maximumPoolSize : 2147483647,maxThreadIdleTime : 5,sizeOfQueue : -1,fairnessPolicy : false,useRetries : false,
   [junit4]   2> 228876 INFO  (TEST-ChaosMonkeyNothingIsSafeTest.test-seed#[CF40E7B32033B482]) [    ] o.a.s.u.UpdateShardHandler Creating UpdateShardHandler HTTP client with params: socketTimeout=340000&connTimeout=45000&retry=true
   [junit4]   2> 228876 INFO  (TEST-ChaosMonkeyNothingIsSafeTest.test-seed#[CF40E7B32033B482]) [    ] o.a.s.l.LogWatcher SLF4J impl is org.slf4j.impl.Log4jLoggerFactory
   [junit4]   2> 228876 INFO  (TEST-ChaosMonkeyNothingIsSafeTest.test-seed#[CF40E7B32033B482]) [    ] o.a.s.l.LogWatcher Registering Log Listener [Log4j (org.slf4j.impl.Log4jLoggerFactory)]
   [junit4]   2> 228876 INFO  (TEST-ChaosMonkeyNothingIsSafeTest.test-seed#[CF40E7B32033B482]) [    ] o.a.s.c.ZkContainer Zookeeper client=127.0.0.1:33751/solr
   [junit4]   2> 228877 INFO  (TEST-ChaosMonkeyNothingIsSafeTest.test-seed#[CF40E7B32033B482]) [    ] o.a.s.c.ZkController zkHost includes chroot
   [junit4]   2> 228877 INFO  (TEST-ChaosMonkeyNothingIsSafeTest.test-seed#[CF40E7B32033B482]) [    ] o.a.s.c.c.SolrZkClient Using default ZkCredentialsProvider
   [junit4]   2> 228877 INFO  (TEST-ChaosMonkeyNothingIsSafeTest.test-seed#[CF40E7B32033B482]) [    ] o.a.s.c.c.ConnectionManager Waiting for client to connect to ZooKeeper
   [junit4]   2> 228879 INFO  (zkCallback-109-thread-1) [    ] o.a.s.c.c.ConnectionManager Watcher org.apache.solr.common.cloud.ConnectionManager@4a21d2b7 name:ZooKeeperConnection Watcher:127.0.0.1:33751 got event WatchedEvent state:SyncConnected type:None path:null path:null type:None
   [junit4]   2> 228880 INFO  (TEST-ChaosMonkeyNothingIsSafeTest.test-seed#[CF40E7B32033B482]) [    ] o.a.s.c.c.ConnectionManager Client is connected to ZooKeeper
   [junit4]   2> 228880 INFO  (TEST-ChaosMonkeyNothingIsSafeTest.test-seed#[CF40E7B32033B482]) [    ] o.a.s.c.c.SolrZkClient Using default ZkACLProvider
   [junit4]   2> 228883 INFO  (TEST-ChaosMonkeyNothingIsSafeTest.test-seed#[CF40E7B32033B482]) [n:127.0.0.1:48831_lo_i%2Fj    ] o.a.s.c.c.ConnectionManager Waiting for client to connect to ZooKeeper
   [junit4]   2> 228884 INFO  (zkCallback-110-thread-1-processing-n:127.0.0.1:48831_lo_i%2Fj) [n:127.0.0.1:48831_lo_i%2Fj    ] o.a.s.c.c.ConnectionManager Watcher org.apache.solr.common.cloud.ConnectionManager@1b8da1bd name:ZooKeeperConnection Watcher:127.0.0.1:33751/solr got event WatchedEvent state:SyncConnected type:None path:null path:null type:None
   [junit4]   2> 228884 INFO  (TEST-ChaosMonkeyNothingIsSafeTest.test-seed#[CF40E7B32033B482]) [n:127.0.0.1:48831_lo_i%2Fj    ] o.a.s.c.c.ConnectionManager Client is connected to ZooKeeper
   [junit4]   2> 228886 INFO  (TEST-ChaosMonkeyNothingIsSafeTest.test-seed#[CF40E7B32033B482]) [n:127.0.0.1:48831_lo_i%2Fj    ] o.a.s.c.c.SolrZkClient makePath: /overseer/queue
   [junit4]   2> 228889 INFO  (TEST-ChaosMonkeyNothingIsSafeTest.test-seed#[CF40E7B32033B482]) [n:127.0.0.1:48831_lo_i%2Fj    ] o.a.s.c.c.SolrZkClient makePath: /overseer/collection-queue-work
   [junit4]   2> 228891 INFO  (TEST-ChaosMonkeyNothingIsSafeTest.test-seed#[CF40E7B32033B482]) [n:127.0.0.1:48831_lo_i%2Fj    ] o.a.s.c.c.SolrZkClient makePath: /overseer/collection-map-running
   [junit4]   2> 228893 INFO  (TEST-ChaosMonkeyNothingIsSafeTest.test-seed#[CF40E7B32033B482]) [n:127.0.0.1:48831_lo_i%2Fj    ] o.a.s.c.c.SolrZkClient makePath: /overseer/collection-map-completed
   [junit4]   2> 228895 INFO  (TEST-ChaosMonkeyNothingIsSafeTest.test-seed#[CF40E7B32033B482]) [n:127.0.0.1:48831_lo_i%2Fj    ] o.a.s.c.c.SolrZkClient makePath: /overseer/collection-map-failure
   [junit4]   2> 228898 INFO  (TEST-ChaosMonkeyNothingIsSafeTest.test-seed#[CF40E7B32033B482]) [n:127.0.0.1:48831_lo_i%2Fj    ] o.a.s.c.c.SolrZkClient makePath: /live_nodes
   [junit4]   2> 228899 INFO  (TEST-ChaosMonkeyNothingIsSafeTest.test-seed#[CF40E7B32033B482]) [n:127.0.0.1:48831_lo_i%2Fj    ] o.a.s.c.c.SolrZkClient makePath: /aliases.json
   [junit4]   2> 228901 INFO  (TEST-ChaosMonkeyNothingIsSafeTest.test-seed#[CF40E7B32033B482]) [n:127.0.0.1:48831_lo_i%2Fj    ] o.a.s.c.c.SolrZkClient makePath: /clusterstate.json
   [junit4]   2> 228902 INFO  (TEST-ChaosMonkeyNothingIsSafeTest.test-seed#[CF40E7B32033B482]) [n:127.0.0.1:48831_lo_i%2Fj    ] o.a.s.c.ZkController Register node as live in ZooKeeper:/live_nodes/127.0.0.1:48831_lo_i%2Fj
   [junit4]   2> 228903 INFO  (TEST-ChaosMonkeyNothingIsSafeTest.test-seed#[CF40E7B32033B482]) [n:127.0.0.1:48831_lo_i%2Fj    ] o.a.s.c.c.SolrZkClient makePath: /live_nodes/127.0.0.1:48831_lo_i%2Fj
   [junit4]   2> 228904 INFO  (TEST-ChaosMonkeyNothingIsSafeTest.test-seed#[CF40E7B32033B482]) [n:127.0.0.1:48831_lo_i%2Fj    ] o.a.s.c.c.SolrZkClient makePath: /overseer_elect
   [junit4]   2> 228906 INFO  (TEST-ChaosMonkeyNothingIsSafeTest.test-seed#[CF40E7B32033B482]) [n:127.0.0.1:48831_lo_i%2Fj    ] o.a.s.c.c.SolrZkClient makePath: /overseer_elect/election
   [junit4]   2> 228907 INFO  (TEST-ChaosMonkeyNothingIsSafeTest.test-seed#[CF40E7B32033B482]) [n:127.0.0.1:48831_lo_i%2Fj    ] o.a.s.c.Overseer Overseer (id=null) closing
   [junit4]   2> 228908 INFO  (TEST-ChaosMonkeyNothingIsSafeTest.test-seed#[CF40E7B32033B482]) [n:127.0.0.1:48831_lo_i%2Fj    ] o.a.s.c.LeaderElector Joined leadership election with path: /overseer_elect/election/94111529028943875-127.0.0.1:48831_lo_i%2Fj-n_0000000000
   [junit4]   2> 228908 INFO  (TEST-ChaosMonkeyNothingIsSafeTest.test-seed#[CF40E7B32033B482]) [n:127.0.0.1:48831_lo_i%2Fj    ] o.a.s.c.OverseerElectionContext I am going to be the leader 127.0.0.1:48831_lo_i%2Fj
   [junit4]   2> 228909 INFO  (TEST-ChaosMonkeyNothingIsSafeTest.test-seed#[CF40E7B32033B482]) [n:127.0.0.1:48831_lo_i%2Fj    ] o.a.s.c.c.SolrZkClient makePath: /overseer_elect/leader
   [junit4]   2> 228910 INFO  (TEST-ChaosMonkeyNothingIsSafeTest.test-seed#[CF40E7B32033B482]) [n:127.0.0.1:48831_lo_i%2Fj    ] o.a.s.c.Overseer Overseer (id=94111529028943875-127.0.0.1:48831_lo_i%2Fj-n_0000000000) starting
   [junit4]   2> 228912 INFO  (TEST-ChaosMonkeyNothingIsSafeTest.test-seed#[CF40E7B32033B482]) [n:127.0.0.1:48831_lo_i%2Fj    ] o.a.s.c.c.SolrZkClient makePath: /overseer/queue-work
   [junit4]   2> 228918 INFO  (TEST-ChaosMonkeyNothingIsSafeTest.test-seed#[CF40E7B32033B482]) [n:127.0.0.1:48831_lo_i%2Fj    ] o.a.s.c.OverseerAutoReplicaFailoverThread Starting OverseerAutoReplicaFailoverThread autoReplicaFailoverWorkLoopDelay=10000 autoReplicaFailoverWaitAfterExpiration=30000 autoReplicaFailoverBadNodeExpiration=60000
   [junit4]   2> 228919 INFO  (TEST-ChaosMonkeyNothingIsSafeTest.test-seed#[CF40E7B32033B482]) [n:127.0.0.1:48831_lo_i%2Fj    ] o.a.s.c.c.ZkStateReader Updating cluster state from ZooKeeper... 
   [junit4]   2> 228919 INFO  (OverseerCollectionProcessor-94111529028943875-127.0.0.1:48831_lo_i%2Fj-n_0000000000) [n:127.0.0.1:48831_lo_i%2Fj    ] o.a.s.c.OverseerCollectionProcessor Process current queue of collection creations
   [junit4]   2> 228919 INFO  (OverseerStateUpdate-94111529028943875-127.0.0.1:48831_lo_i%2Fj-n_0000000000) [n:127.0.0.1:48831_lo_i%2Fj    ] o.a.s.c.Overseer Starting to work on the main queue
   [junit4]   2> 228922 INFO  (TEST-ChaosMonkeyNothingIsSafeTest.test-seed#[CF40E7B32033B482]) [n:127.0.0.1:48831_lo_i%2Fj    ] o.a.s.c.CoreContainer No authentication plugin used.
   [junit4]   2> 228923 INFO  (TEST-ChaosMonkeyNothingIsSafeTest.test-seed#[CF40E7B32033B482]) [n:127.0.0.1:48831_lo_i%2Fj    ] o.a.s.c.CoreContainer Security conf doesn't exist. Skipping setup for authorization module.
   [junit4]   2> 228924 INFO  (TEST-ChaosMonkeyNothingIsSafeTest.test-seed#[CF40E7B32033B482]) [n:127.0.0.1:48831_lo_i%2Fj    ] o.a.s.c.CoresLocator Looking for core definitions underneath /x1/jenkins/jenkins-slave/workspace/Lucene-Solr-NightlyTests-5.x/solr/build/solr-core/test/J0/../../../../../../../../../../x1/jenkins/jenkins-slave/workspace/Lucene-Solr-NightlyTests-5.x/solr/build/solr-core/test/J0/temp/solr.cloud.ChaosMonkeyNothingIsSafeTest_CF40E7B32033B482-001/control-001/cores
   [junit4]   2> 228925 INFO  (TEST-ChaosMonkeyNothingIsSafeTest.test-seed#[CF40E7B32033B482]) [n:127.0.0.1:48831_lo_i%2Fj    ] o.a.s.c.SolrCore Created CoreDescriptor: {absoluteInstDir=/x1/jenkins/jenkins-slave/workspace/Lucene-Solr-NightlyTests-5.x/solr/build/solr-core/test/J0/../../../../../../../../../../x1/jenkins/jenkins-slave/workspace/Lucene-Solr-NightlyTests-5.x/solr/build/solr-core/test/J0/temp/solr.cloud.ChaosMonkeyNothingIsSafeTest_CF40E7B32033B482-001/control-001/cores/collection1/, loadOnStartup=true, instanceDir=/x1/jenkins/jenkins-slave/workspace/Lucene-Solr-NightlyTests-5.x/solr/build/solr-core/test/J0/../../../../../../../../../../x1/jenkins/jenkins-slave/workspace/Lucene-Solr-NightlyTests-5.x/solr/build/solr-core/test/J0/temp/solr.cloud.ChaosMonkeyNothingIsSafeTest_CF40E7B32033B482-001/control-001/cores/collection1, shard=, schema=schema.xml, config=solrconfig.xml, name=collection1, collection=control_collection, coreNodeName=, dataDir=data/, transient=false}
   [junit4]   2> 228925 INFO  (TEST-ChaosMonkeyNothingIsSafeTest.test-seed#[CF40E7B32033B482]) [n:127.0.0.1:48831_lo_i%2Fj    ] o.a.s.c.CoresLocator Found core collection1 in /x1/jenkins/jenkins-slave/workspace/Lucene-Solr-NightlyTests-5.x/solr/build/solr-core/test/J0/../../../../../../../../../../x1/jenkins/jenkins-slave/workspace/Lucene-Solr-NightlyTests-5.x/solr/build/solr-core/test/J0/temp/solr.cloud.ChaosMonkeyNothingIsSafeTest_CF40E7B32033B482-001/control-001/cores/collection1/
   [junit4]   2> 228925 INFO  (TEST-ChaosMonkeyNothingIsSafeTest.test-seed#[CF40E7B32033B482]) [n:127.0.0.1:48831_lo_i%2Fj    ] o.a.s.c.CoresLocator Found 1 core definitions
   [junit4]   2> 228926 INFO  (coreLoadExecutor-536-thread-1-processing-n:127.0.0.1:48831_lo_i%2Fj) [n:127.0.0.1:48831_lo_i%2Fj c:control_collection   x:collection1] o.a.s.c.ZkController publishing state=down
   [junit4]   2> 228926 INFO  (coreLoadExecutor-536-thread-1-processing-n:127.0.0.1:48831_lo_i%2Fj) [n:127.0.0.1:48831_lo_i%2Fj c:control_collection   x:collection1] o.a.s.c.ZkController numShards not found on descriptor - reading it from system property
   [junit4]   2> 228926 INFO  (TEST-ChaosMonkeyNothingIsSafeTest.test-seed#[CF40E7B32033B482]) [n:127.0.0.1:48831_lo_i%2Fj    ] o.a.s.s.SolrDispatchFilter user.dir=/x1/jenkins/jenkins-slave/workspace/Lucene-Solr-NightlyTests-5.x/solr/build/solr-core/test/J0
   [junit4]   2> 228926 INFO  (TEST-ChaosMonkeyNothingIsSafeTest.test-seed#[CF40E7B32033B482]) [n:127.0.0.1:48831_lo_i%2Fj    ] o.a.s.s.SolrDispatchFilter SolrDispatchFilter.init() done
   [junit4]   2> 228927 INFO  (coreLoadExecutor-536-thread-1-processing-n:127.0.0.1:48831_lo_i%2Fj) [n:127.0.0.1:48831_lo_i%2Fj c:control_collection   x:collection1] o.a.s.c.ZkController look for our core node name
   [junit4]   2> 228927 INFO  (zkCallback-110-thread-1-processing-n:127.0.0.1:48831_lo_i%2Fj) [n:127.0.0.1:48831_lo_i%2Fj    ] o.a.s.c.DistributedQueue NodeChildrenChanged fired on path /overseer/queue state SyncConnected
   [junit4]   2> 228928 INFO  (OverseerStateUpdate-94111529028943875-127.0.0.1:48831_lo_i%2Fj-n_0000000000) [n:127.0.0.1:48831_lo_i%2Fj    ] o.a.s.c.Overseer processMessage: queueSize: 1, message = {
   [junit4]   2>   "numShards":"1",
   [junit4]   2>   "base_url":"http://127.0.0.1:48831/lo_i/j",
   [junit4]   2>   "roles":null,
   [junit4]   2>   "operation":"state",
   [junit4]   2>   "shard":null,
   [junit4]   2>   "collection":"control_collection",
   [junit4]   2>   "state":"down",
   [junit4]   2>   "core":"collection1",
   [junit4]   2>   "node_name":"127.0.0.1:48831_lo_i%2Fj"} current state version: 0
   [junit4]   2> 228928 INFO  (OverseerStateUpdate-94111529028943875-127.0.0.1:48831_lo_i%2Fj-n_0000000000) [n:127.0.0.1:48831_lo_i%2Fj    ] o.a.s.c.o.ReplicaMutator Update state numShards=1 message={
   [junit4]   2>   "numShards":"1",
   [junit4]   2>   "base_url":"http://127.0.0.1:48831/lo_i/j",
   [junit4]   2>   "roles":null,
   [junit4]   2>   "operation":"state",
   [junit4]   2>   "shard":null,
   [junit4]   2>   "collection":"control_collection",
   [junit4]   2>   "state":"down",
   [junit4]   2>   "core":"collection1",
   [junit4]   2>   "node_name":"127.0.0.1:48831_lo_i%2Fj"}
   [junit4]   2> 228929 INFO  (OverseerStateUpdate-94111529028943875-127.0.0.1:48831_lo_i%2Fj-n_0000000000) [n:127.0.0.1:48831_lo_i%2Fj    ] o.a.s.c.o.ClusterStateMutator building a new cName: control_collection
   [junit4]   2> 228929 INFO  (OverseerStateUpdate-94111529028943875-127.0.0.1:48831_lo_i%2Fj-n_0000000000) [n:127.0.0.1:48831_lo_i%2Fj    ] o.a.s.c.o.ReplicaMutator Assigning new node to shard shard=shard1
   [junit4]   2> 228930 INFO  (zkCallback-110-thread-1-processing-n:127.0.0.1:48831_lo_i%2Fj) [n:127.0.0.1:48831_lo_i%2Fj    ] o.a.s.c.c.ZkStateReader A cluster state change: WatchedEvent state:SyncConnected type:NodeDataChanged path:/clusterstate.json, has occurred - updating... (live nodes size: 1)
   [junit4]   2> 228932 INFO  (zkCallback-110-thread-1-processing-n:127.0.0.1:48831_lo_i%2Fj) [n:127.0.0.1:48831_lo_i%2Fj    ] o.a.s.c.c.ZkStateReader Updated cluster state version to 1
   [junit4]   2> 229927 INFO  (coreLoadExecutor-536-thread-1-processing-n:127.0.0.1:48831_lo_i%2Fj) [n:127.0.0.1:48831_lo_i%2Fj c:control_collection   x:collection1] o.a.s.c.ZkController waiting to find shard id in clusterstate for collection1
   [junit4]   2> 229927 INFO  (coreLoadExecutor-536-thread-1-processing-n:127.0.0.1:48831_lo_i%2Fj) [n:127.0.0.1:48831_lo_i%2Fj c:control_collection   x:collection1] o.a.s.c.ZkController Check for collection zkNode:control_collection
   [junit4]   2> 229928 INFO  (coreLoadExecutor-536-thread-1-processing-n:127.0.0.1:48831_lo_i%2Fj) [n:127.0.0.1:48831_lo_i%2Fj c:control_collection   x:collection1] o.a.s.c.ZkController Collection zkNode exists
   [junit4]   2> 229928 INFO  (coreLoadExecutor-536-thread-1-processing-n:127.0.0.1:48831_lo_i%2Fj) [n:127.0.0.1:48831_lo_i%2Fj c:control_collection   x:collection1] o.a.s.c.c.ZkStateReader Load collection config from:/collections/control_collection
   [junit4]   2> 229929 INFO  (coreLoadExecutor-536-thread-1-processing-n:127.0.0.1:48831_lo_i%2Fj) [n:127.0.0.1:48831_lo_i%2Fj c:control_collection   x:collection1] o.a.s.c.c.ZkStateReader path=/collections/control_collection configName=conf1 specified config exists in ZooKeeper
   [junit4]   2> 229929 INFO  (coreLoadExecutor-536-thread-1-processing-n:127.0.0.1:48831_lo_i%2Fj) [n:127.0.0.1:48831_lo_i%2Fj c:control_collection   x:collection1] o.a.s.c.SolrResourceLoader new SolrResourceLoader for directory: '/x1/jenkins/jenkins-slave/workspace/Lucene-Solr-NightlyTests-5.x/solr/build/solr-core/test/J0/../../../../../../../../../../x1/jenkins/jenkins-slave/workspace/Lucene-Solr-NightlyTests-5.x/solr/build/solr-core/test/J0/temp/solr.cloud.ChaosMonkeyNothingIsSafeTest_CF40E7B32033B482-001/control-001/cores/collection1/'
   [junit4]   2> 229944 INFO  (coreLoadExecutor-536-thread-1-processing-n:127.0.0.1:48831_lo_i%2Fj) [n:127.0.0.1:48831_lo_i%2Fj c:control_collection   x:collection1] o.a.s.c.Config loaded config solrconfig.xml with version 0 
   [junit4]   2> 229951 INFO  (coreLoadExecutor-536-thread-1-processing-n:127.0.0.1:48831_lo_i%2Fj) [n:127.0.0.1:48831_lo_i%2Fj c:control_collection   x:collection1] o.a.s.c.SolrConfig current version of requestparams : -1
   [junit4]   2> 229964 INFO  (coreLoadExecutor-536-thread-1-processing-n:127.0.0.1:48831_lo_i%2Fj) [n:127.0.0.1:48831_lo_i%2Fj c:control_collection   x:collection1] o.a.s.c.SolrConfig Using Lucene MatchVersion: 5.3.0
   [junit4]   2> 230002 INFO  (coreLoadExecutor-536-thread-1-processing-n:127.0.0.1:48831_lo_i%2Fj) [n:127.0.0.1:48831_lo_i%2Fj c:control_collection   x:collection1] o.a.s.c.Config Loaded SolrConfig: solrconfig.xml
   [junit4]   2> 230003 INFO  (coreLoadExecutor-536-thread-1-processing-n:127.0.0.1:48831_lo_i%2Fj) [n:127.0.0.1:48831_lo_i%2Fj c:control_collection   x:collection1] o.a.s.s.IndexSchema Reading Solr Schema from /configs/conf1/schema.xml
   [junit4]   2> 230010 INFO  (coreLoadExecutor-536-thread-1-processing-n:127.0.0.1:48831_lo_i%2Fj) [n:127.0.0.1:48831_lo_i%2Fj c:control_collection   x:collection1] o.a.s.s.IndexSchema [collection1] Schema name=test
   [junit4]   2> 230208 INFO  (coreLoadExecutor-536-thread-1-processing-n:127.0.0.1:48831_lo_i%2Fj) [n:127.0.0.1:48831_lo_i%2Fj c:control_collection   x:collection1] o.a.s.s.IndexSchema default search field in schema is text
   [junit4]   2> 230210 INFO  (coreLoadExecutor-536-thread-1-processing-n:127.0.0.1:48831_lo_i%2Fj) [n:127.0.0.1:48831_lo_i%2Fj c:control_collection   x:collection1] o.a.s.s.IndexSchema unique key field: id
   [junit4]   2> 230218 INFO  (coreLoadExecutor-536-thread-1-processing-n:127.0.0.1:48831_lo_i%2Fj) [n:127.0.0.1:48831_lo_i%2Fj c:control_collection   x:collection1] o.a.s.s.FileExchangeRateProvider Reloading exchange rates from file currency.xml
   [junit4]   2> 230222 INFO  (coreLoadExecutor-536-thread-1-processing-n:127.0.0.1:48831_lo_i%2Fj) [n:127.0.0.1:48831_lo_i%2Fj c:control_collection   x:collection1] o.a.s.s.FileExchangeRateProvider Reloading exchange rates from file currency.xml
   [junit4]   2> 230249 INFO  (coreLoadExecutor-536-thread-1-processing-n:127.0.0.1:48831_lo_i%2Fj) [n:127.0.0.1:48831_lo_i%2Fj c:control_collection   x:collection1] o.a.s.c.CoreContainer Creating SolrCore 'collection1' using configuration from collection control_collection
   [junit4]   2> 230249 INFO  (coreLoadExecutor-536-thread-1-processing-n:127.0.0.1:48831_lo_i%2Fj) [n:127.0.0.1:48831_lo_i%2Fj c:control_collection s:shard1 r:core_node1 x:collection1] o.a.s.c.SolrCore solr.StandardDirectoryFactory
   [junit4]   2> 230249 INFO  (coreLoadExecutor-536-thread-1-processing-n:127.0.0.1:48831_lo_i%2Fj) [n:127.0.0.1:48831_lo_i%2Fj c:control_collection s:shard1 r:core_node1 x:collection1] o.a.s.c.SolrCore [[collection1] ] Opening new SolrCore at [/x1/jenkins/jenkins-slave/workspace/Lucene-Solr-NightlyTests-5.x/solr/build/solr-core/test/J0/../../../../../../../../../../x1/jenkins/jenkins-slave/workspace/Lucene-Solr-NightlyTests-5.x/solr/build/solr-core/test/J0/temp/solr.cloud.ChaosMonkeyNothingIsSafeTest_CF40E7B32033B482-001/control-001/cores/collection1/], dataDir=[null]
   [junit4]   2> 230249 INFO  (coreLoadExecutor-536-thread-1-processing-n:127.0.0.1:48831_lo_i%2Fj) [n:127.0.0.1:48831_lo_i%2Fj c:control_collection s:shard1 r:core_node1 x:collection1] o.a.s.c.JmxMonitoredMap JMX monitoring is enabled. Adding Solr mbeans to JMX Server: com.sun.jmx.mbeanserver.JmxMBeanServer@4e8ab79b
   [junit4]   2> 230250 INFO  (coreLoadExecutor-536-thread-1-processing-n:127.0.0.1:48831_lo_i%2Fj) [n:127.0.0.1:48831_lo_i%2Fj c:control_collection s:shard1 r:core_node1 x:collection1] o.a.s.c.CachingDirectoryFactory return new directory for /x1/jenkins/jenkins-slave/workspace/Lucene-Solr-NightlyTests-5.x/solr/build/solr-core/test/J0/temp/solr.cloud.ChaosMonkeyNothingIsSafeTest_CF40E7B32033B482-001/control-001/cores/collection1/data
   [junit4]   2> 230250 INFO  (coreLoadExecutor-536-thread-1-processing-n:127.0.0.1:48831_lo_i%2Fj) [n:127.0.0.1:48831_lo_i%2Fj c:control_collection s:shard1 r:core_node1 x:collection1] o.a.s.c.SolrCore New index directory detected: old=null new=/x1/jenkins/jenkins-slave/workspace/Lucene-Solr-NightlyTests-5.x/solr/build/solr-core/test/J0/temp/solr.cloud.ChaosMonkeyNothingIsSafeTest_CF40E7B32033B482-001/control-001/cores/collection1/data/index/
   [junit4]   2> 230251 WARN  (coreLoadExecutor-536-thread-1-processing-n:127.0.0.1:48831_lo_i%2Fj) [n:127.0.0.1:48831_lo_i%2Fj c:control_collection s:shard1 r:core_node1 x:collection1] o.a.s.c.SolrCore [collection1] Solr index directory '/x1/jenkins/jenkins-slave/workspace/Lucene-Solr-NightlyTests-5.x/solr/build/solr-core/test/J0/temp/solr.cloud.ChaosMonkeyNothingIsSafeTest_CF40E7B32033B482-001/control-001/cores/collection1/data/index' doesn't exist. Creating new index...
   [junit4]   2> 230251 INFO  (coreLoadExecutor-536-thread-1-processing-n:127.0.0.1:48831_lo_i%2Fj) [n:127.0.0.1:48831_lo_i%2Fj c:control_collection s:shard1 r:core_node1 x:collection1] o.a.s.c.CachingDirectoryFactory return new directory for /x1/jenkins/jenkins-slave/workspace/Lucene-Solr-NightlyTests-5.x/solr/build/solr-core/test/J0/temp/solr.cloud.ChaosMonkeyNothingIsSafeTest_CF40E7B32033B482-001/control-001/cores/collection1/data/index
   [junit4]   2> 230251 INFO  (coreLoadExecutor-536-thread-1-processing-n:127.0.0.1:48831_lo_i%2Fj) [n:127.0.0.1:48831_lo_i%2Fj c:control_collection s:shard1 r:core_node1 x:collection1] o.a.s.u.RandomMergePolicy RandomMergePolicy wrapping class org.apache.lucene.index.LogDocMergePolicy: [LogDocMergePolicy: minMergeSize=1000, mergeFactor=45, maxMergeSize=9223372036854775807, maxMergeSizeForForcedMerge=9223372036854775807, calibrateSizeByDeletes=true, maxMergeDocs=2147483647, maxCFSSegmentSizeMB=8.796093022207999E12, noCFSRatio=0.0]
   [junit4]   2> 230260 INFO  (coreLoadExecutor-536-thread-1-processing-n:127.0.0.1:48831_lo_i%2Fj) [n:127.0.0.1:48831_lo_i%2Fj c:control_collection s:shard1 r:core_node1 x:collection1] o.a.s.c.SolrCore SolrDeletionPolicy.onCommit: commits: num=1
   [junit4]   2> 	commit{dir=/x1/jenkins/jenkins-slave/workspace/Lucene-Solr-NightlyTests-5.x/solr/build/solr-core/test/J0/temp/solr.cloud.ChaosMonkeyNothingIsSafeTest_CF40E7B32033B482-001/control-001/cores/collection1/data/index,segFN=segments_1,generation=1}
   [junit4]   2> 230261 INFO  (coreLoadExecutor-536-thread-1-processing-n:127.0.0.1:48831_lo_i%2Fj) [n:127.0.0.1:48831_lo_i%2Fj c:control_collection s:shard1 r:core_node1 x:collection1] o.a.s.c.SolrCore newest commit generation = 1
   [junit4]   2> 230261 INFO  (OldIndexDirectoryCleanupThreadForCore-collection1) [n:127.0.0.1:48831_lo_i%2Fj c:control_collection s:shard1 r:core_node1 x:collection1] o.a.s.c.SolrCore Looking for old index directories to cleanup for core collection1 in /x1/jenkins/jenkins-slave/workspace/Lucene-Solr-NightlyTests-5.x/solr/build/solr-core/test/J0/temp/solr.cloud.ChaosMonkeyNothingIsSafeTest_CF40E7B32033B482-001/control-001/cores/collection1/data/
   [junit4]   2> 230268 INFO  (coreLoadExecutor-536-thread-1-processing-n:127.0.0.1:48831_lo_i%2Fj) [n:127.0.0.1:48831_lo_i%2Fj c:control_collection s:shard1 r:core_node1 x:collection1] o.a.s.u.p.UpdateRequestProcessorChain creating updateRequestProcessorChain "nodistrib"
   [junit4]   2> 230268 INFO  (coreLoadExecutor-536-thread-1-processing-n:127.0.0.1:48831_lo_i%2Fj) [n:127.0.0.1:48831_lo_i%2Fj c:control_collection s:shard1 r:core_node1 x:collection1] o.a.s.u.p.UpdateRequestProcessorChain creating updateRequestProcessorChain "dedupe"
   [junit4]   2> 230268 INFO  (coreLoadExecutor-536-thread-1-processing-n:127.0.0.1:48831_lo_i%2Fj) [n:127.0.0.1:48831_lo_i%2Fj c:control_collection s:shard1 r:core_node1 x:collection1] o.a.s.u.p.UpdateRequestProcessorChain inserting DistributedUpdateProcessorFactory into updateRequestProcessorChain "dedupe"
   [junit4]   2> 230269 INFO  (coreLoadExecutor-536-thread-1-processing-n:127.0.0.1:48831_lo_i%2Fj) [n:127.0.0.1:48831_lo_i%2Fj c:control_collection s:shard1 r:core_node1 x:collection1] o.a.s.u.p.UpdateRequestProcessorChain creating updateRequestProcessorChain "stored_sig"
   [junit4]   2> 230269 INFO  (coreLoadExecutor-536-thread-1-processing-n:127.0.0.1:48831_lo_i%2Fj) [n:127.0.0.1:48831_lo_i%2Fj c:control_collection s:shard1 r:core_node1 x:collection1] o.a.s.u.p.UpdateRequestProcessorChain inserting DistributedUpdateProcessorFactory into updateRequestProcessorChain "stored_sig"
   [junit4]   2> 230269 INFO  (coreLoadExecutor-536-thread-1-processing-n:127.0.0.1:48831_lo_i%2Fj) [n:127.0.0.1:48831_lo_i%2Fj c:control_collection s:shard1 r:core_node1 x:collection1] o.a.s.u.p.UpdateRequestProcessorChain creating updateRequestProcessorChain "distrib-dup-test-chain-explicit"
   [junit4]   2> 230269 INFO  (coreLoadExecutor-536-thread-1-processing-n:127.0.0.1:48831_lo_i%2Fj) [n:127.0.0.1:48831_lo_i%2Fj c:control_collection s:shard1 r:core_node1 x:collection1] o.a.s.u.p.UpdateRequestProcessorChain creating updateRequestProcessorChain "distrib-dup-test-chain-implicit"
   [junit4]   2> 230269 INFO  (coreLoadExecutor-536-thread-1-processing-n:127.0.0.1:48831_lo_i%2Fj) [n:127.0.0.1:48831_lo_i%2Fj c:control_collection s:shard1 r:core_node1 x:collection1] o.a.s.u.p.UpdateRequestProcessorChain inserting DistributedUpdateProcessorFactory into updateRequestProcessorChain "distrib-dup-test-chain-implicit"
   [junit4]   2> 230269 INFO  (coreLoadExecutor-536-thread-1-processing-n:127.0.0.1:48831_lo_i%2Fj) [n:127.0.0.1:48831_lo_i%2Fj c:control_collection s:shard1 r:core_node1 x:collection1] o.a.s.c.SolrCore no updateRequestProcessorChain defined as default, creating implicit default
   [junit4]   2> 230273 INFO  (coreLoadExecutor-536-thread-1-processing-n:127.0.0.1:48831_lo_i%2Fj) [n:127.0.0.1:48831_lo_i%2Fj c:control_collection s:shard1 r:core_node1 x:collection1] o.a.s.h.l.XMLLoader xsltCacheLifetimeSeconds=60
   [junit4]   2> 230274 INFO  (coreLoadExecutor-536-thread-1-processing-n:127.0.0.1:48831_lo_i%2Fj) [n:127.0.0.1:48831_lo_i%2Fj c:control_collection s:shard1 r:core_node1 x:collection1] o.a.s.h.l.XMLLoader xsltCacheLifetimeSeconds=60
   [junit4]   2> 230276 INFO  (coreLoadExecutor-536-thread-1-processing-n:127.0.0.1:48831_lo_i%2Fj) [n:127.0.0.1:48831_lo_i%2Fj c:control_collection s:shard1 r:core_node1 x:collection1] o.a.s.h.l.XMLLoader xsltCacheLifetimeSeconds=60
   [junit4]   2> 230277 INFO  (coreLoadExecutor-536-thread-1-processing-n:127.0.0.1:48831_lo_i%2Fj) [n:127.0.0.1:48831_lo_i%2Fj c:control_collection s:shard1 r:core_node1 x:collection1] o.a.s.h.l.XMLLoader xsltCacheLifetimeSeconds=60
   [junit4]   2> 230281 INFO  (coreLoadExecutor-536-thread-1-processing-n:127.0.0.1:48831_lo_i%2Fj) [n:127.0.0.1:48831_lo_i%2Fj c:control_collection s:shard1 r:core_node1 x:collection1] o.a.s.c.RequestHandlers Registered paths: /admin/mbeans,/admin/system,/config,/admin/luke,/admin/threads,/get,/replication,/admin/plugins,/admin/properties,/update/csv,/update,standard,/update/json/docs,/admin/logging,/admin/file,/schema,/admin/ping,/update/json,/admin/segments
   [junit4]   2> 230283 INFO  (coreLoadExecutor-536-thread-1-processing-n:127.0.0.1:48831_lo_i%2Fj) [n:127.0.0.1:48831_lo_i%2Fj c:control_collection s:shard1 r:core_node1 x:collection1] o.a.s.c.SolrCore Using default statsCache cache: org.apache.solr.search.stats.LocalStatsCache
   [junit4]   2> 230283 INFO  (coreLoadExecutor-536-thread-1-processing-n:127.0.0.1:48831_lo_i%2Fj) [n:127.0.0.1:48831_lo_i%2Fj c:control_collection s:shard1 r:core_node1 x:collection1] o.a.s.u.UpdateHandler Using UpdateLog implementation: org.apache.solr.update.UpdateLog
   [junit4]   2> 230283 INFO  (coreLoadExecutor-536-thread-1-processing-n:127.0.0.1:48831_lo_i%2Fj) [n:127.0.0.1:48831_lo_i%2Fj c:control_collection s:shard1 r:core_node1 x:collection1] o.a.s.u.UpdateLog Initializing UpdateLog: dataDir= defaultSyncLevel=FLUSH numRecordsToKeep=100 maxNumLogsToKeep=10 numVersionBuckets=65536
   [junit4]   2> 230284 INFO  (coreLoadExecutor-536-thread-1-processing-n:127.0.0.1:48831_lo_i%2Fj) [n:127.0.0.1:48831_lo_i%2Fj c:control_collection s:shard1 r:core_node1 x:collection1] o.a.s.c.SolrCore Hard AutoCommit: disabled
   [junit4]   2> 230284 INFO  (coreLoadExecutor-536-thread-1-processing-n:127.0.0.1:48831_lo_i%2Fj) [n:127.0.0.1:48831_lo_i%2Fj c:control_collection s:shard1 r:core_node1 x:collection1] o.a.s.c.SolrCore Soft AutoCommit: disabled
   [junit4]   2> 230285 INFO  (coreLoadExecutor-536-thread-1-processing-n:127.0.0.1:48831_lo_i%2Fj) [n:127.0.0.1:48831_lo_i%2Fj c:control_collection s:shard1 r:core_node1 x:collection1] o.a.s.u.RandomMergePolicy RandomMergePolicy wrapping class org.apache.lucene.index.TieredMergePolicy: [TieredMergePolicy: maxMergeAtOnce=13, maxMergeAtOnceExplicit=18, maxMergedSegmentMB=78.2060546875, floorSegmentMB=0.869140625, forceMergeDeletesPctAllowed=16.828308642486917, segmentsPerTier=50.0, maxCFSSegmentSizeMB=8.796093022207999E12, noCFSRatio=0.23013916795504646
   [junit4]   2> 230286 INFO  (coreLoadExecutor-536-thread-1-processing-n:127.0.0.1:48831_lo_i%2Fj) [n:127.0.0.1:48831_lo_i%2Fj c:control_collection s:shard1 r:core_node1 x:collection1] o.a.s.c.SolrCore SolrDeletionPolicy.onInit: commits: num=1
   [junit4]   2> 	commit{dir=/x1/jenkins/jenkins-slave/workspace/Lucene-Solr-NightlyTests-5.x/solr/build/solr-core/test/J0/temp/solr.cloud.ChaosMonkeyNothingIsSafeTest_CF40E7B32033B482-001/control-001/cores/collection1/data/index,segFN=segments_1,generation=1}
   [junit4]   2> 230286 INFO  (coreLoadExecutor-536-thread-1-processing-n:127.0.0.1:48831_lo_i%2Fj) [n:127.0.0.1:48831_lo_i%2Fj c:control_collection s:shard1 r:core_node1 x:collection1] o.a.s.c.SolrCore newest commit generation = 1
   [junit4]   2> 230286 INFO  (coreLoadExecutor-536-thread-1-processing-n:127.0.0.1:48831_lo_i%2Fj) [n:127.0.0.1:48831_lo_i%2Fj c:control_collection s:shard1 r:core_node1 x:collection1] o.a.s.s.SolrIndexSearcher Opening Searcher@530e0f85[collection1] main
   [junit4]   2> 230286 INFO  (coreLoadExecutor-536-thread-1-processing-n:127.0.0.1:48831_lo_i%2Fj) [n:127.0.0.1:48831_lo_i%2Fj c:control_collection s:shard1 r:core_node1 x:collection1] o.a.s.c.c.ZkStateReader Load collection config from:/collections/control_collection
   [junit4]   2> 230287 INFO  (coreLoadExecutor-536-thread-1-processing-n:127.0.0.1:48831_lo_i%2Fj) [n:127.0.0.1:48831_lo_i%2Fj c:control_collection s:shard1 r:core_node1 x:collection1] o.a.s.c.c.ZkStateReader path=/collections/control_collection configName=conf1 specified config exists in ZooKeeper
   [junit4]   2> 230287 INFO  (coreLoadExecutor-536-thread-1-processing-n:127.0.0.1:48831_lo_i%2Fj) [n:127.0.0.1:48831_lo_i%2Fj c:control_collection s:shard1 r:core_node1 x:collection1] o.a.s.r.ManagedResourceStorage Setting up ZooKeeper-based storage for the RestManager with znodeBase: /configs/conf1
   [junit4]   2> 230288 INFO  (coreLoadExecutor-536-thread-1-processing-n:127.0.0.1:48831_lo_i%2Fj) [n:127.0.0.1:48831_lo_i%2Fj c:control_collection s:shard1 r:core_node1 x:collection1] o.a.s.r.ManagedResourceStorage Configured ZooKeeperStorageIO with znodeBase: /configs/conf1
   [junit4]   2> 230288 INFO  (coreLoadExecutor-536-thread-1-processing-n:127.0.0.1:48831_lo_i%2Fj) [n:127.0.0.1:48831_lo_i%2Fj c:control_collection s:shard1 r:core_node1 x:collection1] o.a.s.r.RestManager Initializing RestManager with initArgs: {}
   [junit4]   2> 230288 INFO  (coreLoadExecutor-536-thread-1-processing-n:127.0.0.1:48831_lo_i%2Fj) [n:127.0.0.1:48831_lo_i%2Fj c:control_collection s:shard1 r:core_node1 x:collection1] o.a.s.r.ManagedResourceStorage Reading _rest_managed.json using ZooKeeperStorageIO:path=/configs/conf1
   [junit4]   2> 230289 INFO  (coreLoadExecutor-536-thread-1-processing-n:127.0.0.1:48831_lo_i%2Fj) [n:127.0.0.1:48831_lo_i%2Fj c:control_collection s:shard1 r:core_node1 x:collection1] o.a.s.r.ManagedResourceStorage No data found for znode /configs/conf1/_rest_managed.json
   [junit4]   2> 230289 INFO  (coreLoadExecutor-536-thread-1-processing-n:127.0.0.1:48831_lo_i%2Fj) [n:127.0.0.1:48831_lo_i%2Fj c:control_collection s:shard1 r:core_node1 x:collection1] o.a.s.r.ManagedResourceStorage Loaded null at path _rest_managed.json using ZooKeeperStorageIO:path=/configs/conf1
   [junit4]   2> 230289 INFO  (coreLoadExecutor-536-thread-1-processing-n:127.0.0.1:48831_lo_i%2Fj) [n:127.0.0.1:48831_lo_i%2Fj c:control_collection s:shard1 r:core_node1 x:collection1] o.a.s.r.RestManager Initializing 0 registered ManagedResources
   [junit4]   2> 230289 INFO  (coreLoadExecutor-536-thread-1-processing-n:127.0.0.1:48831_lo_i%2Fj) [n:127.0.0.1:48831_lo_i%2Fj c:control_collection s:shard1 r:core_node1 x:collection1] o.a.s.h.ReplicationHandler Commits will be reserved for  10000
   [junit4]   2> 230290 INFO  (searcherExecutor-537-thread-1-processing-s:shard1 c:control_collection r:core_node1 x:collection1 n:127.0.0.1:48831_lo_i%2Fj) [n:127.0.0.1:48831_lo_i%2Fj c:control_collection s:shard1 r:core_node1 x:collection1] o.a.s.c.SolrCore [collection1] Registered new searcher Searcher@530e0f85[collection1] main{ExitableDirectoryReader(UninvertingDirectoryReader())}
   [junit4]   2> 230290 INFO  (coreLoadExecutor-536-thread-1-processing-n:127.0.0.1:48831_lo_i%2Fj) [n:127.0.0.1:48831_lo_i%2Fj c:control_collection s:shard1 r:core_node1 x:collection1] o.a.s.u.UpdateLog Looking up max value of version field to seed version buckets
   [junit4]   2> 230290 INFO  (coreLoadExecutor-536-thread-1-processing-n:127.0.0.1:48831_lo_i%2Fj) [n:127.0.0.1:48831_lo_i%2Fj c:control_collection s:shard1 r:core_node1 x:collection1] o.a.s.u.VersionInfo Refreshing highest value of _version_ for 65536 version buckets from index
   [junit4]   2> 230290 INFO  (coreLoadExecutor-536-thread-1-processing-n:127.0.0.1:48831_lo_i%2Fj) [n:127.0.0.1:48831_lo_i%2Fj c:control_collection s:shard1 r:core_node1 x:collection1] o.a.s.u.VersionInfo No terms found for _version_, cannot seed version bucket highest value from index
   [junit4]   2> 230291 INFO  (coreLoadExecutor-536-thread-1-processing-n:127.0.0.1:48831_lo_i%2Fj) [n:127.0.0.1:48831_lo_i%2Fj c:control_collection s:shard1 r:core_node1 x:collection1] o.a.s.u.UpdateLog Could not find max version in index or recent updates, using new clock 1505784466442813440
   [junit4]   2> 230293 INFO  (coreLoadExecutor-536-thread-1-processing-n:127.0.0.1:48831_lo_i%2Fj) [n:127.0.0.1:48831_lo_i%2Fj c:control_collection s:shard1 r:core_node1 x:collection1] o.a.s.u.UpdateLog Took 3 ms to seed version buckets with highest version 1505784466442813440
   [junit4]   2> 230293 INFO  (coreLoadExecutor-536-thread-1-processing-n:127.0.0.1:48831_lo_i%2Fj) [n:127.0.0.1:48831_lo_i%2Fj c:control_collection s:shard1 r:core_node1 x:collection1] o.a.s.c.ZkController watch zkdir /configs/conf1
   [junit4]   2> 230293 INFO  (coreLoadExecutor-536-thread-1-processing-n:127.0.0.1:48831_lo_i%2Fj) [n:127.0.0.1:48831_lo_i%2Fj c:control_collection s:shard1 r:core_node1 x:collection1] o.a.s.c.CoreContainer registering core: collection1
   [junit4]   2> 230294 INFO  (coreZkRegister-530-thread-1-processing-s:shard1 c:control_collection r:core_node1 x:collection1 n:127.0.0.1:48831_lo_i%2Fj) [n:127.0.0.1:48831_lo_i%2Fj c:control_collection s:shard1 r:core_node1 x:collection1] o.a.s.c.ZkController Register replica - core:collection1 address:http://127.0.0.1:48831/lo_i/j collection:control_collection shard:shard1
   [junit4]   2> 230295 INFO  (coreZkRegister-530-thread-1-processing-s:shard1 c:control_collection r:core_node1 x:collection1 n:127.0.0.1:48831_lo_i%2Fj) [n:127.0.0.1:48831_lo_i%2Fj c:control_collection s:shard1 r:core_node1 x:collection1] o.a.s.c.c.SolrZkClient makePath: /collections/control_collection/leader_elect/shard1/election
   [junit4]   2> 230300 INFO  (coreZkRegister-530-thread-1-processing-s:shard1 c:control_collection r:core_node1 x:collection1 n:127.0.0.1:48831_lo_i%2Fj) [n:127.0.0.1:48831_lo_i%2Fj c:control_collection s:shard1 r:core_node1 x:collection1] o.a.s.c.LeaderElector Joined leadership election with path: /collections/control_collection/leader_elect/shard1/election/94111529028943875-core_node1-n_0000000000
   [junit4]   2> 230301 INFO  (coreZkRegister-530-thread-1-processing-s:shard1 c:control_collection r:core_node1 x:collection1 n:127.0.0.1:48831_lo_i%2Fj) [n:127.0.0.1:48831_lo_i%2Fj c:control_collection s:shard1 r:core_node1 x:collection1] o.a.s.c.ShardLeaderElectionContext Running the leader process for shard shard1
   [junit4]   2> 230302 INFO  (zkCallback-110-thread-1-processing-n:127.0.0.1:48831_lo_i%2Fj) [n:127.0.0.1:48831_lo_i%2Fj    ] o.a.s.c.DistributedQueue NodeChildrenChanged fired on path /overseer/queue state SyncConnected
   [junit4]   2> 230303 INFO  (coreZkRegister-530-thread-1-processing-s:shard1 c:control_collection r:core_node1 x:collection1 n:127.0.0.1:48831_lo_i%2Fj) [n:127.0.0.1:48831_lo_i%2Fj c:control_collection s:shard1 r:core_node1 x:collection1] o.a.s.c.ShardLeaderElectionContext Enough replicas found to continue.
   [junit4]   2> 230303 INFO  (coreZkRegister-530-thread-1-processing-s:shard1 c:control_collection r:core_node1 x:collection1 n:127.0.0.1:48831_lo_i%2Fj) [n:127.0.0.1:48831_lo_i%2Fj c:control_collection s:shard1 r:core_node1 x:collection1] o.a.s.c.ShardLeaderElectionContext I may be the new leader - try and sync
   [junit4]   2> 230303 INFO  (OverseerStateUpdate-94111529028943875-127.0.0.1:48831_lo_i%2Fj-n_0000000000) [n:127.0.0.1:48831_lo_i%2Fj    ] o.a.s.c.Overseer processMessage: queueSize: 1, message = {
   [junit4]   2>   "operation":"leader",
   [junit4]   2>   "shard":"shard1",
   [junit4]   2>   "collection":"control_collection"} current state version: 1
   [junit4]   2> 230303 INFO  (coreZkRegister-530-thread-1-processing-s:shard1 c:control_collection r:core_node1 x:collection1 n:127.0.0.1:48831_lo_i%2Fj) [n:127.0.0.1:48831_lo_i%2Fj c:control_collection s:shard1 r:core_node1 x:collection1] o.a.s.c.SyncStrategy Sync replicas to http://127.0.0.1:48831/lo_i/j/collection1/
   [junit4]   2> 230304 INFO  (coreZkRegister-530-thread-1-processing-s:shard1 c:control_collection r:core_node1 x:collection1 n:127.0.0.1:48831_lo_i%2Fj) [n:127.0.0.1:48831_lo_i%2Fj c:control_collection s:shard1 r:core_node1 x:collection1] o.a.s.c.SyncStrategy Sync Success - now sync replicas to me
   [junit4]   2> 230304 INFO  (coreZkRegister-530-thread-1-processing-s:shard1 c:control_collection r:core_node1 x:collection1 n:127.0.0.1:48831_lo_i%2Fj) [n:127.0.0.1:48831_lo_i%2Fj c:control_collection s:shard1 r:core_node1 x:collection1] o.a.s.c.SyncStrategy http://127.0.0.1:48831/lo_i/j/collection1/ has no replicas
   [junit4]   2> 230304 INFO  (coreZkRegister-530-thread-1-processing-s:shard1 c:control_collection r:core_node1 x:collection1 n:127.0.0.1:48831_lo_i%2Fj) [n:127.0.0.1:48831_lo_i%2Fj c:control_collection s:shard1 r:core_node1 x:collection1] o.a.s.c.ShardLeaderElectionContext I am the new leader: http://127.0.0.1:48831/lo_i/j/collection1/ shard1
   [junit4]   2> 230304 INFO  (coreZkRegister-530-thread-1-processing-s:shard1 c:control_collection r:core_node1 x:collection1 n:127.0.0.1:48831_lo_i%2Fj) [n:127.0.0.1:48831_lo_i%2Fj c:control_collection s:shard1 r:core_node1 x:collection1] o.a.s.c.c.SolrZkClient makePath: /collections/control_collection/leaders/shard1
   [junit4]   2> 230308 INFO  (zkCallback-110-thread-1-processing-n:127.0.0.1:48831_lo_i%2Fj) [n:127.0.0.1:48831_lo_i%2Fj    ] o.a.s.c.DistributedQueue NodeChildrenChanged fired on path /overseer/queue state SyncConnected
   [junit4]   2> 230309 INFO  (OverseerStateUpdate-94111529028943875-127.0.0.1:48831_lo_i%2Fj-n_0000000000) [n:127.0.0.1:48831_lo_i%2Fj    ] o.a.s.c.Overseer processMessage: queueSize: 1, message = {
   [junit4]   2>   "operation":"leader",
   [junit4]   2>   "shard":"shard1",
   [junit4]   2>   "collection":"control_collection",
   [junit4]   2>   "base_url":"http://127.0.0.1:48831/lo_i/j",
   [junit4]   2>   "core":"collection1",
   [junit4]   2>   "state":"active"} current state version: 1
   [junit4]   2> 230412 INFO  (zkCallback-110-thread-1-processing-n:127.0.0.1:48831_lo_i%2Fj) [n:127.0.0.1:48831_lo_i%2Fj    ] o.a.s.c.c.ZkStateReader A cluster state change: WatchedEvent state:SyncConnected type:NodeDataChanged path:/clusterstate.json, has occurred - updating... (live nodes size: 1)
   [junit4]   2> 230414 INFO  (zkCallback-110-thread-1-processing-n:127.0.0.1:48831_lo_i%2Fj) [n:127.0.0.1:48831_lo_i%2Fj    ] o.a.s.c.c.ZkStateReader Updated cluster state version to 2
   [junit4]   2> 230428 INFO  (TEST-ChaosMonkeyNothingIsSafeTest.test-seed#[CF40E7B32033B482]) [    ] o.a.s.c.c.SolrZkClient Using default ZkCredentialsProvider
   [junit4]   2> 230430 INFO  (TEST-ChaosMonkeyNothingIsSafeTest.test-seed#[CF40E7B32033B482]) [    ] o.a.s.c.c.ConnectionManager Waiting for client to connect to ZooKeeper
   [junit4]   2> 230430 INFO  (zkCallback-112-thread-1) [    ] o.a.s.c.c.ConnectionManager Watcher org.apache.solr.common.cloud.ConnectionManager@5d1c92cf name:ZooKeeperConnection Watcher:127.0.0.1:33751/solr got event WatchedEvent state:SyncConnected type:None path:null path:null type:None
   [junit4]   2> 230431 INFO  (TEST-ChaosMonkeyNothingIsSafeTest.test-seed#[CF40E7B32033B482]) [    ] o.a.s.c.c.ConnectionManager Client is connected to ZooKeeper
   [junit4]   2> 230431 INFO  (TEST-ChaosMonkeyNothingIsSafeTest.test-seed#[CF40E7B32033B482]) [    ] o.a.s.c.c.SolrZkClient Using default ZkACLProvider
   [junit4]   2> 230431 INFO  (TEST-ChaosMonkeyNothingIsSafeTest.test-seed#[CF40E7B32033B482]) [    ] o.a.s.c.c.ZkStateReader Updating cluster state from ZooKeeper... 
   [junit4]   2> 230434 INFO  (TEST-ChaosMonkeyNothingIsSafeTest.test-seed#[CF40E7B32033B482]) [    ] o.a.s.c.ChaosMonkey monkey: init - expire sessions:false cause connection loss:false
   [junit4]   2> 230460 INFO  (coreZkRegister-530-thread-1-processing-s:shard1 c:control_collection r:core_node1 x:collection1 n:127.0.0.1:48831_lo_i%2Fj) [n:127.0.0.1:48831_lo_i%2Fj c:control_collection s:shard1 r:core_node1 x:collection1] o.a.s.c.ZkController We are http://127.0.0.1:48831/lo_i/j/collection1/ and leader is http://127.0.0.1:48831/lo_i/j/collection1/
   [junit4]   2> 230460 INFO  (coreZkRegister-530-thread-1-processing-s:shard1 c:control_collection r:core_node1 x:collection1 n:127.0.0.1:48831_lo_i%2Fj) [n:127.0.0.1:48831_lo_i%2Fj c:control_collection s:shard1 r:core_node1 x:collection1] o.a.s.c.ZkController No LogReplay needed for core=collection1 baseURL=http://127.0.0.1:48831/lo_i/j
   [junit4]   2> 230460 INFO  (coreZkRegister-530-thread-1-processing-s:shard1 c:control_collection r:core_node1 x:collection1 n:127.0.0.1:48831_lo_i%2Fj) [n:127.0.0.1:48831_lo_i%2Fj c:control_collection s:shard1 r:core_node1 x:collection1] o.a.s.c.ZkController I am the leader, no recovery necessary
   [junit4]   2> 230460 INFO  (coreZkRegister-530-thread-1-processing-s:shard1 c:control_collection r:core_node1 x:collection1 n:127.0.0.1:48831_lo_i%2Fj) [n:127.0.0.1:48831_lo_i%2Fj c:control_collection s:shard1 r:core_node1 x:collection1] o.a.s.c.ZkController publishing state=active
   [junit4]   2> 230460 INFO  (coreZkRegister-530-thread-1-processing-s:shard1 c:control_collection r:core_node1 x:collection1 n:127.0.0.1:48831_lo_i%2Fj) [n:127.0.0.1:48831_lo_i%2Fj c:control_collection s:shard1 r:core_node1 x:collection1] o.a.s.c.ZkController numShards not found on descriptor - reading it from system property
   [junit4]   2> 230462 INFO  (zkCallback-110-thread-1-processing-n:127.0.0.1:48831_lo_i%2Fj) [n:127.0.0.1:48831_lo_i%2Fj    ] o.a.s.c.DistributedQueue NodeChildrenChanged fired on path /overseer/queue state SyncConnected
   [junit4]   2> 230463 INFO  (OverseerStateUpdate-94111529028943875-127.0.0.1:48831_lo_i%2Fj-n_0000000000) [n:127.0.0.1:48831_lo_i%2Fj    ] o.a.s.c.Overseer processMessage: queueSize: 1, message = {
   [junit4]   2>   "core_node_name":"core_node1",
   [junit4]   2>   "numShards":"2",
   [junit4]   2>   "base_url":"http://127.0.0.1:48831/lo_i/j",
   [junit4]   2>   "roles":null,
   [junit4]   2>   "operation":"state",
   [junit4]   2>   "shard":"shard1",
   [junit4]   2>   "collection":"control_collection",
   [junit4]   2>   "state":"active",
   [junit4]   2>   "core":"collection1",
   [junit4]   2>   "node_name":"127.0.0.1:48831_lo_i%2Fj"} current state version: 2
   [junit4]   2> 230464 INFO  (OverseerStateUpdate-94111529028943875-127.0.0.1:48831_lo_i%2Fj-n_0000000000) [n:127.0.0.1:48831_lo_i%2Fj    ] o.a.s.c.o.ReplicaMutator Update state numShards=2 message={
   [junit4]   2>   "core_node_name":"core_node1",
   [junit4]   2>   "numShards":"2",
   [junit4]   2>   "base_url":"http://127.0.0.1:48831/lo_i/j",
   [junit4]   2>   "roles":null,
   [junit4]   2>   "operation":"state",
   [junit4]   2>   "shard":"shard1",
   [junit4]   2>   "collection":"control_collection",
   [junit4]   2>   "state":"active",
   [junit4]   2>   "core":"collection1",
   [junit4]   2>   "node_name":"127.0.0.1:48831_lo_i%2Fj"}
   [junit4]   2> 230567 INFO  (zkCallback-112-thread-1) [    ] o.a.s.c.c.ZkStateReader A cluster state change: WatchedEvent state:SyncConnected type:NodeDataChanged path:/clusterstate.json, has occurred - updating... (live nodes size: 1)
   [junit4]   2> 230567 INFO  (zkCallback-110-thread-1-processing-n:127.0.0.1:48831_lo_i%2Fj) [n:127.0.0.1:48831_lo_i%2Fj    ] o.a.s.c.c.ZkStateReader A cluster state change: WatchedEvent state:SyncConnected type:NodeDataChanged path:/clusterstate.json, has occurred - updating... (live nodes size: 1)
   [junit4]   2> 230575 INFO  (zkCallback-112-thread-1) [    ] o.a.s.c.c.ZkStateReader Updated cluster state version to 3
   [junit4]   2> 230575 INFO  (zkCallback-110-thread-1-processing-n:127.0.0.1:48831_lo_i%2Fj) [n:127.0.0.1:48831_lo_i%2Fj    ] o.a.s.c.c.ZkStateReader Updated cluster state version to 3
   [junit4]   2> 230724 INFO  (TEST-ChaosMonkeyNothingIsSafeTest.test-seed#[CF40E7B32033B482]) [    ] o.a.s.SolrTestCaseJ4 Writing core.properties file to /x1/jenkins/jenkins-slave/workspace/Lucene-Solr-NightlyTests-5.x/solr/build/solr-core/test/J0/temp/solr.cloud.ChaosMonkeyNothingIsSafeTest_CF40E7B32033B482-001/shard-1-001/cores/collection1
   [junit4]   2> 230725 INFO  (TEST-ChaosMonkeyNothingIsSafeTest.test-seed#[CF40E7B32033B482]) [    ] o.a.s.c.AbstractFullDistribZkTestBase create jetty 1 in directory /x1/jenkins/jenkins-slave/workspace/Lucene-Solr-NightlyTests-5.x/solr/build/solr-core/test/J0/temp/solr.cloud.ChaosMonkeyNothingIsSafeTest_CF40E7B32033B482-001/shard-1-001
   [junit4]   2> 230726 INFO  (TEST-ChaosMonkeyNothingIsSafeTest.test-seed#[CF40E7B32033B482]) [    ] o.e.j.s.Server jetty-9.2.11.v20150529
   [junit4]   2> 230728 INFO  (TEST-ChaosMonkeyNothingIsSafeTest.test-seed#[CF40E7B32033B482]) [    ] o.e.j.s.h.ContextHandler Started o.e.j.s.ServletContextHandler@3b49d172{/lo_i/j,null,AVAILABLE}
   [junit4]   2> 230729 INFO  (TEST-ChaosMonkeyNothingIsSafeTest.test-seed#[CF40E7B32033B482]) [    ] o.e.j.s.ServerConnector Started ServerConnector@470a7537{HTTP/1.1}{127.0.0.1:39998}
   [junit4]   2> 230729 INFO  (TEST-ChaosMonkeyNothingIsSafeTest.test-seed#[CF40E7B32033B482]) [    ] o.e.j.s.Server Started @233655ms
   [junit4]   2> 230729 INFO  (TEST-ChaosMonkeyNothingIsSafeTest.test-seed#[CF40E7B32033B482]) [    ] o.a.s.c.s.e.JettySolrRunner Jetty properties: {hostContext=/lo_i/j, solrconfig=solrconfig.xml, coreRootDirectory=/x1/jenkins/jenkins-slave/workspace/Lucene-Solr-NightlyTests-5.x/solr/build/solr-core/test/J0/temp/solr.cloud.ChaosMonkeyNothingIsSafeTest_CF40E7B32033B482-001/shard-1-001/cores, hostPort=39998, solr.data.dir=/x1/jenkins/jenkins-slave/workspace/Lucene-Solr-NightlyTests-5.x/solr/build/solr-core/test/J0/temp/solr.cloud.ChaosMonkeyNothingIsSafeTest_CF40E7B32033B482-001/tempDir-001/jetty1}
   [junit4]   2> 230730 INFO  (TEST-ChaosMonkeyNothingIsSafeTest.test-seed#[CF40E7B32033B482]) [    ] o.a.s.s.SolrDispatchFilter SolrDispatchFilter.init(): sun.misc.Launcher$AppClassLoader@1fe91485
   [junit4]   2> 230730 INFO  (TEST-ChaosMonkeyNothingIsSafeTest.test-seed#[CF40E7B32033B482]) [    ] o.a.s.c.SolrResourceLoader new SolrResourceLoader for directory: '/x1/jenkins/jenkins-slave/workspace/Lucene-Solr-NightlyTests-5.x/solr/build/solr-core/test/J0/temp/solr.cloud.ChaosMonkeyNothingIsSafeTest_CF40E7B32033B482-001/shard-1-001/'
   [junit4]   2> 230746 INFO  (TEST-ChaosMonkeyNothingIsSafeTest.test-seed#[CF40E7B32033B482]) [    ] o.a.s.c.SolrXmlConfig Loading container configuration from /x1/jenkins/jenkins-slave/workspace/Lucene-Solr-NightlyTests-5.x/solr/build/solr-core/test/J0/temp/solr.cloud.ChaosMonkeyNothingIsSafeTest_CF40E7B32033B482-001/shard-1-001/solr.xml
   [junit4]   2> 230760 INFO  (TEST-ChaosMonkeyNothingIsSafeTest.test-seed#[CF40E7B32033B482]) [    ] o.a.s.c.CoresLocator Config-defined core root directory: /x1/jenkins/jenkins-slave/workspace/Lucene-Solr-NightlyTests-5.x/solr/build/solr-core/test/J0/temp/solr.cloud.ChaosMonkeyNothingIsSafeTest_CF40E7B32033B482-001/shard-1-001/cores
   [junit4]   2> 230760 INFO  (TEST-ChaosMonkeyNothingIsSafeTest.test-seed#[CF40E7B32033B482]) [    ] o.a.s.c.CoreContainer New CoreContainer 625788784
   [junit4]   2> 230760 INFO  (TEST-ChaosMonkeyNothingIsSafeTest.test-seed#[CF40E7B32033B482]) [    ] o.a.s.c.CoreContainer Loading cores into CoreContainer [instanceDir=/x1/jenkins/jenkins-slave/workspace/Lucene-Solr-NightlyTests-5.x/solr/build/solr-core/test/J0/temp/solr.cloud.ChaosMonkeyNothingIsSafeTest_CF40E7B32033B482-001/shard-1-001/]
   [junit4]   2> 230760 INFO  (TEST-ChaosMonkeyNothingIsSafeTest.test-seed#[CF40E7B32033B482]) [    ] o.a.s.c.CoreContainer loading shared library: /x1/jenkins/jenkins-slave/workspace/Lucene-Solr-NightlyTests-5.x/solr/build/solr-core/test/J0/temp/solr.cloud.ChaosMonkeyNothingIsSafeTest_CF40E7B32033B482-001/shard-1-001/lib
   [junit4]   2> 230760 WARN  (TEST-ChaosMonkeyNothingIsSafeTest.test-seed#[CF40E7B32033B482]) [    ] o.a.s.c.SolrResourceLoader Can't find (or read) directory to add to classloader: lib (resolved as: /x1/jenkins/jenkins-slave/workspace/Lucene-Solr-NightlyTests-5.x/solr/build/solr-core/test/J0/temp/solr.cloud.ChaosMonkeyNothingIsSafeTest_CF40E7B32033B482-001/shard-1-001/lib).
   [junit4]   2> 230772 INFO  (TEST-ChaosMonkeyNothingIsSafeTest.test-seed#[CF40E7B32033B482]) [    ] o.a.s.h.c.HttpShardHandlerFactory created with socketTimeout : 90000,urlScheme : ,connTimeout : 15000,maxConnectionsPerHost : 20,maxConnections : 10000,corePoolSize : 0,maximumPoolSize : 2147483647,maxThreadIdleTime : 5,sizeOfQueue : -1,fairnessPolicy : false,useRetries : false,
   [junit4]   2> 230774 INFO  (TEST-ChaosMonkeyNothingIsSafeTest.test-seed#[CF40E7B32033B482]) [    ] o.a.s.u.UpdateShardHandler Creating UpdateShardHandler HTTP client with params: socketTimeout=340000&connTimeout=45000&retry=true
   [junit4]   2> 230775 INFO  (TEST-ChaosMonkeyNothingIsSafeTest.test-seed#[CF40E7B32033B482]) [    ] o.a.s.l.LogWatcher SLF4J impl is org.slf4j.impl.Log4jLoggerFactory
   [junit4]   2> 230775 INFO  (TEST-ChaosMonkeyNothingIsSafeTest.test-seed#[CF40E7B32033B482]) [    ] o.a.s.l.LogWatcher Registering Log Listener [Log4j (org.slf4j.impl.Log4jLoggerFactory)]
   [junit4]   2> 230775 INFO  (TEST-ChaosMonkeyNothingIsSafeTest.test-seed#[CF40E7B32033B482]) [    ] o.a.s.c.ZkContainer Zookeeper client=127.0.0.1:33751/solr
   [junit4]   2> 230775 INFO  (TEST-ChaosMonkeyNothingIsSafeTest.test-seed#[CF40E7B32033B482]) [    ] o.a.s.c.ZkController zkHost includes chroot
   [junit4]   2> 230775 INFO  (TEST-ChaosMonkeyNothingIsSafeTest.test-seed#[CF40E7B32033B482]) [    ] o.a.s.c.c.SolrZkClient Using default ZkCredentialsProvider
   [junit4]   2> 230777 INFO  (TEST-ChaosMonkeyNothingIsSafeTest.test-seed#[CF40E7B32033B482]) [    ] o.a.s.c.c.ConnectionManager Waiting for client to connect to ZooKeeper
   [junit4]   2> 230778 INFO  (zkCallback-114-thread-1) [    ] o.a.s.c.c.ConnectionManager Watcher org.apache.solr.common.cloud.ConnectionManager@3cd4f5a2 name:ZooKeeperConnection Watcher:127.0.0.1:33751 got event WatchedEvent state:SyncConnected type:None path:null path:null type:None
   [junit4]   2> 230779 INFO  (TEST-ChaosMonkeyNothingIsSafeTest.test-seed#[CF40E7B32033B482]) [    ] o.a.s.c.c.ConnectionManager Client is connected to ZooKeeper
   [junit4]   2> 230780 INFO  (TEST-ChaosMonkeyNothingIsSafeTest.test-seed#[CF40E7B32033B482]) [    ] o.a.s.c.c.SolrZkClient Using default ZkACLProvider
   [junit4]   2> 230782 INFO  (TEST-ChaosMonkeyNothingIsSafeTest.test-seed#[CF40E7B32033B482]) [n:127.0.0.1:39998_lo_i%2Fj    ] o.a.s.c.c.ConnectionManager Waiting for client to connect to ZooKeeper
   [junit4]   2> 230784 INFO  (zkCallback-115-thread-1-processing-n:127.0.0.1:39998_lo_i%2Fj) [n:127.0.0.1:39998_lo_i%2Fj    ] o.a.s.c.c.ConnectionManager Watcher org.apache.solr.common.cloud.ConnectionManager@58c8edd7 name:ZooKeeperConnection Watcher:127.0.0.1:33751/solr got event WatchedEvent state:SyncConnected type:None path:null path:null type:None
   [junit4]   2> 230784 INFO  (TEST-ChaosMonkeyNothingIsSafeTest.test-seed#[CF40E7B32033B482]) [n:127.0.0.1:39998_lo_i%2Fj    ] o.a.s.c.c.ConnectionManager Client is connected to ZooKeeper
   [junit4]   2> 230790 INFO  (TEST-ChaosMonkeyNothingIsSafeTest.test-seed#[CF40E7B32033B482]) [n:127.0.0.1:39998_lo_i%2Fj    ] o.a.s.c.c.ZkStateReader Updating cluster state from ZooKeeper... 
   [junit4]   2> 231795 INFO  (TEST-ChaosMonkeyNothingIsSafeTest.test-seed#[CF40E7B32033B482]) [n:127.0.0.1:39998_lo_i%2Fj    ] o.a.s.c.ZkController Register node as live in ZooKeeper:/live_nodes/127.0.0.1:39998_lo_i%2Fj
   [junit4]   2> 231795 INFO  (TEST-ChaosMonkeyNothingIsSafeTest.test-seed#[CF40E7B32033B482]) [n:127.0.0.1:39998_lo_i%2Fj    ] o.a.s.c.c.SolrZkClient makePath: /live_nodes/127.0.0.1:39998_lo_i%2Fj
   [junit4]   2> 231800 INFO  (TEST-Ch

[...truncated too long message...]

mpl.client.DefaultRequestDirector.tryExecute(DefaultRequestDirector.java:685)
   [junit4]    > 	at org.apache.http.impl.client.DefaultRequestDirector.execute(DefaultRequestDirector.java:487)
   [junit4]    > 	at org.apache.http.impl.client.AbstractHttpClient.doExecute(AbstractHttpClient.java:882)
   [junit4]    > 	at org.apache.http.impl.client.CloseableHttpClient.execute(CloseableHttpClient.java:82)
   [junit4]    > 	at org.apache.http.impl.client.CloseableHttpClient.execute(CloseableHttpClient.java:107)
   [junit4]    > 	at org.apache.http.impl.client.CloseableHttpClient.execute(CloseableHttpClient.java:55)
   [junit4]    > 	at org.apache.solr.client.solrj.impl.HttpSolrClient.executeMethod(HttpSolrClient.java:465)
   [junit4]    > 	... 11 moreThrowable #7: com.carrotsearch.randomizedtesting.UncaughtExceptionError: Captured an uncaught exception in thread: Thread[id=6963, name=collection0, state=RUNNABLE, group=TGRP-CollectionsAPIDistributedZkTest]
   [junit4]    > Caused by: java.lang.RuntimeException: org.apache.solr.client.solrj.SolrServerException: No live SolrServers available to handle this request:[http://127.0.0.1:49275/q_nne, http://127.0.0.1:42945/q_nne, http://127.0.0.1:42486/q_nne, http://127.0.0.1:58405/q_nne, http://127.0.0.1:47541/q_nne]
   [junit4]    > 	at __randomizedtesting.SeedInfo.seed([CF40E7B32033B482]:0)
   [junit4]    > 	at org.apache.solr.cloud.CollectionsAPIDistributedZkTest$1CollectionThread.run(CollectionsAPIDistributedZkTest.java:897)
   [junit4]    > Caused by: org.apache.solr.client.solrj.SolrServerException: No live SolrServers available to handle this request:[http://127.0.0.1:49275/q_nne, http://127.0.0.1:42945/q_nne, http://127.0.0.1:42486/q_nne, http://127.0.0.1:58405/q_nne, http://127.0.0.1:47541/q_nne]
   [junit4]    > 	at org.apache.solr.client.solrj.impl.LBHttpSolrClient.request(LBHttpSolrClient.java:355)
   [junit4]    > 	at org.apache.solr.client.solrj.impl.CloudSolrClient.sendRequest(CloudSolrClient.java:1086)
   [junit4]    > 	at org.apache.solr.client.solrj.impl.CloudSolrClient.requestWithRetryOnStaleState(CloudSolrClient.java:856)
   [junit4]    > 	at org.apache.solr.client.solrj.impl.CloudSolrClient.request(CloudSolrClient.java:799)
   [junit4]    > 	at org.apache.solr.client.solrj.SolrClient.request(SolrClient.java:1220)
   [junit4]    > 	at org.apache.solr.cloud.AbstractFullDistribZkTestBase.createCollection(AbstractFullDistribZkTestBase.java:1572)
   [junit4]    > 	at org.apache.solr.cloud.AbstractFullDistribZkTestBase.createCollection(AbstractFullDistribZkTestBase.java:1593)
   [junit4]    > 	at org.apache.solr.cloud.CollectionsAPIDistributedZkTest$1CollectionThread.run(CollectionsAPIDistributedZkTest.java:887)
   [junit4]    > Caused by: org.apache.solr.client.solrj.SolrServerException: Timeout occured while waiting response from server at: http://127.0.0.1:42486/q_nne
   [junit4]    > 	at org.apache.solr.client.solrj.impl.HttpSolrClient.executeMethod(HttpSolrClient.java:570)
   [junit4]    > 	at org.apache.solr.client.solrj.impl.HttpSolrClient.request(HttpSolrClient.java:234)
   [junit4]    > 	at org.apache.solr.client.solrj.impl.HttpSolrClient.request(HttpSolrClient.java:226)
   [junit4]    > 	at org.apache.solr.client.solrj.impl.LBHttpSolrClient.doRequest(LBHttpSolrClient.java:376)
   [junit4]    > 	at org.apache.solr.client.solrj.impl.LBHttpSolrClient.request(LBHttpSolrClient.java:328)
   [junit4]    > 	... 7 more
   [junit4]    > Caused by: java.net.SocketTimeoutException: Read timed out
   [junit4]    > 	at java.net.SocketInputStream.socketRead0(Native Method)
   [junit4]    > 	at java.net.SocketInputStream.read(SocketInputStream.java:152)
   [junit4]    > 	at java.net.SocketInputStream.read(SocketInputStream.java:122)
   [junit4]    > 	at org.apache.http.impl.io.AbstractSessionInputBuffer.fillBuffer(AbstractSessionInputBuffer.java:160)
   [junit4]    > 	at org.apache.http.impl.io.SocketInputBuffer.fillBuffer(SocketInputBuffer.java:84)
   [junit4]    > 	at org.apache.http.impl.io.AbstractSessionInputBuffer.readLine(AbstractSessionInputBuffer.java:273)
   [junit4]    > 	at org.apache.http.impl.conn.DefaultHttpResponseParser.parseHead(DefaultHttpResponseParser.java:140)
   [junit4]    > 	at org.apache.http.impl.conn.DefaultHttpResponseParser.parseHead(DefaultHttpResponseParser.java:57)
   [junit4]    > 	at org.apache.http.impl.io.AbstractMessageParser.parse(AbstractMessageParser.java:261)
   [junit4]    > 	at org.apache.http.impl.AbstractHttpClientConnection.receiveResponseHeader(AbstractHttpClientConnection.java:283)
   [junit4]    > 	at org.apache.http.impl.conn.DefaultClientConnection.receiveResponseHeader(DefaultClientConnection.java:251)
   [junit4]    > 	at org.apache.http.impl.conn.ManagedClientConnectionImpl.receiveResponseHeader(ManagedClientConnectionImpl.java:197)
   [junit4]    > 	at org.apache.http.protocol.HttpRequestExecutor.doReceiveResponse(HttpRequestExecutor.java:272)
   [junit4]    > 	at org.apache.http.protocol.HttpRequestExecutor.execute(HttpRequestExecutor.java:124)
   [junit4]    > 	at org.apache.http.impl.client.DefaultRequestDirector.tryExecute(DefaultRequestDirector.java:685)
   [junit4]    > 	at org.apache.http.impl.client.DefaultRequestDirector.execute(DefaultRequestDirector.java:487)
   [junit4]    > 	at org.apache.http.impl.client.AbstractHttpClient.doExecute(AbstractHttpClient.java:882)
   [junit4]    > 	at org.apache.http.impl.client.CloseableHttpClient.execute(CloseableHttpClient.java:82)
   [junit4]    > 	at org.apache.http.impl.client.CloseableHttpClient.execute(CloseableHttpClient.java:107)
   [junit4]    > 	at org.apache.http.impl.client.CloseableHttpClient.execute(CloseableHttpClient.java:55)
   [junit4]    > 	at org.apache.solr.client.solrj.impl.HttpSolrClient.executeMethod(HttpSolrClient.java:465)
   [junit4]    > 	... 11 more
   [junit4]   2> 3295130 INFO  (SUITE-CollectionsAPIDistributedZkTest-seed#[CF40E7B32033B482]-worker) [n:127.0.0.1:58405_q_nne c:awholynewstresscollection_collection5_2 s:shard6 r:core_node14 x:awholynewstresscollection_collection5_2_shard6_replica2] o.a.s.SolrTestCaseJ4 ###deleteCore
   [junit4]   2> NOTE: leaving temporary files on disk at: /x1/jenkins/jenkins-slave/workspace/Lucene-Solr-NightlyTests-5.x/solr/build/solr-core/test/J1/temp/solr.cloud.CollectionsAPIDistributedZkTest_CF40E7B32033B482-001
   [junit4]   2> Jul 04, 2015 1:30:36 PM com.carrotsearch.randomizedtesting.ThreadLeakControl checkThreadLeaks
   [junit4]   2> WARNING: Will linger awaiting termination of 1 leaked thread(s).
   [junit4]   2> NOTE: test params are: codec=Asserting(Lucene53): {multiDefault=PostingsFormat(name=Memory doPackFST= false), a_t=PostingsFormat(name=Memory doPackFST= false), timestamp=PostingsFormat(name=Memory doPackFST= false), other_tl1=BlockTreeOrds(blocksize=128), range_facet_i_dv=PostingsFormat(name=Memory doPackFST= false), range_facet_l_dv=PostingsFormat(name=Memory doPackFST= true), intDefault=BlockTreeOrds(blocksize=128), text=Lucene50(blocksize=128), id=PostingsFormat(name=Memory doPackFST= true), a_i1=PostingsFormat(name=Memory doPackFST= false), _version_=BlockTreeOrds(blocksize=128), range_facet_l=PostingsFormat(name=Memory doPackFST= false)}, docValues:{timestamp=DocValuesFormat(name=Asserting), range_facet_i_dv=DocValuesFormat(name=Asserting), range_facet_l_dv=DocValuesFormat(name=Lucene50)}, sim=DefaultSimilarity, locale=es_MX, timezone=Australia/Hobart
   [junit4]   2> NOTE: Linux 3.13.0-52-generic amd64/Oracle Corporation 1.7.0_72 (64-bit)/cpus=4,threads=1,free=48075600,total=533200896
   [junit4]   2> NOTE: All tests run in this JVM: [SpatialFilterTest, CacheHeaderTest, TestFastWriter, TestFoldingMultitermQuery, TestIntervalFaceting, TestLRUCache, ReturnFieldsTest, TestSerializedLuceneMatchVersion, ResourceLoaderTest, AnalysisAfterCoreReloadTest, HdfsNNFailoverTest, MultiThreadedOCPTest, QueryResultKeyTest, TestCharFilters, SpellCheckComponentTest, DistributedIntervalFacetingTest, BadComponentTest, LeaderInitiatedRecoveryOnCommitTest, AsyncCallRequestStatusResponseTest, DistanceFunctionTest, CachingDirectoryFactoryTest, OpenCloseCoreStressTest, EchoParamsTest, TestFiltering, TestHashQParserPlugin, ConcurrentDeleteAndCreateCollectionTest, VersionInfoTest, SuggesterTSTTest, CollectionsAPIDistributedZkTest]
   [junit4] Completed [452/507] on J1 in 2206.81s, 1 test, 1 error <<< FAILURES!

[...truncated 197 lines...]
BUILD FAILED
/x1/jenkins/jenkins-slave/workspace/Lucene-Solr-NightlyTests-5.x/build.xml:543: The following error occurred while executing this line:
/x1/jenkins/jenkins-slave/workspace/Lucene-Solr-NightlyTests-5.x/build.xml:484: The following error occurred while executing this line:
/x1/jenkins/jenkins-slave/workspace/Lucene-Solr-NightlyTests-5.x/build.xml:61: The following error occurred while executing this line:
/x1/jenkins/jenkins-slave/workspace/Lucene-Solr-NightlyTests-5.x/extra-targets.xml:39: The following error occurred while executing this line:
/x1/jenkins/jenkins-slave/workspace/Lucene-Solr-NightlyTests-5.x/solr/build.xml:230: The following error occurred while executing this line:
/x1/jenkins/jenkins-slave/workspace/Lucene-Solr-NightlyTests-5.x/solr/common-build.xml:512: The following error occurred while executing this line:
/x1/jenkins/jenkins-slave/workspace/Lucene-Solr-NightlyTests-5.x/lucene/common-build.xml:1444: The following error occurred while executing this line:
/x1/jenkins/jenkins-slave/workspace/Lucene-Solr-NightlyTests-5.x/lucene/common-build.xml:999: There were test failures: 507 suites, 2009 tests, 5 suite-level errors, 1 error, 428 ignored (10 assumptions)

Total time: 183 minutes 11 seconds
Build step 'Invoke Ant' marked build as failure
Archiving artifacts
Sending artifact delta relative to Lucene-Solr-NightlyTests-5.x #874
Archived 4 artifacts
Archive block size is 32768
Received 0 blocks and 1017061399 bytes
Compression is 0.0%
Took 2 min 48 sec
Recording test results
Email was triggered for: Failure
Sending email for trigger: Failure



Mime
View raw message