lucene-dev mailing list archives

Site index · List index
Message view « Date » · « Thread »
Top « Date » · « Thread »
From Policeman Jenkins Server <jenk...@thetaphi.de>
Subject [JENKINS] Lucene-Solr-5.x-Windows (32bit/jdk1.7.0_80) - Build # 4933 - Still Failing!
Date Thu, 23 Jul 2015 20:29:04 GMT
Build: http://jenkins.thetaphi.de/job/Lucene-Solr-5.x-Windows/4933/
Java: 32bit/jdk1.7.0_80 -client -XX:+UseConcMarkSweepGC

1 tests failed.
FAILED:  org.apache.solr.handler.TestReplicationHandler.doTestStressReplication

Error Message:
[index.20150723140346214, index.20150723140347729, index.properties, replication.properties] expected:<1> but was:<2>

Stack Trace:
java.lang.AssertionError: [index.20150723140346214, index.20150723140347729, index.properties, replication.properties] expected:<1> but was:<2>
	at __randomizedtesting.SeedInfo.seed([56BD2D639E8ACD3E:8D162DA59BA2A48D]:0)
	at org.junit.Assert.fail(Assert.java:93)
	at org.junit.Assert.failNotEquals(Assert.java:647)
	at org.junit.Assert.assertEquals(Assert.java:128)
	at org.junit.Assert.assertEquals(Assert.java:472)
	at org.apache.solr.handler.TestReplicationHandler.checkForSingleIndex(TestReplicationHandler.java:818)
	at org.apache.solr.handler.TestReplicationHandler.doTestStressReplication(TestReplicationHandler.java:785)
	at sun.reflect.NativeMethodAccessorImpl.invoke0(Native Method)
	at sun.reflect.NativeMethodAccessorImpl.invoke(NativeMethodAccessorImpl.java:57)
	at sun.reflect.DelegatingMethodAccessorImpl.invoke(DelegatingMethodAccessorImpl.java:43)
	at java.lang.reflect.Method.invoke(Method.java:606)
	at com.carrotsearch.randomizedtesting.RandomizedRunner.invoke(RandomizedRunner.java:1627)
	at com.carrotsearch.randomizedtesting.RandomizedRunner$6.evaluate(RandomizedRunner.java:836)
	at com.carrotsearch.randomizedtesting.RandomizedRunner$7.evaluate(RandomizedRunner.java:872)
	at com.carrotsearch.randomizedtesting.RandomizedRunner$8.evaluate(RandomizedRunner.java:886)
	at com.carrotsearch.randomizedtesting.rules.SystemPropertiesRestoreRule$1.evaluate(SystemPropertiesRestoreRule.java:57)
	at org.apache.lucene.util.TestRuleSetupTeardownChained$1.evaluate(TestRuleSetupTeardownChained.java:50)
	at org.apache.lucene.util.AbstractBeforeAfterRule$1.evaluate(AbstractBeforeAfterRule.java:46)
	at org.apache.lucene.util.TestRuleThreadAndTestName$1.evaluate(TestRuleThreadAndTestName.java:49)
	at org.apache.lucene.util.TestRuleIgnoreAfterMaxFailures$1.evaluate(TestRuleIgnoreAfterMaxFailures.java:65)
	at org.apache.lucene.util.TestRuleMarkFailure$1.evaluate(TestRuleMarkFailure.java:48)
	at com.carrotsearch.randomizedtesting.rules.StatementAdapter.evaluate(StatementAdapter.java:36)
	at com.carrotsearch.randomizedtesting.ThreadLeakControl$StatementRunner.run(ThreadLeakControl.java:365)
	at com.carrotsearch.randomizedtesting.ThreadLeakControl.forkTimeoutingTask(ThreadLeakControl.java:798)
	at com.carrotsearch.randomizedtesting.ThreadLeakControl$3.evaluate(ThreadLeakControl.java:458)
	at com.carrotsearch.randomizedtesting.RandomizedRunner.runSingleTest(RandomizedRunner.java:845)
	at com.carrotsearch.randomizedtesting.RandomizedRunner$3.evaluate(RandomizedRunner.java:747)
	at com.carrotsearch.randomizedtesting.RandomizedRunner$4.evaluate(RandomizedRunner.java:781)
	at com.carrotsearch.randomizedtesting.RandomizedRunner$5.evaluate(RandomizedRunner.java:792)
	at com.carrotsearch.randomizedtesting.rules.StatementAdapter.evaluate(StatementAdapter.java:36)
	at com.carrotsearch.randomizedtesting.rules.SystemPropertiesRestoreRule$1.evaluate(SystemPropertiesRestoreRule.java:57)
	at org.apache.lucene.util.AbstractBeforeAfterRule$1.evaluate(AbstractBeforeAfterRule.java:46)
	at com.carrotsearch.randomizedtesting.rules.StatementAdapter.evaluate(StatementAdapter.java:36)
	at org.apache.lucene.util.TestRuleStoreClassName$1.evaluate(TestRuleStoreClassName.java:42)
	at com.carrotsearch.randomizedtesting.rules.NoShadowingOrOverridesOnMethodsRule$1.evaluate(NoShadowingOrOverridesOnMethodsRule.java:39)
	at com.carrotsearch.randomizedtesting.rules.NoShadowingOrOverridesOnMethodsRule$1.evaluate(NoShadowingOrOverridesOnMethodsRule.java:39)
	at com.carrotsearch.randomizedtesting.rules.StatementAdapter.evaluate(StatementAdapter.java:36)
	at com.carrotsearch.randomizedtesting.rules.StatementAdapter.evaluate(StatementAdapter.java:36)
	at com.carrotsearch.randomizedtesting.rules.StatementAdapter.evaluate(StatementAdapter.java:36)
	at org.apache.lucene.util.TestRuleAssertionsRequired$1.evaluate(TestRuleAssertionsRequired.java:54)
	at org.apache.lucene.util.TestRuleMarkFailure$1.evaluate(TestRuleMarkFailure.java:48)
	at org.apache.lucene.util.TestRuleIgnoreAfterMaxFailures$1.evaluate(TestRuleIgnoreAfterMaxFailures.java:65)
	at org.apache.lucene.util.TestRuleIgnoreTestSuites$1.evaluate(TestRuleIgnoreTestSuites.java:55)
	at com.carrotsearch.randomizedtesting.rules.StatementAdapter.evaluate(StatementAdapter.java:36)
	at com.carrotsearch.randomizedtesting.ThreadLeakControl$StatementRunner.run(ThreadLeakControl.java:365)
	at java.lang.Thread.run(Thread.java:745)




Build Log:
[...truncated 21423 lines...]
   [junit4] Suite: org.apache.solr.handler.TestReplicationHandler
   [junit4]   2> Creating dataDir: C:\Users\JenkinsSlave\workspace\Lucene-Solr-5.x-Windows\solr\build\solr-core\test\J0\temp\solr.handler.TestReplicationHandler_56BD2D639E8ACD3E-001\init-core-data-001
   [junit4]   2> 1815441 INFO  (TEST-TestReplicationHandler.doTestRepeater-seed#[56BD2D639E8ACD3E]) [    ] o.a.s.SolrTestCaseJ4 ###Starting doTestRepeater
   [junit4]   2> 1815443 INFO  (TEST-TestReplicationHandler.doTestRepeater-seed#[56BD2D639E8ACD3E]) [    ] o.a.s.SolrTestCaseJ4 Writing core.properties file to C:\Users\JenkinsSlave\workspace\Lucene-Solr-5.x-Windows\solr\build\solr-core\test\J0\temp\solr.handler.TestReplicationHandler_56BD2D639E8ACD3E-001\solr-instance-001\collection1
   [junit4]   2> 1815462 INFO  (TEST-TestReplicationHandler.doTestRepeater-seed#[56BD2D639E8ACD3E]) [    ] o.e.j.s.Server jetty-9.2.11.v20150529
   [junit4]   2> 1815467 INFO  (TEST-TestReplicationHandler.doTestRepeater-seed#[56BD2D639E8ACD3E]) [    ] o.e.j.s.h.ContextHandler Started o.e.j.s.ServletContextHandler@1a7464c{/solr,null,AVAILABLE}
   [junit4]   2> 1815468 INFO  (TEST-TestReplicationHandler.doTestRepeater-seed#[56BD2D639E8ACD3E]) [    ] o.e.j.s.ServerConnector Started ServerConnector@f85ecb{HTTP/1.1}{127.0.0.1:60025}
   [junit4]   2> 1815469 INFO  (TEST-TestReplicationHandler.doTestRepeater-seed#[56BD2D639E8ACD3E]) [    ] o.e.j.s.Server Started @1820445ms
   [junit4]   2> 1815469 INFO  (TEST-TestReplicationHandler.doTestRepeater-seed#[56BD2D639E8ACD3E]) [    ] o.a.s.c.s.e.JettySolrRunner Jetty properties: {hostPort=60025, hostContext=/solr, solr.data.dir=C:\Users\JenkinsSlave\workspace\Lucene-Solr-5.x-Windows\solr\build\solr-core\test\J0\temp\solr.handler.TestReplicationHandler_56BD2D639E8ACD3E-001\solr-instance-001\collection1\data}
   [junit4]   2> 1815469 INFO  (TEST-TestReplicationHandler.doTestRepeater-seed#[56BD2D639E8ACD3E]) [    ] o.a.s.s.SolrDispatchFilter SolrDispatchFilter.init(): sun.misc.Launcher$AppClassLoader@a5c9f1
   [junit4]   2> 1815470 INFO  (TEST-TestReplicationHandler.doTestRepeater-seed#[56BD2D639E8ACD3E]) [    ] o.a.s.c.SolrResourceLoader new SolrResourceLoader for directory: 'C:\Users\JenkinsSlave\workspace\Lucene-Solr-5.x-Windows\solr\build\solr-core\test\J0\temp\solr.handler.TestReplicationHandler_56BD2D639E8ACD3E-001\solr-instance-001\'
   [junit4]   2> 1815524 INFO  (TEST-TestReplicationHandler.doTestRepeater-seed#[56BD2D639E8ACD3E]) [    ] o.a.s.c.SolrXmlConfig Loading container configuration from C:\Users\JenkinsSlave\workspace\Lucene-Solr-5.x-Windows\solr\build\solr-core\test\J0\temp\solr.handler.TestReplicationHandler_56BD2D639E8ACD3E-001\solr-instance-001\solr.xml
   [junit4]   2> 1815565 INFO  (TEST-TestReplicationHandler.doTestRepeater-seed#[56BD2D639E8ACD3E]) [    ] o.a.s.c.CoresLocator Config-defined core root directory: C:\Users\JenkinsSlave\workspace\Lucene-Solr-5.x-Windows\solr\build\solr-core\test\J0\temp\solr.handler.TestReplicationHandler_56BD2D639E8ACD3E-001\solr-instance-001\.
   [junit4]   2> 1815566 INFO  (TEST-TestReplicationHandler.doTestRepeater-seed#[56BD2D639E8ACD3E]) [    ] o.a.s.c.CoreContainer New CoreContainer 32592234
   [junit4]   2> 1815566 INFO  (TEST-TestReplicationHandler.doTestRepeater-seed#[56BD2D639E8ACD3E]) [    ] o.a.s.c.CoreContainer Loading cores into CoreContainer [instanceDir=C:\Users\JenkinsSlave\workspace\Lucene-Solr-5.x-Windows\solr\build\solr-core\test\J0\temp\solr.handler.TestReplicationHandler_56BD2D639E8ACD3E-001\solr-instance-001\]
   [junit4]   2> 1815566 INFO  (TEST-TestReplicationHandler.doTestRepeater-seed#[56BD2D639E8ACD3E]) [    ] o.a.s.c.CoreContainer loading shared library: C:\Users\JenkinsSlave\workspace\Lucene-Solr-5.x-Windows\solr\build\solr-core\test\J0\temp\solr.handler.TestReplicationHandler_56BD2D639E8ACD3E-001\solr-instance-001\lib
   [junit4]   2> 1815567 WARN  (TEST-TestReplicationHandler.doTestRepeater-seed#[56BD2D639E8ACD3E]) [    ] o.a.s.c.SolrResourceLoader Can't find (or read) directory to add to classloader: lib (resolved as: C:\Users\JenkinsSlave\workspace\Lucene-Solr-5.x-Windows\solr\build\solr-core\test\J0\temp\solr.handler.TestReplicationHandler_56BD2D639E8ACD3E-001\solr-instance-001\lib).
   [junit4]   2> 1815577 INFO  (TEST-TestReplicationHandler.doTestRepeater-seed#[56BD2D639E8ACD3E]) [    ] o.a.s.h.c.HttpShardHandlerFactory created with socketTimeout : 90000,urlScheme : ,connTimeout : 15000,maxConnectionsPerHost : 20,maxConnections : 10000,corePoolSize : 0,maximumPoolSize : 2147483647,maxThreadIdleTime : 5,sizeOfQueue : -1,fairnessPolicy : false,useRetries : false,
   [junit4]   2> 1815580 INFO  (TEST-TestReplicationHandler.doTestRepeater-seed#[56BD2D639E8ACD3E]) [    ] o.a.s.u.UpdateShardHandler Creating UpdateShardHandler HTTP client with params: socketTimeout=340000&connTimeout=45000&retry=true
   [junit4]   2> 1815581 INFO  (TEST-TestReplicationHandler.doTestRepeater-seed#[56BD2D639E8ACD3E]) [    ] o.a.s.l.LogWatcher SLF4J impl is org.slf4j.impl.Log4jLoggerFactory
   [junit4]   2> 1815581 INFO  (TEST-TestReplicationHandler.doTestRepeater-seed#[56BD2D639E8ACD3E]) [    ] o.a.s.l.LogWatcher Registering Log Listener [Log4j (org.slf4j.impl.Log4jLoggerFactory)]
   [junit4]   2> 1815581 INFO  (TEST-TestReplicationHandler.doTestRepeater-seed#[56BD2D639E8ACD3E]) [    ] o.a.s.c.CoreContainer No authentication plugin used.
   [junit4]   2> 1815584 INFO  (TEST-TestReplicationHandler.doTestRepeater-seed#[56BD2D639E8ACD3E]) [    ] o.a.s.c.CoresLocator Looking for core definitions underneath C:\Users\JenkinsSlave\workspace\Lucene-Solr-5.x-Windows\solr\build\solr-core\test\J0\temp\solr.handler.TestReplicationHandler_56BD2D639E8ACD3E-001\solr-instance-001\.
   [junit4]   2> 1815587 INFO  (TEST-TestReplicationHandler.doTestRepeater-seed#[56BD2D639E8ACD3E]) [    ] o.a.s.c.SolrCore Created CoreDescriptor: {instanceDir=C:\Users\JenkinsSlave\workspace\Lucene-Solr-5.x-Windows\solr\build\solr-core\test\J0\temp\solr.handler.TestReplicationHandler_56BD2D639E8ACD3E-001\solr-instance-001\.\collection1, name=collection1, config=solrconfig.xml, absoluteInstDir=C:\Users\JenkinsSlave\workspace\Lucene-Solr-5.x-Windows\solr\build\solr-core\test\J0\temp\solr.handler.TestReplicationHandler_56BD2D639E8ACD3E-001\solr-instance-001\.\collection1\, schema=schema.xml, transient=false, loadOnStartup=true, configSetProperties=configsetprops.json, dataDir=data\}
   [junit4]   2> 1815588 INFO  (TEST-TestReplicationHandler.doTestRepeater-seed#[56BD2D639E8ACD3E]) [    ] o.a.s.c.CoresLocator Found core collection1 in C:\Users\JenkinsSlave\workspace\Lucene-Solr-5.x-Windows\solr\build\solr-core\test\J0\temp\solr.handler.TestReplicationHandler_56BD2D639E8ACD3E-001\solr-instance-001\.\collection1\
   [junit4]   2> 1815590 INFO  (TEST-TestReplicationHandler.doTestRepeater-seed#[56BD2D639E8ACD3E]) [    ] o.a.s.c.CoresLocator Found 1 core definitions
   [junit4]   2> 1815592 INFO  (coreLoadExecutor-3760-thread-1) [    ] o.a.s.c.SolrResourceLoader new SolrResourceLoader for directory: 'C:\Users\JenkinsSlave\workspace\Lucene-Solr-5.x-Windows\solr\build\solr-core\test\J0\temp\solr.handler.TestReplicationHandler_56BD2D639E8ACD3E-001\solr-instance-001\.\collection1\'
   [junit4]   2> 1815594 INFO  (TEST-TestReplicationHandler.doTestRepeater-seed#[56BD2D639E8ACD3E]) [    ] o.a.s.s.SolrDispatchFilter user.dir=C:\Users\JenkinsSlave\workspace\Lucene-Solr-5.x-Windows\solr\build\solr-core\test\J0
   [junit4]   2> 1815594 INFO  (TEST-TestReplicationHandler.doTestRepeater-seed#[56BD2D639E8ACD3E]) [    ] o.a.s.s.SolrDispatchFilter SolrDispatchFilter.init() done
   [junit4]   2> 1815637 INFO  (coreLoadExecutor-3760-thread-1) [    ] o.a.s.c.SolrConfig current version of requestparams : -1
   [junit4]   2> 1815653 INFO  (coreLoadExecutor-3760-thread-1) [    ] o.a.s.c.SolrConfig Using Lucene MatchVersion: 5.3.0
   [junit4]   2> 1815692 INFO  (coreLoadExecutor-3760-thread-1) [    ] o.a.s.c.Config Loaded SolrConfig: solrconfig.xml
   [junit4]   2> 1815692 INFO  (coreLoadExecutor-3760-thread-1) [    ] o.a.s.s.IndexSchema Reading Solr Schema from C:\Users\JenkinsSlave\workspace\Lucene-Solr-5.x-Windows\solr\build\solr-core\test\J0\temp\solr.handler.TestReplicationHandler_56BD2D639E8ACD3E-001\solr-instance-001\.\collection1\conf\schema.xml
   [junit4]   2> 1815697 INFO  (coreLoadExecutor-3760-thread-1) [    ] o.a.s.s.IndexSchema [collection1] Schema name=test
   [junit4]   2> 1815713 INFO  (coreLoadExecutor-3760-thread-1) [    ] o.a.s.s.IndexSchema unique key field: id
   [junit4]   2> 1815718 INFO  (coreLoadExecutor-3760-thread-1) [    ] o.a.s.c.ConfigSetProperties Did not find ConfigSet properties, assuming default properties: Can't find resource 'configsetprops.json' in classpath or 'C:\Users\JenkinsSlave\workspace\Lucene-Solr-5.x-Windows\solr\build\solr-core\test\J0\temp\solr.handler.TestReplicationHandler_56BD2D639E8ACD3E-001\solr-instance-001\.\collection1\conf'
   [junit4]   2> 1815718 INFO  (coreLoadExecutor-3760-thread-1) [    ] o.a.s.c.CoreContainer Creating SolrCore 'collection1' using configuration from instancedir C:\Users\JenkinsSlave\workspace\Lucene-Solr-5.x-Windows\solr\build\solr-core\test\J0\temp\solr.handler.TestReplicationHandler_56BD2D639E8ACD3E-001\solr-instance-001\.\collection1\
   [junit4]   2> 1815719 INFO  (coreLoadExecutor-3760-thread-1) [    x:collection1] o.a.s.c.SolrCore org.apache.solr.core.MockDirectoryFactory
   [junit4]   2> 1815719 INFO  (coreLoadExecutor-3760-thread-1) [    x:collection1] o.a.s.c.SolrCore [[collection1] ] Opening new SolrCore at [C:\Users\JenkinsSlave\workspace\Lucene-Solr-5.x-Windows\solr\build\solr-core\test\J0\temp\solr.handler.TestReplicationHandler_56BD2D639E8ACD3E-001\solr-instance-001\.\collection1\], dataDir=[null]
   [junit4]   2> 1815719 INFO  (coreLoadExecutor-3760-thread-1) [    x:collection1] o.a.s.c.SolrCore JMX monitoring not detected for core: collection1
   [junit4]   2> 1815726 INFO  (coreLoadExecutor-3760-thread-1) [    x:collection1] o.a.s.c.CachingDirectoryFactory return new directory for C:\Users\JenkinsSlave\workspace\Lucene-Solr-5.x-Windows\solr\build\solr-core\test\J0\temp\solr.handler.TestReplicationHandler_56BD2D639E8ACD3E-001\solr-instance-001\.\collection1\data\
   [junit4]   2> 1815729 INFO  (coreLoadExecutor-3760-thread-1) [    x:collection1] o.a.s.c.SolrCore New index directory detected: old=null new=C:\Users\JenkinsSlave\workspace\Lucene-Solr-5.x-Windows\solr\build\solr-core\test\J0\temp\solr.handler.TestReplicationHandler_56BD2D639E8ACD3E-001\solr-instance-001\.\collection1\data\index/
   [junit4]   2> 1815729 WARN  (coreLoadExecutor-3760-thread-1) [    x:collection1] o.a.s.c.SolrCore [collection1] Solr index directory 'C:\Users\JenkinsSlave\workspace\Lucene-Solr-5.x-Windows\solr\build\solr-core\test\J0\temp\solr.handler.TestReplicationHandler_56BD2D639E8ACD3E-001\solr-instance-001\.\collection1\data\index' doesn't exist. Creating new index...
   [junit4]   2> 1815729 INFO  (coreLoadExecutor-3760-thread-1) [    x:collection1] o.a.s.c.CachingDirectoryFactory return new directory for C:\Users\JenkinsSlave\workspace\Lucene-Solr-5.x-Windows\solr\build\solr-core\test\J0\temp\solr.handler.TestReplicationHandler_56BD2D639E8ACD3E-001\solr-instance-001\.\collection1\data\index
   [junit4]   2> 1815731 INFO  (coreLoadExecutor-3760-thread-1) [    x:collection1] o.a.s.u.RandomMergePolicy RandomMergePolicy wrapping class org.apache.lucene.index.TieredMergePolicy: [TieredMergePolicy: maxMergeAtOnce=23, maxMergeAtOnceExplicit=13, maxMergedSegmentMB=96.6650390625, floorSegmentMB=1.732421875, forceMergeDeletesPctAllowed=11.479313264183242, segmentsPerTier=25.0, maxCFSSegmentSizeMB=8.796093022207999E12, noCFSRatio=0.3057751205348932
   [junit4]   2> 1815732 INFO  (coreLoadExecutor-3760-thread-1) [    x:collection1] o.a.s.c.SolrCore SolrDeletionPolicy.onCommit: commits: num=1
   [junit4]   2> 	commit{dir=MockDirectoryWrapper(RAMDirectory@8f67d1 lockFactory=org.apache.lucene.store.SingleInstanceLockFactory@e8ed81),segFN=segments_1,generation=1}
   [junit4]   2> 1815732 INFO  (coreLoadExecutor-3760-thread-1) [    x:collection1] o.a.s.c.SolrCore newest commit generation = 1
   [junit4]   2> 1815733 INFO  (OldIndexDirectoryCleanupThreadForCore-collection1) [    x:collection1] o.a.s.c.SolrCore Looking for old index directories to cleanup for core collection1 in C:\Users\JenkinsSlave\workspace\Lucene-Solr-5.x-Windows\solr\build\solr-core\test\J0\temp\solr.handler.TestReplicationHandler_56BD2D639E8ACD3E-001\solr-instance-001\.\collection1\data\
   [junit4]   2> 1815736 INFO  (coreLoadExecutor-3760-thread-1) [    x:collection1] o.a.s.c.SolrCore no updateRequestProcessorChain defined as default, creating implicit default
   [junit4]   2> 1815745 INFO  (coreLoadExecutor-3760-thread-1) [    x:collection1] o.a.s.h.l.XMLLoader xsltCacheLifetimeSeconds=60
   [junit4]   2> 1815747 INFO  (coreLoadExecutor-3760-thread-1) [    x:collection1] o.a.s.h.l.XMLLoader xsltCacheLifetimeSeconds=60
   [junit4]   2> 1815749 INFO  (coreLoadExecutor-3760-thread-1) [    x:collection1] o.a.s.h.l.XMLLoader xsltCacheLifetimeSeconds=60
   [junit4]   2> 1815753 INFO  (coreLoadExecutor-3760-thread-1) [    x:collection1] o.a.s.h.l.XMLLoader xsltCacheLifetimeSeconds=60
   [junit4]   2> 1815771 INFO  (coreLoadExecutor-3760-thread-1) [    x:collection1] o.a.s.c.PluginBag requestHandler : 'lazy' created with startup=lazy 
   [junit4]   2> 1815771 INFO  (coreLoadExecutor-3760-thread-1) [    x:collection1] o.a.s.c.RequestHandlers Registered paths: /admin/segments,/admin/plugins,standard,/replication,/admin/mbeans,/update/csv,/admin/logging,/config,/update/json/docs,/schema,/admin/ping,/admin/properties,lazy,/admin/system,/admin/luke,/admin/threads,/get,/admin/file,defaults,/update,/update/json
   [junit4]   2> 1815774 INFO  (coreLoadExecutor-3760-thread-1) [    x:collection1] o.a.s.c.SolrCore Using default statsCache cache: org.apache.solr.search.stats.LocalStatsCache
   [junit4]   2> 1815775 INFO  (coreLoadExecutor-3760-thread-1) [    x:collection1] o.a.s.c.SolrCore Hard AutoCommit: disabled
   [junit4]   2> 1815775 INFO  (coreLoadExecutor-3760-thread-1) [    x:collection1] o.a.s.c.SolrCore Soft AutoCommit: disabled
   [junit4]   2> 1815776 INFO  (coreLoadExecutor-3760-thread-1) [    x:collection1] o.a.s.u.RandomMergePolicy RandomMergePolicy wrapping class org.apache.lucene.index.LogDocMergePolicy: [LogDocMergePolicy: minMergeSize=1000, mergeFactor=15, maxMergeSize=9223372036854775807, maxMergeSizeForForcedMerge=9223372036854775807, calibrateSizeByDeletes=true, maxMergeDocs=2147483647, maxCFSSegmentSizeMB=8.796093022207999E12, noCFSRatio=0.6135612017968246]
   [junit4]   2> 1815777 INFO  (coreLoadExecutor-3760-thread-1) [    x:collection1] o.a.s.c.SolrCore SolrDeletionPolicy.onInit: commits: num=1
   [junit4]   2> 	commit{dir=MockDirectoryWrapper(RAMDirectory@8f67d1 lockFactory=org.apache.lucene.store.SingleInstanceLockFactory@e8ed81),segFN=segments_1,generation=1}
   [junit4]   2> 1815777 INFO  (coreLoadExecutor-3760-thread-1) [    x:collection1] o.a.s.c.SolrCore newest commit generation = 1
   [junit4]   2> 1815777 INFO  (coreLoadExecutor-3760-thread-1) [    x:collection1] o.a.s.s.SolrIndexSearcher Opening Searcher@114ecea[collection1] main
   [junit4]   2> 1815778 INFO  (coreLoadExecutor-3760-thread-1) [    x:collection1] o.a.s.r.ManagedResourceStorage File-based storage initialized to use dir: C:\Users\JenkinsSlave\workspace\Lucene-Solr-5.x-Windows\solr\build\solr-core\test\J0\temp\solr.handler.TestReplicationHandler_56BD2D639E8ACD3E-001\solr-instance-001\.\collection1\conf
   [junit4]   2> 1815778 INFO  (coreLoadExecutor-3760-thread-1) [    x:collection1] o.a.s.r.RestManager Initializing RestManager with initArgs: {storageDir=C:\Users\JenkinsSlave\workspace\Lucene-Solr-5.x-Windows\solr\build\solr-core\test\J0\temp\solr.handler.TestReplicationHandler_56BD2D639E8ACD3E-001\solr-instance-001\.\collection1\conf}
   [junit4]   2> 1815778 INFO  (coreLoadExecutor-3760-thread-1) [    x:collection1] o.a.s.r.ManagedResourceStorage Reading _rest_managed.json using file:dir=C:\Users\JenkinsSlave\workspace\Lucene-Solr-5.x-Windows\solr\build\solr-core\test\J0\temp\solr.handler.TestReplicationHandler_56BD2D639E8ACD3E-001\solr-instance-001\.\collection1\conf
   [junit4]   2> 1815779 INFO  (coreLoadExecutor-3760-thread-1) [    x:collection1] o.a.s.r.RestManager Initializing 0 registered ManagedResources
   [junit4]   2> 1815779 INFO  (coreLoadExecutor-3760-thread-1) [    x:collection1] o.a.s.h.ReplicationHandler Replication enabled for following config files: schema.xml,xslt/dummy.xsl
   [junit4]   2> 1815779 INFO  (coreLoadExecutor-3760-thread-1) [    x:collection1] o.a.s.h.ReplicationHandler Commits will be reserved for  10000
   [junit4]   2> 1815780 INFO  (searcherExecutor-3761-thread-1-processing-x:collection1) [    x:collection1] o.a.s.c.SolrCore [collection1] Registered new searcher Searcher@114ecea[collection1] main{ExitableDirectoryReader(UninvertingDirectoryReader())}
   [junit4]   2> 1815780 INFO  (coreLoadExecutor-3760-thread-1) [    x:collection1] o.a.s.c.CoreContainer registering core: collection1
   [junit4]   2> 1816136 INFO  (TEST-TestReplicationHandler.doTestRepeater-seed#[56BD2D639E8ACD3E]) [    ] o.a.s.SolrTestCaseJ4 Writing core.properties file to C:\Users\JenkinsSlave\workspace\Lucene-Solr-5.x-Windows\solr\build\solr-core\test\J0\temp\solr.handler.TestReplicationHandler_56BD2D639E8ACD3E-001\solr-instance-002\collection1
   [junit4]   2> 1816151 INFO  (TEST-TestReplicationHandler.doTestRepeater-seed#[56BD2D639E8ACD3E]) [    ] o.e.j.s.Server jetty-9.2.11.v20150529
   [junit4]   2> 1816155 INFO  (TEST-TestReplicationHandler.doTestRepeater-seed#[56BD2D639E8ACD3E]) [    ] o.e.j.s.h.ContextHandler Started o.e.j.s.ServletContextHandler@13fad12{/solr,null,AVAILABLE}
   [junit4]   2> 1816158 INFO  (TEST-TestReplicationHandler.doTestRepeater-seed#[56BD2D639E8ACD3E]) [    ] o.e.j.s.ServerConnector Started ServerConnector@17b7d7c{HTTP/1.1}{127.0.0.1:60028}
   [junit4]   2> 1816158 INFO  (TEST-TestReplicationHandler.doTestRepeater-seed#[56BD2D639E8ACD3E]) [    ] o.e.j.s.Server Started @1821134ms
   [junit4]   2> 1816158 INFO  (TEST-TestReplicationHandler.doTestRepeater-seed#[56BD2D639E8ACD3E]) [    ] o.a.s.c.s.e.JettySolrRunner Jetty properties: {solr.data.dir=C:\Users\JenkinsSlave\workspace\Lucene-Solr-5.x-Windows\solr\build\solr-core\test\J0\temp\solr.handler.TestReplicationHandler_56BD2D639E8ACD3E-001\solr-instance-002\collection1\data, hostContext=/solr, hostPort=60028}
   [junit4]   2> 1816159 INFO  (TEST-TestReplicationHandler.doTestRepeater-seed#[56BD2D639E8ACD3E]) [    ] o.a.s.s.SolrDispatchFilter SolrDispatchFilter.init(): sun.misc.Launcher$AppClassLoader@a5c9f1
   [junit4]   2> 1816159 INFO  (TEST-TestReplicationHandler.doTestRepeater-seed#[56BD2D639E8ACD3E]) [    ] o.a.s.c.SolrResourceLoader new SolrResourceLoader for directory: 'C:\Users\JenkinsSlave\workspace\Lucene-Solr-5.x-Windows\solr\build\solr-core\test\J0\temp\solr.handler.TestReplicationHandler_56BD2D639E8ACD3E-001\solr-instance-002\'
   [junit4]   2> 1816213 INFO  (TEST-TestReplicationHandler.doTestRepeater-seed#[56BD2D639E8ACD3E]) [    ] o.a.s.c.SolrXmlConfig Loading container configuration from C:\Users\JenkinsSlave\workspace\Lucene-Solr-5.x-Windows\solr\build\solr-core\test\J0\temp\solr.handler.TestReplicationHandler_56BD2D639E8ACD3E-001\solr-instance-002\solr.xml
   [junit4]   2> 1816288 INFO  (TEST-TestReplicationHandler.doTestRepeater-seed#[56BD2D639E8ACD3E]) [    ] o.a.s.c.CoresLocator Config-defined core root directory: C:\Users\JenkinsSlave\workspace\Lucene-Solr-5.x-Windows\solr\build\solr-core\test\J0\temp\solr.handler.TestReplicationHandler_56BD2D639E8ACD3E-001\solr-instance-002\.
   [junit4]   2> 1816290 INFO  (TEST-TestReplicationHandler.doTestRepeater-seed#[56BD2D639E8ACD3E]) [    ] o.a.s.c.CoreContainer New CoreContainer 28571482
   [junit4]   2> 1816290 INFO  (TEST-TestReplicationHandler.doTestRepeater-seed#[56BD2D639E8ACD3E]) [    ] o.a.s.c.CoreContainer Loading cores into CoreContainer [instanceDir=C:\Users\JenkinsSlave\workspace\Lucene-Solr-5.x-Windows\solr\build\solr-core\test\J0\temp\solr.handler.TestReplicationHandler_56BD2D639E8ACD3E-001\solr-instance-002\]
   [junit4]   2> 1816290 INFO  (TEST-TestReplicationHandler.doTestRepeater-seed#[56BD2D639E8ACD3E]) [    ] o.a.s.c.CoreContainer loading shared library: C:\Users\JenkinsSlave\workspace\Lucene-Solr-5.x-Windows\solr\build\solr-core\test\J0\temp\solr.handler.TestReplicationHandler_56BD2D639E8ACD3E-001\solr-instance-002\lib
   [junit4]   2> 1816290 WARN  (TEST-TestReplicationHandler.doTestRepeater-seed#[56BD2D639E8ACD3E]) [    ] o.a.s.c.SolrResourceLoader Can't find (or read) directory to add to classloader: lib (resolved as: C:\Users\JenkinsSlave\workspace\Lucene-Solr-5.x-Windows\solr\build\solr-core\test\J0\temp\solr.handler.TestReplicationHandler_56BD2D639E8ACD3E-001\solr-instance-002\lib).
   [junit4]   2> 1816300 INFO  (TEST-TestReplicationHandler.doTestRepeater-seed#[56BD2D639E8ACD3E]) [    ] o.a.s.h.c.HttpShardHandlerFactory created with socketTimeout : 90000,urlScheme : ,connTimeout : 15000,maxConnectionsPerHost : 20,maxConnections : 10000,corePoolSize : 0,maximumPoolSize : 2147483647,maxThreadIdleTime : 5,sizeOfQueue : -1,fairnessPolicy : false,useRetries : false,
   [junit4]   2> 1816303 INFO  (TEST-TestReplicationHandler.doTestRepeater-seed#[56BD2D639E8ACD3E]) [    ] o.a.s.u.UpdateShardHandler Creating UpdateShardHandler HTTP client with params: socketTimeout=340000&connTimeout=45000&retry=true
   [junit4]   2> 1816304 INFO  (TEST-TestReplicationHandler.doTestRepeater-seed#[56BD2D639E8ACD3E]) [    ] o.a.s.l.LogWatcher SLF4J impl is org.slf4j.impl.Log4jLoggerFactory
   [junit4]   2> 1816304 INFO  (TEST-TestReplicationHandler.doTestRepeater-seed#[56BD2D639E8ACD3E]) [    ] o.a.s.l.LogWatcher Registering Log Listener [Log4j (org.slf4j.impl.Log4jLoggerFactory)]
   [junit4]   2> 1816304 INFO  (TEST-TestReplicationHandler.doTestRepeater-seed#[56BD2D639E8ACD3E]) [    ] o.a.s.c.CoreContainer No authentication plugin used.
   [junit4]   2> 1816305 INFO  (TEST-TestReplicationHandler.doTestRepeater-seed#[56BD2D639E8ACD3E]) [    ] o.a.s.c.CoresLocator Looking for core definitions underneath C:\Users\JenkinsSlave\workspace\Lucene-Solr-5.x-Windows\solr\build\solr-core\test\J0\temp\solr.handler.TestReplicationHandler_56BD2D639E8ACD3E-001\solr-instance-002\.
   [junit4]   2> 1816308 INFO  (TEST-TestReplicationHandler.doTestRepeater-seed#[56BD2D639E8ACD3E]) [    ] o.a.s.c.SolrCore Created CoreDescriptor: {schema=schema.xml, loadOnStartup=true, transient=false, absoluteInstDir=C:\Users\JenkinsSlave\workspace\Lucene-Solr-5.x-Windows\solr\build\solr-core\test\J0\temp\solr.handler.TestReplicationHandler_56BD2D639E8ACD3E-001\solr-instance-002\.\collection1\, config=solrconfig.xml, dataDir=data\, configSetProperties=configsetprops.json, instanceDir=C:\Users\JenkinsSlave\workspace\Lucene-Solr-5.x-Windows\solr\build\solr-core\test\J0\temp\solr.handler.TestReplicationHandler_56BD2D639E8ACD3E-001\solr-instance-002\.\collection1, name=collection1}
   [junit4]   2> 1816308 INFO  (TEST-TestReplicationHandler.doTestRepeater-seed#[56BD2D639E8ACD3E]) [    ] o.a.s.c.CoresLocator Found core collection1 in C:\Users\JenkinsSlave\workspace\Lucene-Solr-5.x-Windows\solr\build\solr-core\test\J0\temp\solr.handler.TestReplicationHandler_56BD2D639E8ACD3E-001\solr-instance-002\.\collection1\
   [junit4]   2> 1816310 INFO  (TEST-TestReplicationHandler.doTestRepeater-seed#[56BD2D639E8ACD3E]) [    ] o.a.s.c.CoresLocator Found 1 core definitions
   [junit4]   2> 1816311 INFO  (coreLoadExecutor-3770-thread-1) [    ] o.a.s.c.SolrResourceLoader new SolrResourceLoader for directory: 'C:\Users\JenkinsSlave\workspace\Lucene-Solr-5.x-Windows\solr\build\solr-core\test\J0\temp\solr.handler.TestReplicationHandler_56BD2D639E8ACD3E-001\solr-instance-002\.\collection1\'
   [junit4]   2> 1816312 INFO  (TEST-TestReplicationHandler.doTestRepeater-seed#[56BD2D639E8ACD3E]) [    ] o.a.s.s.SolrDispatchFilter user.dir=C:\Users\JenkinsSlave\workspace\Lucene-Solr-5.x-Windows\solr\build\solr-core\test\J0
   [junit4]   2> 1816312 INFO  (TEST-TestReplicationHandler.doTestRepeater-seed#[56BD2D639E8ACD3E]) [    ] o.a.s.s.SolrDispatchFilter SolrDispatchFilter.init() done
   [junit4]   2> 1816361 INFO  (coreLoadExecutor-3770-thread-1) [    ] o.a.s.c.SolrConfig current version of requestparams : -1
   [junit4]   2> 1816391 INFO  (coreLoadExecutor-3770-thread-1) [    ] o.a.s.c.SolrConfig Using Lucene MatchVersion: 5.3.0
   [junit4]   2> 1816434 INFO  (coreLoadExecutor-3770-thread-1) [    ] o.a.s.c.Config Loaded SolrConfig: solrconfig.xml
   [junit4]   2> 1816435 INFO  (coreLoadExecutor-3770-thread-1) [    ] o.a.s.s.IndexSchema Reading Solr Schema from C:\Users\JenkinsSlave\workspace\Lucene-Solr-5.x-Windows\solr\build\solr-core\test\J0\temp\solr.handler.TestReplicationHandler_56BD2D639E8ACD3E-001\solr-instance-002\.\collection1\conf\schema.xml
   [junit4]   2> 1816440 INFO  (coreLoadExecutor-3770-thread-1) [    ] o.a.s.s.IndexSchema [collection1] Schema name=test
   [junit4]   2> 1816454 INFO  (coreLoadExecutor-3770-thread-1) [    ] o.a.s.s.IndexSchema unique key field: id
   [junit4]   2> 1816458 INFO  (coreLoadExecutor-3770-thread-1) [    ] o.a.s.c.ConfigSetProperties Did not find ConfigSet properties, assuming default properties: Can't find resource 'configsetprops.json' in classpath or 'C:\Users\JenkinsSlave\workspace\Lucene-Solr-5.x-Windows\solr\build\solr-core\test\J0\temp\solr.handler.TestReplicationHandler_56BD2D639E8ACD3E-001\solr-instance-002\.\collection1\conf'
   [junit4]   2> 1816458 INFO  (coreLoadExecutor-3770-thread-1) [    ] o.a.s.c.CoreContainer Creating SolrCore 'collection1' using configuration from instancedir C:\Users\JenkinsSlave\workspace\Lucene-Solr-5.x-Windows\solr\build\solr-core\test\J0\temp\solr.handler.TestReplicationHandler_56BD2D639E8ACD3E-001\solr-instance-002\.\collection1\
   [junit4]   2> 1816458 INFO  (coreLoadExecutor-3770-thread-1) [    x:collection1] o.a.s.c.SolrCore org.apache.solr.core.MockDirectoryFactory
   [junit4]   2> 1816459 INFO  (coreLoadExecutor-3770-thread-1) [    x:collection1] o.a.s.c.SolrCore [[collection1] ] Opening new SolrCore at [C:\Users\JenkinsSlave\workspace\Lucene-Solr-5.x-Windows\solr\build\solr-core\test\J0\temp\solr.handler.TestReplicationHandler_56BD2D639E8ACD3E-001\solr-instance-002\.\collection1\], dataDir=[null]
   [junit4]   2> 1816459 INFO  (coreLoadExecutor-3770-thread-1) [    x:collection1] o.a.s.c.SolrCore JMX monitoring not detected for core: collection1
   [junit4]   2> 1816461 INFO  (coreLoadExecutor-3770-thread-1) [    x:collection1] o.a.s.c.CachingDirectoryFactory return new directory for C:\Users\JenkinsSlave\workspace\Lucene-Solr-5.x-Windows\solr\build\solr-core\test\J0\temp\solr.handler.TestReplicationHandler_56BD2D639E8ACD3E-001\solr-instance-002\.\collection1\data\
   [junit4]   2> 1816462 INFO  (coreLoadExecutor-3770-thread-1) [    x:collection1] o.a.s.c.SolrCore New index directory detected: old=null new=C:\Users\JenkinsSlave\workspace\Lucene-Solr-5.x-Windows\solr\build\solr-core\test\J0\temp\solr.handler.TestReplicationHandler_56BD2D639E8ACD3E-001\solr-instance-002\.\collection1\data\index/
   [junit4]   2> 1816462 WARN  (coreLoadExecutor-3770-thread-1) [    x:collection1] o.a.s.c.SolrCore [collection1] Solr index directory 'C:\Users\JenkinsSlave\workspace\Lucene-Solr-5.x-Windows\solr\build\solr-core\test\J0\temp\solr.handler.TestReplicationHandler_56BD2D639E8ACD3E-001\solr-instance-002\.\collection1\data\index' doesn't exist. Creating new index...
   [junit4]   2> 1816462 INFO  (coreLoadExecutor-3770-thread-1) [    x:collection1] o.a.s.c.CachingDirectoryFactory return new directory for C:\Users\JenkinsSlave\workspace\Lucene-Solr-5.x-Windows\solr\build\solr-core\test\J0\temp\solr.handler.TestReplicationHandler_56BD2D639E8ACD3E-001\solr-instance-002\.\collection1\data\index
   [junit4]   2> 1816463 INFO  (coreLoadExecutor-3770-thread-1) [    x:collection1] o.a.s.u.RandomMergePolicy RandomMergePolicy wrapping class org.apache.lucene.index.TieredMergePolicy: [TieredMergePolicy: maxMergeAtOnce=23, maxMergeAtOnceExplicit=13, maxMergedSegmentMB=96.6650390625, floorSegmentMB=1.732421875, forceMergeDeletesPctAllowed=11.479313264183242, segmentsPerTier=25.0, maxCFSSegmentSizeMB=8.796093022207999E12, noCFSRatio=0.3057751205348932
   [junit4]   2> 1816463 INFO  (coreLoadExecutor-3770-thread-1) [    x:collection1] o.a.s.c.SolrCore SolrDeletionPolicy.onCommit: commits: num=1
   [junit4]   2> 	commit{dir=MockDirectoryWrapper(RAMDirectory@1bbafbc lockFactory=org.apache.lucene.store.SingleInstanceLockFactory@10e8368),segFN=segments_1,generation=1}
   [junit4]   2> 1816463 INFO  (coreLoadExecutor-3770-thread-1) [    x:collection1] o.a.s.c.SolrCore newest commit generation = 1
   [junit4]   2> 1816464 INFO  (OldIndexDirectoryCleanupThreadForCore-collection1) [    x:collection1] o.a.s.c.SolrCore Looking for old index directories to cleanup for core collection1 in C:\Users\JenkinsSlave\workspace\Lucene-Solr-5.x-Windows\solr\build\solr-core\test\J0\temp\solr.handler.TestReplicationHandler_56BD2D639E8ACD3E-001\solr-instance-002\.\collection1\data\
   [junit4]   2> 1816469 INFO  (coreLoadExecutor-3770-thread-1) [    x:collection1] o.a.s.c.SolrCore no updateRequestProcessorChain defined as default, creating implicit default
   [junit4]   2> 1816477 INFO  (coreLoadExecutor-3770-thread-1) [    x:collection1] o.a.s.h.l.XMLLoader xsltCacheLifetimeSeconds=60
   [junit4]   2> 1816479 INFO  (coreLoadExecutor-3770-thread-1) [    x:collection1] o.a.s.h.l.XMLLoader xsltCacheLifetimeSeconds=60
   [junit4]   2> 1816481 INFO  (coreLoadExecutor-3770-thread-1) [    x:collection1] o.a.s.h.l.XMLLoader xsltCacheLifetimeSeconds=60
   [junit4]   2> 1816482 INFO  (coreLoadExecutor-3770-thread-1) [    x:collection1] o.a.s.h.l.XMLLoader xsltCacheLifetimeSeconds=60
   [junit4]   2> 1816485 INFO  (coreLoadExecutor-3770-thread-1) [    x:collection1] o.a.s.c.PluginBag requestHandler : 'lazy' created with startup=lazy 
   [junit4]   2> 1816485 INFO  (coreLoadExecutor-3770-thread-1) [    x:collection1] o.a.s.c.RequestHandlers Registered paths: /admin/segments,/admin/plugins,standard,/replication,/admin/mbeans,/update/csv,/admin/logging,/config,/update/json/docs,/schema,/admin/ping,/admin/properties,lazy,/admin/system,/admin/luke,/admin/threads,/get,/admin/file,defaults,/update,/update/json
   [junit4]   2> 1816487 INFO  (coreLoadExecutor-3770-thread-1) [    x:collection1] o.a.s.c.SolrCore Using default statsCache cache: org.apache.solr.search.stats.LocalStatsCache
   [junit4]   2> 1816489 INFO  (coreLoadExecutor-3770-thread-1) [    x:collection1] o.a.s.c.SolrCore Hard AutoCommit: disabled
   [junit4]   2> 1816489 INFO  (coreLoadExecutor-3770-thread-1) [    x:collection1] o.a.s.c.SolrCore Soft AutoCommit: disabled
   [junit4]   2> 1816489 INFO  (coreLoadExecutor-3770-thread-1) [    x:collection1] o.a.s.u.RandomMergePolicy RandomMergePolicy wrapping class org.apache.lucene.index.LogDocMergePolicy: [LogDocMergePolicy: minMergeSize=1000, mergeFactor=15, maxMergeSize=9223372036854775807, maxMergeSizeForForcedMerge=9223372036854775807, calibrateSizeByDeletes=true, maxMergeDocs=2147483647, maxCFSSegmentSizeMB=8.796093022207999E12, noCFSRatio=0.6135612017968246]
   [junit4]   2> 1816490 INFO  (coreLoadExecutor-3770-thread-1) [    x:collection1] o.a.s.c.SolrCore SolrDeletionPolicy.onInit: commits: num=1
   [junit4]   2> 	commit{dir=MockDirectoryWrapper(RAMDirectory@1bbafbc lockFactory=org.apache.lucene.store.SingleInstanceLockFactory@10e8368),segFN=segments_1,generation=1}
   [junit4]   2> 1816490 INFO  (coreLoadExecutor-3770-thread-1) [    x:collection1] o.a.s.c.SolrCore newest commit generation = 1
   [junit4]   2> 1816490 INFO  (coreLoadExecutor-3770-thread-1) [    x:collection1] o.a.s.s.SolrIndexSearcher Opening Searcher@65dfaa[collection1] main
   [junit4]   2> 1816490 INFO  (coreLoadExecutor-3770-thread-1) [    x:collection1] o.a.s.r.ManagedResourceStorage File-based storage initialized to use dir: C:\Users\JenkinsSlave\workspace\Lucene-Solr-5.x-Windows\solr\build\solr-core\test\J0\temp\solr.handler.TestReplicationHandler_56BD2D639E8ACD3E-001\solr-instance-002\.\collection1\conf
   [junit4]   2> 1816490 INFO  (coreLoadExecutor-3770-thread-1) [    x:collection1] o.a.s.r.RestManager Initializing RestManager with initArgs: {storageDir=C:\Users\JenkinsSlave\workspace\Lucene-Solr-5.x-Windows\solr\build\solr-core\test\J0\temp\solr.handler.TestReplicationHandler_56BD2D639E8ACD3E-001\solr-instance-002\.\collection1\conf}
   [junit4]   2> 1816491 INFO  (coreLoadExecutor-3770-thread-1) [    x:collection1] o.a.s.r.ManagedResourceStorage Reading _rest_managed.json using file:dir=C:\Users\JenkinsSlave\workspace\Lucene-Solr-5.x-Windows\solr\build\solr-core\test\J0\temp\solr.handler.TestReplicationHandler_56BD2D639E8ACD3E-001\solr-instance-002\.\collection1\conf
   [junit4]   2> 1816491 INFO  (coreLoadExecutor-3770-thread-1) [    x:collection1] o.a.s.r.RestManager Initializing 0 registered ManagedResources
   [junit4]   2> 1816495 INFO  (coreLoadExecutor-3770-thread-1) [    x:collection1] o.a.s.h.ReplicationHandler Poll Scheduled at an interval of 1000ms
   [junit4]   2> 1816495 INFO  (searcherExecutor-3771-thread-1-processing-x:collection1) [    x:collection1] o.a.s.c.SolrCore [collection1] Registered new searcher Searcher@65dfaa[collection1] main{ExitableDirectoryReader(UninvertingDirectoryReader())}
   [junit4]   2> 1816495 INFO  (coreLoadExecutor-3770-thread-1) [    x:collection1] o.a.s.c.CoreContainer registering core: collection1
   [junit4]   2> 1816854 INFO  (TEST-TestReplicationHandler.doTestRepeater-seed#[56BD2D639E8ACD3E]) [    ] o.e.j.s.ServerConnector Stopped ServerConnector@17b7d7c{HTTP/1.1}{127.0.0.1:0}
   [junit4]   2> 1816854 INFO  (TEST-TestReplicationHandler.doTestRepeater-seed#[56BD2D639E8ACD3E]) [    ] o.a.s.c.CoreContainer Shutting down CoreContainer instance=28571482
   [junit4]   2> 1816854 INFO  (TEST-TestReplicationHandler.doTestRepeater-seed#[56BD2D639E8ACD3E]) [    x:collection1] o.a.s.c.SolrCore [collection1]  CLOSING SolrCore org.apache.solr.core.SolrCore@2ab62
   [junit4]   2> 1816855 INFO  (TEST-TestReplicationHandler.doTestRepeater-seed#[56BD2D639E8ACD3E]) [    x:collection1] o.a.s.u.UpdateHandler closing DirectUpdateHandler2{commits=0,autocommits=0,soft autocommits=0,optimizes=0,rollbacks=0,expungeDeletes=0,docsPending=0,adds=0,deletesById=0,deletesByQuery=0,errors=0,cumulative_adds=0,cumulative_deletesById=0,cumulative_deletesByQuery=0,cumulative_errors=0}
   [junit4]   2> 1816855 INFO  (TEST-TestReplicationHandler.doTestRepeater-seed#[56BD2D639E8ACD3E]) [    x:collection1] o.a.s.u.SolrCoreState Closing SolrCoreState
   [junit4]   2> 1816855 INFO  (TEST-TestReplicationHandler.doTestRepeater-seed#[56BD2D639E8ACD3E]) [    x:collection1] o.a.s.u.DefaultSolrCoreState SolrCoreState ref count has reached 0 - closing IndexWriter
   [junit4]   2> 1816855 INFO  (TEST-TestReplicationHandler.doTestRepeater-seed#[56BD2D639E8ACD3E]) [    x:collection1] o.a.s.u.DefaultSolrCoreState closing IndexWriter with IndexWriterCloser
   [junit4]   2> 1816857 INFO  (TEST-TestReplicationHandler.doTestRepeater-seed#[56BD2D639E8ACD3E]) [    x:collection1] o.a.s.c.SolrCore [collection1] Closing main searcher on request.
   [junit4]   2> 1816857 INFO  (TEST-TestReplicationHandler.doTestRepeater-seed#[56BD2D639E8ACD3E]) [    x:collection1] o.a.s.c.CachingDirectoryFactory Closing MockDirectoryFactory - 2 directories currently being tracked
   [junit4]   2> 1816857 INFO  (TEST-TestReplicationHandler.doTestRepeater-seed#[56BD2D639E8ACD3E]) [    x:collection1] o.a.s.c.CachingDirectoryFactory looking to close C:\Users\JenkinsSlave\workspace\Lucene-Solr-5.x-Windows\solr\build\solr-core\test\J0\temp\solr.handler.TestReplicationHandler_56BD2D639E8ACD3E-001\solr-instance-002\.\collection1\data\index [CachedDir<<refCount=0;path=C:\Users\JenkinsSlave\workspace\Lucene-Solr-5.x-Windows\solr\build\solr-core\test\J0\temp\solr.handler.TestReplicationHandler_56BD2D639E8ACD3E-001\solr-instance-002\.\collection1\data\index;done=false>>]
   [junit4]   2> 1816857 INFO  (TEST-TestReplicationHandler.doTestRepeater-seed#[56BD2D639E8ACD3E]) [    x:collection1] o.a.s.c.CachingDirectoryFactory Closing directory: C:\Users\JenkinsSlave\workspace\Lucene-Solr-5.x-Windows\solr\build\solr-core\test\J0\temp\solr.handler.TestReplicationHandler_56BD2D639E8ACD3E-001\solr-instance-002\.\collection1\data\index
   [junit4]   2> 1816858 INFO  (TEST-TestReplicationHandler.doTestRepeater-seed#[56BD2D639E8ACD3E]) [    x:collection1] o.a.s.c.CachingDirectoryFactory looking to close C:\Users\JenkinsSlave\workspace\Lucene-Solr-5.x-Windows\solr\build\solr-core\test\J0\temp\solr.handler.TestReplicationHandler_56BD2D639E8ACD3E-001\solr-instance-002\.\collection1\data\ [CachedDir<<refCount=0;path=C:\Users\JenkinsSlave\workspace\Lucene-Solr-5.x-Windows\solr\build\solr-core\test\J0\temp\solr.handler.TestReplicationHandler_56BD2D639E8ACD3E-001\solr-instance-002\.\collection1\data\;done=false>>]
   [junit4]   2> 1816858 INFO  (TEST-TestReplicationHandler.doTestRepeater-seed#[56BD2D639E8ACD3E]) [    x:collection1] o.a.s.c.CachingDirectoryFactory Closing directory: C:\Users\JenkinsSlave\workspace\Lucene-Solr-5.x-Windows\solr\build\solr-core\test\J0\temp\solr.handler.TestReplicationHandler_56BD2D639E8ACD3E-001\solr-instance-002\.\collection1\data\
   [junit4]   2> 1816859 INFO  (TEST-TestReplicationHandler.doTestRepeater-seed#[56BD2D639E8ACD3E]) [    x:collection1] o.e.j.s.h.ContextHandler Stopped o.e.j.s.ServletContextHandler@13fad12{/solr,null,UNAVAILABLE}
   [junit4]   2> 1816863 INFO  (TEST-TestReplicationHandler.doTestRepeater-seed#[56BD2D639E8ACD3E]) [    ] o.e.j.s.Server jetty-9.2.11.v20150529
   [junit4]   2> 1816868 INFO  (TEST-TestReplicationHandler.doTestRepeater-seed#[56BD2D639E8ACD3E]) [    ] o.e.j.s.h.ContextHandler Started o.e.j.s.ServletContextHandler@14375f8{/solr,null,AVAILABLE}
   [junit4]   2> 1816869 INFO  (TEST-TestReplicationHandler.doTestRepeater-seed#[56BD2D639E8ACD3E]) [    ] o.e.j.s.ServerConnector Started ServerConnector@1f6198a{HTTP/1.1}{127.0.0.1:60031}
   [junit4]   2> 1816869 INFO  (TEST-TestReplicationHandler.doTestRepeater-seed#[56BD2D639E8ACD3E]) [    ] o.e.j.s.Server Started @1821845ms
   [junit4]   2> 1816869 INFO  (TEST-TestReplicationHandler.doTestRepeater-seed#[56BD2D639E8ACD3E]) [    ] o.a.s.c.s.e.JettySolrRunner Jetty properties: {hostContext=/solr, hostPort=60031, solr.data.dir=C:\Users\JenkinsSlave\workspace\Lucene-Solr-5.x-Windows\solr\build\solr-core\test\J0\temp\solr.handler.TestReplicationHandler_56BD2D639E8ACD3E-001\solr-instance-002\collection1\data}
   [junit4]   2> 1816869 INFO  (TEST-TestReplicationHandler.doTestRepeater-seed#[56BD2D639E8ACD3E]) [    ] o.a.s.s.SolrDispatchFilter SolrDispatchFilter.init(): sun.misc.Launcher$AppClassLoader@a5c9f1
   [junit4]   2> 1816869 INFO  (TEST-TestReplicationHandler.doTestRepeater-seed#[56BD2D639E8ACD3E]) [    ] o.a.s.c.SolrResourceLoader new SolrResourceLoader for directory: 'C:\Users\JenkinsSlave\workspace\Lucene-Solr-5.x-Windows\solr\build\solr-core\test\J0\temp\solr.handler.TestReplicationHandler_56BD2D639E8ACD3E-001\solr-instance-002\'
   [junit4]   2> 1816902 INFO  (TEST-TestReplicationHandler.doTestRepeater-seed#[56BD2D639E8ACD3E]) [    ] o.a.s.c.SolrXmlConfig Loading container configuration from C:\Users\JenkinsSlave\workspace\Lucene-Solr-5.x-Windows\solr\build\solr-core\test\J0\temp\solr.handler.TestReplicationHandler_56BD2D639E8ACD3E-001\solr-instance-002\solr.xml
   [junit4]   2> 1816931 INFO  (TEST-TestReplicationHandler.doTestRepeater-seed#[56BD2D639E8ACD3E]) [    ] o.a.s.c.CoresLocator Config-defined core root directory: C:\Users\JenkinsSlave\workspace\Lucene-Solr-5.x-Windows\solr\build\solr-core\test\J0\temp\solr.handler.TestReplicationHandler_56BD2D639E8ACD3E-001\solr-instance-002\.
   [junit4]   2> 1816932 INFO  (TEST-TestReplicationHandler.doTestRepeater-seed#[56BD2D639E8ACD3E]) [    ] o.a.s.c.CoreContainer New CoreContainer 2719051
   [junit4]   2> 1816932 INFO  (TEST-TestReplicationHandler.doTestRepeater-seed#[56BD2D639E8ACD3E]) [    ] o.a.s.c.CoreContainer Loading cores into CoreContainer [instanceDir=C:\Users\JenkinsSlave\workspace\Lucene-Solr-5.x-Windows\solr\build\solr-core\test\J0\temp\solr.handler.TestReplicationHandler_56BD2D639E8ACD3E-001\solr-instance-002\]
   [junit4]   2> 1816932 INFO  (TEST-TestReplicationHandler.doTestRepeater-seed#[56BD2D639E8ACD3E]) [    ] o.a.s.c.CoreContainer loading shared library: C:\Users\JenkinsSlave\workspace\Lucene-Solr-5.x-Windows\solr\build\solr-core\test\J0\temp\solr.handler.TestReplicationHandler_56BD2D639E8ACD3E-001\solr-instance-002\lib
   [junit4]   2> 1816932 WARN  (TEST-TestReplicationHandler.doTestRepeater-seed#[56BD2D639E8ACD3E]) [    ] o.a.s.c.SolrResourceLoader Can't find (or read) directory to add to classloader: lib (resolved as: C:\Users\JenkinsSlave\workspace\Lucene-Solr-5.x-Windows\solr\build\solr-core\test\J0\temp\solr.handler.TestReplicationHandler_56BD2D639E8ACD3E-001\solr-instance-002\lib).
   [junit4]   2> 1816942 INFO  (TEST-TestReplicationHandler.doTestRepeater-seed#[56BD2D639E8ACD3E]) [    ] o.a.s.h.c.HttpShardHandlerFactory created with socketTimeout : 90000,urlScheme : ,connTimeout : 15000,maxConnectionsPerHost : 20,maxConnections : 10000,corePoolSize : 0,maximumPoolSize : 2147483647,maxThreadIdleTime : 5,sizeOfQueue : -1,fairnessPolicy : false,useRetries : false,
   [junit4]   2> 1816945 INFO  (TEST-TestReplicationHandler.doTestRepeater-seed#[56BD2D639E8ACD3E]) [    ] o.a.s.u.UpdateShardHandler Creating UpdateShardHandler HTTP client with params: socketTimeout=340000&connTimeout=45000&retry=true
   [junit4]   2> 1816945 INFO  (TEST-TestReplicationHandler.doTestRepeater-seed#[56BD2D639E8ACD3E]) [    ] o.a.s.l.LogWatcher SLF4J impl is org.slf4j.impl.Log4jLoggerFactory
   [junit4]   2> 1816945 INFO  (TEST-TestReplicationHandler.doTestRepeater-seed#[56BD2D639E8ACD3E]) [    ] o.a.s.l.LogWatcher Registering Log Listener [Log4j (org.slf4j.impl.Log4jLoggerFactory)]
   [junit4]   2> 1816946 INFO  (TEST-TestReplicationHandler.doTestRepeater-seed#[56BD2D639E8ACD3E]) [    ] o.a.s.c.CoreContainer No authentication plugin used.
   [junit4]   2> 1816948 INFO  (TEST-TestReplicationHandler.doTestRepeater-seed#[56BD2D639E8ACD3E]) [    ] o.a.s.c.CoresLocator Looking for core definitions underneath C:\Users\JenkinsSlave\workspace\Lucene-Solr-5.x-Windows\solr\build\solr-core\test\J0\temp\solr.handler.TestReplicationHandler_56BD2D639E8ACD3E-001\solr-instance-002\.
   [junit4]   2> 1816949 INFO  (TEST-TestReplicationHandler.doTestRepeater-seed#[56BD2D639E8ACD3E]) [    ] o.a.s.c.SolrCore Created CoreDescriptor: {absoluteInstDir=C:\Users\JenkinsSlave\workspace\Lucene-Solr-5.x-Windows\solr\build\solr-core\test\J0\temp\solr.handler.TestReplicationHandler_56BD2D639E8ACD3E-001\solr-instance-002\.\collection1\, transient=false, schema=schema.xml, instanceDir=C:\Users\JenkinsSlave\workspace\Lucene-Solr-5.x-Windows\solr\build\solr-core\test\J0\temp\solr.handler.TestReplicationHandler_56BD2D639E8ACD3E-001\solr-instance-002\.\collection1, name=collection1, loadOnStartup=true, configSetProperties=configsetprops.json, dataDir=data\, config=solrconfig.xml}
   [junit4]   2> 1816949 INFO  (TEST-TestReplicationHandler.doTestRepeater-seed#[56BD2D639E8ACD3E]) [    ] o.a.s.c.CoresLocator Found core collection1 in C:\Users\JenkinsSlave\workspace\Lucene-Solr-5.x-Windows\solr\build\solr-core\test\J0\temp\solr.handler.TestReplicationHandler_56BD2D639E8ACD3E-001\solr-instance-002\.\collection1\
   [junit4]   2> 1816950 INFO  (TEST-TestReplicationHandler.doTestRepeater-seed#[56BD2D639E8ACD3E]) [    ] o.a.s.c.CoresLocator Found 1 core definitions
   [junit4]   2> 1816951 INFO  (coreLoadExecutor-3781-thread-1) [    ] o.a.s.c.SolrResourceLoader new SolrResourceLoader for directory: 'C:\Users\JenkinsSlave\workspace\Lucene-Solr-5.x-Windows\solr\build\solr-core\test\J0\temp\solr.handler.TestReplicationHandler_56BD2D639E8ACD3E-001\solr-instance-002\.\collection1\'
   [junit4]   2> 1816952 INFO  (TEST-TestReplicationHandler.doTestRepeater-seed#[56BD2D639E8ACD3E]) [    ] o.a.s.s.SolrDispatchFilter user.dir=C:\Users\JenkinsSlave\workspace\Lucene-Solr-5.x-Windows\solr\build\solr-core\test\J0
   [junit4]   2> 1816953 INFO  (TEST-TestReplicationHandler.doTestRepeater-seed#[56BD2D639E8ACD3E]) [    ] o.a.s.s.SolrDispatchFilter SolrDispatchFilter.init() done
   [junit4]   2> 1816991 INFO  (coreLoadExecutor-3781-thread-1) [    ] o.a.s.c.SolrConfig current version of requestparams : -1
   [junit4]   2> 1817008 INFO  (coreLoadExecutor-3781-thread-1) [    ] o.a.s.c.SolrConfig Using Lucene MatchVersion: 5.3.0
   [junit4]   2> 1817083 INFO  (coreLoadExecutor-3781-thread-1) [    ] o.a.s.c.Config Loaded SolrConfig: solrconfig.xml
   [junit4]   2> 1817084 INFO  (coreLoadExecutor-3781-thread-1) [    ] o.a.s.s.IndexSchema Reading Solr Schema from C:\Users\JenkinsSlave\workspace\Lucene-Solr-5.x-Windows\solr\build\solr-core\test\J0\temp\solr.handler.TestReplicationHandler_56BD2D639E8ACD3E-001\solr-instance-002\.\collection1\conf\schema.xml
   [junit4]   2> 1817090 INFO  (coreLoadExecutor-3781-thread-1) [    ] o.a.s.s.IndexSchema [collection1] Schema name=test
   [junit4]   2> 1817101 INFO  (coreLoadExecutor-3781-thread-1) [    ] o.a.s.s.IndexSchema unique key field: id
   [junit4]   2> 1817105 INFO  (coreLoadExecutor-3781-thread-1) [    ] o.a.s.c.ConfigSetProperties Did not find ConfigSet properties, assuming default properties: Can't find resource 'configsetprops.json' in classpath or 'C:\Users\JenkinsSlave\workspace\Lucene-Solr-5.x-Windows\solr\build\solr-core\test\J0\temp\solr.handler.TestReplicationHandler_56BD2D639E8ACD3E-001\solr-instance-002\.\collection1\conf'
   [junit4]   2> 1817105 INFO  (coreLoadExecutor-3781-thread-1) [    ] o.a.s.c.CoreContainer Creating SolrCore 'collection1' using configuration from instancedir C:\Users\JenkinsSlave\workspace\Lucene-Solr-5.x-Windows\solr\build\solr-core\test\J0\temp\solr.handler.TestReplicationHandler_56BD2D639E8ACD3E-001\solr-instance-002\.\collection1\
   [junit4]   2> 1817105 INFO  (coreLoadExecutor-3781-thread-1) [    x:collection1] o.a.s.c.SolrCore org.apache.solr.core.MockDirectoryFactory
   [junit4]   2> 1817105 INFO  (coreLoadExecutor-3781-thread-1) [    x:collection1] o.a.s.c.SolrCore [[collection1] ] Opening new SolrCore at [C:\Users\JenkinsSlave\workspace\Lucene-Solr-5.x-Windows\solr\build\solr-core\test\J0\temp\solr.handler.TestReplicationHandler_56BD2D639E8ACD3E-001\solr-instance-002\.\collection1\], dataDir=[null]
   [junit4]   2> 1817107 INFO  (coreLoadExecutor-3781-thread-1) [    x:collection1] o.a.s.c.SolrCore JMX monitoring not detected for core: collection1
   [junit4]   2> 1817109 INFO  (coreLoadExecutor-3781-thread-1) [    x:collection1] o.a.s.c.CachingDirectoryFactory return new directory for C:\Users\JenkinsSlave\workspace\Lucene-Solr-5.x-Windows\solr\build\solr-core\test\J0\temp\solr.handler.TestReplicationHandler_56BD2D639E8ACD3E-001\solr-instance-002\.\collection1\data\
   [junit4]   2> 1817109 INFO  (coreLoadExecutor-3781-thread-1) [    x:collection1] o.a.s.c.SolrCore New index directory detected: old=null new=C:\Users\JenkinsSlave\workspace\Lucene-Solr-5.x-Windows\solr\build\solr-core\test\J0\temp\solr.handler.TestReplicationHandler_56BD2D639E8ACD3E-001\solr-instance-002\.\collection1\data\index/
   [junit4]   2> 1817110 WARN  (coreLoadExecutor-3781-thread-1) [    x:collection1] o.a.s.c.SolrCore [collection1] Solr index directory 'C:\Users\JenkinsSlave\workspace\Lucene-Solr-5.x-Windows\solr\build\solr-core\test\J0\temp\solr.handler.TestReplicationHandler_56BD2D639E8ACD3E-001\solr-instance-002\.\collection1\data\index' doesn't exist. Creating new index...
   [junit4]   2> 1817110 INFO  (coreLoadExecutor-3781-thread-1) [    x:collection1] o.a.s.c.CachingDirectoryFactory return new directory for C:\Users\JenkinsSlave\workspace\Lucene-Solr-5.x-Windows\solr\build\solr-core\test\J0\temp\solr.handler.TestReplicationHandler_56BD2D639E8ACD3E-001\solr-instance-002\.\collection1\data\index
   [junit4]   2> 1817110 INFO  (coreLoadExecutor-3781-thread-1) [    x:collection1] o.a.s.u.RandomMergePolicy RandomMergePolicy wrapping class org.apache.lucene.index.TieredMergePolicy: [TieredMergePolicy: maxMergeAtOnce=23, maxMergeAtOnceExplicit=13, maxMergedSegmentMB=96.6650390625, floorSegmentMB=1.732421875, forceMergeDeletesPctAllowed=11.479313264183242, segmentsPerTier=25.0, maxCFSSegmentSizeMB=8.796093022207999E12, noCFSRatio=0.3057751205348932
   [junit4]   2> 1817111 INFO  (coreLoadExecutor-3781-thread-1) [    x:collection1] o.a.s.c.SolrCore SolrDeletionPolicy.onCommit: commits: num=1
   [junit4]   2> 	commit{dir=MockDirectoryWrapper(RAMDirectory@773cc5 lockFactory=org.apache.lucene.store.SingleInstanceLockFactory@36e74c),segFN=segments_1,generation=1}
   [junit4]   2> 1817111 INFO  (coreLoadExecutor-3781-thread-1) [    x:collection1] o.a.s.c.SolrCore newest commit generation = 1
   [junit4]   2> 1817113 INFO  (OldIndexDirectoryCleanupThreadForCore-collection1) [    x:collection1] o.a.s.c.SolrCore Looking for old index directories to cleanup for core collection1 in C:\Users\JenkinsSlave\workspace\Lucene-Solr-5.x-Windows\solr\build\solr-core\test\J0\temp\solr.handler.TestReplicationHandler_56BD2D639E8ACD3E-001\solr-instance-002\.\collection1\data\
   [junit4]   2> 1817116 INFO  (coreLoadExecutor-3781-thread-1) [    x:collection1] o.a.s.c.SolrCore no updateRequestProcessorChain defined as default, creating implicit default
   [junit4]   2> 1817123 INFO  (coreLoadExecutor-3781-thread-1) [    x:collection1] o.a.s.h.l.XMLLoader xsltCacheLifetimeSeconds=60
   [junit4]   2> 1817124 INFO  (coreLoadExecutor-3781-thread-1) [    x:collection1] o.a.s.h.l.XMLLoader xsltCacheLifetimeSeconds=60
   [junit4]   2> 1817127 INFO  (coreLoadExecutor-3781-thread-1) [    x:collection1] o.a.s.h.l.XMLLoader xsltCacheLifetimeSeconds=60
   [junit4]   2> 1817128 INFO  (coreLoadExecutor-3781-thread-1) [    x:collection1] o.a.s.h.l.XMLLoader xsltCacheLifetimeSeconds=60
   [junit4]   2> 1817131 INFO  (coreLoadExecutor-3781-thread-1) [    x:collection1] o.a.s.c.PluginBag requestHandler : 'lazy' created with startup=lazy 
   [junit4]   2> 1817131 INFO  (coreLoadExecutor-3781-thread-1) [    x:collection1] o.a.s.c.RequestHandlers Registered paths: /admin/segments,/admin/plugins,standard,/replication,/admin/mbeans,/update/csv,/admin/logging,/config,/update/json/docs,/schema,/admin/ping,/admin/properties,lazy,/admin/system,/admin/luke,/admin/threads,/get,/admin/file,defaults,/update,/update/json
   [junit4]   2> 1817133 INFO  (coreLoadExecutor-3781-thread-1) [    x:collection1] o.a.s.c.SolrCore Using default statsCache cache: org.apache.solr.search.stats.LocalStatsCache
   [junit4]   2> 1817134 INFO  (coreLoadExecutor-3781-thread-1) [    x:collection1] o.a.s.c.SolrCore Hard AutoCommit: disabled
   [junit4]   2> 1817134 INFO  (coreLoadExecutor-3781-thread-1) [    x:collection1] o.a.s.c.SolrCore Soft AutoCommit: disabled
   [junit4]   2> 1817134 INFO  (coreLoadExecutor-3781-thread-1) [    x:collection1] o.a.s.u.RandomMergePolicy RandomMergePolicy wrapping class org.apache.lucene.index.LogDocMergePolicy: [LogDocMergePolicy: minMergeSize=1000, mergeFactor=15, maxMergeSize=9223372036854775807, maxMergeSizeForForcedMerge=9223372036854775807, calibrateSizeByDeletes=true, maxMergeDocs=2147483647, maxCFSSegmentSizeMB=8.796093022207999E12, noCFSRatio=0.6135612017968246]
   [junit4]   2> 1817134 INFO  (coreLoadExecutor-3781-thread-1) [    x:collection1] o.a.s.c.SolrCore SolrDeletionPolicy.onInit: commits: num=1
   [junit4]   2> 	commit{dir=MockDirectoryWrapper(RAMDirectory@773cc5 lockFactory=org.apache.lucene.store.SingleInstanceLockFactory@36e74c),segFN=segments_1,generation=1}
   [junit4]   2> 1817135 INFO  (coreLoadExecutor-3781-thread-1) [    x:collection1] o.a.s.c.SolrCore newest commit generation = 1
   [junit4]   2> 1817135 INFO  (coreLoadExecutor-3781-thread-1) [    x:collection1] o.a.s.s.SolrIndexSearcher Opening Searcher@4a8121[collection1] main
   [junit4]   2> 1817135 INFO  (coreLoadExecutor-3781-thread-1) [    x:collection1] o.a.s.r.ManagedResourceStorage File-based storage initialized to use dir: C:\Users\JenkinsSlave\workspace\Lucene-Solr-5.x-Windows\solr\build\solr-core\test\J0\temp\solr.handler.TestReplicationHandler_56BD2D639E8ACD3E-001\solr-instance-002\.\collection1\conf
   [junit4]   2> 1817136 INFO  (coreLoadExecutor-3781-thread-1) [    x:collection1] o.a.s.r.RestManager Initializing RestManager with initArgs: {storageDir=C:\Users\JenkinsSlave\workspace\Lucene-Solr-5.x-Windows\solr\build\solr-core\test\J0\temp\solr.handler.TestReplicationHandler_56BD2D639E8ACD3E-001\solr-instance-002\.\collection1\conf}
   [junit4]   2> 1817136 INFO  (coreLoadExecutor-3781-thread-1) [    x:collection1] o.a.s.r.ManagedResourceStorage Reading _rest_managed.json using file:dir=C:\Users\JenkinsSlave\workspace\Lucene-Solr-5.x-Windows\solr\build\solr-core\test\J0\temp\solr.handler.TestReplicationHandler_56BD2D639E8ACD3E-001\solr-instance-002\.\collection1\conf
   [junit4]   2> 1817136 INFO  (coreLoadExecutor-3781-thread-1) [    x:collection1] o.a.s.r.RestManager Initializing 0 registered ManagedResources
   [junit4]   2> 1817136 INFO  (coreLoadExecutor-3781-thread-1) [    x:collection1] o.a.s.h.ReplicationHandler Commits will be reserved for  10000
   [junit4]   2> 1817136 INFO  (searcherExecutor-3782-thread-1-processing-x:collection1) [    x:collection1] o.a.s.c.SolrCore [collection1] Registered new searcher Searcher@4a8121[collection1] main{ExitableDirectoryReader(UninvertingDirectoryReader())}
   [junit4]   2> 1817136 INFO  (coreLoadExecutor-3781-thread-1) [    x:collection1] o.a.s.c.CoreContainer registering core: collection1
   [junit4]   2> 1817495 INFO  (TEST-TestReplicationHandler.doTestRepeater-seed#[56BD2D639E8ACD3E]) [    ] o.a.s.SolrTestCaseJ4 Writing core.properties file to C:\Users\JenkinsSlave\workspace\Lucene-Solr-5.x-Windows\solr\build\solr-core\test\J0\temp\solr.handler.TestReplicationHandler_56BD2D639E8ACD3E-001\solr-instance-003\collection1
   [junit4]   2> 1817512 INFO  (TEST-TestReplicationHandler.doTestRepeater-seed#[56BD2D639E8ACD3E]) [    ] o.e.j.s.Server jetty-9.2.11.v20150529
   [junit4]   2> 1817515 INFO  (TEST-TestReplicationHandler.doTestRepeater-seed#[56BD2D639E8ACD3E]) [    ] o.e.j.s.h.ContextHandler Started o.e.j.s.ServletContextHandler@15b0348{/solr,null,AVAILABLE}
   [junit4]   2> 1817516 INFO  (TEST-TestReplicationHandler.doTestRepeater-seed#[56BD2D639E8ACD3E]) [    ] o.e.j.s.ServerConnector Started ServerConnector@34a829{HTTP/1.1}{127.0.0.1:60034}
   [junit4]   2> 1817516 INFO  (TEST-TestReplicationHandler.doTestRepeater-seed#[56BD2D639E8ACD3E]) [    ] o.e.j.s.Server Started @1822492ms
   [junit4]   2> 1817517 INFO  (TEST-TestReplicationHandler.doTestRepeater-seed#[56BD2D639E8ACD3E]) [    ] o.a.s.c.s.e.JettySolrRunner Jetty properties: {hostContext=/solr, hostPort=60034, solr.data.dir=C:\Users\JenkinsSlave\workspace\Lucene-Solr-5.x-Windows\solr\build\solr-core\test\J0\temp\solr.handler.TestReplicationHandler_56BD2D639E8ACD3E-001\solr-instance-003\collection1\data}
   [junit4]   2> 1817517 INFO  (TEST-TestReplicationHandler.doTestRepeater-seed#[56BD2D639E8ACD3E]) [    ] o.a.s.s.SolrDispatchFilter SolrDispatchFilter.init(): sun.misc.Launcher$AppClassLoader@a5c9f1
   [junit4]   2> 1817517 INFO  (TEST-TestReplicationHandler.doTestRepeater-seed#[56BD2D639E8ACD3E]) [    ] o.a.s.c.SolrResourceLoader new SolrResourceLoader for directory: 'C:\Users\JenkinsSlave\workspace\Lucene-Solr-5.x-Windows\solr\build\solr-core\test\J0\temp\solr.handler.TestReplicationHandler_56BD2D639E8ACD3E-001\solr-instance-003\'
   [junit4]   2> 1817571 INFO  (TEST-TestReplicationHandler.doTestRepeater-seed#[56BD2D639E8ACD3E]) [    ] o.a.s.c.SolrXmlConfig Loading container configuration from C:\Users\JenkinsSlave\workspace\Lucene-Solr-5.x-Windows\solr\build\solr-core\test\J0\temp\solr.handler.TestReplicationHandler_56BD2D639E8ACD3E-001\solr-instance-003\solr.xml
   [junit4]   2> 1817614 INFO  (TEST-TestReplicationHandler.doTestRepeater-seed#[56BD2D639E8ACD3E]) [    ] o.a.s.c.CoresLocator Config-defined core root directory: C:\Users\JenkinsSlave\workspace\Lucene-Solr-5.x-Windows\solr\build\solr-core\test\J0\temp\solr.handler.TestReplicationHandler_56BD2D639E8ACD3E-001\solr-instance-003\.
   [junit4]   2> 1817614 INFO  (TEST-TestReplicationHandler.doTestRepeater-seed#[56BD2D639E8ACD3E]) [    ] o.a.s.c.CoreContainer New CoreContainer 16452689
   [junit4]   2> 1817615 INFO  (TEST-TestReplicationHandler.doTestRepeater-seed#[56BD2D639E8ACD3E]) [    ] o.a.s.c.CoreContainer Loading cores into CoreContainer [instanceDir=C:\Users\JenkinsSlave\workspace\Lucene-Solr-5.x-Windows\solr\build\solr-core\test\J0\temp\solr.handler.TestReplicationHandler_56BD2D639E8ACD3E-001\solr-instance-003\]
   [junit4]   2> 1817615 INFO  (TEST-TestReplicationHandler.doTestRepeater-seed#[56BD2D639E8ACD3E]) [    ] o.a.s.c.CoreContainer loading shared library: C:\Users\JenkinsSlave\workspace\Lucene-Solr-5.x-Windows\solr\build\solr-core\test\J0\temp\solr.handler.TestReplicationHandler_56BD2D639E8ACD3E-001\solr-instance-003\lib
   [junit4]   2> 1817615 WARN  (TEST-TestReplicationHandler.doTestRepeater-seed#[56BD2D639E8ACD3E]) [    ] o.a.s.c.SolrResourceLoader Can't find (or read) directory to add to classloader: lib (resolved as: C:\Users\JenkinsSlave\workspace\Lucene-Solr-5.x-Windows\solr\build\solr-core\test\J0\temp\solr.handler.TestReplicationHandler_56BD2D639E8ACD3E-001\solr-instance-003\lib).
   [junit4]   2> 1817631 INFO  (TEST-TestReplicationHandler.doTestRepeater-seed#[56BD2D639E8ACD3E]) [    ] o.a.s.h.c.HttpShardHandlerFactory created with socketTimeout : 90000,urlScheme : ,connTimeout : 15000,maxConnectionsPerHost : 20,maxConnections : 10000,corePoolSize : 0,maximumPoolSize : 2147483647,maxThreadIdleTime : 5,sizeOfQueue : -1,fairnessPolicy : false,useRetries : false,
   [junit4]   2> 1817637 INFO  (TEST-TestReplicationHandler.doTestRepeater-seed#[56BD2D639E8ACD3E]) [    ] o.a.s.u.UpdateShardHandler Creating UpdateShardHandler HTTP client with params: socketTimeout=340000&connTimeout=45000&retry=true
   [junit4]   2> 1817638 INFO  (TEST-TestReplicationHandler.doTestRepeater-seed#[56BD2D639E8ACD3E]) [    ] o.a.s.l.LogWatcher SLF4J impl is org.slf4j.impl.Log4jLoggerFactory
   [junit4]   2> 1817638 INFO  (TEST-TestReplicationHandler.doTestRepeater-seed#[56BD2D639E8ACD3E]) [    ] o.a.s.l.LogWatcher Registering Log Listener [Log4j (org.slf4j.impl.Log4jLoggerFactory)]
   [junit4]   2> 1817638 INFO  (TEST-TestReplicationHandler.doTestRepeater-seed#[56BD2D639E8ACD3E]) [    ] o.a.s.c.CoreContainer No authentication plugin used.
   [junit4]   2> 1817640 INFO  (TEST-TestReplicationHandler.doTestRepeater-seed#[56BD2D639E8ACD3E]) [    ] o.a.s.c.CoresLocator Looking for core definitions underneath C:\Users\JenkinsSlave\workspace\Lucene-Solr-5.x-Windows\solr\build\solr-core\test\J0\temp\solr.handler.TestReplicationHandler_56BD2D639E8ACD3E-001\solr-instance-003\.
   [junit4]   2> 1817643 INFO  (TEST-TestReplicationHandler.doTestRepeater-seed#[56BD2D639E8ACD3E]) [    ] o.a.s.c.SolrCore Created CoreDescriptor: {loadOnStartup=true, transient=false, schema=schema.xml, configSetProperties=configsetprops.json, absoluteInstDir=C:\Users\JenkinsSlave\workspace\Lucene-Solr-5.x-Windows\solr\build\solr-core\test\J0\temp\solr.handler.TestReplicationHandler_56BD2D639E8ACD3E-001\solr-instance-003\.\collection1\, name=collection1, instanceDir=C:\Users\JenkinsSlave\workspace\Lucene-Solr-5.x-Windows\solr\build\solr-core\test\J0\temp\solr.handler.TestReplicationHandler_56BD2D639E8ACD3E-001\solr-instance-003\.\collection1, dataDir=data\, config=solrconfig.xml}
   [junit4]   2> 1817644 INFO  (TEST-TestReplicationHandler.doTestRepeater-seed#[56BD2D639E8ACD3E]) [    ] o.a.s.c.CoresLocator Found core collection1 in C:\Users\JenkinsSlave\workspace\Lucene-Solr-5.x-Windows\solr\build\solr-core\test\J0\temp\solr.handler.TestReplicationHandler_56BD2D639E8ACD3E-001\solr-instance-003\.\collection1\
   [junit4]   2> 1817647 INFO  (TEST-TestReplicationHandler.doTestRepeater-seed#[56BD2D639E8ACD3E]) [    ] o.a.s.c.CoresLocator Found 1 core definitions
   [junit4]   2> 1817648 INFO  (coreLoadExecutor-3791-thread-1) [    ] o.a.s.c.SolrResourceLoader new SolrResourceLoader for directory: 'C:\Users\JenkinsSlave\workspace\Lucene-Solr-5.x-Windows\solr\build\solr-core\test\J0\temp\solr.handler.TestReplicationHandler_56BD2D639E8ACD3E-001\solr-instance-003\.\collection1\'
   [junit4]   2> 1817649 INFO  (TEST-TestReplicationHandler.doTestRepeater-seed#[56BD2D639E8ACD3E]) [    ] o.a.s.s.SolrDispatchFilter user.dir=C:\Users\JenkinsSlave\workspace\Lucene-Solr-5.x-Windows\solr\build\solr-core\test\J0
   [junit4]   2> 1817649 INFO  (TEST-TestReplicationHandler.doTestRepeater-seed#[56BD2D639E8ACD3E]) [    ] o.a.s.s.SolrDispatchFilter SolrDispatchFilter.init() done
   [junit4]   2> 1817694 INFO  (coreLoadExecutor-3791-thread-1) [    ] o.a.s.c.SolrConfig current version of requestparams : -1
   [junit4]   2> 1817714 INFO  (coreLoadExecutor-3791-thread-1) [    ] o.a.s.c.SolrConfig Using Lucene MatchVersion: 5.3.0
   [junit4]   2> 1817749 INFO  (coreLoadExecutor-3791-thread-1) [    ] o.a.s.c.Config Loaded SolrConfig: solrconfig.xml
   [junit4]   2> 1817750 INFO  (coreLoadExecutor-3791-thread-1) [    ] o.a.s.s.IndexSchema Reading Solr Schema from C:\Users\JenkinsSlave\workspace\Lucene-Solr-5.x-Windows\solr\build\solr-core\test\J0\temp\solr.handler.TestReplicationHandler_56BD2D639E8ACD3E-001\solr-instance-003\.\collection1\conf\schema.xml
   [junit4]   2> 1817755 INFO  (coreLoadExecutor-3791-thread-1) [    ] o.a.s.s.IndexSchema [collection1] Schema name=test
   [junit4]   2> 1817767 INFO  (coreLoadExecutor-3791-thread-1) [    ] o.a.s.s.IndexSchema unique key field: id
   [junit4]   2> 1817771 INFO  (coreLoadExecutor-3791-thread-1) [    ] o.a.s.c.ConfigSetProperties Did not find ConfigSet properties, assuming default properties: Can't find resource 'configsetprops.json' in classpath or 'C:\Users\JenkinsSlave\workspace\Lucene-Solr-5.x-Windows\solr\build\solr-core\test\J0\temp\solr.handler.TestReplicationHandler_56BD2D639E8ACD3E-001\solr-instance-003\.\collection1\conf'
   [junit4]   2> 1817771 INFO  (coreLoadExecutor-3791-thread-1) [    ] o.a.s.c.CoreContainer Creating SolrCore 'collection1' using configuration from instancedir C:\Users\JenkinsSlave\workspace\Lucene-Solr-5.x-Windows\solr\build\solr-core\test\J0\temp\solr.handler.TestReplicationHandler_56BD2D639E8ACD3E-001\solr-instance-003\.\collection1\
   [junit4]   2> 1817771 INFO  (coreLoadExecutor-3791-thread-1) [    x:collection1] o.a.s.c.SolrCore org.apache.solr.core.MockDirectoryFactory
   [junit4]   2> 1817771 INFO  (coreLoadExecutor-3791-thread-1) [    x:collection1] o.a.s.c.SolrCore [[collection1] ] Opening new SolrCore at [C:\Users\JenkinsSlave\workspace\Lucene-Solr-5.x-Windows\solr\build\solr-core\test\J0\temp\solr.handler.TestReplicationHandler_56BD2D639E8ACD3E-001\solr-instance-003\.\collection1\], dataDir=[null]
   [junit4]   2> 1817772 INFO  (coreLoadExecutor-3791-thread-1) [    x:collection1] o.a.s.c.SolrCore JMX monitoring not detected for core: collection1
   [junit4]   2> 1817774 INFO  (coreLoadExecutor-3791-thread-1) [    x:collection1] o.a.s.c.CachingDirectoryFactory return new directory for C:\Users\JenkinsSlave\workspace\Lucene-Solr-5.x-Windows\solr\build\solr-core\test\J0\temp\solr.handler.TestReplicationHandler_56BD2D639E8ACD3E-001\solr-instance-003\.\collection1\data\
   [junit4]   2> 1817775 INFO  (coreLoadExecutor-3791-thread-1) [    x:collection1] o.a.s.c.SolrCore New index directory detected: old=null new=C:\Users\JenkinsSlave\workspace\Lucene-Solr-5.x-Windows\solr\build\solr-core\test\J0\temp\solr.handler.TestReplicationHandler_56BD2D639E8ACD3E-001\solr-instance-003\.\collection1\data\index/
   [junit4]   2> 1817775 WARN  (coreLoadExecutor-3791-thread-1) [    x:collection1] o.a.s.c.SolrCore [collection1] Solr index directory 'C:\Users\JenkinsSlave\workspace\Lucene-Solr-5.x-Windows\solr\build\solr-core\test\J0\temp\solr.handler.TestReplicationHandler_56BD2D639E8ACD3E-001\solr-instance-003\.\collection1\data\index' doesn't exist. Creating new index...
   [junit4]   2> 1817775 INFO  (coreLoadExecutor-3791-thread-1) [    x:collection1] o.a.s.c.CachingDirectoryFactory return new directory for C:\Users\JenkinsSlave\workspace\Lucene-Solr-5.x-Windows\solr\build\solr-core\test\J0\temp\solr.handler.TestReplicationHandler_56BD2D639E8ACD3E-001\solr-instance-003\.\collection1\data\index
   [junit4]   2> 1817776 INFO  (coreLoadExecutor-3791-thread-1) [    x:collection1] o.a.s.u.RandomMergePolicy RandomMergePolicy wrapping class org.apache.lucene.index.TieredMergePolicy: [TieredMergePolicy: maxMergeAtOnce=23, maxMergeAtOnceExplicit=13, maxMergedSegmentMB=96.6650390625, floorSegmentMB=1.732421875, forceMergeDeletesPctAllowed=11.479313264183242, segmentsPerTier=25.0, maxCFSSegmentSizeMB=8.796093022207999E12, noCFSRatio=0.3057751205348932
   [junit4]   2> 1817776 INFO  (coreLoadExecutor-3791-thread-1) [    x:collection1] o.a.s.c.SolrCore SolrDeletionPolicy.onCommit: commits: num=1
   [junit4]   2> 	commit{dir=MockDirectoryWrapper(RAMDirectory@11b2d26 lockFactory=org.apache.lucene.store.SingleInstanceLockFactory@13130ec),segFN=segments_1,generation=1}
   [junit4]   2> 1817776 INFO  (coreLoadExecutor-3791-thread-1) [    x:collection1] o.a.s.c.SolrCore newest commit generation = 1
   [junit4]   2> 1817778 INFO  (OldIndexDirectoryCleanupThreadForCore-collection1) [    x:collection1] o.a.s.c.SolrCore Looking for old index directories to cleanup for core collection1 in C:\Users\JenkinsSlave\workspace\Lucene-Solr-5.x-Windows\solr\build\solr-core\test\J0\temp\solr.handler.TestReplicationHandler_56BD2D639E8ACD3E-001\solr-instance-003\.\collection1\data\
   [junit4]   2> 1817781 INFO  (coreLoadExecutor-3791-thread-1) [    x:collection1] o.a.s.c.SolrCore no updateRequestProcessorChain defined as default, creating implicit default
   [junit4]   2> 1817788 INFO  (coreLoadExecutor-3791-thread-1) [    x:collection1] o.a.s.h.l.XMLLoader xsltCacheLifetimeSeconds=60
   [junit4]   2> 1817790 INFO  (coreLoadExecutor-3791-thread-1) [    x:collection1] o.a.s.h.l.XMLLoader xsltCacheLifetimeSeconds=60
   [junit4]   2> 1817792 INFO  (coreLoadExecutor-3791-thread-1) [    x:collection1] o.a.s.h.l.XMLLoader xsltCacheLifetimeSeconds=60
   [junit4]   2> 1817793 INFO  (coreLoadExecutor-3791-thread-1) [    x:collection1] o.a.s.h.l.XMLLoader xsltCacheLifetimeSeconds=60
   [junit4]   2> 1817795 INFO  (coreLoadExecutor-3791-thread-1) [    x:collection1] o.a.s.c.PluginBag requestHandler : 'lazy' created with startup=lazy 
   [junit4]   2> 1817796 INFO  (coreLoadExecutor-3791-thread-1) [    x:collection1] o.a.s.c.RequestHandlers Registered paths: /admin/segments,/admin/plugins,standard,/replication,/admin/mbeans,/update/csv,/admin/logging,/config,/update/json/docs,/schema,/admin/ping,/admin/properties,lazy,/admin/system,/admin/luke,/admin/threads,/get,/admin/file,defaults,/update,/update/json
   [junit4]   2> 1817798 INFO  (coreLoadExecutor-3791-thread-1) [    x:collection1] o.a.s.c.SolrCore Using default statsCache cache: org.apache.solr.search.stats.LocalStatsCache
   [junit4]   2> 1817798 INFO  (coreLoadExecutor-3791-thread-1) [    x:collection1] o.a.s.c.SolrCore Hard AutoCommit: disabled
   [junit4]   2> 1817798 INFO  (coreLoadExecutor-3791-thread-1) [    x:collection1] o.a.s.c.SolrCore Soft AutoCommit: disabled
   [junit4]   2> 1817799 INFO  (coreLoadExecutor-3791-thread-1) [    x:collection1] o.a.s.u.RandomMergePolicy RandomMergePolicy wrapping class org.apache.lucene.index.LogDocMergePolicy: [LogDocMergePolicy: minMergeSize=1000, mergeFactor=15, maxMergeSize=9223372036854775807, maxMergeSizeForForcedMerge=9223372036854775807, calibrateSizeByDeletes=true, maxMergeDocs=2147483647, maxCFSSegmentSizeMB=8.796093022207999E12, noCFSRatio=0.6135612017968246]
   [junit4]   2> 1817799 INFO  (coreLoadExecutor-3791-thread-1) [    x:collection1] o.a.s.c.SolrCore SolrDeletionPolicy.onInit: commits: num=1
   [junit4]   2> 	commit{dir=MockDirectoryWrapper(RAMDirectory@11b2d26 lockFactory=org.apache.lucene.store.SingleInstanceLockFactory@13130ec),segFN=segments_1,generation=1}
   [junit4]   2> 1817799 INFO  (coreLoadExecutor-3791-thread-1) [    x:collection1] o.a.s.c.SolrCore newest commit generation = 1
   [junit4]   2> 1817799 INFO  (coreLoadExecutor-3791-thread-1) [    x:collection1] o.a.s.s.SolrIndexSearcher Opening Searcher@18ee6b9[collection1] main
   [junit4]   2> 1817800 INFO  (coreLoadExecutor-3791-thread-1) [    x:collection1] o.a.s.r.ManagedResourceStorage File-based storage initialized to use dir: C:\Users\JenkinsSlave\workspace\Lucene-Solr-5.x-Windows\solr\build\solr-core\test\J0\temp\solr.handler.TestReplicationHandler_56BD2D639E8ACD3E-001\solr-instance-003\.\collection1\conf
   [junit4]   2> 1817800 INFO  (coreLoadExecutor-3791-thread-1) [    x:collection1] o.a.s.r.RestManager Initializing RestManager with initArgs: {storageDir=C:\Users\JenkinsSlave\workspace\Lucene-Solr-5.x-Windows\solr\build\solr-core\test\J0\temp\solr.handler.TestReplicationHandler_56BD2D639E8ACD3E-001\solr-instance-003\.\collection1\conf}
   [junit4]   2> 1817800 INFO  (coreLoadExecutor-3791-thread-1) [    x:collection1] o.a.s.r.ManagedResourceStorage Reading _rest_managed.json using file:dir=C:\Users\JenkinsSlave\workspace\Lucene-Solr-5.x-Windows\solr\build\solr-core\test\J0\temp\solr.handler.TestReplicationHandler_56BD2D639E8ACD3E-001\solr-instance-003\.\collection1\conf
   [junit4]   2> 1817800 INFO  (coreLoadExecutor-3791-thread-1) [    x:collection1] o.a.s.r.RestManager Initializing 0 registered ManagedResources
   [junit4]   2> 1817801 WARN  (coreLoadExecutor-3791-thread-1) [    x:collection1] o.a.s.h.IndexFetcher 'masterUrl' must be specified without the /replication suffix
   [junit4]   2> 1817801 INFO  (coreLoadExecutor-3791-thread-1) [    x:collection1] o.a.s.h.ReplicationHandler  No value set for 'pollInterval'. Timer Task not started.
   [junit4]   2> 1817801 INFO  (coreLoadExecutor-3791-thread-1) [    x:collection1] o.a.s.h.ReplicationHandler Replication enabled for following config files: schema.xml
   [junit4]   2> 1817801 INFO  (coreLoadExecutor-3791-thread-1) [    x:collection1] o.a.s.h.ReplicationHandler Commits will be reserved for  10000
   [junit4]   2> 1817802 INFO  (searcherExecutor-3792-thread-1-processing-x:collection1) [    x:collection1] o.a.s.c.SolrCore [collection1] Registered new searcher Searcher@18ee6b9[collection1] main{ExitableDirectoryReader(UninvertingDirectoryReader())}
   [junit4]   2> 1817802 INFO  (coreLoadExecutor-3791-thread-1) [    x:collection1] o.a.s.c.CoreContainer registering core: collection1
   [junit4]   2> 1818200 INFO  (qtp26153610-8929) [    x:collection1] o.a.s.u.p.LogUpdateProcessor [collection1] webapp=/solr path=/update params={wt=javabin&version=2} {add=[0]} 0 7
   [junit4]   2> 1818205 INFO  (qtp26153610-8928) [    x:collection1] o.a.s.u.p.LogUpdateProcessor [collection1] webapp=/solr path=/update params={wt=javabin&version=2} {add=[1]} 0 1
   [junit4]   2> 1818209 INFO  (qtp26153610-8930) [    x:collection1] o.a.s.u.p.LogUpdateProcessor [collection1] webapp=/solr path=/update params={wt=javabin&version=2} {add=[2]} 0 1
   [junit4]   2> 1818213 INFO  (qtp26153610-8931) [    x:collection1] o.a.s.u.UpdateHandler start commit{,optimize=false,openSearcher=true,waitSearcher=true,expungeDeletes=false,softCommit=false,prepareCommit=false}
   [junit4]   2> 1818214 INFO  (qtp26153610-8931) [    x:collection1] o.a.s.c.SolrCore SolrDeletionPolicy.onCommit: commits: num=2
   [junit4]   2> 	commit{dir=MockDirectoryWrapper(RAMDirectory@8f67d1 lockFactory=org.apache.lucene.store.SingleInstanceLockFactory@e8ed81),segFN=segments_1,generation=1}
   [junit4]   2> 	commit{dir=MockDirectoryWrapper(RAMDirectory@8f67d1 lockFactory=org.apache.lucene.store.SingleInstanceLockFactory@e8ed81),segFN=segments_2,generation=2}
   [junit4]   2> 1818214 INFO  (qtp26153610-8931) [    x:collection1] o.a.s.c.SolrCore newest commit generation = 2
   [junit4]   2> 1818216 INFO  (qtp26153610-8931) [    x:collection1] o.a.s.s.SolrIndexSearcher Opening Searcher@15bf1cd[collection1] main
   [junit4]   2> 1818217 INFO  (qtp26153610-8931) [    x:collection1] o.a.s.u.UpdateHandler end_commit_flush
   [junit4]   2> 1818217 INFO  (searcherExecutor-3761-thread-1-processing-x:collection1) [    x:collection1] o.a.s.c.SolrCore [collection1] Registered new searcher Searcher@15bf1cd[collection1] main{ExitableDirectoryReader(UninvertingDirectoryReader(Uninverting(_0(5.3.0):C3)))}
   [junit4]   2> 1818217 INFO  (qtp26153610-8931) [    x:collection1] o.a.s.u.p.LogUpdateProcessor [collection1] webapp=/solr path=/update params={wt=javabin&waitSearcher=true&softCommit=false&commit=true&version=2} {commit=} 0 4
   [junit4]   2> 1818229 WARN  (explicit-fetchindex-cmd) [    x:collection1] o.a.s.h.IndexFetcher 'masterUrl' must be specified without the /replication suffix
   [junit4]   2> 1818232 INFO  (qtp26153610-8932) [    x:collection1] o.a.s.c.S.Request [collection1] webapp=/solr path=/replication params={wt=javabin&qt=/replication&command=indexversion&version=2} status=0 QTime=0 
   [junit4]   2> 1818232 INFO  (explicit-fetchindex-cmd) [    x:collection1] o.a.s.h.IndexFetcher Master's generation: 2
   [junit4]   2> 1818232 INFO  (explicit-fetchindex-cmd) [    x:collection1] o.a.s.h.IndexFetcher Slave's generation: 1
   [junit4]   2> 1818232 INFO  (explicit-fetchindex-cmd) [    x:collection1] o.a.s.h.IndexFetcher Starting replication process
   [junit4]   2> 1818241 INFO  (qtp26153610-8933) [    x:collection1] o.a.s.c.S.Request [collection1] webapp=/solr path=/replication params={wt=javabin&qt=/replication&generation=2&command=filelist&version=2} status=0 QTime=6 
   [junit4]   2> 1818241 INFO  (explicit-fetchindex-cmd) [    x:collection1] o.a.s.h.IndexFetcher Number of files in latest index in master: 10
   [junit4]   2> 1818245 INFO  (explicit-fetchindex-cmd) [    x:collection1] o.a.s.c.CachingDirectoryFactory return new directory for C:\Users\JenkinsSlave\workspace\Lucene-Solr-5.x-Windows\solr\build\solr-core\test\J0\temp\solr.handler.TestReplicationHandler_56BD2D639E8ACD3E-001\solr-instance-003\.\collection1\data\index.20150723140322393
   [junit4]   2> 1818246 INFO  (explicit-fetchindex-cmd) [    x:collection1] o.a.s.u.DefaultSolrCoreState Creating new IndexWriter...
   [junit4]   2> 1818246 INFO  (explicit-fetchindex-cmd) [    x:collection1] o.a.s.u.DefaultSolrCoreState Waiting until IndexWriter is unused... core=collection1
   [junit4]   2> 1818246 INFO  (explicit-fetchindex-cmd) [    x:collection1] o.a.s.u.DefaultSolrCoreState Rollback old IndexWriter... core=collection1
   [junit4]   2> 1818246 INFO  (explicit-fetchindex-cmd) [    x:collection1] o.a.s.u.RandomMergePolicy RandomMergePolicy wrapping class org.apache.lucene.index.LogDocMergePolicy: [LogDocMergePolicy: minMergeSize=1000, mergeFactor=23, maxMergeSize=9223372036854775807, maxMergeSizeForForcedMerge=9223372036854775807, calibrateSizeByDeletes=true, maxMergeDocs=2147483647, maxCFSSegmentSizeMB=8.796093022207999E12, noCFSRatio=0.13641178988579616]
   [junit4]   2> 1818247 INFO  (explicit-fetchindex-cmd) [    x:collection1] o.a.s.c.SolrCore SolrDeletionPolicy.onInit: commits: num=1
   [junit4]   2> 	commit{dir=MockDirectoryWrapper(RAMDirectory@11b2d26 lockFactory=org.apache.lucene.store.SingleInstanceLockFactory@13130ec),segFN=segments_1,generation=1}
   [junit4]   2> 1818247 INFO  (explicit-fetchindex-cmd) [    x:collection1] o.a.s.c.SolrCore newest commit generation = 1
   [junit4]   2> 1818247 INFO  (explicit-fetchindex-cmd) [    x:collection1] o.a.s.u.DefaultSolrCoreState New IndexWriter is ready to be used.
   [junit4]   2> 1818247 INFO  (explicit-fetchindex-cmd) [    x:collection1] o.a.s.c.SolrCore SolrDeletionPolicy.onCommit: commits: num=1
   [junit4]   2> 	commit{dir=MockDirectoryWrapper(RAMDirectory@11b2d26 lockFactory=org.apache.lucene.store.SingleInstanceLockFactory@13130ec),segFN=segments_1,generation=1}
   [junit4]   2> 1818247 INFO  (explicit-fetchindex-cmd) [    x:collection1] o.a.s.c.SolrCore newest commit generation = 1
   [junit4]   2> 1818247 INFO  (explicit-fetchindex-cmd) [    x:collection1] o.a.s.u.DefaultSolrCoreState Closing IndexWriter...
   [junit4]   2> 1818248 INFO  (explicit-fetchindex-cmd) [    x:collection1] o.a.s.u.DefaultSolrCoreState Waiting until IndexWriter is unused... core=collection1
   [junit4]   2> 1818248 INFO  (explicit-fetchindex-cmd) [    x:collection1] o.a.s.u.DefaultSolrCoreState Rollback old IndexWriter... core=collection1
   [junit4]   2> 1818248 INFO  (explicit-fetchindex-cmd) [    x:collection1] o.a.s.h.IndexFetcher Starting download to MockDirectoryWrapper(SimpleFSDirectory@C:\Users\JenkinsSlave\workspace\Lucene-Solr-5.x-Windows\solr\build\solr-core\test\J0\temp\solr.handler.TestReplicationHandler_56BD2D639E8ACD3E-001\index-SimpleFSDirectory-005 lockFactory=org.apache.lucene.store.NativeFSLockFactory@1c83fda) fullCopy=false
   [junit4]   2> 1818251 INFO  (qtp26153610-8929) [    x:collection1] o.a.s.c.S.Request [collection1] webapp=/solr path=/replication params={wt=filestream&checksum=true&file=_0_Lucene50_0.tip&qt=/replication&generation=2&command=filecontent} status=0 QTime=0 
   [junit4]   2> 1818255 INFO  (qtp26153610-8928) [    x:collection1] o.a.s.c.S.Request [collection1] webapp=/solr path=/replication params={wt=filestream&checksum=true&file=_0.si&qt=/replication&generation=2&command=filecontent} status=0 QTime=0 
   [junit4]   2> 1818261 INFO  (qtp26153610-8930) [    x:collection1] o.a.s.c.S.Request [collection1] webapp=/solr path=/replication params={wt=filestream&checksum=true&file=_0.fdt&qt=/replication&generation=2&command=filecontent} status=0 QTime=0 
   [junit4]   2> 1818266 INFO  (qtp26153610-8931) [    x:collection1] o.a.s.c.S.Request [collection1] webapp=/solr path=/replication params={wt=filestream&checksum=true&file=_0.nvd&qt=/replication&generation=2&command=filecontent} status=0 QTime=0 
   [junit4]   2> 1818298 INFO  (qtp26153610-8932) [    x:collection1] o.a.s.c.S.Request [collection1] webapp=/solr path=/replication params={wt=filestream&checksum=true&file=_0_Lucene50_0.tim&qt=/replication&generation=2&command=filecontent} status=0 QTime=0 
   [junit4]   2> 1818304 INFO  (qtp26153610-8933) [    x:collection1] o.a.s.c.S.Request [collection1] webapp=/solr path=/replication params={wt=filestream&checksum=true&file=_0_Lucene50_0.doc&qt=/replication&generation=2&command=filecontent} status=0 QTime=0 
   [junit4]   2> 1818308 INFO  (qtp26153610-8929) [    x:collection1] o.a.s.c.S.Request [collection1] webapp=/solr path=/replication params={wt=filestream&checksum=true&file=_0.fdx&qt=/replication&generation=2&command=filecontent} status=0 QTime=0 
   [junit4]   2> 1818312 INFO  (qtp26153610-8928) [    x:collection1] o.a.s.c.S.Request [collection1] webapp=/solr path=/replication params={wt=filestream&checksum=true&file=_0.nvm&qt=/replication&generation=2&command=filecontent} status=0 QTime=0 
   [junit4]   2> 1818316 INFO  (qtp26153610-8930) [    x:collection1] o.a.s.c.S.Request [collection1] webapp=/solr path=/replication params={wt=filestream&checksum=true&file=_0.fnm&qt=/replication&generation=2&command=filecontent} status=0 QTime=0 
   [junit4]   2> 1818320 INFO  (qtp26153610-8931) [    x:collection1] o.a.s.c.S.Request [collection1] webapp=/solr path=/replication params={wt=filestream&checksum=true&file=segments_2&qt=/replication&generation=2&command=filecontent} status=0 QTime=0 
   [junit4]   2> 1818321 INFO  (explicit-fetchindex-cmd) [    x:collection1] o.a.s.h.IndexFetcher Total time taken for download : 0 secs
   [junit4]   2> 1818329 INFO  (explicit-fetchindex-cmd) [    x:collection1] o.a.s.u.DefaultSolrCoreState Creating new IndexWriter...
   [junit4]   2> 1818329 INFO  (explicit-fetchindex-cmd) [    x:collection1] o.a.s.u.RandomMergePolicy RandomMergePolicy wrapping class org.apache.lucene.index.TieredMergePolicy: [TieredMergePolicy: maxMergeAtOnce=15, maxMergeAtOnceExplicit=16, maxMergedSegmentMB=71.7724609375, floorSegmentMB=0.7138671875, forceMergeDeletesPctAllowed=24.635915196908236, segmentsPerTier=11.0, maxCFSSegmentSizeMB=8.796093022207999E12, noCFSRatio=1.0
   [junit4]   2> 1818330 INFO  (explicit-fetchindex-cmd) [    x:collection1] o.a.s.c.SolrCore SolrDeletionPolicy.onInit: commits: num=2
   [junit4]   2> 	commit{dir=MockDirectoryWrapper(RAMDirectory@11b2d26 lockFactory=org.apache.lucene.store.SingleInstanceLockFactory@13130ec),segFN=segments_1,generation=1}
   [junit4]   2> 	commit{dir=MockDirectoryWrapper(RAMDirectory@11b2d26 lockFactory=org.apache.lucene.store.SingleInstanceLockFactory@13130ec),segFN=segments_2,generation=2}
   [junit4]   2> 1818330 INFO  (explicit-fetchindex-cmd) [    x:collection1] o.a.s.c.SolrCore newest commit generation = 2
   [junit4]   2> 1818330 INFO  (explicit-fetchindex-cmd) [    x:collection1] o.a.s.u.DefaultSolrCoreState New IndexWriter is ready to be used.
   [junit4]   2> 1818331 INFO  (explicit-fetchindex-cmd) [    x:collection1] o.a.s.s.SolrIndexSearcher Opening Searcher@19c0b02[collection1] main
   [junit4]   2> 1818331 INFO  (searcherExecutor-3792-thread-1-processing-x:collection1) [    x:collection1] o.a.s.c.SolrCore [collection1] Registered new searcher Searcher@19c0b02[collection1] main{ExitableDirectoryReader(UninvertingDirectoryReader(Uninverting(_0(5.3.0):C3)))}
   [junit4]   2> 1818331 INFO  (explicit-fetchindex-cmd) [    x:collection1] o.a.s.c.CachingDirectoryFactory looking to close C:\Users\JenkinsSlave\workspace\Lucene-Solr-5.x-Windows\solr\build\solr-core\test\J0\temp\solr.handler.TestReplicationHandler_56BD2D639E8ACD3E-001\solr-instance-003\.\collection1\data\index.20150723140322393 [CachedDir<<refCount=0;path=C:\Users\JenkinsSlave\workspace\Lucene-Solr-5.x-Windows\solr\build\solr-core\test\J0\temp\solr.handler.TestReplicationHandler_56BD2D639E8ACD3E-001\solr-instance-003\.\collection1\data\index.20150723140322393;done=true>>]
   [junit4]   2> 1818331 INFO  (explicit-fetchindex-cmd) [    x:collection1] o.a.s.c.CachingDirectoryFactory Closing directory: C:\Users\JenkinsSlave\workspace\Lucene-Solr-5.x-Windows\solr\build\solr-core\test\J0\temp\solr.handler.TestReplicationHandler_56BD2D639E8ACD3E-001\solr-instance-003\.\collection1\data\index.20150723140322393
   [junit4]   2> 1818332 INFO  (qtp31529610-8984) [    x:collection1] o.a.s.c.S.Request [collection1] webapp=/solr path=/replication params={wait=true&masterUrl=http://127.0.0.1:60025/solr/collection1/replication&command=fetchindex} status=0 QTime=97 
   [junit4]   2> 1818339 INFO  (qtp31529610-8985) [    x:collection1] o.a.s.c.S.Request [collection1] webapp=/solr path=/select params={wt=javabin&q=*:*&sort=id+desc&version=2} hits=3 status=0 QTime=0 
   [junit4]   2> 1818339 INFO  (TEST-TestReplicationHandler.doTestRepeater-seed#[56BD2D639E8ACD3E]) [    ] o.a.s.SolrTestCaseJ4 Waited for 0ms and found 3 docs
   [junit4]   2> 1818341 WARN  (explicit-fetchindex-cmd) [    x:collection1] o.a.s.h.IndexFetcher 'masterUrl' must be specified without the /replication suffix
   [junit4]   2> 1818346 INFO  (qtp31529610-8986) [    x:collection1] o.a.s.c.S.Request [collection1] webapp=/solr path=/replication params={wt=javabin&qt=/replication&command=indexversion&version=2} status=0 QTime=0 
   [junit4]   2> 1818346 INFO  (explicit-fetchindex-cmd) [    x:collection1] o.a.s.h.IndexFetcher Master's generation: 2
   [junit4]   2> 1818346 INFO  (explicit-fetchindex-cmd) [    x:collection1] o.a.s.h.IndexFetcher Slave's generation: 1
   [junit4]   2> 1818346 INFO  (explicit-fetchindex-cmd) [    x:collection1] o.a.s.h.IndexFetcher Starting replication process
   [junit4]   2> 1818350 INFO  (qtp31529610-8987) [    x:collection1] o.a.s.c.S.Request [collection1] webapp=/solr path=/replication params={wt=javabin&qt=/replication&generation=2&command=filelist&version=2} status=0 QTime=1 
   [junit4]   2> 1818351 INFO  (explicit-fetchindex-cmd) [    x:collection1] o.a.s.h.IndexFetcher Number of files in latest index in master: 10
   [junit4]   2> 1818353 INFO  (explicit-fetchindex-cmd) [    x:collection1] o.a.s.c.CachingDirectoryFactory return new directory for C:\Users\JenkinsSlave\workspace\Lucene-Solr-5.x-Windows\solr\build\solr-core\test\J0\temp\solr.handler.TestReplicationHandler_56BD2D639E8ACD3E-001\solr-instance-002\.\collection1\data\index.20150723140322502
   [junit4]   2> 1818353 INFO  (explicit-fetchindex-cmd) [    x:collection1] o.a.s.u.DefaultSolrCoreState Creating

[...truncated too long message...]

p\solr.handler.TestReplicationHandler_56BD2D639E8ACD3E-001\solr-instance-027\.\collection1\data\index.20150723140515984
   [junit4]   2> 1932059 INFO  (TEST-TestReplicationHandler.doTestIndexFetchWithMasterUrl-seed#[56BD2D639E8ACD3E]) [    x:collection1] o.e.j.s.h.ContextHandler Stopped o.e.j.s.ServletContextHandler@d1fc7{/solr,null,UNAVAILABLE}
   [junit4]   2> 1932062 INFO  (TEST-TestReplicationHandler.doTestIndexFetchWithMasterUrl-seed#[56BD2D639E8ACD3E]) [    ] o.e.j.s.ServerConnector Stopped ServerConnector@1c37e2b{HTTP/1.1}{127.0.0.1:0}
   [junit4]   2> 1932062 INFO  (TEST-TestReplicationHandler.doTestIndexFetchWithMasterUrl-seed#[56BD2D639E8ACD3E]) [    ] o.a.s.c.CoreContainer Shutting down CoreContainer instance=21461628
   [junit4]   2> 1932066 INFO  (TEST-TestReplicationHandler.doTestIndexFetchWithMasterUrl-seed#[56BD2D639E8ACD3E]) [    x:collection1] o.a.s.c.SolrCore [collection1]  CLOSING SolrCore org.apache.solr.core.SolrCore@c3ef0b
   [junit4]   2> 1932066 INFO  (TEST-TestReplicationHandler.doTestIndexFetchWithMasterUrl-seed#[56BD2D639E8ACD3E]) [    x:collection1] o.a.s.u.UpdateHandler closing DirectUpdateHandler2{commits=2,autocommits=0,soft autocommits=0,optimizes=0,rollbacks=0,expungeDeletes=0,docsPending=0,adds=0,deletesById=0,deletesByQuery=0,errors=0,cumulative_adds=3,cumulative_deletesById=0,cumulative_deletesByQuery=1,cumulative_errors=0}
   [junit4]   2> 1932067 INFO  (TEST-TestReplicationHandler.doTestIndexFetchWithMasterUrl-seed#[56BD2D639E8ACD3E]) [    x:collection1] o.a.s.u.SolrCoreState Closing SolrCoreState
   [junit4]   2> 1932067 INFO  (TEST-TestReplicationHandler.doTestIndexFetchWithMasterUrl-seed#[56BD2D639E8ACD3E]) [    x:collection1] o.a.s.u.DefaultSolrCoreState SolrCoreState ref count has reached 0 - closing IndexWriter
   [junit4]   2> 1932067 INFO  (TEST-TestReplicationHandler.doTestIndexFetchWithMasterUrl-seed#[56BD2D639E8ACD3E]) [    x:collection1] o.a.s.u.DefaultSolrCoreState closing IndexWriter with IndexWriterCloser
   [junit4]   2> 1932067 INFO  (TEST-TestReplicationHandler.doTestIndexFetchWithMasterUrl-seed#[56BD2D639E8ACD3E]) [    x:collection1] o.a.s.c.SolrCore [collection1] Closing main searcher on request.
   [junit4]   2> 1932068 INFO  (TEST-TestReplicationHandler.doTestIndexFetchWithMasterUrl-seed#[56BD2D639E8ACD3E]) [    x:collection1] o.a.s.c.CachingDirectoryFactory Closing MockDirectoryFactory - 2 directories currently being tracked
   [junit4]   2> 1932068 INFO  (TEST-TestReplicationHandler.doTestIndexFetchWithMasterUrl-seed#[56BD2D639E8ACD3E]) [    x:collection1] o.a.s.c.CachingDirectoryFactory looking to close C:\Users\JenkinsSlave\workspace\Lucene-Solr-5.x-Windows\solr\build\solr-core\test\J0\temp\solr.handler.TestReplicationHandler_56BD2D639E8ACD3E-001\solr-instance-028\.\collection1\data\ [CachedDir<<refCount=0;path=C:\Users\JenkinsSlave\workspace\Lucene-Solr-5.x-Windows\solr\build\solr-core\test\J0\temp\solr.handler.TestReplicationHandler_56BD2D639E8ACD3E-001\solr-instance-028\.\collection1\data\;done=false>>]
   [junit4]   2> 1932068 INFO  (TEST-TestReplicationHandler.doTestIndexFetchWithMasterUrl-seed#[56BD2D639E8ACD3E]) [    x:collection1] o.a.s.c.CachingDirectoryFactory Closing directory: C:\Users\JenkinsSlave\workspace\Lucene-Solr-5.x-Windows\solr\build\solr-core\test\J0\temp\solr.handler.TestReplicationHandler_56BD2D639E8ACD3E-001\solr-instance-028\.\collection1\data\
   [junit4]   2> 1932068 INFO  (TEST-TestReplicationHandler.doTestIndexFetchWithMasterUrl-seed#[56BD2D639E8ACD3E]) [    x:collection1] o.a.s.c.CachingDirectoryFactory looking to close C:\Users\JenkinsSlave\workspace\Lucene-Solr-5.x-Windows\solr\build\solr-core\test\J0\temp\solr.handler.TestReplicationHandler_56BD2D639E8ACD3E-001\solr-instance-028\.\collection1\data\index.20150723140515677 [CachedDir<<refCount=0;path=C:\Users\JenkinsSlave\workspace\Lucene-Solr-5.x-Windows\solr\build\solr-core\test\J0\temp\solr.handler.TestReplicationHandler_56BD2D639E8ACD3E-001\solr-instance-028\.\collection1\data\index.20150723140515677;done=false>>]
   [junit4]   2> 1932068 INFO  (TEST-TestReplicationHandler.doTestIndexFetchWithMasterUrl-seed#[56BD2D639E8ACD3E]) [    x:collection1] o.a.s.c.CachingDirectoryFactory Closing directory: C:\Users\JenkinsSlave\workspace\Lucene-Solr-5.x-Windows\solr\build\solr-core\test\J0\temp\solr.handler.TestReplicationHandler_56BD2D639E8ACD3E-001\solr-instance-028\.\collection1\data\index.20150723140515677
   [junit4]   2> 1932069 INFO  (TEST-TestReplicationHandler.doTestIndexFetchWithMasterUrl-seed#[56BD2D639E8ACD3E]) [    x:collection1] o.e.j.s.h.ContextHandler Stopped o.e.j.s.ServletContextHandler@b76ac8{/solr,null,UNAVAILABLE}
   [junit4]   2> 1932070 INFO  (SUITE-TestReplicationHandler-seed#[56BD2D639E8ACD3E]-worker) [    ] o.a.s.SolrTestCaseJ4 ###deleteCore
   [junit4]   2> NOTE: leaving temporary files on disk at: C:\Users\JenkinsSlave\workspace\Lucene-Solr-5.x-Windows\solr\build\solr-core\test\J0\temp\solr.handler.TestReplicationHandler_56BD2D639E8ACD3E-001
   [junit4]   2> NOTE: test params are: codec=FastDecompressionCompressingStoredFields(storedFieldsFormat=CompressingStoredFieldsFormat(compressionMode=FAST_DECOMPRESSION, chunkSize=1, maxDocsPerChunk=4, blockSize=9), termVectorsFormat=CompressingTermVectorsFormat(compressionMode=FAST_DECOMPRESSION, chunkSize=1, blockSize=9)), sim=DefaultSimilarity, locale=es, timezone=MST7MDT
   [junit4]   2> NOTE: Windows 7 6.1 x86/Oracle Corporation 1.7.0_80 (32-bit)/cpus=3,threads=1,free=171743040,total=441098240
   [junit4]   2> NOTE: All tests run in this JVM: [TestDistribDocBasedVersion, DistributedIntervalFacetingTest, TestSurroundQueryParser, CursorMarkTest, TestTrackingShardHandlerFactory, TestPhraseSuggestions, TestHashQParserPlugin, TestSearcherReuse, TestLRUCache, SolrIndexSplitterTest, TestIndexingPerformance, ClusterStateTest, ZkControllerTest, TestManagedSchemaDynamicFieldResource, SpatialRPTFieldTypeTest, RequiredFieldsTest, TestCloudSchemaless, TestDistributedStatsComponentCardinality, TestCollectionAPI, UUIDFieldTest, BigEndianAscendingWordSerializerTest, TestSolrConfigHandler, SyncSliceTest, TestXIncludeConfig, LeaderElectionTest, SynonymTokenizerTest, DistribJoinFromCollectionTest, TestShortCircuitedRequests, TestOrdValues, ShowFileRequestHandlerTest, TestHashPartitioner, DistributedDebugComponentTest, TestPartialUpdateDeduplication, TestPerFieldSimilarity, TestExtendedDismaxParser, ClusterStateUpdateTest, TestSchemaManager, InfoHandlerTest, DocumentAnalysisRequestHandlerTest, HighlighterMaxOffsetTest, TestSolr4Spatial2, NoCacheHeaderTest, TestSolrIndexConfig, DirectUpdateHandlerTest, TestBlendedInfixSuggestions, LukeRequestHandlerTest, TestLFUCache, SimpleFacetsTest, SuggesterFSTTest, TestRandomRequestDistribution, TestInitQParser, HdfsLockFactoryTest, HdfsChaosMonkeySafeLeaderTest, AddSchemaFieldsUpdateProcessorFactoryTest, TestHdfsUpdateLog, DirectSolrConnectionTest, TestLeaderElectionZkExpiry, TestCharFilters, TestCloudInspectUtil, JavabinLoaderTest, AlternateDirectoryTest, DeleteShardTest, ChangedSchemaMergeTest, TestDefaultSearchFieldResource, TestSort, TestBulkSchemaConcurrent, RankQueryTest, TestChildDocTransformer, ResponseLogComponentTest, TestSerializedLuceneMatchVersion, URLClassifyProcessorTest, HdfsDirectoryTest, TestJmxMonitoredMap, JSONWriterTest, SOLR749Test, IndexSchemaRuntimeFieldTest, TestUpdate, TestExactSharedStatsCache, OutOfBoxZkACLAndCredentialsProvidersTest, TestFieldTypeCollectionResource, NumericFieldsTest, TestTrieFacet, TestStandardQParsers, AliasIntegrationTest, BadComponentTest, DistribDocExpirationUpdateProcessorTest, HdfsBasicDistributedZkTest, TestSweetSpotSimilarityFactory, TestFunctionQuery, TestReqParamsAPI, TestSolrConfigHandlerConcurrent, CollectionsAPIAsyncDistributedZkTest, ChaosMonkeyNothingIsSafeTest, TestConfigSets, TestCloudManagedSchema, IgnoreCommitOptimizeUpdateProcessorFactoryTest, SuggesterTest, TestDistributedMissingSort, TestExpandComponent, TestClassNameShortening, TestSortingResponseWriter, TestStressLucene, TestComponentsName, ResponseHeaderTest, SliceStateTest, ParsingFieldUpdateProcessorsTest, TestQueryUtils, TestStressVersions, TestIndexSearcher, DistributedSuggestComponentTest, DeleteInactiveReplicaTest, TestNamedUpdateProcessors, SampleTest, SolrCloudExampleTest, PathHierarchyTokenizerFactoryTest, TestSolrDynamicMBean, DistributedExpandComponentTest, TestSchemaNameResource, TestFreeTextSuggestions, ZkCLITest, LeaderFailoverAfterPartitionTest, TestTolerantSearch, TestFieldCollectionResource, TestManagedSynonymFilterFactory, ZkStateWriterTest, ChaosMonkeySafeLeaderTest, UnloadDistributedZkTest, ShardRoutingTest, TestReplicationHandler]
   [junit4] Completed [272/518] on J0 in 116.68s, 13 tests, 1 failure <<< FAILURES!

[...truncated 785 lines...]
BUILD FAILED
C:\Users\JenkinsSlave\workspace\Lucene-Solr-5.x-Windows\build.xml:720: The following error occurred while executing this line:
C:\Users\JenkinsSlave\workspace\Lucene-Solr-5.x-Windows\build.xml:667: The following error occurred while executing this line:
C:\Users\JenkinsSlave\workspace\Lucene-Solr-5.x-Windows\build.xml:59: The following error occurred while executing this line:
C:\Users\JenkinsSlave\workspace\Lucene-Solr-5.x-Windows\solr\build.xml:230: The following error occurred while executing this line:
C:\Users\JenkinsSlave\workspace\Lucene-Solr-5.x-Windows\solr\common-build.xml:516: The following error occurred while executing this line:
C:\Users\JenkinsSlave\workspace\Lucene-Solr-5.x-Windows\lucene\common-build.xml:1447: The following error occurred while executing this line:
C:\Users\JenkinsSlave\workspace\Lucene-Solr-5.x-Windows\lucene\common-build.xml:1002: There were test failures: 518 suites, 2055 tests, 1 failure, 69 ignored (35 assumptions)

Total time: 76 minutes 25 seconds
Build step 'Invoke Ant' marked build as failure
Archiving artifacts
Recording test results
Email was triggered for: Failure - Any
Sending email for trigger: Failure - Any



Mime
View raw message