lucene-dev mailing list archives

Site index · List index
Message view « Date » · « Thread »
Top « Date » · « Thread »
From Policeman Jenkins Server <jenk...@thetaphi.de>
Subject [JENKINS] Lucene-Solr-trunk-Windows (32bit/jdk1.8.0_51) - Build # 5079 - Failure!
Date Tue, 28 Jul 2015 10:41:07 GMT
Build: http://jenkins.thetaphi.de/job/Lucene-Solr-trunk-Windows/5079/
Java: 32bit/jdk1.8.0_51 -server -XX:+UseSerialGC

4 tests failed.
FAILED:  org.apache.solr.cloud.CdcrRequestHandlerTest.doTest

Error Message:
expected:<[dis]abled> but was:<[en]abled>

Stack Trace:
org.junit.ComparisonFailure: expected:<[dis]abled> but was:<[en]abled>
	at __randomizedtesting.SeedInfo.seed([B13C768832EBB8DC:1678CE2C5F50AB65]:0)
	at org.junit.Assert.assertEquals(Assert.java:125)
	at org.junit.Assert.assertEquals(Assert.java:147)
	at org.apache.solr.cloud.BaseCdcrDistributedZkTest.assertState(BaseCdcrDistributedZkTest.java:289)
	at org.apache.solr.cloud.CdcrRequestHandlerTest.doTestBufferActions(CdcrRequestHandlerTest.java:138)
	at org.apache.solr.cloud.CdcrRequestHandlerTest.doTest(CdcrRequestHandlerTest.java:40)
	at sun.reflect.NativeMethodAccessorImpl.invoke0(Native Method)
	at sun.reflect.NativeMethodAccessorImpl.invoke(NativeMethodAccessorImpl.java:62)
	at sun.reflect.DelegatingMethodAccessorImpl.invoke(DelegatingMethodAccessorImpl.java:43)
	at java.lang.reflect.Method.invoke(Method.java:497)
	at com.carrotsearch.randomizedtesting.RandomizedRunner.invoke(RandomizedRunner.java:1627)
	at com.carrotsearch.randomizedtesting.RandomizedRunner$6.evaluate(RandomizedRunner.java:836)
	at com.carrotsearch.randomizedtesting.RandomizedRunner$7.evaluate(RandomizedRunner.java:872)
	at com.carrotsearch.randomizedtesting.RandomizedRunner$8.evaluate(RandomizedRunner.java:886)
	at org.apache.solr.BaseDistributedSearchTestCase$ShardsRepeatRule$ShardsFixedStatement.callStatement(BaseDistributedSearchTestCase.java:963)
	at org.apache.solr.BaseDistributedSearchTestCase$ShardsRepeatRule$ShardsStatement.evaluate(BaseDistributedSearchTestCase.java:938)
	at com.carrotsearch.randomizedtesting.rules.SystemPropertiesRestoreRule$1.evaluate(SystemPropertiesRestoreRule.java:57)
	at org.apache.lucene.util.TestRuleSetupTeardownChained$1.evaluate(TestRuleSetupTeardownChained.java:50)
	at org.apache.lucene.util.AbstractBeforeAfterRule$1.evaluate(AbstractBeforeAfterRule.java:46)
	at org.apache.lucene.util.TestRuleThreadAndTestName$1.evaluate(TestRuleThreadAndTestName.java:49)
	at org.apache.lucene.util.TestRuleIgnoreAfterMaxFailures$1.evaluate(TestRuleIgnoreAfterMaxFailures.java:65)
	at org.apache.lucene.util.TestRuleMarkFailure$1.evaluate(TestRuleMarkFailure.java:48)
	at com.carrotsearch.randomizedtesting.rules.StatementAdapter.evaluate(StatementAdapter.java:36)
	at com.carrotsearch.randomizedtesting.ThreadLeakControl$StatementRunner.run(ThreadLeakControl.java:365)
	at com.carrotsearch.randomizedtesting.ThreadLeakControl.forkTimeoutingTask(ThreadLeakControl.java:798)
	at com.carrotsearch.randomizedtesting.ThreadLeakControl$3.evaluate(ThreadLeakControl.java:458)
	at com.carrotsearch.randomizedtesting.RandomizedRunner.runSingleTest(RandomizedRunner.java:845)
	at com.carrotsearch.randomizedtesting.RandomizedRunner$3.evaluate(RandomizedRunner.java:747)
	at com.carrotsearch.randomizedtesting.RandomizedRunner$4.evaluate(RandomizedRunner.java:781)
	at com.carrotsearch.randomizedtesting.RandomizedRunner$5.evaluate(RandomizedRunner.java:792)
	at com.carrotsearch.randomizedtesting.rules.StatementAdapter.evaluate(StatementAdapter.java:36)
	at com.carrotsearch.randomizedtesting.rules.SystemPropertiesRestoreRule$1.evaluate(SystemPropertiesRestoreRule.java:57)
	at org.apache.lucene.util.AbstractBeforeAfterRule$1.evaluate(AbstractBeforeAfterRule.java:46)
	at com.carrotsearch.randomizedtesting.rules.StatementAdapter.evaluate(StatementAdapter.java:36)
	at org.apache.lucene.util.TestRuleStoreClassName$1.evaluate(TestRuleStoreClassName.java:42)
	at com.carrotsearch.randomizedtesting.rules.NoShadowingOrOverridesOnMethodsRule$1.evaluate(NoShadowingOrOverridesOnMethodsRule.java:39)
	at com.carrotsearch.randomizedtesting.rules.NoShadowingOrOverridesOnMethodsRule$1.evaluate(NoShadowingOrOverridesOnMethodsRule.java:39)
	at com.carrotsearch.randomizedtesting.rules.StatementAdapter.evaluate(StatementAdapter.java:36)
	at com.carrotsearch.randomizedtesting.rules.StatementAdapter.evaluate(StatementAdapter.java:36)
	at com.carrotsearch.randomizedtesting.rules.StatementAdapter.evaluate(StatementAdapter.java:36)
	at org.apache.lucene.util.TestRuleAssertionsRequired$1.evaluate(TestRuleAssertionsRequired.java:54)
	at org.apache.lucene.util.TestRuleMarkFailure$1.evaluate(TestRuleMarkFailure.java:48)
	at org.apache.lucene.util.TestRuleIgnoreAfterMaxFailures$1.evaluate(TestRuleIgnoreAfterMaxFailures.java:65)
	at org.apache.lucene.util.TestRuleIgnoreTestSuites$1.evaluate(TestRuleIgnoreTestSuites.java:55)
	at com.carrotsearch.randomizedtesting.rules.StatementAdapter.evaluate(StatementAdapter.java:36)
	at com.carrotsearch.randomizedtesting.ThreadLeakControl$StatementRunner.run(ThreadLeakControl.java:365)
	at java.lang.Thread.run(Thread.java:745)


FAILED:  junit.framework.TestSuite.org.apache.solr.core.TestLazyCores

Error Message:
ERROR: SolrIndexSearcher opens=51 closes=50

Stack Trace:
java.lang.AssertionError: ERROR: SolrIndexSearcher opens=51 closes=50
	at __randomizedtesting.SeedInfo.seed([B13C768832EBB8DC]:0)
	at org.junit.Assert.fail(Assert.java:93)
	at org.apache.solr.SolrTestCaseJ4.endTrackingSearchers(SolrTestCaseJ4.java:467)
	at org.apache.solr.SolrTestCaseJ4.afterClass(SolrTestCaseJ4.java:233)
	at sun.reflect.GeneratedMethodAccessor36.invoke(Unknown Source)
	at sun.reflect.DelegatingMethodAccessorImpl.invoke(DelegatingMethodAccessorImpl.java:43)
	at java.lang.reflect.Method.invoke(Method.java:497)
	at com.carrotsearch.randomizedtesting.RandomizedRunner.invoke(RandomizedRunner.java:1627)
	at com.carrotsearch.randomizedtesting.RandomizedRunner$5.evaluate(RandomizedRunner.java:799)
	at com.carrotsearch.randomizedtesting.rules.StatementAdapter.evaluate(StatementAdapter.java:36)
	at com.carrotsearch.randomizedtesting.rules.SystemPropertiesRestoreRule$1.evaluate(SystemPropertiesRestoreRule.java:57)
	at org.apache.lucene.util.AbstractBeforeAfterRule$1.evaluate(AbstractBeforeAfterRule.java:46)
	at com.carrotsearch.randomizedtesting.rules.StatementAdapter.evaluate(StatementAdapter.java:36)
	at org.apache.lucene.util.TestRuleStoreClassName$1.evaluate(TestRuleStoreClassName.java:42)
	at com.carrotsearch.randomizedtesting.rules.NoShadowingOrOverridesOnMethodsRule$1.evaluate(NoShadowingOrOverridesOnMethodsRule.java:39)
	at com.carrotsearch.randomizedtesting.rules.NoShadowingOrOverridesOnMethodsRule$1.evaluate(NoShadowingOrOverridesOnMethodsRule.java:39)
	at com.carrotsearch.randomizedtesting.rules.StatementAdapter.evaluate(StatementAdapter.java:36)
	at com.carrotsearch.randomizedtesting.rules.StatementAdapter.evaluate(StatementAdapter.java:36)
	at com.carrotsearch.randomizedtesting.rules.StatementAdapter.evaluate(StatementAdapter.java:36)
	at org.apache.lucene.util.TestRuleAssertionsRequired$1.evaluate(TestRuleAssertionsRequired.java:54)
	at org.apache.lucene.util.TestRuleMarkFailure$1.evaluate(TestRuleMarkFailure.java:48)
	at org.apache.lucene.util.TestRuleIgnoreAfterMaxFailures$1.evaluate(TestRuleIgnoreAfterMaxFailures.java:65)
	at org.apache.lucene.util.TestRuleIgnoreTestSuites$1.evaluate(TestRuleIgnoreTestSuites.java:55)
	at com.carrotsearch.randomizedtesting.rules.StatementAdapter.evaluate(StatementAdapter.java:36)
	at com.carrotsearch.randomizedtesting.ThreadLeakControl$StatementRunner.run(ThreadLeakControl.java:365)
	at java.lang.Thread.run(Thread.java:745)


FAILED:  junit.framework.TestSuite.org.apache.solr.core.TestLazyCores

Error Message:
1 thread leaked from SUITE scope at org.apache.solr.core.TestLazyCores:     1) Thread[id=6132, name=searcherExecutor-2028-thread-1, state=WAITING, group=TGRP-TestLazyCores]         at sun.misc.Unsafe.park(Native Method)         at java.util.concurrent.locks.LockSupport.park(LockSupport.java:175)         at java.util.concurrent.locks.AbstractQueuedSynchronizer$ConditionObject.await(AbstractQueuedSynchronizer.java:2039)         at java.util.concurrent.LinkedBlockingQueue.take(LinkedBlockingQueue.java:442)         at java.util.concurrent.ThreadPoolExecutor.getTask(ThreadPoolExecutor.java:1067)         at java.util.concurrent.ThreadPoolExecutor.runWorker(ThreadPoolExecutor.java:1127)         at java.util.concurrent.ThreadPoolExecutor$Worker.run(ThreadPoolExecutor.java:617)         at java.lang.Thread.run(Thread.java:745)

Stack Trace:
com.carrotsearch.randomizedtesting.ThreadLeakError: 1 thread leaked from SUITE scope at org.apache.solr.core.TestLazyCores: 
   1) Thread[id=6132, name=searcherExecutor-2028-thread-1, state=WAITING, group=TGRP-TestLazyCores]
        at sun.misc.Unsafe.park(Native Method)
        at java.util.concurrent.locks.LockSupport.park(LockSupport.java:175)
        at java.util.concurrent.locks.AbstractQueuedSynchronizer$ConditionObject.await(AbstractQueuedSynchronizer.java:2039)
        at java.util.concurrent.LinkedBlockingQueue.take(LinkedBlockingQueue.java:442)
        at java.util.concurrent.ThreadPoolExecutor.getTask(ThreadPoolExecutor.java:1067)
        at java.util.concurrent.ThreadPoolExecutor.runWorker(ThreadPoolExecutor.java:1127)
        at java.util.concurrent.ThreadPoolExecutor$Worker.run(ThreadPoolExecutor.java:617)
        at java.lang.Thread.run(Thread.java:745)
	at __randomizedtesting.SeedInfo.seed([B13C768832EBB8DC]:0)


FAILED:  junit.framework.TestSuite.org.apache.solr.core.TestLazyCores

Error Message:
There are still zombie threads that couldn't be terminated:    1) Thread[id=6132, name=searcherExecutor-2028-thread-1, state=WAITING, group=TGRP-TestLazyCores]         at sun.misc.Unsafe.park(Native Method)         at java.util.concurrent.locks.LockSupport.park(LockSupport.java:175)         at java.util.concurrent.locks.AbstractQueuedSynchronizer$ConditionObject.await(AbstractQueuedSynchronizer.java:2039)         at java.util.concurrent.LinkedBlockingQueue.take(LinkedBlockingQueue.java:442)         at java.util.concurrent.ThreadPoolExecutor.getTask(ThreadPoolExecutor.java:1067)         at java.util.concurrent.ThreadPoolExecutor.runWorker(ThreadPoolExecutor.java:1127)         at java.util.concurrent.ThreadPoolExecutor$Worker.run(ThreadPoolExecutor.java:617)         at java.lang.Thread.run(Thread.java:745)

Stack Trace:
com.carrotsearch.randomizedtesting.ThreadLeakError: There are still zombie threads that couldn't be terminated:
   1) Thread[id=6132, name=searcherExecutor-2028-thread-1, state=WAITING, group=TGRP-TestLazyCores]
        at sun.misc.Unsafe.park(Native Method)
        at java.util.concurrent.locks.LockSupport.park(LockSupport.java:175)
        at java.util.concurrent.locks.AbstractQueuedSynchronizer$ConditionObject.await(AbstractQueuedSynchronizer.java:2039)
        at java.util.concurrent.LinkedBlockingQueue.take(LinkedBlockingQueue.java:442)
        at java.util.concurrent.ThreadPoolExecutor.getTask(ThreadPoolExecutor.java:1067)
        at java.util.concurrent.ThreadPoolExecutor.runWorker(ThreadPoolExecutor.java:1127)
        at java.util.concurrent.ThreadPoolExecutor$Worker.run(ThreadPoolExecutor.java:617)
        at java.lang.Thread.run(Thread.java:745)
	at __randomizedtesting.SeedInfo.seed([B13C768832EBB8DC]:0)




Build Log:
[...truncated 9737 lines...]
   [junit4] Suite: org.apache.solr.cloud.CdcrRequestHandlerTest
   [junit4]   2> Creating dataDir: C:\Users\JenkinsSlave\workspace\Lucene-Solr-trunk-Windows\solr\build\solr-core\test\J1\temp\solr.cloud.CdcrRequestHandlerTest_B13C768832EBB8DC-001\init-core-data-001
   [junit4]   2> 127174 INFO  (SUITE-CdcrRequestHandlerTest-seed#[B13C768832EBB8DC]-worker) [    ] o.a.s.SolrTestCaseJ4 Randomized ssl (false) and clientAuth (false)
   [junit4]   2> 127174 INFO  (SUITE-CdcrRequestHandlerTest-seed#[B13C768832EBB8DC]-worker) [    ] o.a.s.BaseDistributedSearchTestCase Setting hostContext system property: /dh/
   [junit4]   2> 127176 INFO  (TEST-CdcrRequestHandlerTest.doTest-seed#[B13C768832EBB8DC]) [    ] o.a.s.c.ZkTestServer STARTING ZK TEST SERVER
   [junit4]   2> 127177 INFO  (Thread-330) [    ] o.a.s.c.ZkTestServer client port:0.0.0.0/0.0.0.0:0
   [junit4]   2> 127178 INFO  (Thread-330) [    ] o.a.s.c.ZkTestServer Starting server
   [junit4]   2> 127284 INFO  (TEST-CdcrRequestHandlerTest.doTest-seed#[B13C768832EBB8DC]) [    ] o.a.s.c.ZkTestServer start zk server on port:49856
   [junit4]   2> 127284 INFO  (TEST-CdcrRequestHandlerTest.doTest-seed#[B13C768832EBB8DC]) [    ] o.a.s.c.c.SolrZkClient Using default ZkCredentialsProvider
   [junit4]   2> 127285 INFO  (TEST-CdcrRequestHandlerTest.doTest-seed#[B13C768832EBB8DC]) [    ] o.a.s.c.c.ConnectionManager Waiting for client to connect to ZooKeeper
   [junit4]   2> 127289 INFO  (zkCallback-87-thread-1) [    ] o.a.s.c.c.ConnectionManager Watcher org.apache.solr.common.cloud.ConnectionManager@4ff6ca name:ZooKeeperConnection Watcher:127.0.0.1:49856 got event WatchedEvent state:SyncConnected type:None path:null path:null type:None
   [junit4]   2> 127289 INFO  (TEST-CdcrRequestHandlerTest.doTest-seed#[B13C768832EBB8DC]) [    ] o.a.s.c.c.ConnectionManager Client is connected to ZooKeeper
   [junit4]   2> 127289 INFO  (TEST-CdcrRequestHandlerTest.doTest-seed#[B13C768832EBB8DC]) [    ] o.a.s.c.c.SolrZkClient Using default ZkACLProvider
   [junit4]   2> 127289 INFO  (TEST-CdcrRequestHandlerTest.doTest-seed#[B13C768832EBB8DC]) [    ] o.a.s.c.c.SolrZkClient makePath: /solr
   [junit4]   2> 127291 INFO  (TEST-CdcrRequestHandlerTest.doTest-seed#[B13C768832EBB8DC]) [    ] o.a.s.c.c.SolrZkClient Using default ZkCredentialsProvider
   [junit4]   2> 127292 INFO  (TEST-CdcrRequestHandlerTest.doTest-seed#[B13C768832EBB8DC]) [    ] o.a.s.c.c.ConnectionManager Waiting for client to connect to ZooKeeper
   [junit4]   2> 127294 INFO  (zkCallback-88-thread-1) [    ] o.a.s.c.c.ConnectionManager Watcher org.apache.solr.common.cloud.ConnectionManager@170d44a name:ZooKeeperConnection Watcher:127.0.0.1:49856/solr got event WatchedEvent state:SyncConnected type:None path:null path:null type:None
   [junit4]   2> 127295 INFO  (TEST-CdcrRequestHandlerTest.doTest-seed#[B13C768832EBB8DC]) [    ] o.a.s.c.c.ConnectionManager Client is connected to ZooKeeper
   [junit4]   2> 127295 INFO  (TEST-CdcrRequestHandlerTest.doTest-seed#[B13C768832EBB8DC]) [    ] o.a.s.c.c.SolrZkClient Using default ZkACLProvider
   [junit4]   2> 127295 INFO  (TEST-CdcrRequestHandlerTest.doTest-seed#[B13C768832EBB8DC]) [    ] o.a.s.c.c.SolrZkClient makePath: /collections/collection1
   [junit4]   2> 127297 INFO  (TEST-CdcrRequestHandlerTest.doTest-seed#[B13C768832EBB8DC]) [    ] o.a.s.c.c.SolrZkClient makePath: /collections/collection1/shards
   [junit4]   2> 127299 INFO  (TEST-CdcrRequestHandlerTest.doTest-seed#[B13C768832EBB8DC]) [    ] o.a.s.c.c.SolrZkClient makePath: /collections/control_collection
   [junit4]   2> 127300 INFO  (TEST-CdcrRequestHandlerTest.doTest-seed#[B13C768832EBB8DC]) [    ] o.a.s.c.c.SolrZkClient makePath: /collections/control_collection/shards
   [junit4]   2> 127302 INFO  (TEST-CdcrRequestHandlerTest.doTest-seed#[B13C768832EBB8DC]) [    ] o.a.s.c.AbstractZkTestCase put C:\Users\JenkinsSlave\workspace\Lucene-Solr-trunk-Windows\solr\core\src\test-files\solr\collection1\conf\solrconfig-cdcr.xml to /configs/conf1/solrconfig.xml
   [junit4]   2> 127302 INFO  (TEST-CdcrRequestHandlerTest.doTest-seed#[B13C768832EBB8DC]) [    ] o.a.s.c.c.SolrZkClient makePath: /configs/conf1/solrconfig.xml
   [junit4]   2> 127304 INFO  (TEST-CdcrRequestHandlerTest.doTest-seed#[B13C768832EBB8DC]) [    ] o.a.s.c.AbstractZkTestCase put C:\Users\JenkinsSlave\workspace\Lucene-Solr-trunk-Windows\solr\core\src\test-files\solr\collection1\conf\schema15.xml to /configs/conf1/schema.xml
   [junit4]   2> 127306 INFO  (TEST-CdcrRequestHandlerTest.doTest-seed#[B13C768832EBB8DC]) [    ] o.a.s.c.c.SolrZkClient makePath: /configs/conf1/schema.xml
   [junit4]   2> 127308 INFO  (TEST-CdcrRequestHandlerTest.doTest-seed#[B13C768832EBB8DC]) [    ] o.a.s.c.AbstractZkTestCase put C:\Users\JenkinsSlave\workspace\Lucene-Solr-trunk-Windows\solr\core\src\test-files\solr\collection1\conf\solrconfig.snippet.randomindexconfig.xml to /configs/conf1/solrconfig.snippet.randomindexconfig.xml
   [junit4]   2> 127308 INFO  (TEST-CdcrRequestHandlerTest.doTest-seed#[B13C768832EBB8DC]) [    ] o.a.s.c.c.SolrZkClient makePath: /configs/conf1/solrconfig.snippet.randomindexconfig.xml
   [junit4]   2> 127310 INFO  (TEST-CdcrRequestHandlerTest.doTest-seed#[B13C768832EBB8DC]) [    ] o.a.s.c.AbstractZkTestCase put C:\Users\JenkinsSlave\workspace\Lucene-Solr-trunk-Windows\solr\core\src\test-files\solr\collection1\conf\stopwords.txt to /configs/conf1/stopwords.txt
   [junit4]   2> 127310 INFO  (TEST-CdcrRequestHandlerTest.doTest-seed#[B13C768832EBB8DC]) [    ] o.a.s.c.c.SolrZkClient makePath: /configs/conf1/stopwords.txt
   [junit4]   2> 127312 INFO  (TEST-CdcrRequestHandlerTest.doTest-seed#[B13C768832EBB8DC]) [    ] o.a.s.c.AbstractZkTestCase put C:\Users\JenkinsSlave\workspace\Lucene-Solr-trunk-Windows\solr\core\src\test-files\solr\collection1\conf\protwords.txt to /configs/conf1/protwords.txt
   [junit4]   2> 127312 INFO  (TEST-CdcrRequestHandlerTest.doTest-seed#[B13C768832EBB8DC]) [    ] o.a.s.c.c.SolrZkClient makePath: /configs/conf1/protwords.txt
   [junit4]   2> 127314 INFO  (TEST-CdcrRequestHandlerTest.doTest-seed#[B13C768832EBB8DC]) [    ] o.a.s.c.AbstractZkTestCase put C:\Users\JenkinsSlave\workspace\Lucene-Solr-trunk-Windows\solr\core\src\test-files\solr\collection1\conf\currency.xml to /configs/conf1/currency.xml
   [junit4]   2> 127314 INFO  (TEST-CdcrRequestHandlerTest.doTest-seed#[B13C768832EBB8DC]) [    ] o.a.s.c.c.SolrZkClient makePath: /configs/conf1/currency.xml
   [junit4]   2> 127316 INFO  (TEST-CdcrRequestHandlerTest.doTest-seed#[B13C768832EBB8DC]) [    ] o.a.s.c.AbstractZkTestCase put C:\Users\JenkinsSlave\workspace\Lucene-Solr-trunk-Windows\solr\core\src\test-files\solr\collection1\conf\enumsConfig.xml to /configs/conf1/enumsConfig.xml
   [junit4]   2> 127316 INFO  (TEST-CdcrRequestHandlerTest.doTest-seed#[B13C768832EBB8DC]) [    ] o.a.s.c.c.SolrZkClient makePath: /configs/conf1/enumsConfig.xml
   [junit4]   2> 127318 INFO  (TEST-CdcrRequestHandlerTest.doTest-seed#[B13C768832EBB8DC]) [    ] o.a.s.c.AbstractZkTestCase put C:\Users\JenkinsSlave\workspace\Lucene-Solr-trunk-Windows\solr\core\src\test-files\solr\collection1\conf\open-exchange-rates.json to /configs/conf1/open-exchange-rates.json
   [junit4]   2> 127319 INFO  (TEST-CdcrRequestHandlerTest.doTest-seed#[B13C768832EBB8DC]) [    ] o.a.s.c.c.SolrZkClient makePath: /configs/conf1/open-exchange-rates.json
   [junit4]   2> 127321 INFO  (TEST-CdcrRequestHandlerTest.doTest-seed#[B13C768832EBB8DC]) [    ] o.a.s.c.AbstractZkTestCase put C:\Users\JenkinsSlave\workspace\Lucene-Solr-trunk-Windows\solr\core\src\test-files\solr\collection1\conf\mapping-ISOLatin1Accent.txt to /configs/conf1/mapping-ISOLatin1Accent.txt
   [junit4]   2> 127321 INFO  (TEST-CdcrRequestHandlerTest.doTest-seed#[B13C768832EBB8DC]) [    ] o.a.s.c.c.SolrZkClient makePath: /configs/conf1/mapping-ISOLatin1Accent.txt
   [junit4]   2> 127323 INFO  (TEST-CdcrRequestHandlerTest.doTest-seed#[B13C768832EBB8DC]) [    ] o.a.s.c.AbstractZkTestCase put C:\Users\JenkinsSlave\workspace\Lucene-Solr-trunk-Windows\solr\core\src\test-files\solr\collection1\conf\old_synonyms.txt to /configs/conf1/old_synonyms.txt
   [junit4]   2> 127323 INFO  (TEST-CdcrRequestHandlerTest.doTest-seed#[B13C768832EBB8DC]) [    ] o.a.s.c.c.SolrZkClient makePath: /configs/conf1/old_synonyms.txt
   [junit4]   2> 127326 INFO  (TEST-CdcrRequestHandlerTest.doTest-seed#[B13C768832EBB8DC]) [    ] o.a.s.c.AbstractZkTestCase put C:\Users\JenkinsSlave\workspace\Lucene-Solr-trunk-Windows\solr\core\src\test-files\solr\collection1\conf\synonyms.txt to /configs/conf1/synonyms.txt
   [junit4]   2> 127326 INFO  (TEST-CdcrRequestHandlerTest.doTest-seed#[B13C768832EBB8DC]) [    ] o.a.s.c.c.SolrZkClient makePath: /configs/conf1/synonyms.txt
   [junit4]   2> 127329 INFO  (TEST-CdcrRequestHandlerTest.doTest-seed#[B13C768832EBB8DC]) [    ] o.a.s.SolrTestCaseJ4 ###Starting doTest
   [junit4]   2> 127753 INFO  (TEST-CdcrRequestHandlerTest.doTest-seed#[B13C768832EBB8DC]) [    ] o.a.s.SolrTestCaseJ4 Writing core.properties file to C:\Users\JenkinsSlave\workspace\Lucene-Solr-trunk-Windows\solr\build\solr-core\test\J1\temp\solr.cloud.CdcrRequestHandlerTest_B13C768832EBB8DC-001\jetty-001\cores\collection1
   [junit4]   2> 127756 INFO  (TEST-CdcrRequestHandlerTest.doTest-seed#[B13C768832EBB8DC]) [    ] o.e.j.s.Server jetty-9.2.11.v20150529
   [junit4]   2> 127758 INFO  (TEST-CdcrRequestHandlerTest.doTest-seed#[B13C768832EBB8DC]) [    ] o.e.j.s.h.ContextHandler Started o.e.j.s.ServletContextHandler@6d1437{/dh,null,AVAILABLE}
   [junit4]   2> 127765 INFO  (TEST-CdcrRequestHandlerTest.doTest-seed#[B13C768832EBB8DC]) [    ] o.e.j.s.ServerConnector Started ServerConnector@3f96ff{HTTP/1.1}{127.0.0.1:49864}
   [junit4]   2> 127765 INFO  (TEST-CdcrRequestHandlerTest.doTest-seed#[B13C768832EBB8DC]) [    ] o.e.j.s.Server Started @131932ms
   [junit4]   2> 127765 INFO  (TEST-CdcrRequestHandlerTest.doTest-seed#[B13C768832EBB8DC]) [    ] o.a.s.c.s.e.JettySolrRunner Jetty properties: {shards=shard1, hostContext=/dh, hostPort=49864, coreRootDirectory=C:\Users\JenkinsSlave\workspace\Lucene-Solr-trunk-Windows\solr\build\solr-core\test\J1\temp\solr.cloud.CdcrRequestHandlerTest_B13C768832EBB8DC-001\jetty-001\cores}
   [junit4]   2> 127767 INFO  (TEST-CdcrRequestHandlerTest.doTest-seed#[B13C768832EBB8DC]) [    ] o.a.s.s.SolrDispatchFilter SolrDispatchFilter.init(): sun.misc.Launcher$AppClassLoader@e2f2a
   [junit4]   2> 127767 INFO  (TEST-CdcrRequestHandlerTest.doTest-seed#[B13C768832EBB8DC]) [    ] o.a.s.c.SolrResourceLoader new SolrResourceLoader for directory: 'C:\Users\JenkinsSlave\workspace\Lucene-Solr-trunk-Windows\solr\build\solr-core\test\J1\temp\solr.cloud.CdcrRequestHandlerTest_B13C768832EBB8DC-001\jetty-001\'
   [junit4]   2> 127788 INFO  (TEST-CdcrRequestHandlerTest.doTest-seed#[B13C768832EBB8DC]) [    ] o.a.s.c.c.SolrZkClient Using default ZkCredentialsProvider
   [junit4]   2> 127789 INFO  (TEST-CdcrRequestHandlerTest.doTest-seed#[B13C768832EBB8DC]) [    ] o.a.s.c.c.ConnectionManager Waiting for client to connect to ZooKeeper
   [junit4]   2> 127791 INFO  (zkCallback-89-thread-1) [    ] o.a.s.c.c.ConnectionManager Watcher org.apache.solr.common.cloud.ConnectionManager@62b634 name:ZooKeeperConnection Watcher:127.0.0.1:49856/solr got event WatchedEvent state:SyncConnected type:None path:null path:null type:None
   [junit4]   2> 127791 INFO  (TEST-CdcrRequestHandlerTest.doTest-seed#[B13C768832EBB8DC]) [    ] o.a.s.c.c.ConnectionManager Client is connected to ZooKeeper
   [junit4]   2> 127792 INFO  (TEST-CdcrRequestHandlerTest.doTest-seed#[B13C768832EBB8DC]) [    ] o.a.s.c.c.SolrZkClient Using default ZkACLProvider
   [junit4]   2> 127793 WARN  (NIOServerCxn.Factory:0.0.0.0/0.0.0.0:0) [    ] o.a.z.s.NIOServerCnxn caught end of stream exception
   [junit4]   2> EndOfStreamException: Unable to read additional data from client sessionid 0x14ed42c76310002, likely client has closed socket
   [junit4]   2> 	at org.apache.zookeeper.server.NIOServerCnxn.doIO(NIOServerCnxn.java:228)
   [junit4]   2> 	at org.apache.zookeeper.server.NIOServerCnxnFactory.run(NIOServerCnxnFactory.java:208)
   [junit4]   2> 	at java.lang.Thread.run(Thread.java:745)
   [junit4]   2> 127794 INFO  (TEST-CdcrRequestHandlerTest.doTest-seed#[B13C768832EBB8DC]) [    ] o.a.s.s.SolrDispatchFilter Loading solr.xml from SolrHome (not found in ZooKeeper)
   [junit4]   2> 127794 INFO  (TEST-CdcrRequestHandlerTest.doTest-seed#[B13C768832EBB8DC]) [    ] o.a.s.c.SolrXmlConfig Loading container configuration from C:\Users\JenkinsSlave\workspace\Lucene-Solr-trunk-Windows\solr\build\solr-core\test\J1\temp\solr.cloud.CdcrRequestHandlerTest_B13C768832EBB8DC-001\jetty-001\solr.xml
   [junit4]   2> 127803 INFO  (TEST-CdcrRequestHandlerTest.doTest-seed#[B13C768832EBB8DC]) [    ] o.a.s.c.CoresLocator Config-defined core root directory: C:\Users\JenkinsSlave\workspace\Lucene-Solr-trunk-Windows\solr\build\solr-core\test\J1\temp\solr.cloud.CdcrRequestHandlerTest_B13C768832EBB8DC-001\jetty-001\cores
   [junit4]   2> 127803 INFO  (TEST-CdcrRequestHandlerTest.doTest-seed#[B13C768832EBB8DC]) [    ] o.a.s.c.CoreContainer New CoreContainer 17958266
   [junit4]   2> 127803 INFO  (TEST-CdcrRequestHandlerTest.doTest-seed#[B13C768832EBB8DC]) [    ] o.a.s.c.CoreContainer Loading cores into CoreContainer [instanceDir=C:\Users\JenkinsSlave\workspace\Lucene-Solr-trunk-Windows\solr\build\solr-core\test\J1\temp\solr.cloud.CdcrRequestHandlerTest_B13C768832EBB8DC-001\jetty-001\]
   [junit4]   2> 127803 INFO  (TEST-CdcrRequestHandlerTest.doTest-seed#[B13C768832EBB8DC]) [    ] o.a.s.c.CoreContainer loading shared library: C:\Users\JenkinsSlave\workspace\Lucene-Solr-trunk-Windows\solr\build\solr-core\test\J1\temp\solr.cloud.CdcrRequestHandlerTest_B13C768832EBB8DC-001\jetty-001\lib
   [junit4]   2> 127803 WARN  (TEST-CdcrRequestHandlerTest.doTest-seed#[B13C768832EBB8DC]) [    ] o.a.s.c.SolrResourceLoader Can't find (or read) directory to add to classloader: lib (resolved as: C:\Users\JenkinsSlave\workspace\Lucene-Solr-trunk-Windows\solr\build\solr-core\test\J1\temp\solr.cloud.CdcrRequestHandlerTest_B13C768832EBB8DC-001\jetty-001\lib).
   [junit4]   2> 127812 INFO  (TEST-CdcrRequestHandlerTest.doTest-seed#[B13C768832EBB8DC]) [    ] o.a.s.h.c.HttpShardHandlerFactory created with socketTimeout : 90000,urlScheme : ,connTimeout : 15000,maxConnectionsPerHost : 20,maxConnections : 10000,corePoolSize : 0,maximumPoolSize : 2147483647,maxThreadIdleTime : 5,sizeOfQueue : -1,fairnessPolicy : false,useRetries : false,
   [junit4]   2> 127815 INFO  (TEST-CdcrRequestHandlerTest.doTest-seed#[B13C768832EBB8DC]) [    ] o.a.s.u.UpdateShardHandler Creating UpdateShardHandler HTTP client with params: socketTimeout=340000&connTimeout=45000&retry=true
   [junit4]   2> 127815 INFO  (TEST-CdcrRequestHandlerTest.doTest-seed#[B13C768832EBB8DC]) [    ] o.a.s.l.LogWatcher SLF4J impl is org.slf4j.impl.Log4jLoggerFactory
   [junit4]   2> 127815 INFO  (TEST-CdcrRequestHandlerTest.doTest-seed#[B13C768832EBB8DC]) [    ] o.a.s.l.LogWatcher Registering Log Listener [Log4j (org.slf4j.impl.Log4jLoggerFactory)]
   [junit4]   2> 127816 INFO  (TEST-CdcrRequestHandlerTest.doTest-seed#[B13C768832EBB8DC]) [    ] o.a.s.c.ZkContainer Zookeeper client=127.0.0.1:49856/solr
   [junit4]   2> 127816 INFO  (TEST-CdcrRequestHandlerTest.doTest-seed#[B13C768832EBB8DC]) [    ] o.a.s.c.ZkController zkHost includes chroot
   [junit4]   2> 127816 INFO  (TEST-CdcrRequestHandlerTest.doTest-seed#[B13C768832EBB8DC]) [    ] o.a.s.c.c.SolrZkClient Using default ZkCredentialsProvider
   [junit4]   2> 127817 INFO  (TEST-CdcrRequestHandlerTest.doTest-seed#[B13C768832EBB8DC]) [    ] o.a.s.c.c.ConnectionManager Waiting for client to connect to ZooKeeper
   [junit4]   2> 127819 INFO  (zkCallback-91-thread-1) [    ] o.a.s.c.c.ConnectionManager Watcher org.apache.solr.common.cloud.ConnectionManager@88fb45 name:ZooKeeperConnection Watcher:127.0.0.1:49856 got event WatchedEvent state:SyncConnected type:None path:null path:null type:None
   [junit4]   2> 127820 INFO  (TEST-CdcrRequestHandlerTest.doTest-seed#[B13C768832EBB8DC]) [    ] o.a.s.c.c.ConnectionManager Client is connected to ZooKeeper
   [junit4]   2> 127820 INFO  (TEST-CdcrRequestHandlerTest.doTest-seed#[B13C768832EBB8DC]) [    ] o.a.s.c.c.SolrZkClient Using default ZkACLProvider
   [junit4]   2> 127822 INFO  (TEST-CdcrRequestHandlerTest.doTest-seed#[B13C768832EBB8DC]) [n:127.0.0.1:49864_dh    ] o.a.s.c.c.ConnectionManager Waiting for client to connect to ZooKeeper
   [junit4]   2> 127825 INFO  (zkCallback-92-thread-1-processing-n:127.0.0.1:49864_dh) [n:127.0.0.1:49864_dh    ] o.a.s.c.c.ConnectionManager Watcher org.apache.solr.common.cloud.ConnectionManager@8a16f7 name:ZooKeeperConnection Watcher:127.0.0.1:49856/solr got event WatchedEvent state:SyncConnected type:None path:null path:null type:None
   [junit4]   2> 127825 INFO  (TEST-CdcrRequestHandlerTest.doTest-seed#[B13C768832EBB8DC]) [n:127.0.0.1:49864_dh    ] o.a.s.c.c.ConnectionManager Client is connected to ZooKeeper
   [junit4]   2> 127826 INFO  (TEST-CdcrRequestHandlerTest.doTest-seed#[B13C768832EBB8DC]) [n:127.0.0.1:49864_dh    ] o.a.s.c.c.SolrZkClient makePath: /overseer/queue
   [junit4]   2> 127829 INFO  (TEST-CdcrRequestHandlerTest.doTest-seed#[B13C768832EBB8DC]) [n:127.0.0.1:49864_dh    ] o.a.s.c.c.SolrZkClient makePath: /overseer/collection-queue-work
   [junit4]   2> 127832 INFO  (TEST-CdcrRequestHandlerTest.doTest-seed#[B13C768832EBB8DC]) [n:127.0.0.1:49864_dh    ] o.a.s.c.c.SolrZkClient makePath: /overseer/collection-map-running
   [junit4]   2> 127833 INFO  (TEST-CdcrRequestHandlerTest.doTest-seed#[B13C768832EBB8DC]) [n:127.0.0.1:49864_dh    ] o.a.s.c.c.SolrZkClient makePath: /overseer/collection-map-completed
   [junit4]   2> 127836 INFO  (TEST-CdcrRequestHandlerTest.doTest-seed#[B13C768832EBB8DC]) [n:127.0.0.1:49864_dh    ] o.a.s.c.c.SolrZkClient makePath: /overseer/collection-map-failure
   [junit4]   2> 127838 INFO  (TEST-CdcrRequestHandlerTest.doTest-seed#[B13C768832EBB8DC]) [n:127.0.0.1:49864_dh    ] o.a.s.c.c.SolrZkClient makePath: /live_nodes
   [junit4]   2> 127839 INFO  (TEST-CdcrRequestHandlerTest.doTest-seed#[B13C768832EBB8DC]) [n:127.0.0.1:49864_dh    ] o.a.s.c.c.SolrZkClient makePath: /aliases.json
   [junit4]   2> 127840 INFO  (TEST-CdcrRequestHandlerTest.doTest-seed#[B13C768832EBB8DC]) [n:127.0.0.1:49864_dh    ] o.a.s.c.c.SolrZkClient makePath: /clusterstate.json
   [junit4]   2> 127841 INFO  (TEST-CdcrRequestHandlerTest.doTest-seed#[B13C768832EBB8DC]) [n:127.0.0.1:49864_dh    ] o.a.s.c.ZkController Register node as live in ZooKeeper:/live_nodes/127.0.0.1:49864_dh
   [junit4]   2> 127841 INFO  (TEST-CdcrRequestHandlerTest.doTest-seed#[B13C768832EBB8DC]) [n:127.0.0.1:49864_dh    ] o.a.s.c.c.SolrZkClient makePath: /live_nodes/127.0.0.1:49864_dh
   [junit4]   2> 127843 INFO  (TEST-CdcrRequestHandlerTest.doTest-seed#[B13C768832EBB8DC]) [n:127.0.0.1:49864_dh    ] o.a.s.c.c.SolrZkClient makePath: /overseer_elect
   [junit4]   2> 127846 INFO  (TEST-CdcrRequestHandlerTest.doTest-seed#[B13C768832EBB8DC]) [n:127.0.0.1:49864_dh    ] o.a.s.c.c.SolrZkClient makePath: /overseer_elect/election
   [junit4]   2> 127847 INFO  (TEST-CdcrRequestHandlerTest.doTest-seed#[B13C768832EBB8DC]) [n:127.0.0.1:49864_dh    ] o.a.s.c.Overseer Overseer (id=null) closing
   [junit4]   2> 127848 INFO  (TEST-CdcrRequestHandlerTest.doTest-seed#[B13C768832EBB8DC]) [n:127.0.0.1:49864_dh    ] o.a.s.c.LeaderElector Joined leadership election with path: /overseer_elect/election/94245929647931396-127.0.0.1:49864_dh-n_0000000000
   [junit4]   2> 127849 INFO  (TEST-CdcrRequestHandlerTest.doTest-seed#[B13C768832EBB8DC]) [n:127.0.0.1:49864_dh    ] o.a.s.c.OverseerElectionContext I am going to be the leader 127.0.0.1:49864_dh
   [junit4]   2> 127849 INFO  (TEST-CdcrRequestHandlerTest.doTest-seed#[B13C768832EBB8DC]) [n:127.0.0.1:49864_dh    ] o.a.s.c.c.SolrZkClient makePath: /overseer_elect/leader
   [junit4]   2> 127850 INFO  (TEST-CdcrRequestHandlerTest.doTest-seed#[B13C768832EBB8DC]) [n:127.0.0.1:49864_dh    ] o.a.s.c.Overseer Overseer (id=94245929647931396-127.0.0.1:49864_dh-n_0000000000) starting
   [junit4]   2> 127852 INFO  (TEST-CdcrRequestHandlerTest.doTest-seed#[B13C768832EBB8DC]) [n:127.0.0.1:49864_dh    ] o.a.s.c.c.SolrZkClient makePath: /overseer/queue-work
   [junit4]   2> 127858 INFO  (TEST-CdcrRequestHandlerTest.doTest-seed#[B13C768832EBB8DC]) [n:127.0.0.1:49864_dh    ] o.a.s.c.OverseerAutoReplicaFailoverThread Starting OverseerAutoReplicaFailoverThread autoReplicaFailoverWorkLoopDelay=10000 autoReplicaFailoverWaitAfterExpiration=30000 autoReplicaFailoverBadNodeExpiration=60000
   [junit4]   2> 127859 INFO  (TEST-CdcrRequestHandlerTest.doTest-seed#[B13C768832EBB8DC]) [n:127.0.0.1:49864_dh    ] o.a.s.c.c.ZkStateReader Updating cluster state from ZooKeeper... 
   [junit4]   2> 127859 INFO  (OverseerCollectionProcessor-94245929647931396-127.0.0.1:49864_dh-n_0000000000) [n:127.0.0.1:49864_dh    ] o.a.s.c.OverseerCollectionProcessor Process current queue of collection creations
   [junit4]   2> 127859 INFO  (OverseerStateUpdate-94245929647931396-127.0.0.1:49864_dh-n_0000000000) [n:127.0.0.1:49864_dh    ] o.a.s.c.Overseer Starting to work on the main queue
   [junit4]   2> 127862 INFO  (TEST-CdcrRequestHandlerTest.doTest-seed#[B13C768832EBB8DC]) [n:127.0.0.1:49864_dh    ] o.a.s.c.CoreContainer No authentication plugin used.
   [junit4]   2> 127862 INFO  (TEST-CdcrRequestHandlerTest.doTest-seed#[B13C768832EBB8DC]) [n:127.0.0.1:49864_dh    ] o.a.s.c.CoreContainer Security conf doesn't exist. Skipping setup for authorization module.
   [junit4]   2> 127865 INFO  (TEST-CdcrRequestHandlerTest.doTest-seed#[B13C768832EBB8DC]) [n:127.0.0.1:49864_dh    ] o.a.s.c.CoresLocator Looking for core definitions underneath C:\Users\JenkinsSlave\workspace\Lucene-Solr-trunk-Windows\solr\build\solr-core\test\J1\temp\solr.cloud.CdcrRequestHandlerTest_B13C768832EBB8DC-001\jetty-001\cores
   [junit4]   2> 127866 INFO  (TEST-CdcrRequestHandlerTest.doTest-seed#[B13C768832EBB8DC]) [n:127.0.0.1:49864_dh    ] o.a.s.c.SolrCore Created CoreDescriptor: {name=collection1, config=solrconfig.xml, transient=false, schema=schema.xml, loadOnStartup=true, configSetProperties=configsetprops.json, instanceDir=C:\Users\JenkinsSlave\workspace\Lucene-Solr-trunk-Windows\solr\build\solr-core\test\J1\temp\solr.cloud.CdcrRequestHandlerTest_B13C768832EBB8DC-001\jetty-001\cores\collection1, collection=tmp_collection, absoluteInstDir=C:\Users\JenkinsSlave\workspace\Lucene-Solr-trunk-Windows\solr\build\solr-core\test\J1\temp\solr.cloud.CdcrRequestHandlerTest_B13C768832EBB8DC-001\jetty-001\cores\collection1\, coreNodeName=, dataDir=data\, shard=}
   [junit4]   2> 127867 INFO  (TEST-CdcrRequestHandlerTest.doTest-seed#[B13C768832EBB8DC]) [n:127.0.0.1:49864_dh    ] o.a.s.c.CoresLocator Found core collection1 in C:\Users\JenkinsSlave\workspace\Lucene-Solr-trunk-Windows\solr\build\solr-core\test\J1\temp\solr.cloud.CdcrRequestHandlerTest_B13C768832EBB8DC-001\jetty-001\cores\collection1\
   [junit4]   2> 127867 INFO  (TEST-CdcrRequestHandlerTest.doTest-seed#[B13C768832EBB8DC]) [n:127.0.0.1:49864_dh    ] o.a.s.c.CoresLocator Found 1 core definitions
   [junit4]   2> 127868 INFO  (TEST-CdcrRequestHandlerTest.doTest-seed#[B13C768832EBB8DC]) [n:127.0.0.1:49864_dh    ] o.a.s.s.SolrDispatchFilter user.dir=C:\Users\JenkinsSlave\workspace\Lucene-Solr-trunk-Windows\solr\build\solr-core\test\J1
   [junit4]   2> 127868 INFO  (TEST-CdcrRequestHandlerTest.doTest-seed#[B13C768832EBB8DC]) [n:127.0.0.1:49864_dh    ] o.a.s.s.SolrDispatchFilter SolrDispatchFilter.init() done
   [junit4]   2> 127869 INFO  (coreLoadExecutor-285-thread-1-processing-n:127.0.0.1:49864_dh) [n:127.0.0.1:49864_dh c:tmp_collection   x:collection1] o.a.s.c.ZkController publishing state=down
   [junit4]   2> 127869 INFO  (coreLoadExecutor-285-thread-1-processing-n:127.0.0.1:49864_dh) [n:127.0.0.1:49864_dh c:tmp_collection   x:collection1] o.a.s.c.ZkController numShards not found on descriptor - reading it from system property
   [junit4]   2> 127869 INFO  (zkCallback-92-thread-1-processing-n:127.0.0.1:49864_dh) [n:127.0.0.1:49864_dh    ] o.a.s.c.DistributedQueue NodeChildrenChanged fired on path /overseer/queue state SyncConnected
   [junit4]   2> 127869 INFO  (coreLoadExecutor-285-thread-1-processing-n:127.0.0.1:49864_dh) [n:127.0.0.1:49864_dh c:tmp_collection   x:collection1] o.a.s.c.ZkController look for our core node name
   [junit4]   2> 127870 INFO  (OverseerStateUpdate-94245929647931396-127.0.0.1:49864_dh-n_0000000000) [n:127.0.0.1:49864_dh    ] o.a.s.c.Overseer processMessage: queueSize: 1, message = {
   [junit4]   2>   "core":"collection1",
   [junit4]   2>   "roles":null,
   [junit4]   2>   "base_url":"http://127.0.0.1:49864/dh",
   [junit4]   2>   "node_name":"127.0.0.1:49864_dh",
   [junit4]   2>   "numShards":"2",
   [junit4]   2>   "state":"down",
   [junit4]   2>   "shard":null,
   [junit4]   2>   "collection":"tmp_collection",
   [junit4]   2>   "operation":"state"} current state version: 0
   [junit4]   2> 127870 INFO  (OverseerStateUpdate-94245929647931396-127.0.0.1:49864_dh-n_0000000000) [n:127.0.0.1:49864_dh    ] o.a.s.c.o.ReplicaMutator Update state numShards=2 message={
   [junit4]   2>   "core":"collection1",
   [junit4]   2>   "roles":null,
   [junit4]   2>   "base_url":"http://127.0.0.1:49864/dh",
   [junit4]   2>   "node_name":"127.0.0.1:49864_dh",
   [junit4]   2>   "numShards":"2",
   [junit4]   2>   "state":"down",
   [junit4]   2>   "shard":null,
   [junit4]   2>   "collection":"tmp_collection",
   [junit4]   2>   "operation":"state"}
   [junit4]   2> 127870 INFO  (OverseerStateUpdate-94245929647931396-127.0.0.1:49864_dh-n_0000000000) [n:127.0.0.1:49864_dh    ] o.a.s.c.o.ClusterStateMutator building a new cName: tmp_collection
   [junit4]   2> 127870 INFO  (OverseerStateUpdate-94245929647931396-127.0.0.1:49864_dh-n_0000000000) [n:127.0.0.1:49864_dh    ] o.a.s.c.o.ReplicaMutator Assigning new node to shard shard=shard2
   [junit4]   2> 127875 INFO  (zkCallback-92-thread-1-processing-n:127.0.0.1:49864_dh) [n:127.0.0.1:49864_dh    ] o.a.s.c.c.ZkStateReader A cluster state change: WatchedEvent state:SyncConnected type:NodeDataChanged path:/clusterstate.json, has occurred - updating... (live nodes size: 1)
   [junit4]   2> 127876 INFO  (zkCallback-92-thread-1-processing-n:127.0.0.1:49864_dh) [n:127.0.0.1:49864_dh    ] o.a.s.c.c.ZkStateReader Updated cluster state version to 1
   [junit4]   2> 128948 INFO  (coreLoadExecutor-285-thread-1-processing-n:127.0.0.1:49864_dh) [n:127.0.0.1:49864_dh c:tmp_collection   x:collection1] o.a.s.c.ZkController waiting to find shard id in clusterstate for collection1
   [junit4]   2> 128948 INFO  (coreLoadExecutor-285-thread-1-processing-n:127.0.0.1:49864_dh) [n:127.0.0.1:49864_dh c:tmp_collection   x:collection1] o.a.s.c.ZkController Check for collection zkNode:tmp_collection
   [junit4]   2> 128948 INFO  (coreLoadExecutor-285-thread-1-processing-n:127.0.0.1:49864_dh) [n:127.0.0.1:49864_dh c:tmp_collection   x:collection1] o.a.s.c.ZkController Creating collection in ZooKeeper:tmp_collection
   [junit4]   2> 128948 INFO  (coreLoadExecutor-285-thread-1-processing-n:127.0.0.1:49864_dh) [n:127.0.0.1:49864_dh c:tmp_collection   x:collection1] o.a.s.c.ZkController Looking for collection configName
   [junit4]   2> 128949 INFO  (coreLoadExecutor-285-thread-1-processing-n:127.0.0.1:49864_dh) [n:127.0.0.1:49864_dh c:tmp_collection   x:collection1] o.a.s.c.ZkController Only one config set found in zk - using it:conf1
   [junit4]   2> 128949 INFO  (coreLoadExecutor-285-thread-1-processing-n:127.0.0.1:49864_dh) [n:127.0.0.1:49864_dh c:tmp_collection   x:collection1] o.a.s.c.c.SolrZkClient makePath: /collections/tmp_collection
   [junit4]   2> 128951 INFO  (coreLoadExecutor-285-thread-1-processing-n:127.0.0.1:49864_dh) [n:127.0.0.1:49864_dh c:tmp_collection   x:collection1] o.a.s.c.c.ZkStateReader Load collection config from:/collections/tmp_collection
   [junit4]   2> 128952 INFO  (coreLoadExecutor-285-thread-1-processing-n:127.0.0.1:49864_dh) [n:127.0.0.1:49864_dh c:tmp_collection   x:collection1] o.a.s.c.c.ZkStateReader path=/collections/tmp_collection configName=conf1 specified config exists in ZooKeeper
   [junit4]   2> 128952 INFO  (coreLoadExecutor-285-thread-1-processing-n:127.0.0.1:49864_dh) [n:127.0.0.1:49864_dh c:tmp_collection   x:collection1] o.a.s.c.SolrResourceLoader new SolrResourceLoader for directory: 'C:\Users\JenkinsSlave\workspace\Lucene-Solr-trunk-Windows\solr\build\solr-core\test\J1\temp\solr.cloud.CdcrRequestHandlerTest_B13C768832EBB8DC-001\jetty-001\cores\collection1\'
   [junit4]   2> 128972 INFO  (coreLoadExecutor-285-thread-1-processing-n:127.0.0.1:49864_dh) [n:127.0.0.1:49864_dh c:tmp_collection   x:collection1] o.a.s.c.Config loaded config solrconfig.xml with version 0 
   [junit4]   2> 128979 INFO  (coreLoadExecutor-285-thread-1-processing-n:127.0.0.1:49864_dh) [n:127.0.0.1:49864_dh c:tmp_collection   x:collection1] o.a.s.c.SolrConfig current version of requestparams : -1
   [junit4]   2> 128982 INFO  (coreLoadExecutor-285-thread-1-processing-n:127.0.0.1:49864_dh) [n:127.0.0.1:49864_dh c:tmp_collection   x:collection1] o.a.s.c.SolrConfig Using Lucene MatchVersion: 6.0.0
   [junit4]   2> 128986 INFO  (coreLoadExecutor-285-thread-1-processing-n:127.0.0.1:49864_dh) [n:127.0.0.1:49864_dh c:tmp_collection   x:collection1] o.a.s.c.Config Loaded SolrConfig: solrconfig.xml
   [junit4]   2> 128987 INFO  (coreLoadExecutor-285-thread-1-processing-n:127.0.0.1:49864_dh) [n:127.0.0.1:49864_dh c:tmp_collection   x:collection1] o.a.s.s.IndexSchema Reading Solr Schema from /configs/conf1/schema.xml
   [junit4]   2> 129159 INFO  (coreLoadExecutor-285-thread-1-processing-n:127.0.0.1:49864_dh) [n:127.0.0.1:49864_dh c:tmp_collection   x:collection1] o.a.s.s.IndexSchema [collection1] Schema name=test
   [junit4]   2> 129237 INFO  (coreLoadExecutor-285-thread-1-processing-n:127.0.0.1:49864_dh) [n:127.0.0.1:49864_dh c:tmp_collection   x:collection1] o.a.s.s.IndexSchema default search field in schema is text
   [junit4]   2> 129239 INFO  (coreLoadExecutor-285-thread-1-processing-n:127.0.0.1:49864_dh) [n:127.0.0.1:49864_dh c:tmp_collection   x:collection1] o.a.s.s.IndexSchema unique key field: id
   [junit4]   2> 129239 INFO  (coreLoadExecutor-285-thread-1-processing-n:127.0.0.1:49864_dh) [n:127.0.0.1:49864_dh c:tmp_collection   x:collection1] o.a.s.s.FileExchangeRateProvider Reloading exchange rates from file currency.xml
   [junit4]   2> 129243 INFO  (coreLoadExecutor-285-thread-1-processing-n:127.0.0.1:49864_dh) [n:127.0.0.1:49864_dh c:tmp_collection   x:collection1] o.a.s.s.FileExchangeRateProvider Reloading exchange rates from file currency.xml
   [junit4]   2> 129265 INFO  (coreLoadExecutor-285-thread-1-processing-n:127.0.0.1:49864_dh) [n:127.0.0.1:49864_dh c:tmp_collection   x:collection1] o.a.s.c.ConfigSetProperties Did not find ConfigSet properties, assuming default properties: Can't find resource 'configsetprops.json' in classpath or '/configs/conf1', cwd=C:\Users\JenkinsSlave\workspace\Lucene-Solr-trunk-Windows\solr\build\solr-core\test\J1
   [junit4]   2> 129265 INFO  (coreLoadExecutor-285-thread-1-processing-n:127.0.0.1:49864_dh) [n:127.0.0.1:49864_dh c:tmp_collection   x:collection1] o.a.s.c.CoreContainer Creating SolrCore 'collection1' using configuration from collection tmp_collection
   [junit4]   2> 129265 INFO  (coreLoadExecutor-285-thread-1-processing-n:127.0.0.1:49864_dh) [n:127.0.0.1:49864_dh c:tmp_collection s:shard2 r:core_node1 x:collection1] o.a.s.c.SolrCore org.apache.solr.core.MockDirectoryFactory
   [junit4]   2> 129265 INFO  (coreLoadExecutor-285-thread-1-processing-n:127.0.0.1:49864_dh) [n:127.0.0.1:49864_dh c:tmp_collection s:shard2 r:core_node1 x:collection1] o.a.s.c.SolrCore [[collection1] ] Opening new SolrCore at [C:\Users\JenkinsSlave\workspace\Lucene-Solr-trunk-Windows\solr\build\solr-core\test\J1\temp\solr.cloud.CdcrRequestHandlerTest_B13C768832EBB8DC-001\jetty-001\cores\collection1\], dataDir=[null]
   [junit4]   2> 129265 INFO  (coreLoadExecutor-285-thread-1-processing-n:127.0.0.1:49864_dh) [n:127.0.0.1:49864_dh c:tmp_collection s:shard2 r:core_node1 x:collection1] o.a.s.c.JmxMonitoredMap JMX monitoring is enabled. Adding Solr mbeans to JMX Server: com.sun.jmx.mbeanserver.JmxMBeanServer@1bdf5d1
   [junit4]   2> 129266 INFO  (coreLoadExecutor-285-thread-1-processing-n:127.0.0.1:49864_dh) [n:127.0.0.1:49864_dh c:tmp_collection s:shard2 r:core_node1 x:collection1] o.a.s.c.CachingDirectoryFactory return new directory for C:\Users\JenkinsSlave\workspace\Lucene-Solr-trunk-Windows\solr\build\solr-core\test\J1\temp\solr.cloud.CdcrRequestHandlerTest_B13C768832EBB8DC-001\jetty-001\cores\collection1\data\
   [junit4]   2> 129266 INFO  (coreLoadExecutor-285-thread-1-processing-n:127.0.0.1:49864_dh) [n:127.0.0.1:49864_dh c:tmp_collection s:shard2 r:core_node1 x:collection1] o.a.s.c.SolrCore New index directory detected: old=null new=C:\Users\JenkinsSlave\workspace\Lucene-Solr-trunk-Windows\solr\build\solr-core\test\J1\temp\solr.cloud.CdcrRequestHandlerTest_B13C768832EBB8DC-001\jetty-001\cores\collection1\data\index/
   [junit4]   2> 129266 WARN  (coreLoadExecutor-285-thread-1-processing-n:127.0.0.1:49864_dh) [n:127.0.0.1:49864_dh c:tmp_collection s:shard2 r:core_node1 x:collection1] o.a.s.c.SolrCore [collection1] Solr index directory 'C:\Users\JenkinsSlave\workspace\Lucene-Solr-trunk-Windows\solr\build\solr-core\test\J1\temp\solr.cloud.CdcrRequestHandlerTest_B13C768832EBB8DC-001\jetty-001\cores\collection1\data\index' doesn't exist. Creating new index...
   [junit4]   2> 129267 INFO  (coreLoadExecutor-285-thread-1-processing-n:127.0.0.1:49864_dh) [n:127.0.0.1:49864_dh c:tmp_collection s:shard2 r:core_node1 x:collection1] o.a.s.c.CachingDirectoryFactory return new directory for C:\Users\JenkinsSlave\workspace\Lucene-Solr-trunk-Windows\solr\build\solr-core\test\J1\temp\solr.cloud.CdcrRequestHandlerTest_B13C768832EBB8DC-001\jetty-001\cores\collection1\data\index
   [junit4]   2> 129267 INFO  (coreLoadExecutor-285-thread-1-processing-n:127.0.0.1:49864_dh) [n:127.0.0.1:49864_dh c:tmp_collection s:shard2 r:core_node1 x:collection1] o.a.s.u.RandomMergePolicy RandomMergePolicy wrapping class org.apache.lucene.index.LogByteSizeMergePolicy: [LogByteSizeMergePolicy: minMergeSize=1677721, mergeFactor=42, maxMergeSize=2147483648, maxMergeSizeForForcedMerge=9223372036854775807, calibrateSizeByDeletes=false, maxMergeDocs=2147483647, maxCFSSegmentSizeMB=8.796093022207999E12, noCFSRatio=0.3686352962649537]
   [junit4]   2> 129268 INFO  (coreLoadExecutor-285-thread-1-processing-n:127.0.0.1:49864_dh) [n:127.0.0.1:49864_dh c:tmp_collection s:shard2 r:core_node1 x:collection1] o.a.s.c.SolrCore SolrDeletionPolicy.onCommit: commits: num=1
   [junit4]   2> 	commit{dir=MockDirectoryWrapper(RAMDirectory@173582 lockFactory=org.apache.lucene.store.SingleInstanceLockFactory@185aea9),segFN=segments_1,generation=1}
   [junit4]   2> 129268 INFO  (coreLoadExecutor-285-thread-1-processing-n:127.0.0.1:49864_dh) [n:127.0.0.1:49864_dh c:tmp_collection s:shard2 r:core_node1 x:collection1] o.a.s.c.SolrCore newest commit generation = 1
   [junit4]   2> 129269 INFO  (OldIndexDirectoryCleanupThreadForCore-collection1) [n:127.0.0.1:49864_dh c:tmp_collection s:shard2 r:core_node1 x:collection1] o.a.s.c.SolrCore Looking for old index directories to cleanup for core collection1 in C:\Users\JenkinsSlave\workspace\Lucene-Solr-trunk-Windows\solr\build\solr-core\test\J1\temp\solr.cloud.CdcrRequestHandlerTest_B13C768832EBB8DC-001\jetty-001\cores\collection1\data\
   [junit4]   2> 129269 WARN  (OldIndexDirectoryCleanupThreadForCore-collection1) [n:127.0.0.1:49864_dh c:tmp_collection s:shard2 r:core_node1 x:collection1] o.a.s.c.DirectoryFactory C:\Users\JenkinsSlave\workspace\Lucene-Solr-trunk-Windows\solr\build\solr-core\test\J1\temp\solr.cloud.CdcrRequestHandlerTest_B13C768832EBB8DC-001\jetty-001\cores\collection1\data\ does not point to a valid data directory; skipping clean-up of old index directories.
   [junit4]   2> 129271 INFO  (coreLoadExecutor-285-thread-1-processing-n:127.0.0.1:49864_dh) [n:127.0.0.1:49864_dh c:tmp_collection s:shard2 r:core_node1 x:collection1] o.a.s.u.p.UpdateRequestProcessorChain creating updateRequestProcessorChain "cdcr-processor-chain"
   [junit4]   2> 129301 INFO  (coreLoadExecutor-285-thread-1-processing-n:127.0.0.1:49864_dh) [n:127.0.0.1:49864_dh c:tmp_collection s:shard2 r:core_node1 x:collection1] o.a.s.c.SolrCore no updateRequestProcessorChain defined as default, creating implicit default
   [junit4]   2> 129314 INFO  (coreLoadExecutor-285-thread-1-processing-n:127.0.0.1:49864_dh) [n:127.0.0.1:49864_dh c:tmp_collection s:shard2 r:core_node1 x:collection1] o.a.s.h.l.XMLLoader xsltCacheLifetimeSeconds=60
   [junit4]   2> 129315 INFO  (coreLoadExecutor-285-thread-1-processing-n:127.0.0.1:49864_dh) [n:127.0.0.1:49864_dh c:tmp_collection s:shard2 r:core_node1 x:collection1] o.a.s.h.l.XMLLoader xsltCacheLifetimeSeconds=60
   [junit4]   2> 129316 INFO  (coreLoadExecutor-285-thread-1-processing-n:127.0.0.1:49864_dh) [n:127.0.0.1:49864_dh c:tmp_collection s:shard2 r:core_node1 x:collection1] o.a.s.h.l.XMLLoader xsltCacheLifetimeSeconds=60
   [junit4]   2> 129316 INFO  (coreLoadExecutor-285-thread-1-processing-n:127.0.0.1:49864_dh) [n:127.0.0.1:49864_dh c:tmp_collection s:shard2 r:core_node1 x:collection1] o.a.s.h.l.XMLLoader xsltCacheLifetimeSeconds=60
   [junit4]   2> 129333 INFO  (coreLoadExecutor-285-thread-1-processing-n:127.0.0.1:49864_dh) [n:127.0.0.1:49864_dh c:tmp_collection s:shard2 r:core_node1 x:collection1] o.a.s.c.RequestHandlers Registered paths: /admin/mbeans,standard,/update/csv,/update/json/docs,/admin/luke,/admin/segments,/get,/admin/system,/replication,/admin/properties,/config,/schema,/admin/plugins,/admin/logging,/update/json,/admin/threads,/admin/ping,/cdcr,/update,/admin/file
   [junit4]   2> 129333 INFO  (coreLoadExecutor-285-thread-1-processing-n:127.0.0.1:49864_dh) [n:127.0.0.1:49864_dh c:tmp_collection s:shard2 r:core_node1 x:collection1] o.a.s.c.SolrCore Using default statsCache cache: org.apache.solr.search.stats.LocalStatsCache
   [junit4]   2> 129351 INFO  (coreLoadExecutor-285-thread-1-processing-n:127.0.0.1:49864_dh) [n:127.0.0.1:49864_dh c:tmp_collection s:shard2 r:core_node1 x:collection1] o.a.s.u.UpdateHandler Using UpdateLog implementation: org.apache.solr.update.CdcrUpdateLog
   [junit4]   2> 129351 INFO  (coreLoadExecutor-285-thread-1-processing-n:127.0.0.1:49864_dh) [n:127.0.0.1:49864_dh c:tmp_collection s:shard2 r:core_node1 x:collection1] o.a.s.u.UpdateLog Initializing UpdateLog: dataDir= defaultSyncLevel=FLUSH numRecordsToKeep=100 maxNumLogsToKeep=10 numVersionBuckets=65536
   [junit4]   2> 129352 INFO  (coreLoadExecutor-285-thread-1-processing-n:127.0.0.1:49864_dh) [n:127.0.0.1:49864_dh c:tmp_collection s:shard2 r:core_node1 x:collection1] o.a.s.c.SolrCore Hard AutoCommit: disabled
   [junit4]   2> 129352 INFO  (coreLoadExecutor-285-thread-1-processing-n:127.0.0.1:49864_dh) [n:127.0.0.1:49864_dh c:tmp_collection s:shard2 r:core_node1 x:collection1] o.a.s.c.SolrCore Soft AutoCommit: disabled
   [junit4]   2> 129353 INFO  (coreLoadExecutor-285-thread-1-processing-n:127.0.0.1:49864_dh) [n:127.0.0.1:49864_dh c:tmp_collection s:shard2 r:core_node1 x:collection1] o.a.s.u.RandomMergePolicy RandomMergePolicy wrapping class org.apache.lucene.index.TieredMergePolicy: [TieredMergePolicy: maxMergeAtOnce=13, maxMergeAtOnceExplicit=28, maxMergedSegmentMB=73.2666015625, floorSegmentMB=1.6953125, forceMergeDeletesPctAllowed=1.2514751504481891, segmentsPerTier=43.0, maxCFSSegmentSizeMB=8.796093022207999E12, noCFSRatio=1.0
   [junit4]   2> 129353 INFO  (coreLoadExecutor-285-thread-1-processing-n:127.0.0.1:49864_dh) [n:127.0.0.1:49864_dh c:tmp_collection s:shard2 r:core_node1 x:collection1] o.a.s.c.SolrCore SolrDeletionPolicy.onInit: commits: num=1
   [junit4]   2> 	commit{dir=MockDirectoryWrapper(RAMDirectory@173582 lockFactory=org.apache.lucene.store.SingleInstanceLockFactory@185aea9),segFN=segments_1,generation=1}
   [junit4]   2> 129353 INFO  (coreLoadExecutor-285-thread-1-processing-n:127.0.0.1:49864_dh) [n:127.0.0.1:49864_dh c:tmp_collection s:shard2 r:core_node1 x:collection1] o.a.s.c.SolrCore newest commit generation = 1
   [junit4]   2> 129353 INFO  (coreLoadExecutor-285-thread-1-processing-n:127.0.0.1:49864_dh) [n:127.0.0.1:49864_dh c:tmp_collection s:shard2 r:core_node1 x:collection1] o.a.s.s.SolrIndexSearcher Opening Searcher@2122b3[collection1] main
   [junit4]   2> 129353 INFO  (coreLoadExecutor-285-thread-1-processing-n:127.0.0.1:49864_dh) [n:127.0.0.1:49864_dh c:tmp_collection s:shard2 r:core_node1 x:collection1] o.a.s.c.c.ZkStateReader Load collection config from:/collections/tmp_collection
   [junit4]   2> 129355 INFO  (coreLoadExecutor-285-thread-1-processing-n:127.0.0.1:49864_dh) [n:127.0.0.1:49864_dh c:tmp_collection s:shard2 r:core_node1 x:collection1] o.a.s.c.c.ZkStateReader path=/collections/tmp_collection configName=conf1 specified config exists in ZooKeeper
   [junit4]   2> 129355 INFO  (coreLoadExecutor-285-thread-1-processing-n:127.0.0.1:49864_dh) [n:127.0.0.1:49864_dh c:tmp_collection s:shard2 r:core_node1 x:collection1] o.a.s.r.ManagedResourceStorage Setting up ZooKeeper-based storage for the RestManager with znodeBase: /configs/conf1
   [junit4]   2> 129355 INFO  (coreLoadExecutor-285-thread-1-processing-n:127.0.0.1:49864_dh) [n:127.0.0.1:49864_dh c:tmp_collection s:shard2 r:core_node1 x:collection1] o.a.s.r.ManagedResourceStorage Configured ZooKeeperStorageIO with znodeBase: /configs/conf1
   [junit4]   2> 129355 INFO  (coreLoadExecutor-285-thread-1-processing-n:127.0.0.1:49864_dh) [n:127.0.0.1:49864_dh c:tmp_collection s:shard2 r:core_node1 x:collection1] o.a.s.r.RestManager Initializing RestManager with initArgs: {}
   [junit4]   2> 129355 INFO  (coreLoadExecutor-285-thread-1-processing-n:127.0.0.1:49864_dh) [n:127.0.0.1:49864_dh c:tmp_collection s:shard2 r:core_node1 x:collection1] o.a.s.r.ManagedResourceStorage Reading _rest_managed.json using ZooKeeperStorageIO:path=/configs/conf1
   [junit4]   2> 129356 INFO  (coreLoadExecutor-285-thread-1-processing-n:127.0.0.1:49864_dh) [n:127.0.0.1:49864_dh c:tmp_collection s:shard2 r:core_node1 x:collection1] o.a.s.r.ManagedResourceStorage No data found for znode /configs/conf1/_rest_managed.json
   [junit4]   2> 129356 INFO  (coreLoadExecutor-285-thread-1-processing-n:127.0.0.1:49864_dh) [n:127.0.0.1:49864_dh c:tmp_collection s:shard2 r:core_node1 x:collection1] o.a.s.r.ManagedResourceStorage Loaded null at path _rest_managed.json using ZooKeeperStorageIO:path=/configs/conf1
   [junit4]   2> 129356 INFO  (coreLoadExecutor-285-thread-1-processing-n:127.0.0.1:49864_dh) [n:127.0.0.1:49864_dh c:tmp_collection s:shard2 r:core_node1 x:collection1] o.a.s.r.RestManager Initializing 0 registered ManagedResources
   [junit4]   2> 129356 INFO  (coreLoadExecutor-285-thread-1-processing-n:127.0.0.1:49864_dh) [n:127.0.0.1:49864_dh c:tmp_collection s:shard2 r:core_node1 x:collection1] o.a.s.h.ReplicationHandler Commits will be reserved for  10000
   [junit4]   2> 129363 INFO  (coreLoadExecutor-285-thread-1-processing-n:127.0.0.1:49864_dh) [n:127.0.0.1:49864_dh c:tmp_collection s:shard2 r:core_node1 x:collection1] o.a.s.c.c.SolrZkClient makePath: /collections/tmp_collection/cdcr/state
   [junit4]   2> 129366 INFO  (coreLoadExecutor-285-thread-1-processing-n:127.0.0.1:49864_dh) [n:127.0.0.1:49864_dh c:tmp_collection s:shard2 r:core_node1 x:collection1] o.a.s.h.CdcrBufferStateManager Created znode /collections/tmp_collection/cdcr/state/buffer
   [junit4]   2> 129372 INFO  (coreLoadExecutor-285-thread-1-processing-n:127.0.0.1:49864_dh) [n:127.0.0.1:49864_dh c:tmp_collection s:shard2 r:core_node1 x:collection1] o.a.s.h.CdcrProcessStateManager Created znode /collections/tmp_collection/cdcr/state/process
   [junit4]   2> 129400 INFO  (searcherExecutor-286-thread-1-processing-n:127.0.0.1:49864_dh x:collection1 s:shard2 c:tmp_collection r:core_node1) [n:127.0.0.1:49864_dh c:tmp_collection s:shard2 r:core_node1 x:collection1] o.a.s.c.SolrCore [collection1] Registered new searcher Searcher@2122b3[collection1] main{ExitableDirectoryReader(UninvertingDirectoryReader())}
   [junit4]   2> 129400 INFO  (coreLoadExecutor-285-thread-1-processing-n:127.0.0.1:49864_dh) [n:127.0.0.1:49864_dh c:tmp_collection s:shard2 r:core_node1 x:collection1] o.a.s.u.UpdateLog Looking up max value of version field to seed version buckets
   [junit4]   2> 129400 INFO  (coreLoadExecutor-285-thread-1-processing-n:127.0.0.1:49864_dh) [n:127.0.0.1:49864_dh c:tmp_collection s:shard2 r:core_node1 x:collection1] o.a.s.u.VersionInfo Refreshing highest value of _version_ for 65536 version buckets from index
   [junit4]   2> 129400 INFO  (coreLoadExecutor-285-thread-1-processing-n:127.0.0.1:49864_dh) [n:127.0.0.1:49864_dh c:tmp_collection s:shard2 r:core_node1 x:collection1] o.a.s.u.VersionInfo No terms found for _version_, cannot seed version bucket highest value from index
   [junit4]   2> 129400 INFO  (coreLoadExecutor-285-thread-1-processing-n:127.0.0.1:49864_dh) [n:127.0.0.1:49864_dh c:tmp_collection s:shard2 r:core_node1 x:collection1] o.a.s.u.UpdateLog Could not find max version in index or recent updates, using new clock 1507934876679012352
   [junit4]   2> 129401 INFO  (coreLoadExecutor-285-thread-1-processing-n:127.0.0.1:49864_dh) [n:127.0.0.1:49864_dh c:tmp_collection s:shard2 r:core_node1 x:collection1] o.a.s.u.UpdateLog Took 1 ms to seed version buckets with highest version 1507934876679012352
   [junit4]   2> 129402 INFO  (coreLoadExecutor-285-thread-1-processing-n:127.0.0.1:49864_dh) [n:127.0.0.1:49864_dh c:tmp_collection s:shard2 r:core_node1 x:collection1] o.a.s.c.ZkController watch zkdir /configs/conf1
   [junit4]   2> 129402 INFO  (coreLoadExecutor-285-thread-1-processing-n:127.0.0.1:49864_dh) [n:127.0.0.1:49864_dh c:tmp_collection s:shard2 r:core_node1 x:collection1] o.a.s.c.CoreContainer registering core: collection1
   [junit4]   2> 129404 INFO  (coreZkRegister-279-thread-1-processing-n:127.0.0.1:49864_dh x:collection1 s:shard2 c:tmp_collection r:core_node1) [n:127.0.0.1:49864_dh c:tmp_collection s:shard2 r:core_node1 x:collection1] o.a.s.c.ZkController Register replica - core:collection1 address:http://127.0.0.1:49864/dh collection:tmp_collection shard:shard2
   [junit4]   2> 129405 INFO  (coreZkRegister-279-thread-1-processing-n:127.0.0.1:49864_dh x:collection1 s:shard2 c:tmp_collection r:core_node1) [n:127.0.0.1:49864_dh c:tmp_collection s:shard2 r:core_node1 x:collection1] o.a.s.c.c.SolrZkClient makePath: /collections/tmp_collection/leader_elect/shard2/election
   [junit4]   2> 129409 INFO  (coreZkRegister-279-thread-1-processing-n:127.0.0.1:49864_dh x:collection1 s:shard2 c:tmp_collection r:core_node1) [n:127.0.0.1:49864_dh c:tmp_collection s:shard2 r:core_node1 x:collection1] o.a.s.c.LeaderElector Joined leadership election with path: /collections/tmp_collection/leader_elect/shard2/election/94245929647931396-core_node1-n_0000000000
   [junit4]   2> 129409 INFO  (coreZkRegister-279-thread-1-processing-n:127.0.0.1:49864_dh x:collection1 s:shard2 c:tmp_collection r:core_node1) [n:127.0.0.1:49864_dh c:tmp_collection s:shard2 r:core_node1 x:collection1] o.a.s.c.ShardLeaderElectionContext Running the leader process for shard shard2
   [junit4]   2> 129411 INFO  (zkCallback-92-thread-1-processing-n:127.0.0.1:49864_dh) [n:127.0.0.1:49864_dh    ] o.a.s.c.DistributedQueue NodeChildrenChanged fired on path /overseer/queue state SyncConnected
   [junit4]   2> 129411 INFO  (coreZkRegister-279-thread-1-processing-n:127.0.0.1:49864_dh x:collection1 s:shard2 c:tmp_collection r:core_node1) [n:127.0.0.1:49864_dh c:tmp_collection s:shard2 r:core_node1 x:collection1] o.a.s.c.ShardLeaderElectionContext Enough replicas found to continue.
   [junit4]   2> 129411 INFO  (coreZkRegister-279-thread-1-processing-n:127.0.0.1:49864_dh x:collection1 s:shard2 c:tmp_collection r:core_node1) [n:127.0.0.1:49864_dh c:tmp_collection s:shard2 r:core_node1 x:collection1] o.a.s.c.ShardLeaderElectionContext I may be the new leader - try and sync
   [junit4]   2> 129411 INFO  (coreZkRegister-279-thread-1-processing-n:127.0.0.1:49864_dh x:collection1 s:shard2 c:tmp_collection r:core_node1) [n:127.0.0.1:49864_dh c:tmp_collection s:shard2 r:core_node1 x:collection1] o.a.s.c.SyncStrategy Sync replicas to http://127.0.0.1:49864/dh/collection1/
   [junit4]   2> 129411 INFO  (coreZkRegister-279-thread-1-processing-n:127.0.0.1:49864_dh x:collection1 s:shard2 c:tmp_collection r:core_node1) [n:127.0.0.1:49864_dh c:tmp_collection s:shard2 r:core_node1 x:collection1] o.a.s.c.SyncStrategy Sync Success - now sync replicas to me
   [junit4]   2> 129411 INFO  (coreZkRegister-279-thread-1-processing-n:127.0.0.1:49864_dh x:collection1 s:shard2 c:tmp_collection r:core_node1) [n:127.0.0.1:49864_dh c:tmp_collection s:shard2 r:core_node1 x:collection1] o.a.s.c.SyncStrategy http://127.0.0.1:49864/dh/collection1/ has no replicas
   [junit4]   2> 129411 INFO  (coreZkRegister-279-thread-1-processing-n:127.0.0.1:49864_dh x:collection1 s:shard2 c:tmp_collection r:core_node1) [n:127.0.0.1:49864_dh c:tmp_collection s:shard2 r:core_node1 x:collection1] o.a.s.c.ShardLeaderElectionContext I am the new leader: http://127.0.0.1:49864/dh/collection1/ shard2
   [junit4]   2> 129412 INFO  (coreZkRegister-279-thread-1-processing-n:127.0.0.1:49864_dh x:collection1 s:shard2 c:tmp_collection r:core_node1) [n:127.0.0.1:49864_dh c:tmp_collection s:shard2 r:core_node1 x:collection1] o.a.s.c.c.SolrZkClient makePath: /collections/tmp_collection/leaders/shard2
   [junit4]   2> 129414 INFO  (OverseerStateUpdate-94245929647931396-127.0.0.1:49864_dh-n_0000000000) [n:127.0.0.1:49864_dh    ] o.a.s.c.Overseer processMessage: queueSize: 1, message = {
   [junit4]   2>   "operation":"leader",
   [junit4]   2>   "shard":"shard2",
   [junit4]   2>   "collection":"tmp_collection"} current state version: 1
   [junit4]   2> 129416 INFO  (zkCallback-92-thread-1-processing-n:127.0.0.1:49864_dh) [n:127.0.0.1:49864_dh    ] o.a.s.h.CdcrProcessStateManager Received new leader state @ tmp_collection:shard2
   [junit4]   2> 129420 INFO  (zkCallback-92-thread-1-processing-n:127.0.0.1:49864_dh) [n:127.0.0.1:49864_dh    ] o.a.s.c.DistributedQueue NodeChildrenChanged fired on path /overseer/queue state SyncConnected
   [junit4]   2> 129420 INFO  (OverseerStateUpdate-94245929647931396-127.0.0.1:49864_dh-n_0000000000) [n:127.0.0.1:49864_dh    ] o.a.s.c.Overseer processMessage: queueSize: 1, message = {
   [junit4]   2>   "operation":"leader",
   [junit4]   2>   "shard":"shard2",
   [junit4]   2>   "collection":"tmp_collection",
   [junit4]   2>   "base_url":"http://127.0.0.1:49864/dh",
   [junit4]   2>   "core":"collection1",
   [junit4]   2>   "state":"active"} current state version: 1
   [junit4]   2> 129531 INFO  (zkCallback-92-thread-1-processing-n:127.0.0.1:49864_dh) [n:127.0.0.1:49864_dh    ] o.a.s.c.c.ZkStateReader A cluster state change: WatchedEvent state:SyncConnected type:NodeDataChanged path:/clusterstate.json, has occurred - updating... (live nodes size: 1)
   [junit4]   2> 129534 INFO  (zkCallback-92-thread-1-processing-n:127.0.0.1:49864_dh) [n:127.0.0.1:49864_dh    ] o.a.s.c.c.ZkStateReader Updated cluster state version to 2
   [junit4]   2> 129584 INFO  (coreZkRegister-279-thread-1-processing-n:127.0.0.1:49864_dh x:collection1 s:shard2 c:tmp_collection r:core_node1) [n:127.0.0.1:49864_dh c:tmp_collection s:shard2 r:core_node1 x:collection1] o.a.s.c.ZkController We are http://127.0.0.1:49864/dh/collection1/ and leader is http://127.0.0.1:49864/dh/collection1/
   [junit4]   2> 129584 INFO  (coreZkRegister-279-thread-1-processing-n:127.0.0.1:49864_dh x:collection1 s:shard2 c:tmp_collection r:core_node1) [n:127.0.0.1:49864_dh c:tmp_collection s:shard2 r:core_node1 x:collection1] o.a.s.c.ZkController No LogReplay needed for core=collection1 baseURL=http://127.0.0.1:49864/dh
   [junit4]   2> 129584 INFO  (coreZkRegister-279-thread-1-processing-n:127.0.0.1:49864_dh x:collection1 s:shard2 c:tmp_collection r:core_node1) [n:127.0.0.1:49864_dh c:tmp_collection s:shard2 r:core_node1 x:collection1] o.a.s.c.ZkController I am the leader, no recovery necessary
   [junit4]   2> 129584 INFO  (coreZkRegister-279-thread-1-processing-n:127.0.0.1:49864_dh x:collection1 s:shard2 c:tmp_collection r:core_node1) [n:127.0.0.1:49864_dh c:tmp_collection s:shard2 r:core_node1 x:collection1] o.a.s.c.ZkController publishing state=active
   [junit4]   2> 129584 INFO  (coreZkRegister-279-thread-1-processing-n:127.0.0.1:49864_dh x:collection1 s:shard2 c:tmp_collection r:core_node1) [n:127.0.0.1:49864_dh c:tmp_collection s:shard2 r:core_node1 x:collection1] o.a.s.c.ZkController numShards not found on descriptor - reading it from system property
   [junit4]   2> 129586 INFO  (zkCallback-92-thread-1-processing-n:127.0.0.1:49864_dh) [n:127.0.0.1:49864_dh    ] o.a.s.c.DistributedQueue NodeChildrenChanged fired on path /overseer/queue state SyncConnected
   [junit4]   2> 129587 INFO  (OverseerStateUpdate-94245929647931396-127.0.0.1:49864_dh-n_0000000000) [n:127.0.0.1:49864_dh    ] o.a.s.c.Overseer processMessage: queueSize: 1, message = {
   [junit4]   2>   "core":"collection1",
   [junit4]   2>   "core_node_name":"core_node1",
   [junit4]   2>   "roles":null,
   [junit4]   2>   "base_url":"http://127.0.0.1:49864/dh",
   [junit4]   2>   "node_name":"127.0.0.1:49864_dh",
   [junit4]   2>   "numShards":"2",
   [junit4]   2>   "state":"active",
   [junit4]   2>   "shard":"shard2",
   [junit4]   2>   "collection":"tmp_collection",
   [junit4]   2>   "operation":"state"} current state version: 2
   [junit4]   2> 129587 INFO  (OverseerStateUpdate-94245929647931396-127.0.0.1:49864_dh-n_0000000000) [n:127.0.0.1:49864_dh    ] o.a.s.c.o.ReplicaMutator Update state numShards=2 message={
   [junit4]   2>   "core":"collection1",
   [junit4]   2>   "core_node_name":"core_node1",
   [junit4]   2>   "roles":null,
   [junit4]   2>   "base_url":"http://127.0.0.1:49864/dh",
   [junit4]   2>   "node_name":"127.0.0.1:49864_dh",
   [junit4]   2>   "numShards":"2",
   [junit4]   2>   "state":"active",
   [junit4]   2>   "shard":"shard2",
   [junit4]   2>   "collection":"tmp_collection",
   [junit4]   2>   "operation":"state"}
   [junit4]   2> 129701 INFO  (zkCallback-92-thread-1-processing-n:127.0.0.1:49864_dh) [n:127.0.0.1:49864_dh    ] o.a.s.c.c.ZkStateReader A cluster state change: WatchedEvent state:SyncConnected type:NodeDataChanged path:/clusterstate.json, has occurred - updating... (live nodes size: 1)
   [junit4]   2> 129703 INFO  (zkCallback-92-thread-1-processing-n:127.0.0.1:49864_dh) [n:127.0.0.1:49864_dh    ] o.a.s.c.c.ZkStateReader Updated cluster state version to 3
   [junit4]   2> 129888 INFO  (TEST-CdcrRequestHandlerTest.doTest-seed#[B13C768832EBB8DC]) [    ] o.a.s.SolrTestCaseJ4 Writing core.properties file to C:\Users\JenkinsSlave\workspace\Lucene-Solr-trunk-Windows\solr\build\solr-core\test\J1\temp\solr.cloud.CdcrRequestHandlerTest_B13C768832EBB8DC-001\jetty-002\cores\collection1
   [junit4]   2> 129890 INFO  (TEST-CdcrRequestHandlerTest.doTest-seed#[B13C768832EBB8DC]) [    ] o.e.j.s.Server jetty-9.2.11.v20150529
   [junit4]   2> 129893 INFO  (TEST-CdcrRequestHandlerTest.doTest-seed#[B13C768832EBB8DC]) [    ] o.e.j.s.h.ContextHandler Started o.e.j.s.ServletContextHandler@62ad4d{/dh,null,AVAILABLE}
   [junit4]   2> 129894 INFO  (TEST-CdcrRequestHandlerTest.doTest-seed#[B13C768832EBB8DC]) [    ] o.e.j.s.ServerConnector Started ServerConnector@1b35ddb{HTTP/1.1}{127.0.0.1:49888}
   [junit4]   2> 129894 INFO  (TEST-CdcrRequestHandlerTest.doTest-seed#[B13C768832EBB8DC]) [    ] o.e.j.s.Server Started @133908ms
   [junit4]   2> 129894 INFO  (TEST-CdcrRequestHandlerTest.doTest-seed#[B13C768832EBB8DC]) [    ] o.a.s.c.s.e.JettySolrRunner Jetty properties: {shards=shard2, hostContext=/dh, hostPort=49888, coreRootDirectory=C:\Users\JenkinsSlave\workspace\Lucene-Solr-trunk-Windows\solr\build\solr-core\test\J1\temp\solr.cloud.CdcrRequestHandlerTest_B13C768832EBB8DC-001\jetty-002\cores}
   [junit4]   2> 129894 INFO  (TEST-CdcrRequestHandlerTest.doTest-seed#[B13C768832EBB8DC]) [    ] o.a.s.s.SolrDispatchFilter SolrDispatchFilter.init(): sun.misc.Launcher$AppClassLoader@e2f2a
   [junit4]   2> 129894 INFO  (TEST-CdcrRequestHandlerTest.doTest-seed#[B13C768832EBB8DC]) [    ] o.a.s.c.SolrResourceLoader new SolrResourceLoader for directory: 'C:\Users\JenkinsSlave\workspace\Lucene-Solr-trunk-Windows\solr\build\solr-core\test\J1\temp\solr.cloud.CdcrRequestHandlerTest_B13C768832EBB8DC-001\jetty-002\'
   [junit4]   2> 129920 INFO  (TEST-CdcrRequestHandlerTest.doTest-seed#[B13C768832EBB8DC]) [    ] o.a.s.c.c.SolrZkClient Using default ZkCredentialsProvider
   [junit4]   2> 129922 INFO  (TEST-CdcrRequestHandlerTest.doTest-seed#[B13C768832EBB8DC]) [    ] o.a.s.c.c.ConnectionManager Waiting for client to connect to ZooKeeper
   [junit4]   2> 129923 INFO  (zkCallback-93-thread-1) [    ] o.a.s.c.c.ConnectionManager Watcher org.apache.solr.common.cloud.ConnectionManager@110b44 name:ZooKeeperConnection Watcher:127.0.0.1:49856/solr got event WatchedEvent state:SyncConnected type:None path:null path:null type:None
   [junit4]   2> 129923 INFO  (TEST-CdcrRequestHandlerTest.doTest-seed#[B13C768832EBB8DC]) [    ] o.a.s.c.c.ConnectionManager Client is connected to ZooKeeper
   [junit4]   2> 129924 INFO  (TEST-CdcrRequestHandlerTest.doTest-seed#[B13C768832EBB8DC]) [    ] o.a.s.c.c.SolrZkClient Using default ZkACLProvider
   [junit4]   2> 129925 INFO  (TEST-CdcrRequestHandlerTest.doTest-seed#[B13C768832EBB8DC]) [    ] o.a.s.s.SolrDispatchFilter Loading solr.xml from SolrHome (not found in ZooKeeper)
   [junit4]   2> 129925 INFO  (TEST-CdcrRequestHandlerTest.doTest-seed#[B13C768832EBB8DC]) [    ] o.a.s.c.SolrXmlConfig Loading container configuration from C:\Users\JenkinsSlave\workspace\Lucene-Solr-trunk-Windows\solr\build\solr-core\test\J1\temp\solr.cloud.CdcrRequestHandlerTest_B13C768832EBB8DC-001\jetty-002\solr.xml
   [junit4]   2> 129933 INFO  (TEST-CdcrRequestHandlerTest.doTest-seed#[B13C768832EBB8DC]) [    ] o.a.s.c.CoresLocator Config-defined core root directory: C:\Users\JenkinsSlave\workspace\Lucene-Solr-trunk-Windows\solr\build\solr-core\test\J1\temp\solr.cloud.CdcrRequestHandlerTest_B13C768832EBB8DC-001\jetty-002\cores
   [junit4]   2> 129934 INFO  (TEST-CdcrRequestHandlerTest.doTest-seed#[B13C768832EBB8DC]) [    ] o.a.s.c.CoreContainer New CoreContainer 10428383
   [junit4]   2> 129934 INFO  (TEST-CdcrRequestHandlerTest.doTest-seed#[B13C768832EBB8DC]) [    ] o.a.s.c.CoreContainer Loading cores into CoreContainer [instanceDir=C:\Users\JenkinsSlave\workspace\Lucene-Solr-trunk-Windows\solr\build\solr-core\test\J1\temp\solr.cloud.CdcrRequestHandlerTest_B13C768832EBB8DC-001\jetty-002\]
   [junit4]   2> 129934 INFO  (TEST-CdcrRequestHandlerTest.doTest-seed#[B13C768832EBB8DC]) [    ] o.a.s.c.CoreContainer loading shared library: C:\Users\JenkinsSlave\workspace\Lucene-Solr-trunk-Windows\solr\build\solr-core\test\J1\temp\solr.cloud.CdcrRequestHandlerTest_B13C768832EBB8DC-001\jetty-002\lib
   [junit4]   2> 129934 WARN  (TEST-CdcrRequestHandlerTest.doTest-seed#[B13C768832EBB8DC]) [    ] o.a.s.c.SolrResourceLoader Can't find (or read) directory to add to classloader: lib (resolved as: C:\Users\JenkinsSlave\workspace\Lucene-Solr-trunk-Windows\solr\build\solr-core\test\J1\temp\solr.cloud.CdcrRequestHandlerTest_B13C768832EBB8DC-001\jetty-002\lib).
   [junit4]   2> 129945 INFO  (TEST-CdcrRequestHandlerTest.doTest-seed#[B13C768832EBB8DC]) [    ] o.a.s.h.c.HttpShardHandlerFactory created with socketTimeout : 90000,urlScheme : ,connTimeout : 15000,maxConnectionsPerHost : 20,maxConnections : 10000,corePoolSize : 0,maximumPoolSize : 2147483647,maxThreadIdleTime : 5,sizeOfQueue : -1,fairnessPolicy : false,useRetries : false,
   [junit4]   2> 129948 INFO  (TEST-CdcrRequestHandlerTest.doTest-seed#[B13C768832EBB8DC]) [    ] o.a.s.u.UpdateShardHandler Creating UpdateShardHandler HTTP client with params: socketTimeout=340000&connTimeout=45000&retry=true
   [junit4]   2> 129949 INFO  (TEST-CdcrRequestHandlerTest.doTest-seed#[B13C768832EBB8DC]) [    ] o.a.s.l.LogWatcher SLF4J impl is org.slf4j.impl.Log4jLoggerFactory
   [junit4]   2> 129949 INFO  (TEST-CdcrRequestHandlerTest.doTest-seed#[B13C768832EBB8DC]) [    ] o.a.s.l.LogWatcher Registering Log Listener [Log4j (org.slf4j.impl.Log4jLoggerFactory)]
   [junit4]   2> 129949 INFO  (TEST-CdcrRequestHandlerTest.doTest-seed#[B13C768832EBB8DC]) [    ] o.a.s.c.ZkContainer Zookeeper client=127.0.0.1:49856/solr
   [junit4]   2> 129949 INFO  (TEST-CdcrRequestHandlerTest.doTest-seed#[B13C768832EBB8DC]) [    ] o.a.s.c.ZkController zkHost includes chroot
   [junit4]   2> 129949 INFO  (TEST-CdcrRequestHandlerTest.doTest-seed#[B13C768832EBB8DC]) [    ] o.a.s.c.c.SolrZkClient Using default ZkCredentialsProvider
   [junit4]   2> 129950 INFO  (TEST-CdcrRequestHandlerTest.doTest-seed#[B13C768832EBB8DC]) [    ] o.a.s.c.c.ConnectionManager Waiting for client to connect to ZooKeeper
   [junit4]   2> 129951 INFO  (zkCallback-95-thread-1) [    ] o.a.s.c.c.ConnectionManager Watcher org.apache.solr.common.cloud.ConnectionManager@1f560b6 name:ZooKeeperConnection Watcher:127.0.0.1:49856 got event WatchedEvent state:SyncConnected type:None path:null path:null type:None
   [junit4]   2> 129952 INFO  (TEST-CdcrRequestHandlerTest.doTest-seed#[B13C768832EBB8DC]) [    ] o.a.s.c.c.ConnectionManager Client is connected to ZooKeeper
   [junit4]   2> 129952 INFO  (TEST-CdcrRequestHandlerTest.doTest-seed#[B13C768832EBB8DC]) [    ] o.a.s.c.c.SolrZkClient Using default ZkACLProvider
   [junit4]   2> 129958 INFO  (TEST-CdcrRequestHandlerTest.doTest-seed#[B13C768832EBB8DC]) [n:127.0.0.1:49888_dh    ] o.a.s.c.c.ConnectionManager Waiting for client to connect to ZooKeeper
   [junit4]   2> 129960 INFO  (zkCallback-96-thread-1-processing-n:127.0.0.1:49888_dh) [n:127.0.0.1:49888_dh    ] o.a.s.c.c.ConnectionManager Watcher org.apache.solr.common.cloud.ConnectionManager@358be4 name:ZooKeeperConnection Watcher:127.0.0.1:49856/solr got event WatchedEvent state:SyncConnected type:None path:null path:null type:None
   [junit4]   2> 129960 INFO  (TEST-CdcrRequestHandlerTest.doTest-seed#[B13C768832EBB8DC]) [n:127.0.0.1:49888_dh    ] o.a.s.c.c.ConnectionManager Client is connected to ZooKeeper
   [junit4]   2> 129965 INFO  (TEST-CdcrRequestHandlerTest.doTest-seed#[B13C768832EBB8DC]) [n:127.0.0.1:49888_dh    ] o.a.s.c.c.ZkStateReader Updating cluster state from ZooKeeper... 
   [junit4]   2> 131016 INFO  (TEST-CdcrRequestHandlerTest.doTest-seed#[B13C768832EBB8DC]) [n:127.0.0.1:49888_dh    ] o.a.s.c.ZkController Register node as live in ZooKeeper:/live_nodes/127.0.0.1:49888_dh
   [junit4]   2> 131017 INFO  (TEST-CdcrRequestHandlerTest.doTest-seed#[B13C768832EBB8DC]) [n:127.0.0.1:49888_dh    ] o.a.s.c.c.SolrZkClient makePath: /live_nodes/127.0.0.1:49888_dh
   [junit4]   2> 131020 INFO  (TEST-CdcrRequestHandlerTest.doTest-seed#[B13C768832EBB8DC]) [n:127.0.0.1:49888_dh    ] o.a.s.c.Overseer Overseer (id=null) closing
   [junit4]   2> 131021 INFO  (TEST-CdcrRequestHandlerTest.doTest-seed#[B13C768832EBB8DC]) [n:127.0.0.1:49888_dh    ] o.a.s.c.LeaderElector Joined leadership election with path: /overseer_elect/election/94245929647931399-127.0.0.1:49888_dh-n_0000000001
   [junit4]   2> 131021 INFO  (TEST-CdcrRequestHandlerTest.doTest-seed#[B13C768832EBB8DC]) [n:127.0.0.1:49888_dh    ] o.a.s.c.LeaderElector Watching path /overseer_elect/election/94245929647931396-127.0.0.1:49864_dh-n_0000000000 to know if I could be the leader
   [junit4]   2> 131022 INFO  (TEST-CdcrRequestHandlerTest.doTest-seed#[B13C768832EBB8DC]) [n:127.0.0.1:49888_dh    ] o.a.s.c.CoreContainer No authentication plugin used.
   [junit4]   2> 131023 INFO  (TEST-CdcrRequestHandlerTest.doTest-seed#[B13C768832EBB8DC]) [n:127.0.0.1:49888_dh    ] o.a.s.c.CoreContainer Security conf doesn't exist. Skipping setup for authorization module.
   [junit4]   2> 131023 INFO  (TEST-CdcrRequestHandlerTest.doTest-seed#[B13C768832EBB8DC]) [n:127.0.0.1:49888_dh    ] o.a.s.c.CoresLocator Looking for core definitions underneath C:\Users\JenkinsSlave\workspace\Lucene-Solr-trunk-Windows\solr\build\solr-core\test\J1\temp\solr.cloud.CdcrRequestHandlerTest_B13C768832EBB8DC-001\jetty-002\cores
   [junit4]   2> 131025 INFO  (TEST-CdcrRequestHandlerTest.doTest-seed#[B13C768832EBB8DC]) [n:127.0.0.1:49888_dh    ] o.a.s.c.SolrCore Created CoreDescriptor: {name=collection1, config=solrconfig.xml, transient=false, schema=schema.xml, loadOnStartup=true, configSetProperties=configsetprops.json, instanceDir=C:\Users\JenkinsSlave\workspace\Lucene-Solr-trunk-Windows\solr\build\solr-core\test\J1\temp\solr.cloud.CdcrRequestHandlerTest_B13C768832EBB8DC-001\jetty-002\cores\collection1, collection=tmp_collection, absoluteInstDir=C:\Users\JenkinsSlave\workspace\Lucene-Solr-trunk-Windows\solr\build\solr-core\test\J1\temp\solr.cloud.CdcrRequestHandlerTest_B13C768832EBB8DC-001\jetty-002\cores\collection1\, coreNodeName=, dataDir=data\, shard=}
   [junit4]   2> 131025 INFO  (TEST-CdcrRequestHandlerTest.doTest-seed#[B13C768832EBB8DC]) [n:127.0.0.1:49888_dh    ] o.a.s.c.CoresLocator Found core collection1 in C:\Users\JenkinsSlave\workspace\Lucene-Solr-trunk-Windows\solr\build\solr-core\test\J1\temp\solr.cloud.CdcrRequestHandlerTest_B13C768832EBB8DC-001\jetty-002\cores\collection1\
   [junit4]   2> 131025 INFO  (TEST-CdcrRequestHandlerTest.doTest-seed#[B13C768832EBB8DC]) [n:127.0.0.1:49888_dh    ] o.a.s.c.CoresLocator Found 1 core definitions
   [junit4]   2> 131027 INFO  (coreLoadExecutor-297-thread-1-processing-n:127.0.0.1:49888_dh) [n:127.0.0.1:49888_dh c:tmp_collection   x:collection1] o.a.s.c.ZkController publishing state=down
   [junit4]   2> 131027 INFO  (coreLoadExecutor-297-thread-1-processing-n:127.0.0.1:49888_dh) [n:127.0.0.1:49888_dh c:tmp_collection   x:collection1] o.a.s.c.ZkController numShards not found on descriptor - reading it from system property
   [junit4]   2> 131027 INFO  (TEST-CdcrRequestHandlerTest.doTest-seed#[B13C768832EBB8DC]) [n:127.0.0.1:49888_dh    ] o.a.s.s.SolrDispatchFilter user.dir=C:\Users\JenkinsSlave\workspace\Lucene-Solr-trunk-Windows\solr\build\solr-core\test\J1
   [junit4]   2> 131027 INFO  (TEST-CdcrRequestHandlerTest.doTest-seed#[B13C768832EBB8DC]) [n:127.0.0.1:49888_dh    ] o.a.s.s.SolrDispatchFilter SolrDispatchFilter.init() done
   [junit4]   2> 131028 INFO  (coreLoadExecutor-297-thread-1-processing-n:127.0.0.1:49888_dh) [n:127.0.0.1:49888_dh c:tmp_collection   x:collection1] o.a.s.c.ZkController look for our core node name
   [junit4]   2> 131028 INFO  (zkCallback-92-thread-1-processing-n:127.0.0.1:49864_dh) [n:127.0.0.1:49864_dh    ] o.a.s.c.DistributedQueue NodeChildrenChanged fired on path /overseer/queue state SyncConnected
   [junit4]   2> 131028 INFO  (OverseerStateUpdate-94245929647931396-127.0.0.1:49864_dh-n_0000000000) [n:127.0.0.1:49864_dh    ] o.a.s.c.Overseer processMessage: queueSize: 1, message = {
   [junit4]   2>   "core":"collection1",
   [junit4]   2>   "roles":null,
   [junit4]   2>   "base_url":"http://127.0.0.1:49888/dh",
   [junit4]   2>   "node_name":"127.0.0.1:49888_dh",
   [junit4]   2>   "numShards":"2",
   [junit4]   2>   "state":"down",
   [junit4]   2>   "shard":null,
   [junit4]   2>   "collection":"tmp_collection",
   [junit4]   2>   "operation":"state"} current state version: 3
   [junit4]   2> 131029 INFO  (OverseerStateUpdate-94245929647931396-127.0.0.1:49864_dh-n_0000000000) [n:127.0.0.1:49864_dh    ] o.a.s.c.o.ReplicaMutator Update state numShards=2 message={
   [junit4]   2>   "core":"collection1",
   [junit4]   2>   "roles":null,
   [junit4]   2>   "base_url":"http://127.0.0.1:49888/dh",
   [junit4]   2>   "node_name":"127.0.0.1:49888_dh",
   [junit4]   2>   "numShards":"2",
   [junit4]   2>   "state":"down",
   [junit4]   2>   "shard":null,
   [junit4]   2>   "collection":"tmp_collection",
   [junit4]   2>   "operation":"state"}
   [junit4]   2> 131029 INFO  (OverseerStateUpdate-94245929647931396-127.0.0.1:49864_dh-n_0000000000) [n:127.0.0.1:49864_dh    ] o.a.s.c.o.ReplicaMutator Collection already exists with numShards=2
   [junit4]   2> 131029 INFO  (OverseerStateUpdate-94245929647931396-127.0.0.1:49864_dh-n_0000000000) [n:127.0.0.1:49864_dh    ] o.a.s.c.o.ReplicaMutator Assigning new node to shard shard=shard1
   [junit4]   2> 131131 INFO  (zkCallback-92-thread-1-processing-n:127.0.0.1:49864_dh) [n:127.0.0.1:49864_dh    ] o.a.s.c.c.ZkStateReader A cluster state change: WatchedEvent state:SyncConnected type:NodeDataChanged path:/clusterstate.json, has occurred - updating... (live nodes size: 2)
   [junit4]   2> 131131 INFO  (zkCallback-96-thread-1-processing-n:127.0.0.1:49888_dh) [n:127.0.0.1:49888_dh    ] o.a.s.c.c.ZkStateReader A cluster state change: WatchedEvent state:SyncConnected type:NodeDataChanged path:/clusterstate.json, has occurred - updating... (live nodes size: 2)
   [junit4]   2> 131135 INFO  (zkCallback-92-thread-1-processing-n:127.0.0.1:49864_dh) [n:127.0.0.1:49864_dh    ] o.a.s.c.c.ZkStateReader Updated cluster state version to 4
   [junit4]   2> 131135 INFO  (zkCallback-96-thread-1-processing-n:127.0.0.1:49888_dh) [n:127.0.0.1:49888_dh    ] o.a.s.c.c.ZkStateReader Updated cluster state version to 4
   [junit4]   2> 132028 INFO  (coreLoadExecutor-297-thread-1-processing-n:127.0.0.1:49888_dh) [n:127.0.0.1:49888_dh c:tmp_collection   x:collection1] o.a.s.c.ZkController waiting to find shard id in clusterstate for collection1
   [junit4]   2> 132028 INFO  (coreLoadExecutor-297-thread-1-processing-n:127.0.0.1:49888_dh) [n:127.0.0.1:49888_dh c:tmp_collection   x:collection1] o.a.s.c.ZkController Check for collection zkNode:tmp_collection
   [junit4]   2> 132029 INFO  (coreLoadExecutor-297-thread-1-processing-n:127.0.0.1:49888_dh) [n:127.0.0.1:49888_dh c:tmp_collection   x:collection1] o.a.s.c.ZkController Collection zkNode exists
   [junit4]   2> 132029 INFO  (coreLoadExecutor-297-thread-1-processing-n:127.0.0.1:49888_dh) [n:127.0.0.1:49888_dh c:tmp_collection   x:collection1] o.a.s.c.c.ZkStateReader Load collection config from:/collections/tmp_collection
   [junit4]   2> 132030 INFO  (coreLoadExecutor-297-thread-1-processing-n:127.0.0.1:49888_dh) [n:127.0.0.1:49888_dh c:tmp_collection   x:collection1] o.a.s.c.c.ZkStateReader path=/collections/tmp_collection configName=conf1 specified config exists in ZooKeeper
   [junit4]   2> 132030 INFO  (coreLoadExecutor-297-thread-1-processing-n:127.0.0.1:49888_dh) [n:127.0.0.1:49888_dh c:tmp_collection   x:collection1] o.a.s.c.SolrResourceLoader new SolrResourceLoader for directory: 'C:\Users\JenkinsSlave\workspace\Lucene-Solr-trunk-Windows\solr\build\solr-core\test\J1\temp\solr.cloud.CdcrRequestHandlerTest_B13C768832EBB8DC-001\jetty-002\cores\collection1\'
   [junit4]   2> 132041 INFO  (coreLoadExecutor-297-thread-1-processing-n:127.0.0.1:49888_dh) [n:127.0.0.1:49888_dh c:tmp_collection   x:collection1] o.a.s.c.Config loaded config solrconfig.xml with version 0 
   [junit4]   2> 132048 INFO  (coreLoadExecutor-297-thread-1-processing-n:127.0.0.1:49888_dh) [n:127.0.0.1:49888_dh c:tmp_collection   x:collection1] o.a.s.c.SolrConfig current version of requestparams : -1
   [junit4]   2> 132050 INFO  (coreLoadExecutor-297-thread-1-processing-n:127.0.0.1:49888_dh) [n:127.0.0.1:49888_dh c:tmp_collection   x:collection1] o.a.s.c.SolrConfig Using Lucene MatchVersion: 6.0.0
   [junit4]   2> 132060 INFO  (coreLoadExecutor-297-thread-1-processing-n:127.0.0.1:49888_dh) [n:127.0.0.1:49888_dh c:tmp_collection   x:collection1] o.a.s.c.Config Loaded SolrConfig: solrconfig.xml
   [junit4]   2> 132062 INFO  (coreLoadExecutor-297-thread-1-processing-n:127.0.0.1:49888_dh) [n:127.0.0.1:49888_dh c:tmp_collection   x:collection1] o.a.s.s.IndexSchema Reading Solr Schema from /configs/conf1/schema.xml
   [junit4]   2> 132066 INFO  (coreLoadExecutor-297-thread-1-processing-n:127.0.0.1:49888_dh) [n:127.0.0.1:49888_dh c:tmp_collection   x:collection1] o.a.s.s.IndexSchema [collection1] Schema name=test
   [junit4]   2> 132123 INFO  (coreLoadExecutor-297-thread-1-processing-n:127.0.0.1:49888_dh) [n:127.0.0.1:49888_dh c:tmp_collection   x:collection1] o.a.s.s.IndexSchema default search field in schema is text
   [junit4]   2> 132124 INFO  (coreLoadExecutor-297-thread-1-processing-n:127.0.0.1:49888_dh) [n:127.0.0.1:49888_dh c:tmp_collection   x:collection1] o.a.s.s.IndexSchema unique key field: id
   [junit4]   2> 132124 INFO  (coreLoadExecutor-297-thread-1-processing-n:127.0.0.1:49888_dh) [n:127.0.0.1:49888_dh c:tmp_collection   x:collection1] o.a.s.s.FileExchangeRateProvider Reloading exchange rates from file currency.xml
   [junit4]   2> 132132 INFO  (coreLoadExecutor-297-thread-1-processing-n:127.0.0.1:49888_dh) [n:127.0.0.1:49888_dh c:tmp_collection   x:collection1] o.a.s.s.FileExchangeRateProvider Reloading exchange rates from file currency.xml
   [junit4]   2> 132150 INFO  (coreLoadExecutor-297-thread-1-processing-n:127.0.0.1:49888_dh) [n:127.0.0.1:49888_dh c:tmp_collection   x:collection1] o.a.s.c.ConfigSetProperties Did not find ConfigSet properties, assuming default properties: Can't find resource 'configsetprops.json' in classpath or '/configs/conf1', cwd=C:\Users\JenkinsSlave\workspace\Lucene-Solr-trunk-Windows\solr\build\solr-core\test\J1
   [junit4]   2> 132150 INFO  (coreLoadExecutor-297-thread-1-processing-n:127.0.0.1:49888_dh) [n:127.0.0.1:49888_dh c:tmp_collection   x:collection1] o.a.s.c.CoreContainer Creating SolrCore 'collection1' using configuration from collection tmp_collection
   [junit4]   2> 132150 INFO  (coreLoadExecutor-297-thread-1-processing-n:127.0.0.1:49888_dh) [n:127.0.0.1:49888_dh c:tmp_collection s:shard1 r:core_node2 x:collection1] o.a.s.c.SolrCore org.apache.solr.core.MockDirectoryFactory
   [junit4]   2> 132150 INFO  (coreLoadExecutor-297-thread-1-processing-n:127.0.0.1:49888_dh) [n:127.0.0.1:49888_dh c:tmp_collection s:shard1 r:core_node2 x:collection1] o.a.s.c.SolrCore [[collection1] ] Opening new SolrCore at [C:\Users\JenkinsSlave\workspace\Lucene-Solr-trunk-Windows\solr\build\solr-core\test\J1\temp\solr.cloud.CdcrRequestHandlerTest_B13C768832EBB8DC-001\jetty-002\cores\collection1\], dataDir=[null]
   [junit4]   2> 132150 INFO  (coreLoadExecutor-297-thread-1-processing-n:127.0.0.1:49888_dh) [n:127.0.0.1:49888_dh c:tmp_collection s:shard1 r:core_node2 x:collection1] o.a.s.c.JmxMonitoredMap JMX monitoring is enabled. Adding Solr mbeans to JMX Server: com.sun.jmx.mbeanserver.JmxMBeanServer@1bdf5d1
   [junit4]   2> 132151 INFO  (coreLoadExecutor-297-thread-1-processing-n:127.0.0.1:49888_dh) [n:127.0.0.1:49888_dh c:tmp_collection s:shard1 r:core_node2 x:collection1] o.a.s.c.CachingDirectoryFactory return new directory for C:\Users\JenkinsSlave\workspace\Lucene-Solr-trunk-Windows\solr\build\solr-core\test\J1\temp\solr.cloud.CdcrRequestHandlerTest_B13C768832EBB8DC-001\jetty-002\cores\collection1\data\
   [junit4]   2> 132151 INFO  (coreLoadExecutor-297-thread-1-processing-n:127.0.0.1:49888_dh) [n:127.0.0.1:49888_dh c:tmp_collection s:shard1 r:core_node2 x:collection1] o.a.s.c.SolrCore New index directory detected: old=null new=C:\Users\JenkinsSlave\workspace\Lucene-Solr-trunk-Windows\solr\build\solr-core\test\J1\temp\solr.cloud.CdcrRequestHandlerTest_B13C768832EBB8DC-001\jetty-002\cores\collection1\data\index/
   [junit4]   2> 132151 WARN  (coreLoadExecutor-297-thread-1-processing-n:127.0.0.1:49888_dh) [n:127.0.0.1:49888_dh c:tmp_collection s:shard1 r:core_node2 x:collection1] o.a.s.c.SolrCore [collection1] Solr index directory 'C:\Users\JenkinsSlave\workspace\Lucene-Solr-trunk-Windows\solr\build\solr-core\test\J1\temp\solr.cloud.CdcrRequestHandlerTest_B13C768832EBB8DC-001\jetty-002\cores\collection1\data\index' doesn't exist. Creating new index...
   [junit4]   2> 132151 INFO  (coreLoadExecutor-297-thread-1-processing-n:127.0.0.1:49888_dh) [n:127.0.0.1:49888_dh c:tmp_collection s:shard1 r:core_node2 x:collection1] o.a.s.c.CachingDirectoryFactory return new directory for C:\Users\JenkinsSlave\workspace\Lucene-Solr-trunk-Windows\solr\build\solr-core\test\J1\temp\solr.cloud.CdcrRequestHandlerTest_B13C768832EBB8DC-001\jetty-002\cores\collection1\data\index
   [junit4]   2> 132151 INFO  (coreLoadExecutor-297-thread-1-processing-n:127.0.0.1:49888_dh) [n:127.0.0.1:49888_dh c:tmp_collection s:shard1 r:core_node2 x:collection1] o.a.s.u.RandomMergePolicy RandomMergePolicy wrapping class org.apache.lucene.index.LogByteSizeMergePolicy: [LogByteSizeMergePolicy: minMergeSize=1677721, mergeFactor=42, maxMergeSize=2147483648, maxMergeSizeForForcedMerge=9223372036854775807, calibrateSizeByDeletes=false, maxMergeDocs=2147483647, maxCFSSegmentSizeMB=8.796093022207999E12, noCFSRatio=0.3686352962649537]
   [junit4]   2> 132152 INFO  (coreLoadExecutor-297-thread-1-processing-n:127.0.0.1:49888_dh) [n:127.0.0.1:49888_dh c:tmp_collection s:shard1 r:core_node2 x:collection1] o.a.s.c.SolrCore SolrDeletionPolicy.onCommit: commits: num=1
   [junit4]   2> 	commit{dir=MockDirectoryWrapper(RAMDirectory@e454bd lockFactory=org.apache.lucene.store.SingleInstanceLockFactory@250d5b),segFN=segments_1,generation=1}
   [junit4]   2> 132152 INFO  (coreLoadExecutor-297-thread-1-processing-n:127.0.0.1:49888_dh) [n:127.0.0.1:49888_dh c:tmp_collection s:shard1 r:core_node2 x:collection1] o.a.s.c.SolrCore newest commit generation = 1
   [junit4]   2> 132152 INFO  (OldIndexDirectoryCleanupThreadForCore-collection1) [n:127.0.0.1:49888_dh c:tmp_collection s:shard1 r:core_node2 x:collection1] o.a.s.c.SolrCore Looking for old index directories to cleanup for core collection1 in C:\Users\JenkinsSlave\workspace\Lucene-Solr-trunk-Windows\solr\build\solr-core\test\J1\temp\solr.cloud.CdcrRequestHandlerTest_B13C768832EBB8DC-001\jetty-002\cores\collection1\data\
   [junit4]   2> 132153 WARN  (OldIndexDirectoryCleanupThreadForCore-collection1) [n:127.0.0.1:49888_dh c:tmp_collection s:shard1 r:core_node2 x:collection1] o.a.s.c.DirectoryFactory C:\Users\JenkinsSlave\workspace\Lucene-Solr-trunk-Windows\solr\build\solr-core\test\J1\temp\solr.cloud.CdcrRequestHandlerTest_B13C768832EBB8DC-001\jetty-002\cores\collection1\data\ does not point to a valid data directory; skipping clean-up of old index directories.
   [junit4]   2> 132156 INFO  (coreLoadExecu

[...truncated too long message...]

ollectionLazy3] o.a.s.c.CachingDirectoryFactory looking to close C:\Users\JenkinsSlave\workspace\Lucene-Solr-trunk-Windows\solr\build\solr-core\test\J0\temp\solr.core.TestLazyCores_B13C768832EBB8DC-001\tempDir-007\collection3\data\index [CachedDir<<refCount=0;path=C:\Users\JenkinsSlave\workspace\Lucene-Solr-trunk-Windows\solr\build\solr-core\test\J0\temp\solr.core.TestLazyCores_B13C768832EBB8DC-001\tempDir-007\collection3\data\index;done=false>>]
   [junit4]   2> 715415 INFO  (TEST-TestLazyCores.testRace-seed#[B13C768832EBB8DC]) [    x:collectionLazy3] o.a.s.c.CachingDirectoryFactory Closing directory: C:\Users\JenkinsSlave\workspace\Lucene-Solr-trunk-Windows\solr\build\solr-core\test\J0\temp\solr.core.TestLazyCores_B13C768832EBB8DC-001\tempDir-007\collection3\data\index
   [junit4]   2> 715415 INFO  (TEST-TestLazyCores.testRace-seed#[B13C768832EBB8DC]) [    x:collectionLazy3] o.a.s.SolrTestCaseJ4 ###Ending testRace
   [junit4]   2> 715416 INFO  (SUITE-TestLazyCores-seed#[B13C768832EBB8DC]-worker) [    x:collectionLazy3] o.a.s.SolrTestCaseJ4 ###deleteCore
   [junit4]   2> 715416 INFO  (SUITE-TestLazyCores-seed#[B13C768832EBB8DC]-worker) [    x:collectionLazy3] o.a.s.c.CoreContainer Shutting down CoreContainer instance=14258775
   [junit4]   2> 836152 ERROR (SUITE-TestLazyCores-seed#[B13C768832EBB8DC]-worker) [    x:collectionLazy3] o.a.s.SolrTestCaseJ4 ERROR: SolrIndexSearcher opens=51 closes=50
   [junit4]   2> Jul 28, 2015 10:31:11 AM com.carrotsearch.randomizedtesting.ThreadLeakControl checkThreadLeaks
   [junit4]   2> WARNING: Will linger awaiting termination of 1 leaked thread(s).
   [junit4]   2> Jul 28, 2015 10:31:31 AM com.carrotsearch.randomizedtesting.ThreadLeakControl checkThreadLeaks
   [junit4]   2> SEVERE: 1 thread leaked from SUITE scope at org.apache.solr.core.TestLazyCores: 
   [junit4]   2>    1) Thread[id=6132, name=searcherExecutor-2028-thread-1, state=WAITING, group=TGRP-TestLazyCores]
   [junit4]   2>         at sun.misc.Unsafe.park(Native Method)
   [junit4]   2>         at java.util.concurrent.locks.LockSupport.park(LockSupport.java:175)
   [junit4]   2>         at java.util.concurrent.locks.AbstractQueuedSynchronizer$ConditionObject.await(AbstractQueuedSynchronizer.java:2039)
   [junit4]   2>         at java.util.concurrent.LinkedBlockingQueue.take(LinkedBlockingQueue.java:442)
   [junit4]   2>         at java.util.concurrent.ThreadPoolExecutor.getTask(ThreadPoolExecutor.java:1067)
   [junit4]   2>         at java.util.concurrent.ThreadPoolExecutor.runWorker(ThreadPoolExecutor.java:1127)
   [junit4]   2>         at java.util.concurrent.ThreadPoolExecutor$Worker.run(ThreadPoolExecutor.java:617)
   [junit4]   2>         at java.lang.Thread.run(Thread.java:745)
   [junit4]   2> Jul 28, 2015 10:31:31 AM com.carrotsearch.randomizedtesting.ThreadLeakControl tryToInterruptAll
   [junit4]   2> INFO: Starting to interrupt leaked threads:
   [junit4]   2>    1) Thread[id=6132, name=searcherExecutor-2028-thread-1, state=WAITING, group=TGRP-TestLazyCores]
   [junit4]   2> Jul 28, 2015 10:31:34 AM com.carrotsearch.randomizedtesting.ThreadLeakControl tryToInterruptAll
   [junit4]   2> SEVERE: There are still zombie threads that couldn't be terminated:
   [junit4]   2>    1) Thread[id=6132, name=searcherExecutor-2028-thread-1, state=WAITING, group=TGRP-TestLazyCores]
   [junit4]   2>         at sun.misc.Unsafe.park(Native Method)
   [junit4]   2>         at java.util.concurrent.locks.LockSupport.park(LockSupport.java:175)
   [junit4]   2>         at java.util.concurrent.locks.AbstractQueuedSynchronizer$ConditionObject.await(AbstractQueuedSynchronizer.java:2039)
   [junit4]   2>         at java.util.concurrent.LinkedBlockingQueue.take(LinkedBlockingQueue.java:442)
   [junit4]   2>         at java.util.concurrent.ThreadPoolExecutor.getTask(ThreadPoolExecutor.java:1067)
   [junit4]   2>         at java.util.concurrent.ThreadPoolExecutor.runWorker(ThreadPoolExecutor.java:1127)
   [junit4]   2>         at java.util.concurrent.ThreadPoolExecutor$Worker.run(ThreadPoolExecutor.java:617)
   [junit4]   2>         at java.lang.Thread.run(Thread.java:745)
   [junit4]   2> NOTE: test params are: codec=Asserting(Lucene53): {v_t=PostingsFormat(name=Memory doPackFST= false), id=PostingsFormat(name=Memory doPackFST= false), v_s=PostingsFormat(name=MockRandom), v_f=PostingsFormat(name=LuceneVarGapDocFreqInterval)}, docValues:{}, sim=DefaultSimilarity, locale=el_CY, timezone=Asia/Jayapura
   [junit4]   2> NOTE: Windows 7 6.1 x86/Oracle Corporation 1.8.0_51 (32-bit)/cpus=3,threads=2,free=108902136,total=203128832
   [junit4]   2> NOTE: All tests run in this JVM: [ScriptEngineTest, TestStressReorder, IndexSchemaRuntimeFieldTest, RulesTest, SuggesterWFSTTest, TestShardHandlerFactory, SparseHLLTest, TestRandomDVFaceting, TestLFUCache, TestComplexPhraseQParserPlugin, SpatialHeatmapFacetsTest, SharedFSAutoReplicaFailoverUtilsTest, HdfsDirectoryTest, TestCSVResponseWriter, TestFieldTypeCollectionResource, TestBulkSchemaAPI, DeleteLastCustomShardedReplicaTest, HdfsRecoveryZkTest, TestCloudManagedSchema, TestWordDelimiterFilterFactory, BlockCacheTest, SyncSliceTest, TestTrieFacet, HLLSerializationTest, TestLeaderElectionZkExpiry, XmlUpdateRequestHandlerTest, StressHdfsTest, TestCSVLoader, TestCloudManagedSchemaConcurrent, SolrIndexSplitterTest, TestUniqueKeyFieldResource, RequestHandlersTest, DirectUpdateHandlerTest, SolrXmlInZkTest, TestRTimer, TestHighFrequencyDictionaryFactory, TestSolrConfigHandlerConcurrent, TestRequestStatusCollectionAPI, TestSurroundQueryParser, TestReplicationHandler, TestPerFieldSimilarity, TestHashPartitioner, TestLazyCores]
   [junit4]   2> NOTE: reproduce with: ant test  -Dtestcase=TestLazyCores -Dtests.seed=B13C768832EBB8DC -Dtests.slow=true -Dtests.locale=el_CY -Dtests.timezone=Asia/Jayapura -Dtests.asserts=true -Dtests.file.encoding=UTF-8
   [junit4] ERROR   0.00s J0 | TestLazyCores (suite) <<<
   [junit4]    > Throwable #1: java.lang.AssertionError: ERROR: SolrIndexSearcher opens=51 closes=50
   [junit4]    > 	at __randomizedtesting.SeedInfo.seed([B13C768832EBB8DC]:0)
   [junit4]    > 	at org.apache.solr.SolrTestCaseJ4.endTrackingSearchers(SolrTestCaseJ4.java:467)
   [junit4]    > 	at org.apache.solr.SolrTestCaseJ4.afterClass(SolrTestCaseJ4.java:233)
   [junit4]    > 	at java.lang.Thread.run(Thread.java:745)Throwable #2: com.carrotsearch.randomizedtesting.ThreadLeakError: 1 thread leaked from SUITE scope at org.apache.solr.core.TestLazyCores: 
   [junit4]    >    1) Thread[id=6132, name=searcherExecutor-2028-thread-1, state=WAITING, group=TGRP-TestLazyCores]
   [junit4]    >         at sun.misc.Unsafe.park(Native Method)
   [junit4]    >         at java.util.concurrent.locks.LockSupport.park(LockSupport.java:175)
   [junit4]    >         at java.util.concurrent.locks.AbstractQueuedSynchronizer$ConditionObject.await(AbstractQueuedSynchronizer.java:2039)
   [junit4]    >         at java.util.concurrent.LinkedBlockingQueue.take(LinkedBlockingQueue.java:442)
   [junit4]    >         at java.util.concurrent.ThreadPoolExecutor.getTask(ThreadPoolExecutor.java:1067)
   [junit4]    >         at java.util.concurrent.ThreadPoolExecutor.runWorker(ThreadPoolExecutor.java:1127)
   [junit4]    >         at java.util.concurrent.ThreadPoolExecutor$Worker.run(ThreadPoolExecutor.java:617)
   [junit4]    >         at java.lang.Thread.run(Thread.java:745)
   [junit4]    > 	at __randomizedtesting.SeedInfo.seed([B13C768832EBB8DC]:0)Throwable #3: com.carrotsearch.randomizedtesting.ThreadLeakError: There are still zombie threads that couldn't be terminated:
   [junit4]    >    1) Thread[id=6132, name=searcherExecutor-2028-thread-1, state=WAITING, group=TGRP-TestLazyCores]
   [junit4]    >         at sun.misc.Unsafe.park(Native Method)
   [junit4]    >         at java.util.concurrent.locks.LockSupport.park(LockSupport.java:175)
   [junit4]    >         at java.util.concurrent.locks.AbstractQueuedSynchronizer$ConditionObject.await(AbstractQueuedSynchronizer.java:2039)
   [junit4]    >         at java.util.concurrent.LinkedBlockingQueue.take(LinkedBlockingQueue.java:442)
   [junit4]    >         at java.util.concurrent.ThreadPoolExecutor.getTask(ThreadPoolExecutor.java:1067)
   [junit4]    >         at java.util.concurrent.ThreadPoolExecutor.runWorker(ThreadPoolExecutor.java:1127)
   [junit4]    >         at java.util.concurrent.ThreadPoolExecutor$Worker.run(ThreadPoolExecutor.java:617)
   [junit4]    >         at java.lang.Thread.run(Thread.java:745)
   [junit4]    > 	at __randomizedtesting.SeedInfo.seed([B13C768832EBB8DC]:0)
   [junit4] Completed [119/525] on J0 in 147.89s, 7 tests, 1 failure, 2 errors <<< FAILURES!

[...truncated 1238 lines...]
BUILD FAILED
C:\Users\JenkinsSlave\workspace\Lucene-Solr-trunk-Windows\build.xml:717: The following error occurred while executing this line:
C:\Users\JenkinsSlave\workspace\Lucene-Solr-trunk-Windows\build.xml:661: The following error occurred while executing this line:
C:\Users\JenkinsSlave\workspace\Lucene-Solr-trunk-Windows\build.xml:59: The following error occurred while executing this line:
C:\Users\JenkinsSlave\workspace\Lucene-Solr-trunk-Windows\solr\build.xml:227: The following error occurred while executing this line:
C:\Users\JenkinsSlave\workspace\Lucene-Solr-trunk-Windows\solr\common-build.xml:517: The following error occurred while executing this line:
C:\Users\JenkinsSlave\workspace\Lucene-Solr-trunk-Windows\lucene\common-build.xml:1429: The following error occurred while executing this line:
C:\Users\JenkinsSlave\workspace\Lucene-Solr-trunk-Windows\lucene\common-build.xml:984: There were test failures: 525 suites, 2069 tests, 3 suite-level errors, 1 failure, 1241 ignored (20 assumptions)

Total time: 43 minutes 21 seconds
Build step 'Invoke Ant' marked build as failure
Archiving artifacts
Recording test results
Email was triggered for: Failure - Any
Sending email for trigger: Failure - Any



Mime
View raw message