lucene-dev mailing list archives

Site index · List index
Message view « Date » · « Thread »
Top « Date » · « Thread »
From Policeman Jenkins Server <jenk...@thetaphi.de>
Subject [JENKINS] Lucene-Solr-trunk-Linux (64bit/jdk1.8.0_45) - Build # 13498 - Still Failing!
Date Fri, 17 Jul 2015 16:40:28 GMT
Build: http://jenkins.thetaphi.de/job/Lucene-Solr-trunk-Linux/13498/
Java: 64bit/jdk1.8.0_45 -XX:-UseCompressedOops -XX:+UseParallelGC

1 tests failed.
FAILED:  org.apache.solr.cloud.TestCloudPivotFacet.test

Error Message:
{main(facet=true&facet.pivot=pivot_d1%2Cdense_pivot_ti1%2Cpivot_d&facet.pivot=%7B%21stats%3Dst3%7Dpivot_x_s1%2Cpivot_dt%2Cpivot_tf&facet.limit=15&facet.missing=true&facet.sort=index&facet.overrequest.ratio=1.1039687),extra(rows=0&q=*%3A*&fq=id%3A%5B*+TO+1170%5D&stats=true&stats.field=%7B%21key%3Dsk1+tag%3Dst1%2Cst2%7Dpivot_tdt1&stats.field=%7B%21key%3Dsk2+tag%3Dst2%2Cst3%7Dpivot_tdt&stats.field=%7B%21key%3Dsk3+tag%3Dst3%2Cst4%7Dpivot_d1&_test_miss=true&_test_sort=index)} ==> Sum of sk3 => pivot_x_s1,pivot_dt,pivot_tf: {params(rows=0),defaults({main({main(rows=0&q=*%3A*&fq=id%3A%5B*+TO+1170%5D&stats=true&stats.field=%7B%21key%3Dsk1+tag%3Dst1%2Cst2%7Dpivot_tdt1&stats.field=%7B%21key%3Dsk2+tag%3Dst2%2Cst3%7Dpivot_tdt&stats.field=%7B%21key%3Dsk3+tag%3Dst3%2Cst4%7Dpivot_d1&_test_miss=true&_test_sort=index),extra(fq=%7B%21term+f%3Dpivot_x_s1%7Dc)}),extra(fq=%7B%21term+f%3Dpivot_dt%7D2010-10-31T10%3A31%3A12Z)})} expected:<-1.2747953316671947E8> but was:<-1.2747953316671945E8>

Stack Trace:
java.lang.AssertionError: {main(facet=true&facet.pivot=pivot_d1%2Cdense_pivot_ti1%2Cpivot_d&facet.pivot=%7B%21stats%3Dst3%7Dpivot_x_s1%2Cpivot_dt%2Cpivot_tf&facet.limit=15&facet.missing=true&facet.sort=index&facet.overrequest.ratio=1.1039687),extra(rows=0&q=*%3A*&fq=id%3A%5B*+TO+1170%5D&stats=true&stats.field=%7B%21key%3Dsk1+tag%3Dst1%2Cst2%7Dpivot_tdt1&stats.field=%7B%21key%3Dsk2+tag%3Dst2%2Cst3%7Dpivot_tdt&stats.field=%7B%21key%3Dsk3+tag%3Dst3%2Cst4%7Dpivot_d1&_test_miss=true&_test_sort=index)} ==> Sum of sk3 => pivot_x_s1,pivot_dt,pivot_tf: {params(rows=0),defaults({main({main(rows=0&q=*%3A*&fq=id%3A%5B*+TO+1170%5D&stats=true&stats.field=%7B%21key%3Dsk1+tag%3Dst1%2Cst2%7Dpivot_tdt1&stats.field=%7B%21key%3Dsk2+tag%3Dst2%2Cst3%7Dpivot_tdt&stats.field=%7B%21key%3Dsk3+tag%3Dst3%2Cst4%7Dpivot_d1&_test_miss=true&_test_sort=index),extra(fq=%7B%21term+f%3Dpivot_x_s1%7Dc)}),extra(fq=%7B%21term+f%3Dpivot_dt%7D2010-10-31T10%3A31%3A12Z)})} expected:<-1.2747953316671947E8> but was:<-1.2747953316671945E8>
	at __randomizedtesting.SeedInfo.seed([9CE37D1CCF8B99FB:14B742C66177F403]:0)
	at org.apache.solr.cloud.TestCloudPivotFacet.assertPivotCountsAreCorrect(TestCloudPivotFacet.java:281)
	at org.apache.solr.cloud.TestCloudPivotFacet.test(TestCloudPivotFacet.java:228)
	at sun.reflect.NativeMethodAccessorImpl.invoke0(Native Method)
	at sun.reflect.NativeMethodAccessorImpl.invoke(NativeMethodAccessorImpl.java:62)
	at sun.reflect.DelegatingMethodAccessorImpl.invoke(DelegatingMethodAccessorImpl.java:43)
	at java.lang.reflect.Method.invoke(Method.java:497)
	at com.carrotsearch.randomizedtesting.RandomizedRunner.invoke(RandomizedRunner.java:1627)
	at com.carrotsearch.randomizedtesting.RandomizedRunner$6.evaluate(RandomizedRunner.java:836)
	at com.carrotsearch.randomizedtesting.RandomizedRunner$7.evaluate(RandomizedRunner.java:872)
	at com.carrotsearch.randomizedtesting.RandomizedRunner$8.evaluate(RandomizedRunner.java:886)
	at org.apache.solr.BaseDistributedSearchTestCase$ShardsRepeatRule$ShardsFixedStatement.callStatement(BaseDistributedSearchTestCase.java:960)
	at org.apache.solr.BaseDistributedSearchTestCase$ShardsRepeatRule$ShardsStatement.evaluate(BaseDistributedSearchTestCase.java:935)
	at com.carrotsearch.randomizedtesting.rules.SystemPropertiesRestoreRule$1.evaluate(SystemPropertiesRestoreRule.java:57)
	at org.apache.lucene.util.TestRuleSetupTeardownChained$1.evaluate(TestRuleSetupTeardownChained.java:50)
	at org.apache.lucene.util.AbstractBeforeAfterRule$1.evaluate(AbstractBeforeAfterRule.java:46)
	at org.apache.lucene.util.TestRuleThreadAndTestName$1.evaluate(TestRuleThreadAndTestName.java:49)
	at org.apache.lucene.util.TestRuleIgnoreAfterMaxFailures$1.evaluate(TestRuleIgnoreAfterMaxFailures.java:65)
	at org.apache.lucene.util.TestRuleMarkFailure$1.evaluate(TestRuleMarkFailure.java:48)
	at com.carrotsearch.randomizedtesting.rules.StatementAdapter.evaluate(StatementAdapter.java:36)
	at com.carrotsearch.randomizedtesting.ThreadLeakControl$StatementRunner.run(ThreadLeakControl.java:365)
	at com.carrotsearch.randomizedtesting.ThreadLeakControl.forkTimeoutingTask(ThreadLeakControl.java:798)
	at com.carrotsearch.randomizedtesting.ThreadLeakControl$3.evaluate(ThreadLeakControl.java:458)
	at com.carrotsearch.randomizedtesting.RandomizedRunner.runSingleTest(RandomizedRunner.java:845)
	at com.carrotsearch.randomizedtesting.RandomizedRunner$3.evaluate(RandomizedRunner.java:747)
	at com.carrotsearch.randomizedtesting.RandomizedRunner$4.evaluate(RandomizedRunner.java:781)
	at com.carrotsearch.randomizedtesting.RandomizedRunner$5.evaluate(RandomizedRunner.java:792)
	at com.carrotsearch.randomizedtesting.rules.StatementAdapter.evaluate(StatementAdapter.java:36)
	at com.carrotsearch.randomizedtesting.rules.SystemPropertiesRestoreRule$1.evaluate(SystemPropertiesRestoreRule.java:57)
	at org.apache.lucene.util.AbstractBeforeAfterRule$1.evaluate(AbstractBeforeAfterRule.java:46)
	at com.carrotsearch.randomizedtesting.rules.StatementAdapter.evaluate(StatementAdapter.java:36)
	at org.apache.lucene.util.TestRuleStoreClassName$1.evaluate(TestRuleStoreClassName.java:42)
	at com.carrotsearch.randomizedtesting.rules.NoShadowingOrOverridesOnMethodsRule$1.evaluate(NoShadowingOrOverridesOnMethodsRule.java:39)
	at com.carrotsearch.randomizedtesting.rules.NoShadowingOrOverridesOnMethodsRule$1.evaluate(NoShadowingOrOverridesOnMethodsRule.java:39)
	at com.carrotsearch.randomizedtesting.rules.StatementAdapter.evaluate(StatementAdapter.java:36)
	at com.carrotsearch.randomizedtesting.rules.StatementAdapter.evaluate(StatementAdapter.java:36)
	at com.carrotsearch.randomizedtesting.rules.StatementAdapter.evaluate(StatementAdapter.java:36)
	at org.apache.lucene.util.TestRuleAssertionsRequired$1.evaluate(TestRuleAssertionsRequired.java:54)
	at org.apache.lucene.util.TestRuleMarkFailure$1.evaluate(TestRuleMarkFailure.java:48)
	at org.apache.lucene.util.TestRuleIgnoreAfterMaxFailures$1.evaluate(TestRuleIgnoreAfterMaxFailures.java:65)
	at org.apache.lucene.util.TestRuleIgnoreTestSuites$1.evaluate(TestRuleIgnoreTestSuites.java:55)
	at com.carrotsearch.randomizedtesting.rules.StatementAdapter.evaluate(StatementAdapter.java:36)
	at com.carrotsearch.randomizedtesting.ThreadLeakControl$StatementRunner.run(ThreadLeakControl.java:365)
	at java.lang.Thread.run(Thread.java:745)
Caused by: java.lang.AssertionError: Sum of sk3 => pivot_x_s1,pivot_dt,pivot_tf: {params(rows=0),defaults({main({main(rows=0&q=*%3A*&fq=id%3A%5B*+TO+1170%5D&stats=true&stats.field=%7B%21key%3Dsk1+tag%3Dst1%2Cst2%7Dpivot_tdt1&stats.field=%7B%21key%3Dsk2+tag%3Dst2%2Cst3%7Dpivot_tdt&stats.field=%7B%21key%3Dsk3+tag%3Dst3%2Cst4%7Dpivot_d1&_test_miss=true&_test_sort=index),extra(fq=%7B%21term+f%3Dpivot_x_s1%7Dc)}),extra(fq=%7B%21term+f%3Dpivot_dt%7D2010-10-31T10%3A31%3A12Z)})} expected:<-1.2747953316671947E8> but was:<-1.2747953316671945E8>
	at org.junit.Assert.fail(Assert.java:93)
	at org.junit.Assert.failNotEquals(Assert.java:647)
	at org.junit.Assert.assertEquals(Assert.java:443)
	at org.apache.solr.cloud.TestCloudPivotFacet.assertNumerics(TestCloudPivotFacet.java:733)
	at org.apache.solr.cloud.TestCloudPivotFacet.assertPivotStats(TestCloudPivotFacet.java:389)
	at org.apache.solr.cloud.TestCloudPivotFacet.assertPivotData(TestCloudPivotFacet.java:339)
	at org.apache.solr.cloud.TestCloudPivotFacet.assertPivotCountsAreCorrect(TestCloudPivotFacet.java:302)
	at org.apache.solr.cloud.TestCloudPivotFacet.assertPivotCountsAreCorrect(TestCloudPivotFacet.java:313)
	at org.apache.solr.cloud.TestCloudPivotFacet.assertPivotCountsAreCorrect(TestCloudPivotFacet.java:271)
	... 42 more




Build Log:
[...truncated 10892 lines...]
   [junit4] Suite: org.apache.solr.cloud.TestCloudPivotFacet
   [junit4]   2> Creating dataDir: /home/jenkins/workspace/Lucene-Solr-trunk-Linux/solr/build/solr-core/test/J1/temp/solr.cloud.TestCloudPivotFacet_9CE37D1CCF8B99FB-001/init-core-data-001
   [junit4]   2> 1230916 INFO  (SUITE-TestCloudPivotFacet-seed#[9CE37D1CCF8B99FB]-worker) [    ] o.a.s.BaseDistributedSearchTestCase Setting hostContext system property: /ln_/lz
   [junit4]   2> 1230916 INFO  (SUITE-TestCloudPivotFacet-seed#[9CE37D1CCF8B99FB]-worker) [    ] o.a.s.c.TestCloudPivotFacet init'ing useFieldRandomizedFactor = 19
   [junit4]   2> 1230918 INFO  (TEST-TestCloudPivotFacet.test-seed#[9CE37D1CCF8B99FB]) [    ] o.a.s.c.ZkTestServer STARTING ZK TEST SERVER
   [junit4]   2> 1230919 INFO  (Thread-3762) [    ] o.a.s.c.ZkTestServer client port:0.0.0.0/0.0.0.0:0
   [junit4]   2> 1230919 INFO  (Thread-3762) [    ] o.a.s.c.ZkTestServer Starting server
   [junit4]   2> 1231019 INFO  (TEST-TestCloudPivotFacet.test-seed#[9CE37D1CCF8B99FB]) [    ] o.a.s.c.ZkTestServer start zk server on port:35411
   [junit4]   2> 1231024 INFO  (TEST-TestCloudPivotFacet.test-seed#[9CE37D1CCF8B99FB]) [    ] o.a.s.c.AbstractZkTestCase put /home/jenkins/workspace/Lucene-Solr-trunk-Linux/solr/core/src/test-files/solr/collection1/conf/solrconfig-tlog.xml to /configs/conf1/solrconfig.xml
   [junit4]   2> 1231025 INFO  (TEST-TestCloudPivotFacet.test-seed#[9CE37D1CCF8B99FB]) [    ] o.a.s.c.AbstractZkTestCase put /home/jenkins/workspace/Lucene-Solr-trunk-Linux/solr/core/src/test-files/solr/collection1/conf/schema.xml to /configs/conf1/schema.xml
   [junit4]   2> 1231025 INFO  (TEST-TestCloudPivotFacet.test-seed#[9CE37D1CCF8B99FB]) [    ] o.a.s.c.AbstractZkTestCase put /home/jenkins/workspace/Lucene-Solr-trunk-Linux/solr/core/src/test-files/solr/collection1/conf/solrconfig.snippet.randomindexconfig.xml to /configs/conf1/solrconfig.snippet.randomindexconfig.xml
   [junit4]   2> 1231026 INFO  (TEST-TestCloudPivotFacet.test-seed#[9CE37D1CCF8B99FB]) [    ] o.a.s.c.AbstractZkTestCase put /home/jenkins/workspace/Lucene-Solr-trunk-Linux/solr/core/src/test-files/solr/collection1/conf/stopwords.txt to /configs/conf1/stopwords.txt
   [junit4]   2> 1231027 INFO  (TEST-TestCloudPivotFacet.test-seed#[9CE37D1CCF8B99FB]) [    ] o.a.s.c.AbstractZkTestCase put /home/jenkins/workspace/Lucene-Solr-trunk-Linux/solr/core/src/test-files/solr/collection1/conf/protwords.txt to /configs/conf1/protwords.txt
   [junit4]   2> 1231027 INFO  (TEST-TestCloudPivotFacet.test-seed#[9CE37D1CCF8B99FB]) [    ] o.a.s.c.AbstractZkTestCase put /home/jenkins/workspace/Lucene-Solr-trunk-Linux/solr/core/src/test-files/solr/collection1/conf/currency.xml to /configs/conf1/currency.xml
   [junit4]   2> 1231028 INFO  (TEST-TestCloudPivotFacet.test-seed#[9CE37D1CCF8B99FB]) [    ] o.a.s.c.AbstractZkTestCase put /home/jenkins/workspace/Lucene-Solr-trunk-Linux/solr/core/src/test-files/solr/collection1/conf/enumsConfig.xml to /configs/conf1/enumsConfig.xml
   [junit4]   2> 1231028 INFO  (TEST-TestCloudPivotFacet.test-seed#[9CE37D1CCF8B99FB]) [    ] o.a.s.c.AbstractZkTestCase put /home/jenkins/workspace/Lucene-Solr-trunk-Linux/solr/core/src/test-files/solr/collection1/conf/open-exchange-rates.json to /configs/conf1/open-exchange-rates.json
   [junit4]   2> 1231029 INFO  (TEST-TestCloudPivotFacet.test-seed#[9CE37D1CCF8B99FB]) [    ] o.a.s.c.AbstractZkTestCase put /home/jenkins/workspace/Lucene-Solr-trunk-Linux/solr/core/src/test-files/solr/collection1/conf/mapping-ISOLatin1Accent.txt to /configs/conf1/mapping-ISOLatin1Accent.txt
   [junit4]   2> 1231029 INFO  (TEST-TestCloudPivotFacet.test-seed#[9CE37D1CCF8B99FB]) [    ] o.a.s.c.AbstractZkTestCase put /home/jenkins/workspace/Lucene-Solr-trunk-Linux/solr/core/src/test-files/solr/collection1/conf/old_synonyms.txt to /configs/conf1/old_synonyms.txt
   [junit4]   2> 1231030 INFO  (TEST-TestCloudPivotFacet.test-seed#[9CE37D1CCF8B99FB]) [    ] o.a.s.c.AbstractZkTestCase put /home/jenkins/workspace/Lucene-Solr-trunk-Linux/solr/core/src/test-files/solr/collection1/conf/synonyms.txt to /configs/conf1/synonyms.txt
   [junit4]   2> 1231075 INFO  (TEST-TestCloudPivotFacet.test-seed#[9CE37D1CCF8B99FB]) [    ] o.a.s.SolrTestCaseJ4 Writing core.properties file to /home/jenkins/workspace/Lucene-Solr-trunk-Linux/solr/build/solr-core/test/J1/temp/solr.cloud.TestCloudPivotFacet_9CE37D1CCF8B99FB-001/control-001/cores/collection1
   [junit4]   2> 1231076 INFO  (TEST-TestCloudPivotFacet.test-seed#[9CE37D1CCF8B99FB]) [    ] o.e.j.s.Server jetty-9.2.11.v20150529
   [junit4]   2> 1231077 INFO  (TEST-TestCloudPivotFacet.test-seed#[9CE37D1CCF8B99FB]) [    ] o.e.j.s.h.ContextHandler Started o.e.j.s.ServletContextHandler@4b6b8ef{/ln_/lz,null,AVAILABLE}
   [junit4]   2> 1231080 INFO  (TEST-TestCloudPivotFacet.test-seed#[9CE37D1CCF8B99FB]) [    ] o.e.j.s.ServerConnector Started ServerConnector@c5d8356{HTTP/1.1}{127.0.0.1:58501}
   [junit4]   2> 1231081 INFO  (TEST-TestCloudPivotFacet.test-seed#[9CE37D1CCF8B99FB]) [    ] o.e.j.s.Server Started @1232736ms
   [junit4]   2> 1231081 INFO  (TEST-TestCloudPivotFacet.test-seed#[9CE37D1CCF8B99FB]) [    ] o.a.s.c.s.e.JettySolrRunner Jetty properties: {solr.data.dir=/home/jenkins/workspace/Lucene-Solr-trunk-Linux/solr/build/solr-core/test/J1/temp/solr.cloud.TestCloudPivotFacet_9CE37D1CCF8B99FB-001/tempDir-001/control/data, hostContext=/ln_/lz, hostPort=58501, coreRootDirectory=/home/jenkins/workspace/Lucene-Solr-trunk-Linux/solr/build/solr-core/test/J1/temp/solr.cloud.TestCloudPivotFacet_9CE37D1CCF8B99FB-001/control-001/cores}
   [junit4]   2> 1231081 INFO  (TEST-TestCloudPivotFacet.test-seed#[9CE37D1CCF8B99FB]) [    ] o.a.s.s.SolrDispatchFilter SolrDispatchFilter.init(): sun.misc.Launcher$AppClassLoader@4e0e2f2a
   [junit4]   2> 1231081 INFO  (TEST-TestCloudPivotFacet.test-seed#[9CE37D1CCF8B99FB]) [    ] o.a.s.c.SolrResourceLoader new SolrResourceLoader for directory: '/home/jenkins/workspace/Lucene-Solr-trunk-Linux/solr/build/solr-core/test/J1/temp/solr.cloud.TestCloudPivotFacet_9CE37D1CCF8B99FB-001/control-001/'
   [junit4]   2> 1231090 INFO  (TEST-TestCloudPivotFacet.test-seed#[9CE37D1CCF8B99FB]) [    ] o.a.s.c.SolrXmlConfig Loading container configuration from /home/jenkins/workspace/Lucene-Solr-trunk-Linux/solr/build/solr-core/test/J1/temp/solr.cloud.TestCloudPivotFacet_9CE37D1CCF8B99FB-001/control-001/solr.xml
   [junit4]   2> 1231093 INFO  (TEST-TestCloudPivotFacet.test-seed#[9CE37D1CCF8B99FB]) [    ] o.a.s.c.CoresLocator Config-defined core root directory: /home/jenkins/workspace/Lucene-Solr-trunk-Linux/solr/build/solr-core/test/J1/temp/solr.cloud.TestCloudPivotFacet_9CE37D1CCF8B99FB-001/control-001/cores
   [junit4]   2> 1231094 INFO  (TEST-TestCloudPivotFacet.test-seed#[9CE37D1CCF8B99FB]) [    ] o.a.s.c.CoreContainer New CoreContainer 823000380
   [junit4]   2> 1231094 INFO  (TEST-TestCloudPivotFacet.test-seed#[9CE37D1CCF8B99FB]) [    ] o.a.s.c.CoreContainer Loading cores into CoreContainer [instanceDir=/home/jenkins/workspace/Lucene-Solr-trunk-Linux/solr/build/solr-core/test/J1/temp/solr.cloud.TestCloudPivotFacet_9CE37D1CCF8B99FB-001/control-001/]
   [junit4]   2> 1231094 INFO  (TEST-TestCloudPivotFacet.test-seed#[9CE37D1CCF8B99FB]) [    ] o.a.s.c.CoreContainer loading shared library: /home/jenkins/workspace/Lucene-Solr-trunk-Linux/solr/build/solr-core/test/J1/temp/solr.cloud.TestCloudPivotFacet_9CE37D1CCF8B99FB-001/control-001/lib
   [junit4]   2> 1231094 WARN  (TEST-TestCloudPivotFacet.test-seed#[9CE37D1CCF8B99FB]) [    ] o.a.s.c.SolrResourceLoader Can't find (or read) directory to add to classloader: lib (resolved as: /home/jenkins/workspace/Lucene-Solr-trunk-Linux/solr/build/solr-core/test/J1/temp/solr.cloud.TestCloudPivotFacet_9CE37D1CCF8B99FB-001/control-001/lib).
   [junit4]   2> 1231098 INFO  (TEST-TestCloudPivotFacet.test-seed#[9CE37D1CCF8B99FB]) [    ] o.a.s.h.c.HttpShardHandlerFactory created with socketTimeout : 90000,urlScheme : ,connTimeout : 15000,maxConnectionsPerHost : 20,maxConnections : 10000,corePoolSize : 0,maximumPoolSize : 2147483647,maxThreadIdleTime : 5,sizeOfQueue : -1,fairnessPolicy : false,useRetries : false,
   [junit4]   2> 1231099 INFO  (TEST-TestCloudPivotFacet.test-seed#[9CE37D1CCF8B99FB]) [    ] o.a.s.u.UpdateShardHandler Creating UpdateShardHandler HTTP client with params: socketTimeout=340000&connTimeout=45000&retry=true
   [junit4]   2> 1231099 INFO  (TEST-TestCloudPivotFacet.test-seed#[9CE37D1CCF8B99FB]) [    ] o.a.s.l.LogWatcher SLF4J impl is org.slf4j.impl.Log4jLoggerFactory
   [junit4]   2> 1231099 INFO  (TEST-TestCloudPivotFacet.test-seed#[9CE37D1CCF8B99FB]) [    ] o.a.s.l.LogWatcher Registering Log Listener [Log4j (org.slf4j.impl.Log4jLoggerFactory)]
   [junit4]   2> 1231099 INFO  (TEST-TestCloudPivotFacet.test-seed#[9CE37D1CCF8B99FB]) [    ] o.a.s.c.ZkContainer Zookeeper client=127.0.0.1:35411/solr
   [junit4]   2> 1231099 INFO  (TEST-TestCloudPivotFacet.test-seed#[9CE37D1CCF8B99FB]) [    ] o.a.s.c.ZkController zkHost includes chroot
   [junit4]   2> 1231106 INFO  (TEST-TestCloudPivotFacet.test-seed#[9CE37D1CCF8B99FB]) [n:127.0.0.1:58501_ln_%2Flz    ] o.a.s.c.ZkController Register node as live in ZooKeeper:/live_nodes/127.0.0.1:58501_ln_%2Flz
   [junit4]   2> 1231107 INFO  (TEST-TestCloudPivotFacet.test-seed#[9CE37D1CCF8B99FB]) [n:127.0.0.1:58501_ln_%2Flz    ] o.a.s.c.Overseer Overseer (id=null) closing
   [junit4]   2> 1231107 INFO  (TEST-TestCloudPivotFacet.test-seed#[9CE37D1CCF8B99FB]) [n:127.0.0.1:58501_ln_%2Flz    ] o.a.s.c.LeaderElector Joined leadership election with path: /overseer_elect/election/94185121059045379-127.0.0.1:58501_ln_%2Flz-n_0000000000
   [junit4]   2> 1231108 INFO  (TEST-TestCloudPivotFacet.test-seed#[9CE37D1CCF8B99FB]) [n:127.0.0.1:58501_ln_%2Flz    ] o.a.s.c.OverseerElectionContext I am going to be the leader 127.0.0.1:58501_ln_%2Flz
   [junit4]   2> 1231108 INFO  (TEST-TestCloudPivotFacet.test-seed#[9CE37D1CCF8B99FB]) [n:127.0.0.1:58501_ln_%2Flz    ] o.a.s.c.Overseer Overseer (id=94185121059045379-127.0.0.1:58501_ln_%2Flz-n_0000000000) starting
   [junit4]   2> 1231110 INFO  (TEST-TestCloudPivotFacet.test-seed#[9CE37D1CCF8B99FB]) [n:127.0.0.1:58501_ln_%2Flz    ] o.a.s.c.OverseerAutoReplicaFailoverThread Starting OverseerAutoReplicaFailoverThread autoReplicaFailoverWorkLoopDelay=10000 autoReplicaFailoverWaitAfterExpiration=30000 autoReplicaFailoverBadNodeExpiration=60000
   [junit4]   2> 1231111 INFO  (OverseerCollectionProcessor-94185121059045379-127.0.0.1:58501_ln_%2Flz-n_0000000000) [n:127.0.0.1:58501_ln_%2Flz    ] o.a.s.c.OverseerCollectionProcessor Process current queue of collection creations
   [junit4]   2> 1231111 INFO  (OverseerStateUpdate-94185121059045379-127.0.0.1:58501_ln_%2Flz-n_0000000000) [n:127.0.0.1:58501_ln_%2Flz    ] o.a.s.c.Overseer Starting to work on the main queue
   [junit4]   2> 1231112 INFO  (TEST-TestCloudPivotFacet.test-seed#[9CE37D1CCF8B99FB]) [n:127.0.0.1:58501_ln_%2Flz    ] o.a.s.c.CoreContainer No authentication plugin used.
   [junit4]   2> 1231112 INFO  (TEST-TestCloudPivotFacet.test-seed#[9CE37D1CCF8B99FB]) [n:127.0.0.1:58501_ln_%2Flz    ] o.a.s.c.CoreContainer Security conf doesn't exist. Skipping setup for authorization module.
   [junit4]   2> 1231113 INFO  (TEST-TestCloudPivotFacet.test-seed#[9CE37D1CCF8B99FB]) [n:127.0.0.1:58501_ln_%2Flz    ] o.a.s.c.CoresLocator Looking for core definitions underneath /home/jenkins/workspace/Lucene-Solr-trunk-Linux/solr/build/solr-core/test/J1/temp/solr.cloud.TestCloudPivotFacet_9CE37D1CCF8B99FB-001/control-001/cores
   [junit4]   2> 1231113 INFO  (TEST-TestCloudPivotFacet.test-seed#[9CE37D1CCF8B99FB]) [n:127.0.0.1:58501_ln_%2Flz    ] o.a.s.c.SolrCore Created CoreDescriptor: {name=collection1, config=solrconfig.xml, transient=false, schema=schema.xml, loadOnStartup=true, configSetProperties=configsetprops.json, instanceDir=/home/jenkins/workspace/Lucene-Solr-trunk-Linux/solr/build/solr-core/test/J1/temp/solr.cloud.TestCloudPivotFacet_9CE37D1CCF8B99FB-001/control-001/cores/collection1, collection=control_collection, absoluteInstDir=/home/jenkins/workspace/Lucene-Solr-trunk-Linux/solr/build/solr-core/test/J1/temp/solr.cloud.TestCloudPivotFacet_9CE37D1CCF8B99FB-001/control-001/cores/collection1/, coreNodeName=, dataDir=data/, shard=}
   [junit4]   2> 1231113 INFO  (TEST-TestCloudPivotFacet.test-seed#[9CE37D1CCF8B99FB]) [n:127.0.0.1:58501_ln_%2Flz    ] o.a.s.c.CoresLocator Found core collection1 in /home/jenkins/workspace/Lucene-Solr-trunk-Linux/solr/build/solr-core/test/J1/temp/solr.cloud.TestCloudPivotFacet_9CE37D1CCF8B99FB-001/control-001/cores/collection1/
   [junit4]   2> 1231113 INFO  (TEST-TestCloudPivotFacet.test-seed#[9CE37D1CCF8B99FB]) [n:127.0.0.1:58501_ln_%2Flz    ] o.a.s.c.CoresLocator Found 1 core definitions
   [junit4]   2> 1231114 INFO  (coreLoadExecutor-4327-thread-1-processing-n:127.0.0.1:58501_ln_%2Flz) [n:127.0.0.1:58501_ln_%2Flz c:control_collection   x:collection1] o.a.s.c.ZkController publishing state=down
   [junit4]   2> 1231114 INFO  (TEST-TestCloudPivotFacet.test-seed#[9CE37D1CCF8B99FB]) [n:127.0.0.1:58501_ln_%2Flz    ] o.a.s.s.SolrDispatchFilter user.dir=/home/jenkins/workspace/Lucene-Solr-trunk-Linux/solr/build/solr-core/test/J1
   [junit4]   2> 1231114 INFO  (TEST-TestCloudPivotFacet.test-seed#[9CE37D1CCF8B99FB]) [n:127.0.0.1:58501_ln_%2Flz    ] o.a.s.s.SolrDispatchFilter SolrDispatchFilter.init() done
   [junit4]   2> 1231114 INFO  (coreLoadExecutor-4327-thread-1-processing-n:127.0.0.1:58501_ln_%2Flz) [n:127.0.0.1:58501_ln_%2Flz c:control_collection   x:collection1] o.a.s.c.ZkController numShards not found on descriptor - reading it from system property
   [junit4]   2> 1231114 INFO  (coreLoadExecutor-4327-thread-1-processing-n:127.0.0.1:58501_ln_%2Flz) [n:127.0.0.1:58501_ln_%2Flz c:control_collection   x:collection1] o.a.s.c.ZkController look for our core node name
   [junit4]   2> 1231114 INFO  (zkCallback-940-thread-1-processing-n:127.0.0.1:58501_ln_%2Flz) [n:127.0.0.1:58501_ln_%2Flz    ] o.a.s.c.DistributedQueue NodeChildrenChanged fired on path /overseer/queue state SyncConnected
   [junit4]   2> 1231115 INFO  (OverseerStateUpdate-94185121059045379-127.0.0.1:58501_ln_%2Flz-n_0000000000) [n:127.0.0.1:58501_ln_%2Flz    ] o.a.s.c.Overseer processMessage: queueSize: 1, message = {
   [junit4]   2>   "core":"collection1",
   [junit4]   2>   "roles":null,
   [junit4]   2>   "base_url":"http://127.0.0.1:58501/ln_/lz",
   [junit4]   2>   "node_name":"127.0.0.1:58501_ln_%2Flz",
   [junit4]   2>   "numShards":"1",
   [junit4]   2>   "state":"down",
   [junit4]   2>   "shard":null,
   [junit4]   2>   "collection":"control_collection",
   [junit4]   2>   "operation":"state"} current state version: 0
   [junit4]   2> 1231115 INFO  (OverseerStateUpdate-94185121059045379-127.0.0.1:58501_ln_%2Flz-n_0000000000) [n:127.0.0.1:58501_ln_%2Flz    ] o.a.s.c.o.ReplicaMutator Update state numShards=1 message={
   [junit4]   2>   "core":"collection1",
   [junit4]   2>   "roles":null,
   [junit4]   2>   "base_url":"http://127.0.0.1:58501/ln_/lz",
   [junit4]   2>   "node_name":"127.0.0.1:58501_ln_%2Flz",
   [junit4]   2>   "numShards":"1",
   [junit4]   2>   "state":"down",
   [junit4]   2>   "shard":null,
   [junit4]   2>   "collection":"control_collection",
   [junit4]   2>   "operation":"state"}
   [junit4]   2> 1231115 INFO  (OverseerStateUpdate-94185121059045379-127.0.0.1:58501_ln_%2Flz-n_0000000000) [n:127.0.0.1:58501_ln_%2Flz    ] o.a.s.c.o.ClusterStateMutator building a new cName: control_collection
   [junit4]   2> 1231115 INFO  (OverseerStateUpdate-94185121059045379-127.0.0.1:58501_ln_%2Flz-n_0000000000) [n:127.0.0.1:58501_ln_%2Flz    ] o.a.s.c.o.ReplicaMutator Assigning new node to shard shard=shard1
   [junit4]   2> 1232115 INFO  (coreLoadExecutor-4327-thread-1-processing-n:127.0.0.1:58501_ln_%2Flz) [n:127.0.0.1:58501_ln_%2Flz c:control_collection   x:collection1] o.a.s.c.ZkController waiting to find shard id in clusterstate for collection1
   [junit4]   2> 1232115 INFO  (coreLoadExecutor-4327-thread-1-processing-n:127.0.0.1:58501_ln_%2Flz) [n:127.0.0.1:58501_ln_%2Flz c:control_collection   x:collection1] o.a.s.c.ZkController Check for collection zkNode:control_collection
   [junit4]   2> 1232115 INFO  (coreLoadExecutor-4327-thread-1-processing-n:127.0.0.1:58501_ln_%2Flz) [n:127.0.0.1:58501_ln_%2Flz c:control_collection   x:collection1] o.a.s.c.ZkController Collection zkNode exists
   [junit4]   2> 1232115 INFO  (coreLoadExecutor-4327-thread-1-processing-n:127.0.0.1:58501_ln_%2Flz) [n:127.0.0.1:58501_ln_%2Flz c:control_collection   x:collection1] o.a.s.c.SolrResourceLoader new SolrResourceLoader for directory: '/home/jenkins/workspace/Lucene-Solr-trunk-Linux/solr/build/solr-core/test/J1/temp/solr.cloud.TestCloudPivotFacet_9CE37D1CCF8B99FB-001/control-001/cores/collection1/'
   [junit4]   2> 1232122 INFO  (coreLoadExecutor-4327-thread-1-processing-n:127.0.0.1:58501_ln_%2Flz) [n:127.0.0.1:58501_ln_%2Flz c:control_collection   x:collection1] o.a.s.c.Config loaded config solrconfig.xml with version 0 
   [junit4]   2> 1232124 INFO  (coreLoadExecutor-4327-thread-1-processing-n:127.0.0.1:58501_ln_%2Flz) [n:127.0.0.1:58501_ln_%2Flz c:control_collection   x:collection1] o.a.s.c.SolrConfig current version of requestparams : -1
   [junit4]   2> 1232133 INFO  (coreLoadExecutor-4327-thread-1-processing-n:127.0.0.1:58501_ln_%2Flz) [n:127.0.0.1:58501_ln_%2Flz c:control_collection   x:collection1] o.a.s.c.SolrConfig Using Lucene MatchVersion: 6.0.0
   [junit4]   2> 1232139 INFO  (coreLoadExecutor-4327-thread-1-processing-n:127.0.0.1:58501_ln_%2Flz) [n:127.0.0.1:58501_ln_%2Flz c:control_collection   x:collection1] o.a.s.c.Config Loaded SolrConfig: solrconfig.xml
   [junit4]   2> 1232140 INFO  (coreLoadExecutor-4327-thread-1-processing-n:127.0.0.1:58501_ln_%2Flz) [n:127.0.0.1:58501_ln_%2Flz c:control_collection   x:collection1] o.a.s.s.IndexSchema Reading Solr Schema from /configs/conf1/schema.xml
   [junit4]   2> 1232142 INFO  (coreLoadExecutor-4327-thread-1-processing-n:127.0.0.1:58501_ln_%2Flz) [n:127.0.0.1:58501_ln_%2Flz c:control_collection   x:collection1] o.a.s.s.IndexSchema [collection1] Schema name=test
   [junit4]   2> 1232218 INFO  (coreLoadExecutor-4327-thread-1-processing-n:127.0.0.1:58501_ln_%2Flz) [n:127.0.0.1:58501_ln_%2Flz c:control_collection   x:collection1] o.a.s.s.OpenExchangeRatesOrgProvider Initialized with rates=open-exchange-rates.json, refreshInterval=1440.
   [junit4]   2> 1232222 INFO  (coreLoadExecutor-4327-thread-1-processing-n:127.0.0.1:58501_ln_%2Flz) [n:127.0.0.1:58501_ln_%2Flz c:control_collection   x:collection1] o.a.s.s.IndexSchema default search field in schema is text
   [junit4]   2> 1232223 INFO  (coreLoadExecutor-4327-thread-1-processing-n:127.0.0.1:58501_ln_%2Flz) [n:127.0.0.1:58501_ln_%2Flz c:control_collection   x:collection1] o.a.s.s.IndexSchema unique key field: id
   [junit4]   2> 1232226 INFO  (coreLoadExecutor-4327-thread-1-processing-n:127.0.0.1:58501_ln_%2Flz) [n:127.0.0.1:58501_ln_%2Flz c:control_collection   x:collection1] o.a.s.s.FileExchangeRateProvider Reloading exchange rates from file currency.xml
   [junit4]   2> 1232227 INFO  (coreLoadExecutor-4327-thread-1-processing-n:127.0.0.1:58501_ln_%2Flz) [n:127.0.0.1:58501_ln_%2Flz c:control_collection   x:collection1] o.a.s.s.FileExchangeRateProvider Reloading exchange rates from file currency.xml
   [junit4]   2> 1232228 INFO  (coreLoadExecutor-4327-thread-1-processing-n:127.0.0.1:58501_ln_%2Flz) [n:127.0.0.1:58501_ln_%2Flz c:control_collection   x:collection1] o.a.s.s.OpenExchangeRatesOrgProvider Reloading exchange rates from open-exchange-rates.json
   [junit4]   2> 1232228 WARN  (coreLoadExecutor-4327-thread-1-processing-n:127.0.0.1:58501_ln_%2Flz) [n:127.0.0.1:58501_ln_%2Flz c:control_collection   x:collection1] o.a.s.s.OpenExchangeRatesOrgProvider Unknown key IMPORTANT NOTE
   [junit4]   2> 1232229 WARN  (coreLoadExecutor-4327-thread-1-processing-n:127.0.0.1:58501_ln_%2Flz) [n:127.0.0.1:58501_ln_%2Flz c:control_collection   x:collection1] o.a.s.s.OpenExchangeRatesOrgProvider Expected key, got STRING
   [junit4]   2> 1232229 INFO  (coreLoadExecutor-4327-thread-1-processing-n:127.0.0.1:58501_ln_%2Flz) [n:127.0.0.1:58501_ln_%2Flz c:control_collection   x:collection1] o.a.s.s.OpenExchangeRatesOrgProvider Reloading exchange rates from open-exchange-rates.json
   [junit4]   2> 1232229 WARN  (coreLoadExecutor-4327-thread-1-processing-n:127.0.0.1:58501_ln_%2Flz) [n:127.0.0.1:58501_ln_%2Flz c:control_collection   x:collection1] o.a.s.s.OpenExchangeRatesOrgProvider Unknown key IMPORTANT NOTE
   [junit4]   2> 1232229 WARN  (coreLoadExecutor-4327-thread-1-processing-n:127.0.0.1:58501_ln_%2Flz) [n:127.0.0.1:58501_ln_%2Flz c:control_collection   x:collection1] o.a.s.s.OpenExchangeRatesOrgProvider Expected key, got STRING
   [junit4]   2> 1232230 INFO  (coreLoadExecutor-4327-thread-1-processing-n:127.0.0.1:58501_ln_%2Flz) [n:127.0.0.1:58501_ln_%2Flz c:control_collection   x:collection1] o.a.s.c.ConfigSetProperties Did not find ConfigSet properties
   [junit4]   2> org.apache.solr.core.SolrResourceNotFoundException: Can't find resource 'configsetprops.json' in classpath or '/configs/conf1', cwd=/home/jenkins/workspace/Lucene-Solr-trunk-Linux/solr/build/solr-core/test/J1
   [junit4]   2> 	at org.apache.solr.cloud.ZkSolrResourceLoader.openResource(ZkSolrResourceLoader.java:99)
   [junit4]   2> 	at org.apache.solr.core.ConfigSetProperties.readFromResourceLoader(ConfigSetProperties.java:49)
   [junit4]   2> 	at org.apache.solr.core.ConfigSetService.createConfigSetProperties(ConfigSetService.java:114)
   [junit4]   2> 	at org.apache.solr.core.ConfigSetService.getConfig(ConfigSetService.java:76)
   [junit4]   2> 	at org.apache.solr.core.CoreContainer.create(CoreContainer.java:668)
   [junit4]   2> 	at org.apache.solr.core.CoreContainer$1.call(CoreContainer.java:397)
   [junit4]   2> 	at org.apache.solr.core.CoreContainer$1.call(CoreContainer.java:388)
   [junit4]   2> 	at java.util.concurrent.FutureTask.run(FutureTask.java:266)
   [junit4]   2> 	at org.apache.solr.common.util.ExecutorUtil$MDCAwareThreadPoolExecutor$1.run(ExecutorUtil.java:156)
   [junit4]   2> 	at java.util.concurrent.ThreadPoolExecutor.runWorker(ThreadPoolExecutor.java:1142)
   [junit4]   2> 	at java.util.concurrent.ThreadPoolExecutor$Worker.run(ThreadPoolExecutor.java:617)
   [junit4]   2> 	at java.lang.Thread.run(Thread.java:745)
   [junit4]   2> 1232230 INFO  (coreLoadExecutor-4327-thread-1-processing-n:127.0.0.1:58501_ln_%2Flz) [n:127.0.0.1:58501_ln_%2Flz c:control_collection   x:collection1] o.a.s.c.CoreContainer Creating SolrCore 'collection1' using configuration from collection control_collection
   [junit4]   2> 1232232 INFO  (coreLoadExecutor-4327-thread-1-processing-n:127.0.0.1:58501_ln_%2Flz) [n:127.0.0.1:58501_ln_%2Flz c:control_collection s:shard1 r:core_node1 x:collection1] o.a.s.c.SolrCore org.apache.solr.core.MockDirectoryFactory
   [junit4]   2> 1232232 INFO  (coreLoadExecutor-4327-thread-1-processing-n:127.0.0.1:58501_ln_%2Flz) [n:127.0.0.1:58501_ln_%2Flz c:control_collection s:shard1 r:core_node1 x:collection1] o.a.s.c.SolrCore [[collection1] ] Opening new SolrCore at [/home/jenkins/workspace/Lucene-Solr-trunk-Linux/solr/build/solr-core/test/J1/temp/solr.cloud.TestCloudPivotFacet_9CE37D1CCF8B99FB-001/control-001/cores/collection1/], dataDir=[null]
   [junit4]   2> 1232232 INFO  (coreLoadExecutor-4327-thread-1-processing-n:127.0.0.1:58501_ln_%2Flz) [n:127.0.0.1:58501_ln_%2Flz c:control_collection s:shard1 r:core_node1 x:collection1] o.a.s.c.JmxMonitoredMap JMX monitoring is enabled. Adding Solr mbeans to JMX Server: com.sun.jmx.mbeanserver.JmxMBeanServer@56760817
   [junit4]   2> 1232233 INFO  (coreLoadExecutor-4327-thread-1-processing-n:127.0.0.1:58501_ln_%2Flz) [n:127.0.0.1:58501_ln_%2Flz c:control_collection s:shard1 r:core_node1 x:collection1] o.a.s.c.CachingDirectoryFactory return new directory for /home/jenkins/workspace/Lucene-Solr-trunk-Linux/solr/build/solr-core/test/J1/temp/solr.cloud.TestCloudPivotFacet_9CE37D1CCF8B99FB-001/control-001/cores/collection1/data
   [junit4]   2> 1232233 INFO  (coreLoadExecutor-4327-thread-1-processing-n:127.0.0.1:58501_ln_%2Flz) [n:127.0.0.1:58501_ln_%2Flz c:control_collection s:shard1 r:core_node1 x:collection1] o.a.s.c.SolrCore New index directory detected: old=null new=/home/jenkins/workspace/Lucene-Solr-trunk-Linux/solr/build/solr-core/test/J1/temp/solr.cloud.TestCloudPivotFacet_9CE37D1CCF8B99FB-001/control-001/cores/collection1/data/index/
   [junit4]   2> 1232233 WARN  (coreLoadExecutor-4327-thread-1-processing-n:127.0.0.1:58501_ln_%2Flz) [n:127.0.0.1:58501_ln_%2Flz c:control_collection s:shard1 r:core_node1 x:collection1] o.a.s.c.SolrCore [collection1] Solr index directory '/home/jenkins/workspace/Lucene-Solr-trunk-Linux/solr/build/solr-core/test/J1/temp/solr.cloud.TestCloudPivotFacet_9CE37D1CCF8B99FB-001/control-001/cores/collection1/data/index' doesn't exist. Creating new index...
   [junit4]   2> 1232233 INFO  (coreLoadExecutor-4327-thread-1-processing-n:127.0.0.1:58501_ln_%2Flz) [n:127.0.0.1:58501_ln_%2Flz c:control_collection s:shard1 r:core_node1 x:collection1] o.a.s.c.CachingDirectoryFactory return new directory for /home/jenkins/workspace/Lucene-Solr-trunk-Linux/solr/build/solr-core/test/J1/temp/solr.cloud.TestCloudPivotFacet_9CE37D1CCF8B99FB-001/control-001/cores/collection1/data/index
   [junit4]   2> 1232233 INFO  (coreLoadExecutor-4327-thread-1-processing-n:127.0.0.1:58501_ln_%2Flz) [n:127.0.0.1:58501_ln_%2Flz c:control_collection s:shard1 r:core_node1 x:collection1] o.a.s.u.RandomMergePolicy RandomMergePolicy wrapping class org.apache.lucene.index.LogByteSizeMergePolicy: [LogByteSizeMergePolicy: minMergeSize=1677721, mergeFactor=39, maxMergeSize=2147483648, maxMergeSizeForForcedMerge=9223372036854775807, calibrateSizeByDeletes=true, maxMergeDocs=2147483647, maxCFSSegmentSizeMB=8.796093022207999E12, noCFSRatio=0.38847940073839893]
   [junit4]   2> 1232234 INFO  (coreLoadExecutor-4327-thread-1-processing-n:127.0.0.1:58501_ln_%2Flz) [n:127.0.0.1:58501_ln_%2Flz c:control_collection s:shard1 r:core_node1 x:collection1] o.a.s.c.SolrCore SolrDeletionPolicy.onCommit: commits: num=1
   [junit4]   2> 	commit{dir=MockDirectoryWrapper(RAMDirectory@2d9cb37e lockFactory=org.apache.lucene.store.SingleInstanceLockFactory@58cef3f),segFN=segments_1,generation=1}
   [junit4]   2> 1232234 INFO  (coreLoadExecutor-4327-thread-1-processing-n:127.0.0.1:58501_ln_%2Flz) [n:127.0.0.1:58501_ln_%2Flz c:control_collection s:shard1 r:core_node1 x:collection1] o.a.s.c.SolrCore newest commit generation = 1
   [junit4]   2> 1232234 INFO  (OldIndexDirectoryCleanupThreadForCore-collection1) [n:127.0.0.1:58501_ln_%2Flz c:control_collection s:shard1 r:core_node1 x:collection1] o.a.s.c.SolrCore Looking for old index directories to cleanup for core collection1 in /home/jenkins/workspace/Lucene-Solr-trunk-Linux/solr/build/solr-core/test/J1/temp/solr.cloud.TestCloudPivotFacet_9CE37D1CCF8B99FB-001/control-001/cores/collection1/data/
   [junit4]   2> 1232235 WARN  (OldIndexDirectoryCleanupThreadForCore-collection1) [n:127.0.0.1:58501_ln_%2Flz c:control_collection s:shard1 r:core_node1 x:collection1] o.a.s.c.DirectoryFactory /home/jenkins/workspace/Lucene-Solr-trunk-Linux/solr/build/solr-core/test/J1/temp/solr.cloud.TestCloudPivotFacet_9CE37D1CCF8B99FB-001/control-001/cores/collection1/data/ does not point to a valid data directory; skipping clean-up of old index directories.
   [junit4]   2> 1232236 INFO  (coreLoadExecutor-4327-thread-1-processing-n:127.0.0.1:58501_ln_%2Flz) [n:127.0.0.1:58501_ln_%2Flz c:control_collection s:shard1 r:core_node1 x:collection1] o.a.s.u.p.UpdateRequestProcessorChain creating updateRequestProcessorChain "nodistrib"
   [junit4]   2> 1232236 INFO  (coreLoadExecutor-4327-thread-1-processing-n:127.0.0.1:58501_ln_%2Flz) [n:127.0.0.1:58501_ln_%2Flz c:control_collection s:shard1 r:core_node1 x:collection1] o.a.s.u.p.UpdateRequestProcessorChain creating updateRequestProcessorChain "dedupe"
   [junit4]   2> 1232237 INFO  (coreLoadExecutor-4327-thread-1-processing-n:127.0.0.1:58501_ln_%2Flz) [n:127.0.0.1:58501_ln_%2Flz c:control_collection s:shard1 r:core_node1 x:collection1] o.a.s.u.p.UpdateRequestProcessorChain inserting DistributedUpdateProcessorFactory into updateRequestProcessorChain "dedupe"
   [junit4]   2> 1232237 INFO  (coreLoadExecutor-4327-thread-1-processing-n:127.0.0.1:58501_ln_%2Flz) [n:127.0.0.1:58501_ln_%2Flz c:control_collection s:shard1 r:core_node1 x:collection1] o.a.s.u.p.UpdateRequestProcessorChain creating updateRequestProcessorChain "stored_sig"
   [junit4]   2> 1232237 INFO  (coreLoadExecutor-4327-thread-1-processing-n:127.0.0.1:58501_ln_%2Flz) [n:127.0.0.1:58501_ln_%2Flz c:control_collection s:shard1 r:core_node1 x:collection1] o.a.s.u.p.UpdateRequestProcessorChain inserting DistributedUpdateProcessorFactory into updateRequestProcessorChain "stored_sig"
   [junit4]   2> 1232237 INFO  (coreLoadExecutor-4327-thread-1-processing-n:127.0.0.1:58501_ln_%2Flz) [n:127.0.0.1:58501_ln_%2Flz c:control_collection s:shard1 r:core_node1 x:collection1] o.a.s.u.p.UpdateRequestProcessorChain creating updateRequestProcessorChain "distrib-dup-test-chain-explicit"
   [junit4]   2> 1232237 INFO  (coreLoadExecutor-4327-thread-1-processing-n:127.0.0.1:58501_ln_%2Flz) [n:127.0.0.1:58501_ln_%2Flz c:control_collection s:shard1 r:core_node1 x:collection1] o.a.s.u.p.UpdateRequestProcessorChain creating updateRequestProcessorChain "distrib-dup-test-chain-implicit"
   [junit4]   2> 1232237 INFO  (coreLoadExecutor-4327-thread-1-processing-n:127.0.0.1:58501_ln_%2Flz) [n:127.0.0.1:58501_ln_%2Flz c:control_collection s:shard1 r:core_node1 x:collection1] o.a.s.u.p.UpdateRequestProcessorChain inserting DistributedUpdateProcessorFactory into updateRequestProcessorChain "distrib-dup-test-chain-implicit"
   [junit4]   2> 1232237 INFO  (coreLoadExecutor-4327-thread-1-processing-n:127.0.0.1:58501_ln_%2Flz) [n:127.0.0.1:58501_ln_%2Flz c:control_collection s:shard1 r:core_node1 x:collection1] o.a.s.c.SolrCore no updateRequestProcessorChain defined as default, creating implicit default
   [junit4]   2> 1232238 INFO  (coreLoadExecutor-4327-thread-1-processing-n:127.0.0.1:58501_ln_%2Flz) [n:127.0.0.1:58501_ln_%2Flz c:control_collection s:shard1 r:core_node1 x:collection1] o.a.s.h.l.XMLLoader xsltCacheLifetimeSeconds=60
   [junit4]   2> 1232239 INFO  (coreLoadExecutor-4327-thread-1-processing-n:127.0.0.1:58501_ln_%2Flz) [n:127.0.0.1:58501_ln_%2Flz c:control_collection s:shard1 r:core_node1 x:collection1] o.a.s.h.l.XMLLoader xsltCacheLifetimeSeconds=60
   [junit4]   2> 1232239 INFO  (coreLoadExecutor-4327-thread-1-processing-n:127.0.0.1:58501_ln_%2Flz) [n:127.0.0.1:58501_ln_%2Flz c:control_collection s:shard1 r:core_node1 x:collection1] o.a.s.h.l.XMLLoader xsltCacheLifetimeSeconds=60
   [junit4]   2> 1232240 INFO  (coreLoadExecutor-4327-thread-1-processing-n:127.0.0.1:58501_ln_%2Flz) [n:127.0.0.1:58501_ln_%2Flz c:control_collection s:shard1 r:core_node1 x:collection1] o.a.s.h.l.XMLLoader xsltCacheLifetimeSeconds=60
   [junit4]   2> 1232242 INFO  (coreLoadExecutor-4327-thread-1-processing-n:127.0.0.1:58501_ln_%2Flz) [n:127.0.0.1:58501_ln_%2Flz c:control_collection s:shard1 r:core_node1 x:collection1] o.a.s.c.RequestHandlers Registered paths: /admin/mbeans,standard,/update/csv,/update/json/docs,/admin/luke,/admin/segments,/get,/admin/system,/replication,/admin/properties,/config,/schema,/admin/plugins,/admin/logging,/update/json,/admin/threads,/admin/ping,/update,/admin/file
   [junit4]   2> 1232242 INFO  (coreLoadExecutor-4327-thread-1-processing-n:127.0.0.1:58501_ln_%2Flz) [n:127.0.0.1:58501_ln_%2Flz c:control_collection s:shard1 r:core_node1 x:collection1] o.a.s.c.SolrCore Using default statsCache cache: org.apache.solr.search.stats.LocalStatsCache
   [junit4]   2> 1232242 INFO  (coreLoadExecutor-4327-thread-1-processing-n:127.0.0.1:58501_ln_%2Flz) [n:127.0.0.1:58501_ln_%2Flz c:control_collection s:shard1 r:core_node1 x:collection1] o.a.s.u.UpdateHandler Using UpdateLog implementation: org.apache.solr.update.UpdateLog
   [junit4]   2> 1232243 INFO  (coreLoadExecutor-4327-thread-1-processing-n:127.0.0.1:58501_ln_%2Flz) [n:127.0.0.1:58501_ln_%2Flz c:control_collection s:shard1 r:core_node1 x:collection1] o.a.s.u.UpdateLog Initializing UpdateLog: dataDir= defaultSyncLevel=FLUSH numRecordsToKeep=100 maxNumLogsToKeep=10 numVersionBuckets=65536
   [junit4]   2> 1232243 INFO  (coreLoadExecutor-4327-thread-1-processing-n:127.0.0.1:58501_ln_%2Flz) [n:127.0.0.1:58501_ln_%2Flz c:control_collection s:shard1 r:core_node1 x:collection1] o.a.s.c.SolrCore Hard AutoCommit: disabled
   [junit4]   2> 1232243 INFO  (coreLoadExecutor-4327-thread-1-processing-n:127.0.0.1:58501_ln_%2Flz) [n:127.0.0.1:58501_ln_%2Flz c:control_collection s:shard1 r:core_node1 x:collection1] o.a.s.c.SolrCore Soft AutoCommit: disabled
   [junit4]   2> 1232244 INFO  (coreLoadExecutor-4327-thread-1-processing-n:127.0.0.1:58501_ln_%2Flz) [n:127.0.0.1:58501_ln_%2Flz c:control_collection s:shard1 r:core_node1 x:collection1] o.a.s.u.RandomMergePolicy RandomMergePolicy wrapping class org.apache.lucene.index.TieredMergePolicy: [TieredMergePolicy: maxMergeAtOnce=15, maxMergeAtOnceExplicit=21, maxMergedSegmentMB=19.9697265625, floorSegmentMB=0.400390625, forceMergeDeletesPctAllowed=29.482463469247342, segmentsPerTier=20.0, maxCFSSegmentSizeMB=8.796093022207999E12, noCFSRatio=0.0
   [junit4]   2> 1232244 INFO  (coreLoadExecutor-4327-thread-1-processing-n:127.0.0.1:58501_ln_%2Flz) [n:127.0.0.1:58501_ln_%2Flz c:control_collection s:shard1 r:core_node1 x:collection1] o.a.s.c.SolrCore SolrDeletionPolicy.onInit: commits: num=1
   [junit4]   2> 	commit{dir=MockDirectoryWrapper(RAMDirectory@2d9cb37e lockFactory=org.apache.lucene.store.SingleInstanceLockFactory@58cef3f),segFN=segments_1,generation=1}
   [junit4]   2> 1232244 INFO  (coreLoadExecutor-4327-thread-1-processing-n:127.0.0.1:58501_ln_%2Flz) [n:127.0.0.1:58501_ln_%2Flz c:control_collection s:shard1 r:core_node1 x:collection1] o.a.s.c.SolrCore newest commit generation = 1
   [junit4]   2> 1232244 INFO  (coreLoadExecutor-4327-thread-1-processing-n:127.0.0.1:58501_ln_%2Flz) [n:127.0.0.1:58501_ln_%2Flz c:control_collection s:shard1 r:core_node1 x:collection1] o.a.s.s.SolrIndexSearcher Opening Searcher@5c9c6821[collection1] main
   [junit4]   2> 1232245 INFO  (coreLoadExecutor-4327-thread-1-processing-n:127.0.0.1:58501_ln_%2Flz) [n:127.0.0.1:58501_ln_%2Flz c:control_collection s:shard1 r:core_node1 x:collection1] o.a.s.r.ManagedResourceStorage Setting up ZooKeeper-based storage for the RestManager with znodeBase: /configs/conf1
   [junit4]   2> 1232245 INFO  (coreLoadExecutor-4327-thread-1-processing-n:127.0.0.1:58501_ln_%2Flz) [n:127.0.0.1:58501_ln_%2Flz c:control_collection s:shard1 r:core_node1 x:collection1] o.a.s.r.ManagedResourceStorage Configured ZooKeeperStorageIO with znodeBase: /configs/conf1
   [junit4]   2> 1232245 INFO  (coreLoadExecutor-4327-thread-1-processing-n:127.0.0.1:58501_ln_%2Flz) [n:127.0.0.1:58501_ln_%2Flz c:control_collection s:shard1 r:core_node1 x:collection1] o.a.s.r.RestManager Initializing RestManager with initArgs: {}
   [junit4]   2> 1232245 INFO  (coreLoadExecutor-4327-thread-1-processing-n:127.0.0.1:58501_ln_%2Flz) [n:127.0.0.1:58501_ln_%2Flz c:control_collection s:shard1 r:core_node1 x:collection1] o.a.s.r.ManagedResourceStorage Reading _rest_managed.json using ZooKeeperStorageIO:path=/configs/conf1
   [junit4]   2> 1232245 INFO  (coreLoadExecutor-4327-thread-1-processing-n:127.0.0.1:58501_ln_%2Flz) [n:127.0.0.1:58501_ln_%2Flz c:control_collection s:shard1 r:core_node1 x:collection1] o.a.s.r.ManagedResourceStorage No data found for znode /configs/conf1/_rest_managed.json
   [junit4]   2> 1232245 INFO  (coreLoadExecutor-4327-thread-1-processing-n:127.0.0.1:58501_ln_%2Flz) [n:127.0.0.1:58501_ln_%2Flz c:control_collection s:shard1 r:core_node1 x:collection1] o.a.s.r.ManagedResourceStorage Loaded null at path _rest_managed.json using ZooKeeperStorageIO:path=/configs/conf1
   [junit4]   2> 1232245 INFO  (coreLoadExecutor-4327-thread-1-processing-n:127.0.0.1:58501_ln_%2Flz) [n:127.0.0.1:58501_ln_%2Flz c:control_collection s:shard1 r:core_node1 x:collection1] o.a.s.r.RestManager Initializing 0 registered ManagedResources
   [junit4]   2> 1232246 INFO  (coreLoadExecutor-4327-thread-1-processing-n:127.0.0.1:58501_ln_%2Flz) [n:127.0.0.1:58501_ln_%2Flz c:control_collection s:shard1 r:core_node1 x:collection1] o.a.s.h.ReplicationHandler Commits will be reserved for  10000
   [junit4]   2> 1232246 INFO  (searcherExecutor-4328-thread-1-processing-n:127.0.0.1:58501_ln_%2Flz x:collection1 s:shard1 c:control_collection r:core_node1) [n:127.0.0.1:58501_ln_%2Flz c:control_collection s:shard1 r:core_node1 x:collection1] o.a.s.c.SolrCore [collection1] Registered new searcher Searcher@5c9c6821[collection1] main{ExitableDirectoryReader(UninvertingDirectoryReader())}
   [junit4]   2> 1232246 INFO  (coreLoadExecutor-4327-thread-1-processing-n:127.0.0.1:58501_ln_%2Flz) [n:127.0.0.1:58501_ln_%2Flz c:control_collection s:shard1 r:core_node1 x:collection1] o.a.s.u.UpdateLog Looking up max value of version field to seed version buckets
   [junit4]   2> 1232246 INFO  (coreLoadExecutor-4327-thread-1-processing-n:127.0.0.1:58501_ln_%2Flz) [n:127.0.0.1:58501_ln_%2Flz c:control_collection s:shard1 r:core_node1 x:collection1] o.a.s.u.VersionInfo Refreshing highest value of _version_ for 65536 version buckets from index
   [junit4]   2> 1232246 INFO  (coreLoadExecutor-4327-thread-1-processing-n:127.0.0.1:58501_ln_%2Flz) [n:127.0.0.1:58501_ln_%2Flz c:control_collection s:shard1 r:core_node1 x:collection1] o.a.s.u.VersionInfo No terms found for _version_, cannot seed version bucket highest value from index
   [junit4]   2> 1232246 INFO  (coreLoadExecutor-4327-thread-1-processing-n:127.0.0.1:58501_ln_%2Flz) [n:127.0.0.1:58501_ln_%2Flz c:control_collection s:shard1 r:core_node1 x:collection1] o.a.s.u.UpdateLog Could not find max version in index or recent updates, using new clock 1506961938335137792
   [junit4]   2> 1232248 INFO  (coreLoadExecutor-4327-thread-1-processing-n:127.0.0.1:58501_ln_%2Flz) [n:127.0.0.1:58501_ln_%2Flz c:control_collection s:shard1 r:core_node1 x:collection1] o.a.s.u.UpdateLog Took 2 ms to seed version buckets with highest version 1506961938335137792
   [junit4]   2> 1232248 INFO  (coreLoadExecutor-4327-thread-1-processing-n:127.0.0.1:58501_ln_%2Flz) [n:127.0.0.1:58501_ln_%2Flz c:control_collection s:shard1 r:core_node1 x:collection1] o.a.s.c.ZkController watch zkdir /configs/conf1
   [junit4]   2> 1232249 INFO  (coreLoadExecutor-4327-thread-1-processing-n:127.0.0.1:58501_ln_%2Flz) [n:127.0.0.1:58501_ln_%2Flz c:control_collection s:shard1 r:core_node1 x:collection1] o.a.s.c.CoreContainer registering core: collection1
   [junit4]   2> 1232249 INFO  (coreZkRegister-4321-thread-1-processing-n:127.0.0.1:58501_ln_%2Flz x:collection1 s:shard1 c:control_collection r:core_node1) [n:127.0.0.1:58501_ln_%2Flz c:control_collection s:shard1 r:core_node1 x:collection1] o.a.s.c.ZkController Register replica - core:collection1 address:http://127.0.0.1:58501/ln_/lz collection:control_collection shard:shard1
   [junit4]   2> 1232250 INFO  (coreZkRegister-4321-thread-1-processing-n:127.0.0.1:58501_ln_%2Flz x:collection1 s:shard1 c:control_collection r:core_node1) [n:127.0.0.1:58501_ln_%2Flz c:control_collection s:shard1 r:core_node1 x:collection1] o.a.s.c.LeaderElector Joined leadership election with path: /collections/control_collection/leader_elect/shard1/election/94185121059045379-core_node1-n_0000000000
   [junit4]   2> 1232251 INFO  (coreZkRegister-4321-thread-1-processing-n:127.0.0.1:58501_ln_%2Flz x:collection1 s:shard1 c:control_collection r:core_node1) [n:127.0.0.1:58501_ln_%2Flz c:control_collection s:shard1 r:core_node1 x:collection1] o.a.s.c.ShardLeaderElectionContext Running the leader process for shard shard1
   [junit4]   2> 1232252 INFO  (zkCallback-940-thread-1-processing-n:127.0.0.1:58501_ln_%2Flz) [n:127.0.0.1:58501_ln_%2Flz    ] o.a.s.c.DistributedQueue NodeChildrenChanged fired on path /overseer/queue state SyncConnected
   [junit4]   2> 1232252 INFO  (coreZkRegister-4321-thread-1-processing-n:127.0.0.1:58501_ln_%2Flz x:collection1 s:shard1 c:control_collection r:core_node1) [n:127.0.0.1:58501_ln_%2Flz c:control_collection s:shard1 r:core_node1 x:collection1] o.a.s.c.ShardLeaderElectionContext Enough replicas found to continue.
   [junit4]   2> 1232252 INFO  (coreZkRegister-4321-thread-1-processing-n:127.0.0.1:58501_ln_%2Flz x:collection1 s:shard1 c:control_collection r:core_node1) [n:127.0.0.1:58501_ln_%2Flz c:control_collection s:shard1 r:core_node1 x:collection1] o.a.s.c.ShardLeaderElectionContext I may be the new leader - try and sync
   [junit4]   2> 1232252 INFO  (OverseerStateUpdate-94185121059045379-127.0.0.1:58501_ln_%2Flz-n_0000000000) [n:127.0.0.1:58501_ln_%2Flz    ] o.a.s.c.Overseer processMessage: queueSize: 1, message = {
   [junit4]   2>   "operation":"leader",
   [junit4]   2>   "shard":"shard1",
   [junit4]   2>   "collection":"control_collection"} current state version: 1
   [junit4]   2> 1232252 INFO  (coreZkRegister-4321-thread-1-processing-n:127.0.0.1:58501_ln_%2Flz x:collection1 s:shard1 c:control_collection r:core_node1) [n:127.0.0.1:58501_ln_%2Flz c:control_collection s:shard1 r:core_node1 x:collection1] o.a.s.c.SyncStrategy Sync replicas to http://127.0.0.1:58501/ln_/lz/collection1/
   [junit4]   2> 1232252 INFO  (coreZkRegister-4321-thread-1-processing-n:127.0.0.1:58501_ln_%2Flz x:collection1 s:shard1 c:control_collection r:core_node1) [n:127.0.0.1:58501_ln_%2Flz c:control_collection s:shard1 r:core_node1 x:collection1] o.a.s.c.SyncStrategy Sync Success - now sync replicas to me
   [junit4]   2> 1232252 INFO  (coreZkRegister-4321-thread-1-processing-n:127.0.0.1:58501_ln_%2Flz x:collection1 s:shard1 c:control_collection r:core_node1) [n:127.0.0.1:58501_ln_%2Flz c:control_collection s:shard1 r:core_node1 x:collection1] o.a.s.c.SyncStrategy http://127.0.0.1:58501/ln_/lz/collection1/ has no replicas
   [junit4]   2> 1232252 INFO  (coreZkRegister-4321-thread-1-processing-n:127.0.0.1:58501_ln_%2Flz x:collection1 s:shard1 c:control_collection r:core_node1) [n:127.0.0.1:58501_ln_%2Flz c:control_collection s:shard1 r:core_node1 x:collection1] o.a.s.c.ShardLeaderElectionContext I am the new leader: http://127.0.0.1:58501/ln_/lz/collection1/ shard1
   [junit4]   2> 1232253 INFO  (zkCallback-940-thread-1-processing-n:127.0.0.1:58501_ln_%2Flz) [n:127.0.0.1:58501_ln_%2Flz    ] o.a.s.c.DistributedQueue NodeChildrenChanged fired on path /overseer/queue state SyncConnected
   [junit4]   2> 1232254 INFO  (OverseerStateUpdate-94185121059045379-127.0.0.1:58501_ln_%2Flz-n_0000000000) [n:127.0.0.1:58501_ln_%2Flz    ] o.a.s.c.Overseer processMessage: queueSize: 1, message = {
   [junit4]   2>   "operation":"leader",
   [junit4]   2>   "shard":"shard1",
   [junit4]   2>   "collection":"control_collection",
   [junit4]   2>   "base_url":"http://127.0.0.1:58501/ln_/lz",
   [junit4]   2>   "core":"collection1",
   [junit4]   2>   "state":"active"} current state version: 1
   [junit4]   2> 1232404 INFO  (coreZkRegister-4321-thread-1-processing-n:127.0.0.1:58501_ln_%2Flz x:collection1 s:shard1 c:control_collection r:core_node1) [n:127.0.0.1:58501_ln_%2Flz c:control_collection s:shard1 r:core_node1 x:collection1] o.a.s.c.ZkController We are http://127.0.0.1:58501/ln_/lz/collection1/ and leader is http://127.0.0.1:58501/ln_/lz/collection1/
   [junit4]   2> 1232404 INFO  (coreZkRegister-4321-thread-1-processing-n:127.0.0.1:58501_ln_%2Flz x:collection1 s:shard1 c:control_collection r:core_node1) [n:127.0.0.1:58501_ln_%2Flz c:control_collection s:shard1 r:core_node1 x:collection1] o.a.s.c.ZkController No LogReplay needed for core=collection1 baseURL=http://127.0.0.1:58501/ln_/lz
   [junit4]   2> 1232404 INFO  (coreZkRegister-4321-thread-1-processing-n:127.0.0.1:58501_ln_%2Flz x:collection1 s:shard1 c:control_collection r:core_node1) [n:127.0.0.1:58501_ln_%2Flz c:control_collection s:shard1 r:core_node1 x:collection1] o.a.s.c.ZkController I am the leader, no recovery necessary
   [junit4]   2> 1232404 INFO  (coreZkRegister-4321-thread-1-processing-n:127.0.0.1:58501_ln_%2Flz x:collection1 s:shard1 c:control_collection r:core_node1) [n:127.0.0.1:58501_ln_%2Flz c:control_collection s:shard1 r:core_node1 x:collection1] o.a.s.c.ZkController publishing state=active
   [junit4]   2> 1232404 INFO  (coreZkRegister-4321-thread-1-processing-n:127.0.0.1:58501_ln_%2Flz x:collection1 s:shard1 c:control_collection r:core_node1) [n:127.0.0.1:58501_ln_%2Flz c:control_collection s:shard1 r:core_node1 x:collection1] o.a.s.c.ZkController numShards not found on descriptor - reading it from system property
   [junit4]   2> 1232405 INFO  (zkCallback-940-thread-1-processing-n:127.0.0.1:58501_ln_%2Flz) [n:127.0.0.1:58501_ln_%2Flz    ] o.a.s.c.DistributedQueue NodeChildrenChanged fired on path /overseer/queue state SyncConnected
   [junit4]   2> 1232405 INFO  (OverseerStateUpdate-94185121059045379-127.0.0.1:58501_ln_%2Flz-n_0000000000) [n:127.0.0.1:58501_ln_%2Flz    ] o.a.s.c.Overseer processMessage: queueSize: 1, message = {
   [junit4]   2>   "core":"collection1",
   [junit4]   2>   "core_node_name":"core_node1",
   [junit4]   2>   "roles":null,
   [junit4]   2>   "base_url":"http://127.0.0.1:58501/ln_/lz",
   [junit4]   2>   "node_name":"127.0.0.1:58501_ln_%2Flz",
   [junit4]   2>   "numShards":"1",
   [junit4]   2>   "state":"active",
   [junit4]   2>   "shard":"shard1",
   [junit4]   2>   "collection":"control_collection",
   [junit4]   2>   "operation":"state"} current state version: 2
   [junit4]   2> 1232406 INFO  (OverseerStateUpdate-94185121059045379-127.0.0.1:58501_ln_%2Flz-n_0000000000) [n:127.0.0.1:58501_ln_%2Flz    ] o.a.s.c.o.ReplicaMutator Update state numShards=1 message={
   [junit4]   2>   "core":"collection1",
   [junit4]   2>   "core_node_name":"core_node1",
   [junit4]   2>   "roles":null,
   [junit4]   2>   "base_url":"http://127.0.0.1:58501/ln_/lz",
   [junit4]   2>   "node_name":"127.0.0.1:58501_ln_%2Flz",
   [junit4]   2>   "numShards":"1",
   [junit4]   2>   "state":"active",
   [junit4]   2>   "shard":"shard1",
   [junit4]   2>   "collection":"control_collection",
   [junit4]   2>   "operation":"state"}
   [junit4]   2> 1232617 INFO  (TEST-TestCloudPivotFacet.test-seed#[9CE37D1CCF8B99FB]) [    ] o.a.s.c.ChaosMonkey monkey: init - expire sessions:false cause connection loss:false
   [junit4]   2> 1232617 INFO  (TEST-TestCloudPivotFacet.test-seed#[9CE37D1CCF8B99FB]) [    ] o.a.s.c.AbstractFullDistribZkTestBase Creating collection1 with stateFormat=2
   [junit4]   2> 1232619 INFO  (zkCallback-940-thread-1-processing-n:127.0.0.1:58501_ln_%2Flz) [n:127.0.0.1:58501_ln_%2Flz    ] o.a.s.c.DistributedQueue NodeChildrenChanged fired on path /overseer/queue state SyncConnected
   [junit4]   2> 1232619 INFO  (OverseerStateUpdate-94185121059045379-127.0.0.1:58501_ln_%2Flz-n_0000000000) [n:127.0.0.1:58501_ln_%2Flz    ] o.a.s.c.Overseer processMessage: queueSize: 1, message = {
   [junit4]   2>   "operation":"create",
   [junit4]   2>   "name":"collection1",
   [junit4]   2>   "numShards":"2",
   [junit4]   2>   "stateFormat":"2"} current state version: 3
   [junit4]   2> 1232619 INFO  (OverseerStateUpdate-94185121059045379-127.0.0.1:58501_ln_%2Flz-n_0000000000) [n:127.0.0.1:58501_ln_%2Flz    ] o.a.s.c.o.ClusterStateMutator building a new cName: collection1
   [junit4]   2> 1232663 INFO  (TEST-TestCloudPivotFacet.test-seed#[9CE37D1CCF8B99FB]) [    ] o.a.s.SolrTestCaseJ4 Writing core.properties file to /home/jenkins/workspace/Lucene-Solr-trunk-Linux/solr/build/solr-core/test/J1/temp/solr.cloud.TestCloudPivotFacet_9CE37D1CCF8B99FB-001/shard-1-001/cores/collection1
   [junit4]   2> 1232663 INFO  (TEST-TestCloudPivotFacet.test-seed#[9CE37D1CCF8B99FB]) [    ] o.a.s.c.AbstractFullDistribZkTestBase create jetty 1 in directory /home/jenkins/workspace/Lucene-Solr-trunk-Linux/solr/build/solr-core/test/J1/temp/solr.cloud.TestCloudPivotFacet_9CE37D1CCF8B99FB-001/shard-1-001
   [junit4]   2> 1232664 INFO  (TEST-TestCloudPivotFacet.test-seed#[9CE37D1CCF8B99FB]) [    ] o.e.j.s.Server jetty-9.2.11.v20150529
   [junit4]   2> 1232664 INFO  (TEST-TestCloudPivotFacet.test-seed#[9CE37D1CCF8B99FB]) [    ] o.e.j.s.h.ContextHandler Started o.e.j.s.ServletContextHandler@7209d435{/ln_/lz,null,AVAILABLE}
   [junit4]   2> 1232665 INFO  (TEST-TestCloudPivotFacet.test-seed#[9CE37D1CCF8B99FB]) [    ] o.e.j.s.ServerConnector Started ServerConnector@2ba87594{HTTP/1.1}{127.0.0.1:51086}
   [junit4]   2> 1232665 INFO  (TEST-TestCloudPivotFacet.test-seed#[9CE37D1CCF8B99FB]) [    ] o.e.j.s.Server Started @1234320ms
   [junit4]   2> 1232665 INFO  (TEST-TestCloudPivotFacet.test-seed#[9CE37D1CCF8B99FB]) [    ] o.a.s.c.s.e.JettySolrRunner Jetty properties: {solr.data.dir=/home/jenkins/workspace/Lucene-Solr-trunk-Linux/solr/build/solr-core/test/J1/temp/solr.cloud.TestCloudPivotFacet_9CE37D1CCF8B99FB-001/tempDir-001/jetty1, solrconfig=solrconfig.xml, hostContext=/ln_/lz, hostPort=51086, coreRootDirectory=/home/jenkins/workspace/Lucene-Solr-trunk-Linux/solr/build/solr-core/test/J1/../../../../../../../../../home/jenkins/workspace/Lucene-Solr-trunk-Linux/solr/build/solr-core/test/J1/temp/solr.cloud.TestCloudPivotFacet_9CE37D1CCF8B99FB-001/shard-1-001/cores}
   [junit4]   2> 1232665 INFO  (TEST-TestCloudPivotFacet.test-seed#[9CE37D1CCF8B99FB]) [    ] o.a.s.s.SolrDispatchFilter SolrDispatchFilter.init(): sun.misc.Launcher$AppClassLoader@4e0e2f2a
   [junit4]   2> 1232665 INFO  (TEST-TestCloudPivotFacet.test-seed#[9CE37D1CCF8B99FB]) [    ] o.a.s.c.SolrResourceLoader new SolrResourceLoader for directory: '/home/jenkins/workspace/Lucene-Solr-trunk-Linux/solr/build/solr-core/test/J1/../../../../../../../../../home/jenkins/workspace/Lucene-Solr-trunk-Linux/solr/build/solr-core/test/J1/temp/solr.cloud.TestCloudPivotFacet_9CE37D1CCF8B99FB-001/shard-1-001/'
   [junit4]   2> 1232673 INFO  (TEST-TestCloudPivotFacet.test-seed#[9CE37D1CCF8B99FB]) [    ] o.a.s.c.SolrXmlConfig Loading container configuration from /home/jenkins/workspace/Lucene-Solr-trunk-Linux/solr/build/solr-core/test/J1/../../../../../../../../../home/jenkins/workspace/Lucene-Solr-trunk-Linux/solr/build/solr-core/test/J1/temp/solr.cloud.TestCloudPivotFacet_9CE37D1CCF8B99FB-001/shard-1-001/solr.xml
   [junit4]   2> 1232676 INFO  (TEST-TestCloudPivotFacet.test-seed#[9CE37D1CCF8B99FB]) [    ] o.a.s.c.CoresLocator Config-defined core root directory: /home/jenkins/workspace/Lucene-Solr-trunk-Linux/solr/build/solr-core/test/J1/../../../../../../../../../home/jenkins/workspace/Lucene-Solr-trunk-Linux/solr/build/solr-core/test/J1/temp/solr.cloud.TestCloudPivotFacet_9CE37D1CCF8B99FB-001/shard-1-001/cores
   [junit4]   2> 1232677 INFO  (TEST-TestCloudPivotFacet.test-seed#[9CE37D1CCF8B99FB]) [    ] o.a.s.c.CoreContainer New CoreContainer 89986271
   [junit4]   2> 1232677 INFO  (TEST-TestCloudPivotFacet.test-seed#[9CE37D1CCF8B99FB]) [    ] o.a.s.c.CoreContainer Loading cores into CoreContainer [instanceDir=/home/jenkins/workspace/Lucene-Solr-trunk-Linux/solr/build/solr-core/test/J1/../../../../../../../../../home/jenkins/workspace/Lucene-Solr-trunk-Linux/solr/build/solr-core/test/J1/temp/solr.cloud.TestCloudPivotFacet_9CE37D1CCF8B99FB-001/shard-1-001/]
   [junit4]   2> 1232677 INFO  (TEST-TestCloudPivotFacet.test-seed#[9CE37D1CCF8B99FB]) [    ] o.a.s.c.CoreContainer loading shared library: /home/jenkins/workspace/Lucene-Solr-trunk-Linux/solr/build/solr-core/test/J1/../../../../../../../../../home/jenkins/workspace/Lucene-Solr-trunk-Linux/solr/build/solr-core/test/J1/temp/solr.cloud.TestCloudPivotFacet_9CE37D1CCF8B99FB-001/shard-1-001/lib
   [junit4]   2> 1232677 WARN  (TEST-TestCloudPivotFacet.test-seed#[9CE37D1CCF8B99FB]) [    ] o.a.s.c.SolrResourceLoader Can't find (or read) directory to add to classloader: lib (resolved as: /home/jenkins/workspace/Lucene-Solr-trunk-Linux/solr/build/solr-core/test/J1/../../../../../../../../../home/jenkins/workspace/Lucene-Solr-trunk-Linux/solr/build/solr-core/test/J1/temp/solr.cloud.TestCloudPivotFacet_9CE37D1CCF8B99FB-001/shard-1-001/lib).
   [junit4]   2> 1232681 INFO  (TEST-TestCloudPivotFacet.test-seed#[9CE37D1CCF8B99FB]) [    ] o.a.s.h.c.HttpShardHandlerFactory created with socketTimeout : 90000,urlScheme : ,connTimeout : 15000,maxConnectionsPerHost : 20,maxConnections : 10000,corePoolSize : 0,maximumPoolSize : 2147483647,maxThreadIdleTime : 5,sizeOfQueue : -1,fairnessPolicy : false,useRetries : false,
   [junit4]   2> 1232681 INFO  (TEST-TestCloudPivotFacet.test-seed#[9CE37D1CCF8B99FB]) [    ] o.a.s.u.UpdateShardHandler Creating UpdateShardHandler HTTP client with params: socketTimeout=340000&connTimeout=45000&retry=true
   [junit4]   2> 1232682 INFO  (TEST-TestCloudPivotFacet.test-seed#[9CE37D1CCF8B99FB]) [    ] o.a.s.l.LogWatcher SLF4J impl is org.slf4j.impl.Log4jLoggerFactory
   [junit4]   2> 1232682 INFO  (TEST-TestCloudPivotFacet.test-seed#[9CE37D1CCF8B99FB]) [    ] o.a.s.l.LogWatcher Registering Log Listener [Log4j (org.slf4j.impl.Log4jLoggerFactory)]
   [junit4]   2> 1232682 INFO  (TEST-TestCloudPivotFacet.test-seed#[9CE37D1CCF8B99FB]) [    ] o.a.s.c.ZkContainer Zookeeper client=127.0.0.1:35411/solr
   [junit4]   2> 1232682 INFO  (TEST-TestCloudPivotFacet.test-seed#[9CE37D1CCF8B99FB]) [    ] o.a.s.c.ZkController zkHost includes chroot
   [junit4]   2> 1232720 INFO  (OverseerStateUpdate-94185121059045379-127.0.0.1:58501_ln_%2Flz-n_0000000000) [n:127.0.0.1:58501_ln_%2Flz    ] o.a.s.c.o.ZkStateWriter going to create_collection /collections/collection1/state.json
   [junit4]   2> 1233686 INFO  (TEST-TestCloudPivotFacet.test-seed#[9CE37D1CCF8B99FB]) [n:127.0.0.1:51086_ln_%2Flz    ] o.a.s.c.ZkController Register node as live in ZooKeeper:/live_nodes/127.0.0.1:51086_ln_%2Flz
   [junit4]   2> 1233687 INFO  (TEST-TestCloudPivotFacet.test-seed#[9CE37D1CCF8B99FB]) [n:127.0.0.1:51086_ln_%2Flz    ] o.a.s.c.Overseer Overseer (id=null) closing
   [junit4]   2> 1233688 INFO  (TEST-TestCloudPivotFacet.test-seed#[9CE37D1CCF8B99FB]) [n:127.0.0.1:51086_ln_%2Flz    ] o.a.s.c.LeaderElector Joined leadership election with path: /overseer_elect/election/94185121059045383-127.0.0.1:51086_ln_%2Flz-n_0000000001
   [junit4]   2> 1233688 INFO  (TEST-TestCloudPivotFacet.test-seed#[9CE37D1CCF8B99FB]) [n:127.0.0.1:51086_ln_%2Flz    ] o.a.s.c.LeaderElector Watching path /overseer_elect/election/94185121059045379-127.0.0.1:58501_ln_%2Flz-n_0000000000 to know if I could be the leader
   [junit4]   2> 1233688 INFO  (TEST-TestCloudPivotFacet.test-seed#[9CE37D1CCF8B99FB]) [n:127.0.0.1:51086_ln_%2Flz    ] o.a.s.c.CoreContainer No authentication plugin used.
   [junit4]   2> 1233688 INFO  (TEST-TestCloudPivotFacet.test-seed#[9CE37D1CCF8B99FB]) [n:127.0.0.1:51086_ln_%2Flz    ] o.a.s.c.CoreContainer Security conf doesn't exist. Skipping setup for authorization module.
   [junit4]   2> 1233689 INFO  (TEST-TestCloudPivotFacet.test-seed#[9CE37D1CCF8B99FB]) [n:127.0.0.1:51086_ln_%2Flz    ] o.a.s.c.CoresLocator Looking for core definitions underneath /home/jenkins/workspace/Lucene-Solr-trunk-Linux/solr/build/solr-core/test/J1/../../../../../../../../../home/jenkins/workspace/Lucene-Solr-trunk-Linux/solr/build/solr-core/test/J1/temp/solr.cloud.TestCloudPivotFacet_9CE37D1CCF8B99FB-001/shard-1-001/cores
   [junit4]   2> 1233689 INFO  (TEST-TestCloudPivotFacet.test-seed#[9CE37D1CCF8B99FB]) [n:127.0.0.1:51086_ln_%2Flz    ] o.a.s.c.SolrCore Created CoreDescriptor: {name=collection1, config=solrconfig.xml, transient=false, schema=schema.xml, loadOnStartup=true, configSetProperties=configsetprops.json, instanceDir=/home/jenkins/workspace/Lucene-Solr-trunk-Linux/solr/build/solr-core/test/J1/../../../../../../../../../home/jenkins/workspace/Lucene-Solr-trunk-Linux/solr/build/solr-core/test/J1/temp/solr.cloud.TestCloudPivotFacet_9CE37D1CCF8B99FB-001/shard-1-001/cores/collection1, collection=collection1, absoluteInstDir=/home/jenkins/workspace/Lucene-Solr-trunk-Linux/solr/build/solr-core/test/J1/../../../../../../../../../home/jenkins/workspace/Lucene-Solr-trunk-Linux/solr/build/solr-core/test/J1/temp/solr.cloud.TestCloudPivotFacet_9CE37D1CCF8B99FB-001/shard-1-001/cores/collection1/, coreNodeName=, dataDir=data/, shard=}
   [junit4]   2> 1233689 INFO  (TEST-TestCloudPivotFacet.test-seed#[9CE37D1CCF8B99FB]) [n:127.0.0.1:51086_ln_%2Flz    ] o.a.s.c.CoresLocator Found core collection1 in /home/jenkins/workspace/Lucene-Solr-trunk-Linux/solr/build/solr-core/test/J1/../../../../../../../../../home/jenkins/workspace/Lucene-Solr-trunk-Linux/solr/build/solr-core/test/J1/temp/solr.cloud.TestCloudPivotFacet_9CE37D1CCF8B99FB-001/shard-1-001/cores/collection1/
   [junit4]   2> 1233689 INFO  (TEST-TestCloudPivotFacet.test-seed#[9CE37D1CCF8B99FB]) [n:127.0.0.1:51086_ln_%2Flz    ] o.a.s.c.CoresLocator Found 1 core definitions
   [junit4]   2> 1233690 INFO  (TEST-TestCloudPivotFacet.test-seed#[9CE37D1CCF8B99FB]) [n:127.0.0.1:51086_ln_%2Flz    ] o.a.s.s.SolrDispatchFilter user.dir=/home/jenkins/workspace/Lucene-Solr-trunk-Linux/solr/build/solr-core/test/J1
   [junit4]   2> 1233690 INFO  (TEST-TestCloudPivotFacet.test-seed#[9CE37D1CCF8B99FB]) [n:127.0.0.1:51086_ln_%2Flz    ] o.a.s.s.SolrDispatchFilter SolrDispatchFilter.init() done
   [junit4]   2> 1233690 INFO  (coreLoadExecutor-4338-thread-1-processing-n:127.0.0.1:51086_ln_%2Flz) [n:127.0.0.1:51086_ln_%2Flz c:collection1   x:collection1] o.a.s.c.ZkController publishing state=down
   [junit4]   2> 1233690 INFO  (coreLoadExecutor-4338-thread-1-processing-n:127.0.0.1:51086_ln_%2Flz) [n:127.0.0.1:51086_ln_%2Flz c:collection1   x:collection1] o.a.s.c.ZkController numShards not found on descriptor - reading it from system property
   [junit4]   2> 1233691 INFO  (zkCallback-940-thread-1-processing-n:127.0.0.1:58501_ln_%2Flz) [n:127.0.0.1:58501_ln_%2Flz    ] o.a.s.c.DistributedQueue NodeChildrenChanged fired on path /overseer/queue state SyncConnected
   [junit4]   2> 1233691 INFO  (coreLoadExecutor-4338-thread-1-processing-n:127.0.0.1:51086_ln_%2Flz) [n:127.0.0.1:51086_ln_%2Flz c:collection1   x:collection1] o.a.s.c.ZkController Registering watch for external collection collection1
   [junit4]   2> 1233691 INFO  (OverseerStateUpdate-94185121059045379-127.0.0.1:58501_ln_%2Flz-n_0000000000) [n:127.0.0.1:58501_ln_%2Flz    ] o.a.s.c.Overseer processMessage: queueSize: 1, message = {
   [junit4]   2>   "core":"collection1",
   [junit4]   2>   "roles":null,
   [junit4]   2>   "base_url":"http://127.0.0.1:51086/ln_/lz",
   [junit4]   2>   "node_name":"127.0.0.1:51086_ln_%2Flz",
   [junit4]   2>   "numShards":"2",
   [junit4]   2>   "state":"down",
   [junit4]   2>   "shard":null,
   [junit4]   2>   "collection":"collection1",
   [junit4]   2>   "operation":"state"} current state version: 4
   [junit4]   2> 1233692 INFO  (coreLoadExecutor-4338-thread-1-processing-n:127.0.0.1:51086_ln_%2Flz) [n:127.0.0.1:51086_ln_%2Flz c:collection1   x:collection1] o.a.s.c.ZkController look for our core node name
   [junit4]   2> 1233692 INFO  (OverseerStateUpdate-94185121059045379-127.0.0.1:58501_ln_%2Flz-n_0000000000) [n:127.0.0.1:58501_ln_%2Flz    ] o.a.s.c.o.ReplicaMutator Update state numShards=2 message={
   [junit4]   2>   "core":"collection1",
   [junit4]   2>   "roles":null,
   [junit4]   2>   "base_url":"http://127.0.0.1:51086/ln_/lz",
   [junit4]   2>   "node_name":"127.0.0.1:51086_ln_%2Flz",
   [junit4]   2>   "numShards":"2",
   [junit4]   2>   "state":"down",
   [junit4]   2>   "shard":null,
   [junit4]   2>   "collection":"collection1",
   [junit4]   2>   "operation":"state"}
   [junit4]   2> 1233692 INFO  (OverseerStateUpdate-94185121059045379-127.0.0.1:58501_ln_%2Flz-n_0000000000) [n:127.0.0.1:58501_ln_%2Flz    ] o.a.s.c.o.ReplicaMutator Collection already exists with numShards=2
   [junit4]   2> 1233692 INFO  (OverseerStateUpdate-94185121059045379-127.0.0.1:58501_ln_%2Flz-n_0000000000) [n:127.0.0.1:58501_ln_%2Flz    ] o.a.s.c.o.ReplicaMutator Assigning new node to shard shard=shard2
   [junit4]   2> 1233793 INFO  (OverseerStateUpdate-94185121059045379-127.0.0.1:58501_ln_%2Flz-n_0000000000) [n:127.0.0.1:58501_ln_%2Flz    ] o.a.s.c.o.ZkStateWriter going to update_collection /collections/collection1/state.json version: 0
   [junit4]   2> 1234692 INFO  (coreLoadExecutor-4338-thread-1-processing-n:127.0.0.1:51086_ln_%2Flz) [n:127.0.0.1:51086_ln_%2Flz c:collection1   x:collection1] o.a.s.c.ZkController waiting to find shard id in clusterstate for collection1
   [junit4]   2> 1234692 INFO  (coreLoadExecutor-4338-thread-1-processing-n:127.0.0.1:51086_ln_%2Flz) [n:127.0.0.1:51086_ln_%2Flz c:collection1   x:collection1] o.a.s.c.ZkController Check for collection zkNode:collection1
   [junit4]   2> 1234692 INFO  (coreLoadExecutor-4338-thread-1-processing-n:127.0.0.1:51086_ln_%2Flz) [n:127.0.0.1:51086_ln_%2Flz c:collection1   x:collection1] o.a.s.c.ZkController Collection zkNode exists
   [junit4]   2> 1234692 INFO  (coreLoadExecutor-4338-thread-1-processing-n:127.0.0.1:51086_ln_%2Flz) [n:127.0.0.1:51086_ln_%2Flz c:collection1   x:collection1] o.a.s.c.SolrResourceLoader new SolrResourceLoader for directory: '/home/jenkins/workspace/Lucene-Solr-trunk-Linux/solr/build/solr-core/test/J1/../../../../../../../../../home/jenkins/workspace/Lucene-Solr-trunk-Linux/solr/build/solr-core/test/J1/temp/solr.cloud.TestCloudPivotFacet_9CE37D1CCF8B99FB-001/shard-1-001/cores/collection1/'
   [junit4]   2> 1234699 INFO  (coreLoadExecutor-4338-thread-1-processing-n:127.0.0.1:51086_ln_%2Flz) [n:127.0.0.1:51086_ln_%2Flz c:collection1   x:collection1] o.a.s.c.Config loaded config solrconfig.xml with version 0 
   [junit4]   2> 1234702 INFO  (coreLoadExecutor-4338-thread-1-processing-n:127.0.0.1:51086_ln_%2Flz) [n:127.0.0.1:51086_ln_%2Flz c:collection1   x:collection1] o.a.s.c.SolrConfig current version of requestparams : -1
   [junit4]   2> 1234705 INFO  (coreLoadExecutor-4338-thread-1-processing-n:127.0.0.1:51086_ln_%2Flz) [n:127.0.0.1:51086_ln_%2Flz c:collection1   x:collection1] o.a.s.c.SolrConfig Using Lucene MatchVersion: 6.0.0
   [junit4]   2> 1234717 INFO  (coreLoadExecutor-4338-thread-1-processing-n:127.0.0.1:51086_ln_%2Flz) [n:127.0.0.1:51086_ln_%2Flz c:collection1   x:collection1] o.a.s.c.Config Loaded SolrConfig: solrconfig.xml
   [junit4]   2> 1234718 INFO  (coreLoadExecutor-4338-thread-1-processing-n:127.0.0.1:51086_ln_%2Flz) [n:127.0.0.1:51086_ln_%2Flz c:collection1   x:collection1] o.a.s.s.IndexSchema Reading Solr Schema from /configs/conf1/schema.xml
   [junit4]   2> 1234721 INFO  (coreLoadExecutor-4338-thread-1-processing-n:127.0.0.1:51086_ln_%2Flz) [n:127.0.0.1:51086_ln_%2Flz c:collection1   x:collection1] o.a.s.s.IndexSchema [collection1] Schema name=test
   [junit4]   2> 1234794 INFO  (coreLoadExecutor-4338-thread-1-processing-n:127.0.0.1:51086_ln_%2Flz) [n:127.0.0.1:51086_ln_%2Flz c:collection1   x:collection1] o.a.s.s.OpenExchangeRatesOrgProvider Initialized with rates=open-exchange-rates.json, refreshInterval=1440.
   [junit4]   2> 1234798 INFO  (coreLoadExecutor-4338-thread-1-processing-n:127.0.0.1:51086_ln_%2Flz) [n:127.0.0.1:51086_ln_%2Flz c:collection1   x:collection1] o.a.s.s.IndexSchema default search field in schema is text
   [junit4]   2> 1234798 INFO  (coreLoadExecutor-4338-thread-1-processing-n:127.0.0.1:51086_ln_%2Flz) [n:127.0.0.1:51086_ln_%2Flz c:collection1   x:collection1] o.a.s.s.IndexSchema unique key field: id
   [junit4]   2> 1234801 INFO  (coreLoadExecutor-4338-thread-1-processing-n:127.0.0.1:51086_ln_%2Flz) [n:127.0.0.1:51086_ln_%2Flz c:collection1   x:collection1] o.a.s.s.FileExchangeRateProvider Reloading exchange rates from file currency.xml
   [junit4]   2> 1234803 INFO  (coreLoadExecutor-4338-thread-1-processing-n:127.0.0.1:51086_ln_%2Flz) [n:127.0.0.1:51086_ln_%2Flz c:collection1   x:collection1] o.a.s.s.FileExchangeRateProvider Reloading exchange rates from file currency.xml
   [junit4]   2> 1234804 INFO  (coreLoadExecutor-4338-thread-1-processing-n:127.0.0.1:51086_ln_%2Flz) [n:127.0.0.1:51086_ln_%2Flz c:collection1   x:collection1] o.a.s.s.OpenExchangeRatesOrgProvider Reloading exchange rates from open-exchange-rates.json
   [junit4]   2> 1234804 WARN  (coreLoadExecutor-4338-thread-1-processing-n:127.0.0.1:51086_ln_%2Flz) [n:127.0.0.1:51086_ln_%2Flz c:collection1   x:collection1] o.a.s.s.OpenExchangeRatesOrgProvider Unknown key IMPORTANT NOTE
   [junit4]   2> 1234804 WARN  (coreLoadExecutor-4338-thread-1-processing-n:127.0.0.1:51086_ln_%2Flz) [n:127.0.0.1:51086_ln_%2Flz c:collection1   x:collection1] o.a.s.s.OpenExchangeRatesOrgProvider Expected key, got STRING
   [junit4]   2> 1234804 INFO  (coreLoadExecutor-4338-thread-1-processing-n:127.0.0.1:51086_ln_%2Flz) [n:127.0.0.1:51086_ln_%2Flz c:collection1   x:collection1] o.a.s.s.OpenExchangeRatesOrgProvider Reloading exchange rates from open-exchange-rates.json
   [junit4]   2> 1234804 WARN  (coreLoadExecutor-4338-thread-1-processing-n:127.0.0.1:51086_ln_%2Flz) [n:127.0.0.1:51086_ln_%2Flz c:collection1   x:collection1] o.a.s.s.OpenExchangeRatesOrgProvider Unknown key IMPORTANT NOTE
   [junit4]   2> 1234805 WARN  (coreLoadExecutor-4338-thread-1-processing-n:127.0.0.1:51086_ln_%2Flz) [n:127.0.0.1:51086_ln_%2Flz c:collection1   x:collection1] o.a.s.s.OpenExchangeRatesOrgProvider Expected key, got STRING
   [junit4]   2> 1234805 INFO  (coreLoadExecutor-4338-thread-1-processing-n:127.0.0.1:51086_ln_%2Flz) [n:127.0.0.1:51086_ln_%2Flz c:collection1   x:collection1] o.a.s.c.ConfigSetProperties Did not find ConfigSet properties
   [junit4]   2> org.apache.solr.core.SolrResourceNotFoundException: Can't find resource 'configsetprops.json' in classpath or '/configs/conf1', cwd=/home/jenkins/workspace/Lucene-Solr-trunk-Linux/solr/build/solr-core/test/J1
   [junit4]   2> 	at org.apache.solr.cloud.ZkSolrResourceLoader.openResource(ZkSolrResourceLoader.java:99)
   [junit4]   2> 	at org.apache.solr.core.ConfigSetProperties.readFromResourceLoader(ConfigSetProperties.java:49)
   [junit4]   2> 	at org.apache.solr.core.ConfigSetService.createConfigSetProperties(ConfigSetService.java:114)
   [junit4]   2> 	at org.apache.solr.core.ConfigSetService.getConfig(ConfigSetService.java:76)
   [junit4]   2> 	at org.apache.solr.core.CoreContainer.create(CoreContainer.java:668)
   [junit4]   2> 	at org.apache.solr.core.CoreContainer$1.call(CoreContainer.java:397)
   [junit4]   2> 	at org.apache.solr.core.CoreContainer$1.call(CoreContainer.java:388)
   [junit4]   2> 	at java.util.concurrent.FutureTask.run(FutureTask.java:266)
   [junit4]   2> 	at org.apache.solr.common.util.ExecutorUtil$MDCAwareThreadPoolExecutor$1.run(ExecutorUtil.java:156)
   [junit4]   2> 	at java.util.concurrent.ThreadPoolExecutor.runWorker(ThreadPoolExecutor.java:1142)
   [junit4]   2> 	at java.util.concurrent.ThreadPoolExecutor$Worker.run(ThreadPoolExecutor.java:617)
   [junit4]   2> 	at java.lang.Thread.run(Thread.java:745)
   [junit4]   2> 1234805 INFO  (coreLoadExecutor-4338-thread-1-processing-n:127.0.0.1:51086_ln_%2Flz) [n:127.0.0.1:51086_ln_%2Flz c:collection1   x:collection1] o.a.s.c.CoreContainer Creating SolrCore 'collection1' using configuration from collection collection1
   [junit4]   2> 1234805 INFO  (coreLoadExecutor-4338-thread-1-processing-n:127.0.0.1:51086_ln_%2Flz) [n:127.0.0.1:51086_ln_%2Flz c:collection1 s:shard2 r:core_node1 x:collection1] o.a.s.c.SolrCore org.apache.solr.core.MockDirectoryFactory
   [junit4]   2> 1234806 INFO  (coreLoadExecutor-4338-thread-1-processing-n:127.0.0.1:51086_ln_%2Flz) [n:127.0.0.1:51086_ln_%2Flz c:collection1 s:shard2 r:core_node1 x:collection1] o.a.s.c.SolrCore [[collection1] ] Opening new SolrCore at [/home/jenkins/workspace/Lucene-Solr-trunk-Linux/solr/build/solr-core/test/J1/../../../../../../../../../home/jenkins/workspace/Lucene-Solr-trunk-Linux/solr/build/solr-core/test/J1/temp/solr.cloud.TestCloudPivotFacet_9CE37D1CCF8B99FB-001/shard-1-001/cores/collection1/], dataDir=[null]
   [junit4]   2> 1234806 INFO  (coreLoadExecutor-4338-thread-1-processing-n:127.0.0.1:51086_ln_%2Flz) [n:127.0.0.1:51086_ln_%2Flz c:collection1 s:shard2 r:core_node1 x:collection1] o.a.s.c.JmxMonitoredMap JMX monitoring is enabled. Adding Solr mbeans to JMX Server: com.sun.jmx.mbeanserver.JmxMBeanServer@56760817
   [junit4]   2> 1234806 INFO  (coreLoadExecutor-4338-thread-1-processing-n:127.0.0.1:51086_ln_%2Flz) [n:127.0.0.1:51086_ln_%2Flz c:collection1 s:shard2 r:core_node1 x:collection1] o.a.s.c.CachingDirectoryFactory return new directory for /home/jenkins/workspace/Lucene-Solr-trunk-Linux/solr/build/solr-core/test/J1/../../../../../../../../../home/jenkins/workspace/Lucene-Solr-trunk-Linux/solr/build/solr-core/test/J1/temp/solr.cloud.TestCloudPivotFacet_9CE37D1CCF8B99FB-001/shard-1-001/cores/collection1/data
   [junit4]   2> 1234806 INFO  (coreLoadExecutor-4338-thread-1-processing-n:127.0.0.1:51086_ln_%2Flz) [n:127.0.0.1:51086_ln_%2Flz c:collection1 s:shard2 r:core_node1 x:collection1] o.a.s.c.SolrCore New index directory detected: old=null new=/home/jenkins/workspace/Lucene-Solr-trunk-Linux/solr/build/solr-core/test/J1/../../../../../../../../../home/jenkins/workspace/Lucene-Solr-trunk-Linux/solr/build/solr-core/test/J1/temp/solr.cloud.TestCloudPivotFacet_9CE37D1CCF8B99FB-001/shard-1-001/cores/collection1/data/index/
   [junit4]   2> 1234806 WARN  (coreLoadExecutor-4338-thread-1-processing-n:127.0.0.1:51086_ln_%2Flz) [n:127.0.0.1:51086_ln_%2Flz c:collection1 s:shard2 r:core_node1 x:collection1] o.a.s.c.SolrCore [collection1] Solr index directory '/home/jenkins/workspace/Lucene-Solr-trunk-Linux/solr/build/solr-core/test/J1/../../../../../../../../../home/jenkins/workspace/Lucene-Solr-trunk-Linux/solr/build/solr-core/test/J1/temp/solr.cloud.TestCloudPivotFacet_9CE37D1CCF8B99FB-001/shard-1-001/cores/collection1/data/index' doesn't exist. Creating new index...
   [junit4]   2> 1234807 INFO  (coreLoadExecutor-4338-thread-1-processing-n:127.0.0.1:51086_ln_%2Flz) [n:127.0.0.1:51086_ln_%2Flz c:collection1 s:shard2 r:core_node1 x:collection1] o.a.s.c.CachingDirectoryFactory return new directory for /home/jenkins/workspace/Lucene-Solr-trunk-Linux/solr/build/solr-core/test/J1/../../../../../../../../../home/jenkins/workspace/Lucene-Solr-trunk-Linux/solr/build/solr-core/test/J1/temp/solr.cloud.TestCloudPivotFacet_9CE37D1CCF8B99FB-001/shard-1-001/cores/collection1/data/index
   [junit4]   2> 1234807 INFO  (coreLoadExecutor-4338-thread-1-processing-n:127.0.0.1:51086_ln_%2Flz) [n:127.0.0.1:51086_ln_%2Flz c:collection1 s:shard2 r:core_node1 x:collection1] o.a.s.u.RandomMergePolicy RandomMergePolicy wrapping class org.apache.lucene.index.LogByteSizeMergePolicy: [LogByteSizeMergePolicy: minMergeSize=1677721, mergeFactor=39, maxMergeSize=2147483648, maxMergeSizeForForcedMerge=9223372036854775807, calibrateSizeByDeletes=true, maxMergeDocs=2147483647, maxCFSSegmentSizeMB=8.796093022207999E12, noCFSRatio=0.38847940073839893]
   [junit4]   2> 1234807 INFO  (coreLoadExecutor-4338-thread-1-processing-n:127.0.0.1:51086_ln_%2Flz) [n:127.0.0.1:51086_ln_%2Flz c:collection1 s:shard2 r:core_node1 x:collection1] o.a.s.c.SolrCore SolrDeletionPolicy.onCommit: commits: num=1
   [junit4]   2> 	commit{dir=MockDirectoryWrapper(RAMDirectory@133212ba lockFactory=org.apache.lucene.store.SingleInstanceLockFactory@77135b33),segFN=segments_1,generation=1}
   [junit4]   2> 1234807 INFO  (coreLoadExecutor-4338-thread-1-processing-n:127.0.0.1:51086_ln_%2Flz) [n:127.0.0.1:51086_ln_%2Flz c:collection1 s:shard2 r:core_node1 x:collection1] o.a.s.c.SolrCore newest commit generation = 1
   [junit4]   2> 1234807 INFO  (OldIndexDirectoryCleanupThreadForCore-collection1) [n:127.0.0.1:51086_ln_%2Flz c:collection1 s:shard2 r:core_node1 x:collection1] o.a.s.c.SolrCore Looking for old index directories to cleanup for core collection1 in /home/jenkins/workspace/Lucene-Solr-trunk-Linux/solr/build/solr-core/test/J1/../../../../../../../../../home/jenkins/workspace/Lucene-Solr-trunk-Linux/solr/build/solr-core/test/J1/temp/solr.cloud.TestCloudPivotFacet_9CE37D1CCF8B99FB-001/shard-1-001/cores/collection1/data/
   [junit4]   2> 1234807 WARN  (OldIndexDirectoryCleanupThreadForCore-collection1) [n:127.0.0.1:51086_ln_%2Flz c:collection1 s:shard2 r:core_node1 x:collection1] o.a.s.c.DirectoryFactory /home/jenkins/workspace/Lucene-Solr-trunk-Linux/solr/build/solr-core/test/J1/../../../../../../../../../home/jenkins/workspace/Lucene-Solr-trunk-Linux/solr/build/solr-core/test/J1/temp/solr.cloud.TestCloudPivotFacet_9CE37D1CCF8B99FB-001/shard-1-001/cores/collection1/data/ does not point to a valid data directory; skipping clean-up of old index directories.
   [junit4]   2> 1234809 INFO  (coreLoadExecutor-4338-thread-1-processing-n:127.0.0.1:51086_ln_%2Flz) [n:127.0.0.1:51086_ln_%2Flz c:collection1 s:shard2 r:core_node1 x:collection1] o.a.s.u.p.UpdateRequestProcessorChain creating updateRequestProcessorChain "nodistrib"
   [junit4]   2> 1234809 INFO  (coreLoadExecutor-4338-thread-1-processing-n:127.0.0.1:51086_ln_%2Flz) [n:127.0.0.1:51086_ln_%2Flz c:collection1 s:shard2 r:core_node1 x:collection1] o.a.s.u.p.UpdateRequestProcessorChain creating updateRequestProcessorChain "dedupe"
   [junit4]   2> 1234809 INFO  (coreLoadExecutor-4338-thread-1-processing-n:127.0.0.1:51086_ln_%2Flz) [n:127.0.0.1:51086_ln_%2Flz c:collection1 s:shard2 r:core_node1 x:collection1] o.a.s.u.p.UpdateRequestProcessorChain inserting DistributedUpdateProcessorFactory into updateRequestProcessorChain "dedupe"
   [junit4]   2> 1234810 INFO  (coreLoadExecutor-4338-thread-1-processing-n:127.0.0.1:51086_ln_%2Flz) [n:127.0.0.1:51086_ln_%2Flz c:collection1 s:shard2 r:core_node1 x:collection1] o.a.s.u.p.UpdateRequestProcessorChain creating updateRequestProcessorChain "stored_sig"
   [junit4]   2> 1234810 INFO  (coreLoadExecutor-4338-thread-1-processing-n:127.0.0.1:51086_ln_%2Flz) [n:127.0.0.1:51086_ln_%2Flz c:collection1 s:shard2 r:core_node1 x:collection1] o.a.s.u.p.UpdateRequestProcessorChain inserting DistributedUpdateProcessorFactory into updateRequestProcessorChain "stored_sig"
   [junit4]   2> 1234810 INFO  (coreLoadExecutor-4338-thread-1-processing-n:127.0.0.1:51086_ln_%2Flz) [n:127.0.0.1:51086_ln_%2Flz c:collection1 s:shard2 r:core_node1 x:collection1] o.a.s.u.p.UpdateRequestProcessorChain creating updateRequestProcessorChain "distrib-dup-test-chain-explicit"
   [junit4]   2> 1234810 INFO  (coreLoadExecutor-4338-thread-1-processing-n:127.0.0.1:51086_ln_%2Flz) [n:127.0.0.1:51086_ln_%2Flz c:collection1 s:shard2 r:core_node1 x:collection1] o.a.s.u.p.UpdateRequestProcessorChain creating updateRequestProcessorChain "distrib-dup-test-chain-implicit"
   [junit4]   2> 1234810 INFO  (coreLoadExecutor-4338-thread-1-processing-n:127.0.0.1:51086_ln_%2Flz) [n:127.0.0.1:51086_ln_%2Flz c:collection1 s:shard2 r:core_node1 x:collection1] o.a.s.u.p.UpdateRequestProcessorChain inserting DistributedUpdateProcessorFactory into updateRequestProcessorChain "distrib-dup-test-chain-implicit"
   [junit4]   2> 1234810 INFO  (coreLoadExecutor-4338-thread-1-processing-n:127.0.0.1:51086_ln_%2Flz) [n:127.0.0.1:51086_ln_%2Flz c:collection1 s:shard2 r:core_node1 x:collection1] o.a.s.c.SolrCore no updateRequestProcessorChain defined as default, creating implicit default
   [junit4]   2> 1234811 INFO  (coreLoadExecutor-4338-thread-1-processing-n:127.0.0.1:51086_ln_%2Flz) [n:127.0.0.1:51086_ln_%2Flz c:collection1 s:shard2 r:core_node1 x:collection1] o.a.s.h.l.XMLLoader xsltCacheLifetimeSeconds=60
   [junit4]   2> 1234812 INFO  (coreLoadExecutor-4338-thread-1-processing-n:127.0.0.1:51086_ln_%2Flz) [n:127.0.0.1:51086_ln_%2Flz c:collection1 s:shard2 r:core_node1 x:collection1] o.a.s.h.l.XMLLoader xsltCacheLifetimeSeconds=60
   [junit4]   2> 1234812 INFO  (coreLoadExecutor-4338-thread-1-processing-n:127.0.0.1:51086_ln_%2Flz) [n:127.0.0.1:51086_ln_%2Flz c:collection1 s:shard2 r:core_node1 x:collection1] o.a.s.h.l.XMLLoader xsltCacheLifetimeSeconds=60
   [junit4]   2> 1234813 INFO  (coreLoadExecutor-4338-thread-1-processing-n:127.0.0.1:51086_ln_%2Flz) [n:127.0.0.1:51086_ln_%2Flz c:collection1 s:shard2 r:core_node1 x:collection1] o.a.s.h.l.XMLLoader xsltCacheLifetimeSeconds=60
   [junit4]   2> 1234815 INFO  (coreLoadExecutor-4338-thread-1-processing-n:127.0.0.1:51086_ln_%2Flz) [n:127.0.0.1:51086_ln_%2Flz c:collection1 s:shard2 r:core_node1 x:collection1] o.a.s.c.RequestHandlers Registered paths: /admin/mbeans,standard,/update/csv,/update/json/docs,/admin/luke,/admin/segments,/get,/admin/system,/replication,/admin/properties,/config,/schema,/admin/plugins,/admin/logging,/update/json,/admin/threads,/admin/ping,/update,/admin/file
   [junit4]   2> 1234815 INFO  (coreLoadExecutor-4338-thread-1-processing-n:127.0.0.1:51086_ln_%2Flz) [n:127.0.0.1:51086_ln_%2Flz c:collection1 s:shard2 r:core_node1 x:collection1] o.a.s.c.SolrCore Using default statsCache cache: org.apache.solr.search.stats.LocalStatsCache
   [junit4]   2> 1234816 INFO  (coreLoadExecutor-4338-thread-1-processing-n:127.0.0.1:51086_ln_%2Flz) [n:127.0.0.1:51086_ln_%2Flz c:collection1 s:shard2 r:core_node1 x:collection1] o.a.s.u.UpdateHandler Using UpdateLog implementation: org.apache.solr.update.UpdateLog
   [junit4]   2> 1234816 INFO  (coreLoadExecutor-4338-thread-1-processing-n:127.0.0.1:51086_ln_%2Flz) [n:127.0.0.1:51086_ln_%2Flz c:collection1 s:shard2 r:core_node1 x:collection1] o.a.s.u.UpdateLog Initializing UpdateLog: dataDir= defaultSyncLevel=FLUSH numRecordsToKeep=100 maxNumLogsToKeep=10 numVersionBuckets=65536
   [junit4]   2> 1234816 INFO  (coreLoadExecutor-4338-thread-1-processing-n:127.0.0.1:51086_ln_%2Flz) [n:127.0.0.1:51086_ln_%2Flz c:collection1 s:shard2 r:core_node1 x:collection1] o.a.s.c.SolrCore Hard AutoCommit: disabled
   [junit4]   2> 1234816 INFO  (coreLoadExecutor-4338-thread-1-processing-n:127.0.0.1:51086_ln_%2Flz) [n:127.0.0.1:51086_ln_%2Flz c:collection1 s:shard2 r:core_node1 x:collection1] o.a.s.c.SolrCore Soft AutoCommit: disabled
   [junit4]   2> 1234817 INFO  (coreLoadExecutor-4338-thread-1-processing-n:127.0.0.1:51086_ln_%2Flz) [n:127.0.0.1:51086_ln_%2Flz c:collection1 s:shard2 r:core_node1 x:collection1] o.a.s.u.RandomMergePolicy RandomMergePolicy wrapping class org.apache.lucene.index.TieredMergePolicy: [TieredMergePolicy: maxMergeAtOnce=15, maxMergeAtOnceExplicit=21, maxMergedSegmentMB=19.9697265625, floorSegmentMB=0.400390625, forceMergeDeletesPctAllowed=29.482463469247342, segmentsPerTier=20.0, maxCFSSegmentSizeMB=8.796093022207999E12, noCFSRatio=0.0
   [junit4]   2> 1234817 INFO  (coreLoadExecutor-4338-thread-1-processing-n:127.0.0.1:51086_ln_%2Flz) [n:127.0.0.1:51086_ln_%2Flz c:collection1 s:shard2 r:core_node1 x:collection1] o.a.s.c.SolrCore SolrDeletionPolicy.onInit: commits: num=1
   [junit4]   2> 	commit{dir=MockDirectoryWrapper(RAMDirectory@133212ba lockFactory=org.apache.lucene.store.SingleInstanceLockFactory@77135b33),segFN=segments_1,generation=1}
   [junit4]   2> 1234817 INFO  (coreLoadExecutor-4338-thread-1-processing-n:127.0.0.1:51086_ln_%2Flz) [n:127.0.0.1:51086_ln_%2Flz c:collection1 s:shard2 r:core_node1 x:collection1] o.a.s.c.SolrCore newest commit generation = 1
   [junit4]   2> 1234817 INFO  (coreLoadExecutor-4338-thread-1-processing-n:127.0.0.1:51086_ln_%2Flz) [n:127.0.0.1:51086_ln_%2Flz c:collection1 s:shard2 r:core_node1 x:collection1] o.a.s.s.SolrIndexSearcher Opening Searcher@19ac5a97[collection1] main
   [junit4]   2> 1234817 INFO  (coreLoadExecutor-4338-thread-1-processing-n:127.0.0.1:51086_ln_%2Flz) [n:127.0.0.1:51086_ln_%2Flz c:collection1 s:shard2 r:core_node1 x:collection1] o.a.s.r.ManagedResourceStorage Setting up ZooKeeper-based storage for the RestManager with znodeBase: /configs/conf1
   [junit4]   2> 1234818 INFO  (coreLoadExecutor-4338-thread-1-processing-n:127.0.0.1:51086_ln_%2Flz) [n:127.0.0.1:51086_ln_%2Flz c:collection1 s:shard2 r:core_node1 x:collection1] o.a.s.r.ManagedResourceStorage Configured ZooKeeperStorageIO with znodeBase: /configs/conf1
   [junit4]   2> 1234818 INFO  (coreLoadExecutor-4338-thread-1-processing-n:127.0.0.1:51086_ln_%2Flz) [n:127.0.0.1:51086_ln_%2Flz c:collection1 s:shard2 r:core_node1 x:collection1] o.a.s.r.RestManager Initializing RestManager with initArgs: {}
   [junit4]   2> 1234818 INFO  (coreLoadExecutor-4338-thread-1-processing-n:127.0.0.1:51086_ln_%2Flz) [n:127.0.0.1:51086_ln_%2Flz c:collection1 s:shard2 r:core_node1 x:collection1] o.a.s.r.ManagedResourceStorage Reading _rest_managed.json using ZooKeeperStorageIO:path=/configs/conf1
   [junit4]   2> 1234818 INFO  (coreLoadExecutor-4338-thread-1-processing-n:127.0.0.1:51086_ln_%2Flz) [n:127.0.0.1:51086_ln_%2Flz c:collection1 s:shard2 r:core_node1 x:collection1] o.a.s.r.ManagedResourceStorage No data found for znode /configs/conf1/_rest_managed.json
   [junit4]   2> 1234818 INFO  (coreLoadExecutor-4338-thread-1-processing-n:127.0.0.1:51086_ln_%2Flz) [n:127.0.0.1:51086_ln_%2Flz c:collection1 s:shard2 r:core_node1 x:collection1] o.a.s.r.ManagedResourceStorage Loaded null at path _rest_managed.json using ZooKeeperStorageIO:path=/configs/conf1
   [junit4]   2> 1234818 INFO  (coreLoadExecutor-4338-thread-1-processing-n:127.0.0.1:51086_ln_%2Flz) [n:127.0.0.1:51086_ln_%2Flz c:collection1 s:shard2 r:core_node1 x:collection1] o.a.s.r.RestManager Initializing 0 registered ManagedResources
   [junit4]   2> 1234818 INFO  (coreLoadExecutor-4338-thread-1-processing-n:127.0.0.1:51086_ln_%2Flz) [n:127.0.0.1:51086_ln_%2Flz c:collection1 s:shard2 r:core_node1 x:collection1] o.a.s.h.ReplicationHandler Commits will be reserved for  10000
   [junit4]   2> 1234819 INFO  (searcherExecutor-4339-thread-1-processing-n:127.0.0.1:51086_ln_%2Flz x:collection1 s:shard2 c:collection1 r:core_node1) [n:127.0.0.1:51086_ln_%2Flz c:collection1 s:shard2 r:core_node1 x:collection1] o.a.s.c.SolrCore [collection1] Registered new searcher Searcher@19ac5a97[collection1] main{ExitableDirectoryReader(UninvertingDirectoryReader())}
   [junit4]   2> 1234819 INFO  (coreLoadExecutor-4338-thread-1-processing-n:127.0.0.1:51086_ln_%2Flz) [n:127.0.0.1:51086_ln_%2Flz c:collection1 s:shard2 r:core_node1 x

[...truncated too long message...]

%5B*+TO+1170%5D&stats=true&stats.field=%7B%21key%3Dsk1+tag%3Dst1%2Cst2%7Dpivot_tdt1&stats.field=%7B%21key%3Dsk2+tag%3Dst2%2Cst3%7Dpivot_tdt&stats.field=%7B%21key%3Dsk3+tag%3Dst3%2Cst4%7Dpivot_d1&_test_miss=true&_test_sort=index),extra(fq=%7B%21term+f%3Dpivot_x_s1%7Dc)}),extra(fq=%7B%21term+f%3Dpivot_dt%7D2010-10-31T10%3A31%3A12Z)})} expected:<-1.2747953316671947E8> but was:<-1.2747953316671945E8>
   [junit4]    > 	at __randomizedtesting.SeedInfo.seed([9CE37D1CCF8B99FB:14B742C66177F403]:0)
   [junit4]    > 	at org.apache.solr.cloud.TestCloudPivotFacet.assertPivotCountsAreCorrect(TestCloudPivotFacet.java:281)
   [junit4]    > 	at org.apache.solr.cloud.TestCloudPivotFacet.test(TestCloudPivotFacet.java:228)
   [junit4]    > 	at org.apache.solr.BaseDistributedSearchTestCase$ShardsRepeatRule$ShardsFixedStatement.callStatement(BaseDistributedSearchTestCase.java:960)
   [junit4]    > 	at org.apache.solr.BaseDistributedSearchTestCase$ShardsRepeatRule$ShardsStatement.evaluate(BaseDistributedSearchTestCase.java:935)
   [junit4]    > 	at java.lang.Thread.run(Thread.java:745)
   [junit4]    > Caused by: java.lang.AssertionError: Sum of sk3 => pivot_x_s1,pivot_dt,pivot_tf: {params(rows=0),defaults({main({main(rows=0&q=*%3A*&fq=id%3A%5B*+TO+1170%5D&stats=true&stats.field=%7B%21key%3Dsk1+tag%3Dst1%2Cst2%7Dpivot_tdt1&stats.field=%7B%21key%3Dsk2+tag%3Dst2%2Cst3%7Dpivot_tdt&stats.field=%7B%21key%3Dsk3+tag%3Dst3%2Cst4%7Dpivot_d1&_test_miss=true&_test_sort=index),extra(fq=%7B%21term+f%3Dpivot_x_s1%7Dc)}),extra(fq=%7B%21term+f%3Dpivot_dt%7D2010-10-31T10%3A31%3A12Z)})} expected:<-1.2747953316671947E8> but was:<-1.2747953316671945E8>
   [junit4]    > 	at org.apache.solr.cloud.TestCloudPivotFacet.assertNumerics(TestCloudPivotFacet.java:733)
   [junit4]    > 	at org.apache.solr.cloud.TestCloudPivotFacet.assertPivotStats(TestCloudPivotFacet.java:389)
   [junit4]    > 	at org.apache.solr.cloud.TestCloudPivotFacet.assertPivotData(TestCloudPivotFacet.java:339)
   [junit4]    > 	at org.apache.solr.cloud.TestCloudPivotFacet.assertPivotCountsAreCorrect(TestCloudPivotFacet.java:302)
   [junit4]    > 	at org.apache.solr.cloud.TestCloudPivotFacet.assertPivotCountsAreCorrect(TestCloudPivotFacet.java:313)
   [junit4]    > 	at org.apache.solr.cloud.TestCloudPivotFacet.assertPivotCountsAreCorrect(TestCloudPivotFacet.java:271)
   [junit4]    > 	... 42 more
   [junit4]   2> 1281601 INFO  (SUITE-TestCloudPivotFacet-seed#[9CE37D1CCF8B99FB]-worker) [n:127.0.0.1:51022_ln_%2Flz c:collection1 s:shard1 r:core_node4 x:collection1] o.a.s.SolrTestCaseJ4 ###deleteCore
   [junit4]   2> NOTE: leaving temporary files on disk at: /home/jenkins/workspace/Lucene-Solr-trunk-Linux/solr/build/solr-core/test/J1/temp/solr.cloud.TestCloudPivotFacet_9CE37D1CCF8B99FB-001
   [junit4]   2> Jul 17, 2015 4:35:45 PM com.carrotsearch.randomizedtesting.ThreadLeakControl checkThreadLeaks
   [junit4]   2> WARNING: Will linger awaiting termination of 1 leaked thread(s).
   [junit4]   2> NOTE: test params are: codec=Asserting(Lucene53): {pivot_dt1=PostingsFormat(name=LuceneVarGapFixedInterval), dense_pivot_i1=PostingsFormat(name=Memory doPackFST= true), pivot_l1=PostingsFormat(name=LuceneVarGapDocFreqInterval), range_facet_l_dv=PostingsFormat(name=Memory doPackFST= true), multiDefault=PostingsFormat(name=LuceneVarGapFixedInterval), pivot_f1=PostingsFormat(name=LuceneVarGapFixedInterval), intDefault=PostingsFormat(name=LuceneVarGapDocFreqInterval), pivot_d1=PostingsFormat(name=LuceneVarGapDocFreqInterval), pivot_x_s=PostingsFormat(name=MockRandom), pivot_b1=PostingsFormat(name=LuceneVarGapFixedInterval), pivot_dt=PostingsFormat(name=Memory doPackFST= true), dense_pivot_ti1=PostingsFormat(name=Memory doPackFST= true), range_facet_l=PostingsFormat(name=LuceneVarGapDocFreqInterval), pivot_x_s1=PostingsFormat(name=LuceneVarGapDocFreqInterval), pivot_y_s=PostingsFormat(name=LuceneVarGapFixedInterval), pivot_z_s=PostingsFormat(name=Memory doPackFST= true), dense_pivot_ti=PostingsFormat(name=LuceneVarGapDocFreqInterval), pivot_z_s1=PostingsFormat(name=LuceneVarGapFixedInterval), pivot_tl1=PostingsFormat(name=LuceneVarGapFixedInterval), id=PostingsFormat(name=Memory doPackFST= true), dense_pivot_x_s1=PostingsFormat(name=LuceneVarGapDocFreqInterval), timestamp=PostingsFormat(name=LuceneVarGapDocFreqInterval), dense_pivot_y_s=PostingsFormat(name=LuceneVarGapFixedInterval), pivot_td1=PostingsFormat(name=LuceneVarGapFixedInterval), pivot_tdt=PostingsFormat(name=MockRandom), pivot_i1=PostingsFormat(name=Memory doPackFST= true), pivot_tf1=PostingsFormat(name=LuceneVarGapDocFreqInterval), pivot_td=PostingsFormat(name=Memory doPackFST= true), pivot_tf=PostingsFormat(name=MockRandom), pivot_f=PostingsFormat(name=Memory doPackFST= true), pivot_ti=PostingsFormat(name=LuceneVarGapDocFreqInterval), _version_=PostingsFormat(name=LuceneVarGapDocFreqInterval), pivot_i=PostingsFormat(name=LuceneVarGapFixedInterval), pivot_tl=PostingsFormat(name=Memory doPackFST= true), pivot_l=PostingsFormat(name=MockRandom), pivot_y_s1=PostingsFormat(name=MockRandom), pivot_ti1=PostingsFormat(name=MockRandom), range_facet_i_dv=PostingsFormat(name=LuceneVarGapDocFreqInterval), dense_pivot_i=PostingsFormat(name=LuceneVarGapFixedInterval), pivot_b=PostingsFormat(name=Memory doPackFST= true), dense_pivot_y_s1=PostingsFormat(name=MockRandom), pivot_d=PostingsFormat(name=MockRandom), pivot_tdt1=PostingsFormat(name=LuceneVarGapDocFreqInterval), dense_pivot_x_s=PostingsFormat(name=Memory doPackFST= true)}, docValues:{range_facet_l_dv=DocValuesFormat(name=Direct), range_facet_i_dv=DocValuesFormat(name=Asserting), timestamp=DocValuesFormat(name=Asserting)}, sim=DefaultSimilarity, locale=hr_HR, timezone=Canada/Yukon
   [junit4]   2> NOTE: Linux 3.16.0-43-generic amd64/Oracle Corporation 1.8.0_45 (64-bit)/cpus=12,threads=1,free=155995600,total=529530880
   [junit4]   2> NOTE: All tests run in this JVM: [ShardRoutingTest, AddSchemaFieldsUpdateProcessorFactoryTest, TestCollationFieldDocValues, TestFieldSortValues, RequestLoggingTest, ResourceLoaderTest, SpellCheckComponentTest, DistributedExpandComponentTest, TestLRUStatsCache, TriLevelCompositeIdRoutingTest, SolrCloudExampleTest, TestFuzzyAnalyzedSuggestions, FacetPivotSmallTest, TestSolrQueryParserResource, TestManagedResourceStorage, TestManagedSchemaDynamicFieldResource, TestSchemaVersionResource, CacheHeaderTest, TestPHPSerializedResponseWriter, TestBulkSchemaAPI, BigEndianAscendingWordDeserializerTest, TestReplicaProperties, TestLMJelinekMercerSimilarityFactory, TestAtomicUpdateErrorCases, TestAuthorizationFramework, TestSolrDeletionPolicy2, ReturnFieldsTest, TestComplexPhraseQParserPlugin, HdfsDirectoryTest, CollectionsAPIDistributedZkTest, SliceStateTest, TestHashPartitioner, ShardSplitTest, TestStressUserVersions, MigrateRouteKeyTest, CoreAdminHandlerTest, TestFieldTypeCollectionResource, TestSearchPerf, JsonLoaderTest, CurrencyFieldOpenExchangeTest, TestMacros, IgnoreCommitOptimizeUpdateProcessorFactoryTest, DistributedFacetPivotSmallAdvancedTest, HLLUtilTest, HdfsCollectionsAPIDistributedZkTest, TestSolrCloudWithKerberosAlt, TestIndexSearcher, TestReRankQParserPlugin, WordBreakSolrSpellCheckerTest, TestStandardQParsers, SolrCmdDistributorTest, TestNRTOpen, TestLeaderElectionZkExpiry, OpenCloseCoreStressTest, TestFastWriter, SystemInfoHandlerTest, TestWriterPerf, TestValueSourceCache, DistributedIntervalFacetingTest, ShardRoutingCustomTest, TestAddFieldRealTimeGet, CdcrUpdateLogTest, DistributedQueueTest, TestFastLRUCache, BasicFunctionalityTest, HdfsDirectoryFactoryTest, DocumentBuilderTest, TestCoreContainer, DistribDocExpirationUpdateProcessorTest, TestAnalyzedSuggestions, TestFieldResource, TestCryptoKeys, BlockCacheTest, TestImplicitCoreProperties, TestElisionMultitermQuery, TestStressVersions, TestFoldingMultitermQuery, RequiredFieldsTest, TestLMDirichletSimilarityFactory, PreAnalyzedFieldTest, EchoParamsTest, MergeStrategyTest, TestReplicationHandler, TestRangeQuery, SimpleFacetsTest, SolrCoreTest, PeerSyncTest, TestFiltering, AnalysisAfterCoreReloadTest, SolrRequestParserTest, SuggesterWFSTTest, SolrCoreCheckLockOnStartupTest, TestRemoteStreaming, DistanceFunctionTest, DisMaxRequestHandlerTest, DocumentAnalysisRequestHandlerTest, FileBasedSpellCheckerTest, FieldAnalysisRequestHandlerTest, SolrPluginUtilsTest, TestCSVResponseWriter, TestPartialUpdateDeduplication, TestLFUCache, CloudExitableDirectoryReaderTest, CollectionStateFormat2Test, DeleteReplicaTest, DeleteShardTest, LeaderFailoverAfterPartitionTest, OverriddenZkACLAndCredentialsProvidersTest, OverseerStatusTest, ReplicationFactorTest, RollingRestartTest, TestCloudPivotFacet]
   [junit4] Completed [412/525] on J1 in 51.20s, 1 test, 1 failure <<< FAILURES!

[...truncated 357 lines...]
BUILD FAILED
/home/jenkins/workspace/Lucene-Solr-trunk-Linux/build.xml:526: The following error occurred while executing this line:
/home/jenkins/workspace/Lucene-Solr-trunk-Linux/build.xml:474: The following error occurred while executing this line:
/home/jenkins/workspace/Lucene-Solr-trunk-Linux/build.xml:61: The following error occurred while executing this line:
/home/jenkins/workspace/Lucene-Solr-trunk-Linux/extra-targets.xml:39: The following error occurred while executing this line:
/home/jenkins/workspace/Lucene-Solr-trunk-Linux/solr/build.xml:230: The following error occurred while executing this line:
/home/jenkins/workspace/Lucene-Solr-trunk-Linux/solr/common-build.xml:513: The following error occurred while executing this line:
/home/jenkins/workspace/Lucene-Solr-trunk-Linux/lucene/common-build.xml:1426: The following error occurred while executing this line:
/home/jenkins/workspace/Lucene-Solr-trunk-Linux/lucene/common-build.xml:981: There were test failures: 525 suites, 2067 tests, 1 failure, 60 ignored (26 assumptions)

Total time: 42 minutes 48 seconds
Build step 'Invoke Ant' marked build as failure
Archiving artifacts
Recording test results
Email was triggered for: Failure - Any
Sending email for trigger: Failure - Any



Mime
View raw message