lucene-dev mailing list archives

Site index · List index
Message view « Date » · « Thread »
Top « Date » · « Thread »
From Policeman Jenkins Server <jenk...@thetaphi.de>
Subject [JENKINS] Lucene-Solr-trunk-Linux (64bit/jdk1.8.0_60-ea-b12) - Build # 13286 - Still Failing!
Date Wed, 01 Jul 2015 21:17:34 GMT
Build: http://jenkins.thetaphi.de/job/Lucene-Solr-trunk-Linux/13286/
Java: 64bit/jdk1.8.0_60-ea-b12 -XX:-UseCompressedOops -XX:+UseConcMarkSweepGC

1 tests failed.
FAILED:  org.apache.solr.client.solrj.impl.CloudSolrClientTest.test

Error Message:
Error from server at http://127.0.0.1:43958/kj_st/checkStateVerCol: no servers hosting shard: shard2

Stack Trace:
org.apache.solr.client.solrj.impl.HttpSolrClient$RemoteSolrException: Error from server at http://127.0.0.1:43958/kj_st/checkStateVerCol: no servers hosting shard: shard2
	at __randomizedtesting.SeedInfo.seed([977F0DC3DF3AE3F7:1F2B321971C68E0F]:0)
	at org.apache.solr.client.solrj.impl.HttpSolrClient.executeMethod(HttpSolrClient.java:560)
	at org.apache.solr.client.solrj.impl.HttpSolrClient.request(HttpSolrClient.java:234)
	at org.apache.solr.client.solrj.impl.HttpSolrClient.request(HttpSolrClient.java:226)
	at org.apache.solr.client.solrj.SolrRequest.process(SolrRequest.java:135)
	at org.apache.solr.client.solrj.SolrClient.query(SolrClient.java:943)
	at org.apache.solr.client.solrj.SolrClient.query(SolrClient.java:958)
	at org.apache.solr.client.solrj.impl.CloudSolrClientTest.stateVersionParamTest(CloudSolrClientTest.java:543)
	at org.apache.solr.client.solrj.impl.CloudSolrClientTest.test(CloudSolrClientTest.java:116)
	at sun.reflect.NativeMethodAccessorImpl.invoke0(Native Method)
	at sun.reflect.NativeMethodAccessorImpl.invoke(NativeMethodAccessorImpl.java:62)
	at sun.reflect.DelegatingMethodAccessorImpl.invoke(DelegatingMethodAccessorImpl.java:43)
	at java.lang.reflect.Method.invoke(Method.java:497)
	at com.carrotsearch.randomizedtesting.RandomizedRunner.invoke(RandomizedRunner.java:1627)
	at com.carrotsearch.randomizedtesting.RandomizedRunner$6.evaluate(RandomizedRunner.java:836)
	at com.carrotsearch.randomizedtesting.RandomizedRunner$7.evaluate(RandomizedRunner.java:872)
	at com.carrotsearch.randomizedtesting.RandomizedRunner$8.evaluate(RandomizedRunner.java:886)
	at org.junit.rules.ExpectedException$ExpectedExceptionStatement.evaluate(ExpectedException.java:110)
	at org.apache.solr.BaseDistributedSearchTestCase$ShardsRepeatRule$ShardsFixedStatement.callStatement(BaseDistributedSearchTestCase.java:960)
	at org.apache.solr.BaseDistributedSearchTestCase$ShardsRepeatRule$ShardsStatement.evaluate(BaseDistributedSearchTestCase.java:935)
	at com.carrotsearch.randomizedtesting.rules.SystemPropertiesRestoreRule$1.evaluate(SystemPropertiesRestoreRule.java:57)
	at org.apache.lucene.util.TestRuleSetupTeardownChained$1.evaluate(TestRuleSetupTeardownChained.java:50)
	at org.apache.lucene.util.AbstractBeforeAfterRule$1.evaluate(AbstractBeforeAfterRule.java:46)
	at org.apache.lucene.util.TestRuleThreadAndTestName$1.evaluate(TestRuleThreadAndTestName.java:49)
	at org.apache.lucene.util.TestRuleIgnoreAfterMaxFailures$1.evaluate(TestRuleIgnoreAfterMaxFailures.java:65)
	at org.apache.lucene.util.TestRuleMarkFailure$1.evaluate(TestRuleMarkFailure.java:48)
	at com.carrotsearch.randomizedtesting.rules.StatementAdapter.evaluate(StatementAdapter.java:36)
	at com.carrotsearch.randomizedtesting.ThreadLeakControl$StatementRunner.run(ThreadLeakControl.java:365)
	at com.carrotsearch.randomizedtesting.ThreadLeakControl.forkTimeoutingTask(ThreadLeakControl.java:798)
	at com.carrotsearch.randomizedtesting.ThreadLeakControl$3.evaluate(ThreadLeakControl.java:458)
	at com.carrotsearch.randomizedtesting.RandomizedRunner.runSingleTest(RandomizedRunner.java:845)
	at com.carrotsearch.randomizedtesting.RandomizedRunner$3.evaluate(RandomizedRunner.java:747)
	at com.carrotsearch.randomizedtesting.RandomizedRunner$4.evaluate(RandomizedRunner.java:781)
	at com.carrotsearch.randomizedtesting.RandomizedRunner$5.evaluate(RandomizedRunner.java:792)
	at com.carrotsearch.randomizedtesting.rules.StatementAdapter.evaluate(StatementAdapter.java:36)
	at com.carrotsearch.randomizedtesting.rules.SystemPropertiesRestoreRule$1.evaluate(SystemPropertiesRestoreRule.java:57)
	at org.apache.lucene.util.AbstractBeforeAfterRule$1.evaluate(AbstractBeforeAfterRule.java:46)
	at com.carrotsearch.randomizedtesting.rules.StatementAdapter.evaluate(StatementAdapter.java:36)
	at org.apache.lucene.util.TestRuleStoreClassName$1.evaluate(TestRuleStoreClassName.java:42)
	at com.carrotsearch.randomizedtesting.rules.NoShadowingOrOverridesOnMethodsRule$1.evaluate(NoShadowingOrOverridesOnMethodsRule.java:39)
	at com.carrotsearch.randomizedtesting.rules.NoShadowingOrOverridesOnMethodsRule$1.evaluate(NoShadowingOrOverridesOnMethodsRule.java:39)
	at com.carrotsearch.randomizedtesting.rules.StatementAdapter.evaluate(StatementAdapter.java:36)
	at com.carrotsearch.randomizedtesting.rules.StatementAdapter.evaluate(StatementAdapter.java:36)
	at com.carrotsearch.randomizedtesting.rules.StatementAdapter.evaluate(StatementAdapter.java:36)
	at org.apache.lucene.util.TestRuleAssertionsRequired$1.evaluate(TestRuleAssertionsRequired.java:54)
	at org.apache.lucene.util.TestRuleMarkFailure$1.evaluate(TestRuleMarkFailure.java:48)
	at org.apache.lucene.util.TestRuleIgnoreAfterMaxFailures$1.evaluate(TestRuleIgnoreAfterMaxFailures.java:65)
	at org.apache.lucene.util.TestRuleIgnoreTestSuites$1.evaluate(TestRuleIgnoreTestSuites.java:55)
	at com.carrotsearch.randomizedtesting.rules.StatementAdapter.evaluate(StatementAdapter.java:36)
	at com.carrotsearch.randomizedtesting.ThreadLeakControl$StatementRunner.run(ThreadLeakControl.java:365)
	at java.lang.Thread.run(Thread.java:745)




Build Log:
[...truncated 11624 lines...]
   [junit4] Suite: org.apache.solr.client.solrj.impl.CloudSolrClientTest
   [junit4]   2> Creating dataDir: /home/jenkins/workspace/Lucene-Solr-trunk-Linux/solr/build/solr-solrj/test/J2/temp/solr.client.solrj.impl.CloudSolrClientTest_977F0DC3DF3AE3F7-001/init-core-data-001
   [junit4]   2> 57678 INFO  (SUITE-CloudSolrClientTest-seed#[977F0DC3DF3AE3F7]-worker) [    ] o.a.s.SolrTestCaseJ4 Randomized ssl (false) and clientAuth (false)
   [junit4]   2> 57678 INFO  (SUITE-CloudSolrClientTest-seed#[977F0DC3DF3AE3F7]-worker) [    ] o.a.s.BaseDistributedSearchTestCase Setting hostContext system property: /kj_st/
   [junit4]   2> 57682 INFO  (TEST-CloudSolrClientTest.testWrongZkChrootTest-seed#[977F0DC3DF3AE3F7]) [    ] o.a.s.c.ZkTestServer STARTING ZK TEST SERVER
   [junit4]   2> 57682 INFO  (Thread-167) [    ] o.a.s.c.ZkTestServer client port:0.0.0.0/0.0.0.0:0
   [junit4]   2> 57682 INFO  (Thread-167) [    ] o.a.s.c.ZkTestServer Starting server
   [junit4]   2> 57782 INFO  (TEST-CloudSolrClientTest.testWrongZkChrootTest-seed#[977F0DC3DF3AE3F7]) [    ] o.a.s.c.ZkTestServer start zk server on port:44469
   [junit4]   2> 57782 INFO  (TEST-CloudSolrClientTest.testWrongZkChrootTest-seed#[977F0DC3DF3AE3F7]) [    ] o.a.s.c.c.SolrZkClient Using default ZkCredentialsProvider
   [junit4]   2> 57783 INFO  (TEST-CloudSolrClientTest.testWrongZkChrootTest-seed#[977F0DC3DF3AE3F7]) [    ] o.a.s.c.c.ConnectionManager Waiting for client to connect to ZooKeeper
   [junit4]   2> 57785 INFO  (zkCallback-148-thread-1) [    ] o.a.s.c.c.ConnectionManager Watcher org.apache.solr.common.cloud.ConnectionManager@176806b5 name:ZooKeeperConnection Watcher:127.0.0.1:44469 got event WatchedEvent state:SyncConnected type:None path:null path:null type:None
   [junit4]   2> 57785 INFO  (TEST-CloudSolrClientTest.testWrongZkChrootTest-seed#[977F0DC3DF3AE3F7]) [    ] o.a.s.c.c.ConnectionManager Client is connected to ZooKeeper
   [junit4]   2> 57785 INFO  (TEST-CloudSolrClientTest.testWrongZkChrootTest-seed#[977F0DC3DF3AE3F7]) [    ] o.a.s.c.c.SolrZkClient Using default ZkACLProvider
   [junit4]   2> 57785 INFO  (TEST-CloudSolrClientTest.testWrongZkChrootTest-seed#[977F0DC3DF3AE3F7]) [    ] o.a.s.c.c.SolrZkClient makePath: /solr
   [junit4]   2> 57786 INFO  (TEST-CloudSolrClientTest.testWrongZkChrootTest-seed#[977F0DC3DF3AE3F7]) [    ] o.a.s.c.c.SolrZkClient Using default ZkCredentialsProvider
   [junit4]   2> 57787 INFO  (TEST-CloudSolrClientTest.testWrongZkChrootTest-seed#[977F0DC3DF3AE3F7]) [    ] o.a.s.c.c.ConnectionManager Waiting for client to connect to ZooKeeper
   [junit4]   2> 57787 INFO  (zkCallback-149-thread-1) [    ] o.a.s.c.c.ConnectionManager Watcher org.apache.solr.common.cloud.ConnectionManager@2a2ce5dc name:ZooKeeperConnection Watcher:127.0.0.1:44469/solr got event WatchedEvent state:SyncConnected type:None path:null path:null type:None
   [junit4]   2> 57788 INFO  (TEST-CloudSolrClientTest.testWrongZkChrootTest-seed#[977F0DC3DF3AE3F7]) [    ] o.a.s.c.c.ConnectionManager Client is connected to ZooKeeper
   [junit4]   2> 57788 INFO  (TEST-CloudSolrClientTest.testWrongZkChrootTest-seed#[977F0DC3DF3AE3F7]) [    ] o.a.s.c.c.SolrZkClient Using default ZkACLProvider
   [junit4]   2> 57788 INFO  (TEST-CloudSolrClientTest.testWrongZkChrootTest-seed#[977F0DC3DF3AE3F7]) [    ] o.a.s.c.c.SolrZkClient makePath: /collections/collection1
   [junit4]   2> 57789 INFO  (TEST-CloudSolrClientTest.testWrongZkChrootTest-seed#[977F0DC3DF3AE3F7]) [    ] o.a.s.c.c.SolrZkClient makePath: /collections/collection1/shards
   [junit4]   2> 57789 INFO  (TEST-CloudSolrClientTest.testWrongZkChrootTest-seed#[977F0DC3DF3AE3F7]) [    ] o.a.s.c.c.SolrZkClient makePath: /collections/control_collection
   [junit4]   2> 57790 INFO  (TEST-CloudSolrClientTest.testWrongZkChrootTest-seed#[977F0DC3DF3AE3F7]) [    ] o.a.s.c.c.SolrZkClient makePath: /collections/control_collection/shards
   [junit4]   2> 57791 INFO  (TEST-CloudSolrClientTest.testWrongZkChrootTest-seed#[977F0DC3DF3AE3F7]) [    ] o.a.s.c.AbstractZkTestCase put /home/jenkins/workspace/Lucene-Solr-trunk-Linux/solr/solrj/src/test-files/solrj/solr/collection1/conf/solrconfig.xml to /configs/conf1/solrconfig.xml
   [junit4]   2> 57791 INFO  (TEST-CloudSolrClientTest.testWrongZkChrootTest-seed#[977F0DC3DF3AE3F7]) [    ] o.a.s.c.c.SolrZkClient makePath: /configs/conf1/solrconfig.xml
   [junit4]   2> 57793 INFO  (TEST-CloudSolrClientTest.testWrongZkChrootTest-seed#[977F0DC3DF3AE3F7]) [    ] o.a.s.c.AbstractZkTestCase put /home/jenkins/workspace/Lucene-Solr-trunk-Linux/solr/solrj/src/test-files/solrj/solr/collection1/conf/schema.xml to /configs/conf1/schema.xml
   [junit4]   2> 57793 INFO  (TEST-CloudSolrClientTest.testWrongZkChrootTest-seed#[977F0DC3DF3AE3F7]) [    ] o.a.s.c.c.SolrZkClient makePath: /configs/conf1/schema.xml
   [junit4]   2> 57794 INFO  (TEST-CloudSolrClientTest.testWrongZkChrootTest-seed#[977F0DC3DF3AE3F7]) [    ] o.a.s.c.AbstractZkTestCase skipping /home/jenkins/workspace/Lucene-Solr-trunk-Linux/solr/solrj/src/test-files/solrj/solr/collection1/conf/solrconfig.snippet.randomindexconfig.xml because it doesn't exist
   [junit4]   2> 57794 INFO  (TEST-CloudSolrClientTest.testWrongZkChrootTest-seed#[977F0DC3DF3AE3F7]) [    ] o.a.s.c.AbstractZkTestCase skipping /home/jenkins/workspace/Lucene-Solr-trunk-Linux/solr/solrj/src/test-files/solrj/solr/collection1/conf/stopwords.txt because it doesn't exist
   [junit4]   2> 57794 INFO  (TEST-CloudSolrClientTest.testWrongZkChrootTest-seed#[977F0DC3DF3AE3F7]) [    ] o.a.s.c.AbstractZkTestCase skipping /home/jenkins/workspace/Lucene-Solr-trunk-Linux/solr/solrj/src/test-files/solrj/solr/collection1/conf/protwords.txt because it doesn't exist
   [junit4]   2> 57794 INFO  (TEST-CloudSolrClientTest.testWrongZkChrootTest-seed#[977F0DC3DF3AE3F7]) [    ] o.a.s.c.AbstractZkTestCase skipping /home/jenkins/workspace/Lucene-Solr-trunk-Linux/solr/solrj/src/test-files/solrj/solr/collection1/conf/currency.xml because it doesn't exist
   [junit4]   2> 57794 INFO  (TEST-CloudSolrClientTest.testWrongZkChrootTest-seed#[977F0DC3DF3AE3F7]) [    ] o.a.s.c.AbstractZkTestCase skipping /home/jenkins/workspace/Lucene-Solr-trunk-Linux/solr/solrj/src/test-files/solrj/solr/collection1/conf/enumsConfig.xml because it doesn't exist
   [junit4]   2> 57794 INFO  (TEST-CloudSolrClientTest.testWrongZkChrootTest-seed#[977F0DC3DF3AE3F7]) [    ] o.a.s.c.AbstractZkTestCase skipping /home/jenkins/workspace/Lucene-Solr-trunk-Linux/solr/solrj/src/test-files/solrj/solr/collection1/conf/open-exchange-rates.json because it doesn't exist
   [junit4]   2> 57795 INFO  (TEST-CloudSolrClientTest.testWrongZkChrootTest-seed#[977F0DC3DF3AE3F7]) [    ] o.a.s.c.AbstractZkTestCase skipping /home/jenkins/workspace/Lucene-Solr-trunk-Linux/solr/solrj/src/test-files/solrj/solr/collection1/conf/mapping-ISOLatin1Accent.txt because it doesn't exist
   [junit4]   2> 57795 INFO  (TEST-CloudSolrClientTest.testWrongZkChrootTest-seed#[977F0DC3DF3AE3F7]) [    ] o.a.s.c.AbstractZkTestCase skipping /home/jenkins/workspace/Lucene-Solr-trunk-Linux/solr/solrj/src/test-files/solrj/solr/collection1/conf/old_synonyms.txt because it doesn't exist
   [junit4]   2> 57795 INFO  (TEST-CloudSolrClientTest.testWrongZkChrootTest-seed#[977F0DC3DF3AE3F7]) [    ] o.a.s.c.AbstractZkTestCase skipping /home/jenkins/workspace/Lucene-Solr-trunk-Linux/solr/solrj/src/test-files/solrj/solr/collection1/conf/synonyms.txt because it doesn't exist
   [junit4]   2> 57804 INFO  (TEST-CloudSolrClientTest.testWrongZkChrootTest-seed#[977F0DC3DF3AE3F7]) [    ] o.a.s.SolrTestCaseJ4 Writing core.properties file to /home/jenkins/workspace/Lucene-Solr-trunk-Linux/solr/build/solr-solrj/test/J2/temp/solr.client.solrj.impl.CloudSolrClientTest_977F0DC3DF3AE3F7-001/control-001/cores/collection1
   [junit4]   2> 57805 INFO  (TEST-CloudSolrClientTest.testWrongZkChrootTest-seed#[977F0DC3DF3AE3F7]) [    ] o.e.j.s.Server jetty-9.2.11.v20150529
   [junit4]   2> 57806 INFO  (TEST-CloudSolrClientTest.testWrongZkChrootTest-seed#[977F0DC3DF3AE3F7]) [    ] o.e.j.s.h.ContextHandler Started o.e.j.s.ServletContextHandler@1984015c{/kj_st,null,AVAILABLE}
   [junit4]   2> 57809 INFO  (TEST-CloudSolrClientTest.testWrongZkChrootTest-seed#[977F0DC3DF3AE3F7]) [    ] o.e.j.s.ServerConnector Started ServerConnector@7d17460d{HTTP/1.1}{127.0.0.1:36676}
   [junit4]   2> 57809 INFO  (TEST-CloudSolrClientTest.testWrongZkChrootTest-seed#[977F0DC3DF3AE3F7]) [    ] o.e.j.s.Server Started @59425ms
   [junit4]   2> 57810 INFO  (TEST-CloudSolrClientTest.testWrongZkChrootTest-seed#[977F0DC3DF3AE3F7]) [    ] o.a.s.c.s.e.JettySolrRunner Jetty properties: {solr.data.dir=/home/jenkins/workspace/Lucene-Solr-trunk-Linux/solr/build/solr-solrj/test/J2/temp/solr.client.solrj.impl.CloudSolrClientTest_977F0DC3DF3AE3F7-001/tempDir-001/control/data, hostContext=/kj_st, hostPort=36676, coreRootDirectory=/home/jenkins/workspace/Lucene-Solr-trunk-Linux/solr/build/solr-solrj/test/J2/temp/solr.client.solrj.impl.CloudSolrClientTest_977F0DC3DF3AE3F7-001/control-001/cores}
   [junit4]   2> 57810 INFO  (TEST-CloudSolrClientTest.testWrongZkChrootTest-seed#[977F0DC3DF3AE3F7]) [    ] o.a.s.s.SolrDispatchFilter SolrDispatchFilter.init(): sun.misc.Launcher$AppClassLoader@659e0bfd
   [junit4]   2> 57810 INFO  (TEST-CloudSolrClientTest.testWrongZkChrootTest-seed#[977F0DC3DF3AE3F7]) [    ] o.a.s.c.SolrResourceLoader new SolrResourceLoader for directory: '/home/jenkins/workspace/Lucene-Solr-trunk-Linux/solr/build/solr-solrj/test/J2/temp/solr.client.solrj.impl.CloudSolrClientTest_977F0DC3DF3AE3F7-001/control-001/'
   [junit4]   2> 57817 INFO  (TEST-CloudSolrClientTest.testWrongZkChrootTest-seed#[977F0DC3DF3AE3F7]) [    ] o.a.s.c.SolrXmlConfig Loading container configuration from /home/jenkins/workspace/Lucene-Solr-trunk-Linux/solr/build/solr-solrj/test/J2/temp/solr.client.solrj.impl.CloudSolrClientTest_977F0DC3DF3AE3F7-001/control-001/solr.xml
   [junit4]   2> 57829 INFO  (TEST-CloudSolrClientTest.testWrongZkChrootTest-seed#[977F0DC3DF3AE3F7]) [    ] o.a.s.c.CoresLocator Config-defined core root directory: /home/jenkins/workspace/Lucene-Solr-trunk-Linux/solr/build/solr-solrj/test/J2/temp/solr.client.solrj.impl.CloudSolrClientTest_977F0DC3DF3AE3F7-001/control-001/cores
   [junit4]   2> 57829 INFO  (TEST-CloudSolrClientTest.testWrongZkChrootTest-seed#[977F0DC3DF3AE3F7]) [    ] o.a.s.c.CoreContainer New CoreContainer 233000359
   [junit4]   2> 57829 INFO  (TEST-CloudSolrClientTest.testWrongZkChrootTest-seed#[977F0DC3DF3AE3F7]) [    ] o.a.s.c.CoreContainer Loading cores into CoreContainer [instanceDir=/home/jenkins/workspace/Lucene-Solr-trunk-Linux/solr/build/solr-solrj/test/J2/temp/solr.client.solrj.impl.CloudSolrClientTest_977F0DC3DF3AE3F7-001/control-001/]
   [junit4]   2> 57829 INFO  (TEST-CloudSolrClientTest.testWrongZkChrootTest-seed#[977F0DC3DF3AE3F7]) [    ] o.a.s.c.CoreContainer loading shared library: /home/jenkins/workspace/Lucene-Solr-trunk-Linux/solr/build/solr-solrj/test/J2/temp/solr.client.solrj.impl.CloudSolrClientTest_977F0DC3DF3AE3F7-001/control-001/lib
   [junit4]   2> 57830 WARN  (TEST-CloudSolrClientTest.testWrongZkChrootTest-seed#[977F0DC3DF3AE3F7]) [    ] o.a.s.c.SolrResourceLoader Can't find (or read) directory to add to classloader: lib (resolved as: /home/jenkins/workspace/Lucene-Solr-trunk-Linux/solr/build/solr-solrj/test/J2/temp/solr.client.solrj.impl.CloudSolrClientTest_977F0DC3DF3AE3F7-001/control-001/lib).
   [junit4]   2> 57833 INFO  (TEST-CloudSolrClientTest.testWrongZkChrootTest-seed#[977F0DC3DF3AE3F7]) [    ] o.a.s.h.c.HttpShardHandlerFactory created with socketTimeout : 90000,urlScheme : ,connTimeout : 15000,maxConnectionsPerHost : 20,maxConnections : 10000,corePoolSize : 0,maximumPoolSize : 2147483647,maxThreadIdleTime : 5,sizeOfQueue : -1,fairnessPolicy : false,useRetries : false,
   [junit4]   2> 57834 INFO  (TEST-CloudSolrClientTest.testWrongZkChrootTest-seed#[977F0DC3DF3AE3F7]) [    ] o.a.s.u.UpdateShardHandler Creating UpdateShardHandler HTTP client with params: socketTimeout=340000&connTimeout=45000&retry=true
   [junit4]   2> 57835 INFO  (TEST-CloudSolrClientTest.testWrongZkChrootTest-seed#[977F0DC3DF3AE3F7]) [    ] o.a.s.l.LogWatcher SLF4J impl is org.slf4j.impl.Log4jLoggerFactory
   [junit4]   2> 57835 INFO  (TEST-CloudSolrClientTest.testWrongZkChrootTest-seed#[977F0DC3DF3AE3F7]) [    ] o.a.s.l.LogWatcher Registering Log Listener [Log4j (org.slf4j.impl.Log4jLoggerFactory)]
   [junit4]   2> 57835 INFO  (TEST-CloudSolrClientTest.testWrongZkChrootTest-seed#[977F0DC3DF3AE3F7]) [    ] o.a.s.c.ZkContainer Zookeeper client=127.0.0.1:44469/solr
   [junit4]   2> 57835 INFO  (TEST-CloudSolrClientTest.testWrongZkChrootTest-seed#[977F0DC3DF3AE3F7]) [    ] o.a.s.c.ZkController zkHost includes chroot
   [junit4]   2> 57835 INFO  (TEST-CloudSolrClientTest.testWrongZkChrootTest-seed#[977F0DC3DF3AE3F7]) [    ] o.a.s.c.c.SolrZkClient Using default ZkCredentialsProvider
   [junit4]   2> 57835 INFO  (TEST-CloudSolrClientTest.testWrongZkChrootTest-seed#[977F0DC3DF3AE3F7]) [    ] o.a.s.c.c.ConnectionManager Waiting for client to connect to ZooKeeper
   [junit4]   2> 57836 INFO  (zkCallback-151-thread-1) [    ] o.a.s.c.c.ConnectionManager Watcher org.apache.solr.common.cloud.ConnectionManager@72550d69 name:ZooKeeperConnection Watcher:127.0.0.1:44469 got event WatchedEvent state:SyncConnected type:None path:null path:null type:None
   [junit4]   2> 57837 INFO  (TEST-CloudSolrClientTest.testWrongZkChrootTest-seed#[977F0DC3DF3AE3F7]) [    ] o.a.s.c.c.ConnectionManager Client is connected to ZooKeeper
   [junit4]   2> 57837 INFO  (TEST-CloudSolrClientTest.testWrongZkChrootTest-seed#[977F0DC3DF3AE3F7]) [    ] o.a.s.c.c.SolrZkClient Using default ZkACLProvider
   [junit4]   2> 57838 INFO  (TEST-CloudSolrClientTest.testWrongZkChrootTest-seed#[977F0DC3DF3AE3F7]) [n:127.0.0.1:36676_kj_st    ] o.a.s.c.c.ConnectionManager Waiting for client to connect to ZooKeeper
   [junit4]   2> 57839 INFO  (zkCallback-152-thread-1-processing-n:127.0.0.1:36676_kj_st) [n:127.0.0.1:36676_kj_st    ] o.a.s.c.c.ConnectionManager Watcher org.apache.solr.common.cloud.ConnectionManager@4d473cc name:ZooKeeperConnection Watcher:127.0.0.1:44469/solr got event WatchedEvent state:SyncConnected type:None path:null path:null type:None
   [junit4]   2> 57839 INFO  (TEST-CloudSolrClientTest.testWrongZkChrootTest-seed#[977F0DC3DF3AE3F7]) [n:127.0.0.1:36676_kj_st    ] o.a.s.c.c.ConnectionManager Client is connected to ZooKeeper
   [junit4]   2> 57840 INFO  (TEST-CloudSolrClientTest.testWrongZkChrootTest-seed#[977F0DC3DF3AE3F7]) [n:127.0.0.1:36676_kj_st    ] o.a.s.c.c.SolrZkClient makePath: /overseer/queue
   [junit4]   2> 57841 INFO  (TEST-CloudSolrClientTest.testWrongZkChrootTest-seed#[977F0DC3DF3AE3F7]) [n:127.0.0.1:36676_kj_st    ] o.a.s.c.c.SolrZkClient makePath: /overseer/collection-queue-work
   [junit4]   2> 57841 INFO  (TEST-CloudSolrClientTest.testWrongZkChrootTest-seed#[977F0DC3DF3AE3F7]) [n:127.0.0.1:36676_kj_st    ] o.a.s.c.c.SolrZkClient makePath: /overseer/collection-map-running
   [junit4]   2> 57842 INFO  (TEST-CloudSolrClientTest.testWrongZkChrootTest-seed#[977F0DC3DF3AE3F7]) [n:127.0.0.1:36676_kj_st    ] o.a.s.c.c.SolrZkClient makePath: /overseer/collection-map-completed
   [junit4]   2> 57843 INFO  (TEST-CloudSolrClientTest.testWrongZkChrootTest-seed#[977F0DC3DF3AE3F7]) [n:127.0.0.1:36676_kj_st    ] o.a.s.c.c.SolrZkClient makePath: /overseer/collection-map-failure
   [junit4]   2> 57844 INFO  (TEST-CloudSolrClientTest.testWrongZkChrootTest-seed#[977F0DC3DF3AE3F7]) [n:127.0.0.1:36676_kj_st    ] o.a.s.c.c.SolrZkClient makePath: /live_nodes
   [junit4]   2> 57845 INFO  (TEST-CloudSolrClientTest.testWrongZkChrootTest-seed#[977F0DC3DF3AE3F7]) [n:127.0.0.1:36676_kj_st    ] o.a.s.c.c.SolrZkClient makePath: /aliases.json
   [junit4]   2> 57846 INFO  (TEST-CloudSolrClientTest.testWrongZkChrootTest-seed#[977F0DC3DF3AE3F7]) [n:127.0.0.1:36676_kj_st    ] o.a.s.c.c.SolrZkClient makePath: /clusterstate.json
   [junit4]   2> 57846 INFO  (TEST-CloudSolrClientTest.testWrongZkChrootTest-seed#[977F0DC3DF3AE3F7]) [n:127.0.0.1:36676_kj_st    ] o.a.s.c.ZkController Register node as live in ZooKeeper:/live_nodes/127.0.0.1:36676_kj_st
   [junit4]   2> 57847 INFO  (TEST-CloudSolrClientTest.testWrongZkChrootTest-seed#[977F0DC3DF3AE3F7]) [n:127.0.0.1:36676_kj_st    ] o.a.s.c.c.SolrZkClient makePath: /live_nodes/127.0.0.1:36676_kj_st
   [junit4]   2> 57847 INFO  (TEST-CloudSolrClientTest.testWrongZkChrootTest-seed#[977F0DC3DF3AE3F7]) [n:127.0.0.1:36676_kj_st    ] o.a.s.c.c.SolrZkClient makePath: /overseer_elect
   [junit4]   2> 57848 INFO  (TEST-CloudSolrClientTest.testWrongZkChrootTest-seed#[977F0DC3DF3AE3F7]) [n:127.0.0.1:36676_kj_st    ] o.a.s.c.c.SolrZkClient makePath: /overseer_elect/election
   [junit4]   2> 57848 INFO  (TEST-CloudSolrClientTest.testWrongZkChrootTest-seed#[977F0DC3DF3AE3F7]) [n:127.0.0.1:36676_kj_st    ] o.a.s.c.Overseer Overseer (id=null) closing
   [junit4]   2> 57849 INFO  (TEST-CloudSolrClientTest.testWrongZkChrootTest-seed#[977F0DC3DF3AE3F7]) [n:127.0.0.1:36676_kj_st    ] o.a.s.c.LeaderElector Joined leadership election with path: /overseer_elect/election/94095630014283779-127.0.0.1:36676_kj_st-n_0000000000
   [junit4]   2> 57849 INFO  (TEST-CloudSolrClientTest.testWrongZkChrootTest-seed#[977F0DC3DF3AE3F7]) [n:127.0.0.1:36676_kj_st    ] o.a.s.c.OverseerElectionContext I am going to be the leader 127.0.0.1:36676_kj_st
   [junit4]   2> 57849 INFO  (TEST-CloudSolrClientTest.testWrongZkChrootTest-seed#[977F0DC3DF3AE3F7]) [n:127.0.0.1:36676_kj_st    ] o.a.s.c.c.SolrZkClient makePath: /overseer_elect/leader
   [junit4]   2> 57850 INFO  (TEST-CloudSolrClientTest.testWrongZkChrootTest-seed#[977F0DC3DF3AE3F7]) [n:127.0.0.1:36676_kj_st    ] o.a.s.c.Overseer Overseer (id=94095630014283779-127.0.0.1:36676_kj_st-n_0000000000) starting
   [junit4]   2> 57851 INFO  (TEST-CloudSolrClientTest.testWrongZkChrootTest-seed#[977F0DC3DF3AE3F7]) [n:127.0.0.1:36676_kj_st    ] o.a.s.c.c.SolrZkClient makePath: /overseer/queue-work
   [junit4]   2> 57854 INFO  (TEST-CloudSolrClientTest.testWrongZkChrootTest-seed#[977F0DC3DF3AE3F7]) [n:127.0.0.1:36676_kj_st    ] o.a.s.c.OverseerAutoReplicaFailoverThread Starting OverseerAutoReplicaFailoverThread autoReplicaFailoverWorkLoopDelay=10000 autoReplicaFailoverWaitAfterExpiration=30000 autoReplicaFailoverBadNodeExpiration=60000
   [junit4]   2> 57854 INFO  (TEST-CloudSolrClientTest.testWrongZkChrootTest-seed#[977F0DC3DF3AE3F7]) [n:127.0.0.1:36676_kj_st    ] o.a.s.c.c.ZkStateReader Updating cluster state from ZooKeeper... 
   [junit4]   2> 57854 INFO  (OverseerCollectionProcessor-94095630014283779-127.0.0.1:36676_kj_st-n_0000000000) [n:127.0.0.1:36676_kj_st    ] o.a.s.c.OverseerCollectionProcessor Process current queue of collection creations
   [junit4]   2> 57854 INFO  (OverseerStateUpdate-94095630014283779-127.0.0.1:36676_kj_st-n_0000000000) [n:127.0.0.1:36676_kj_st    ] o.a.s.c.Overseer Starting to work on the main queue
   [junit4]   2> 57856 INFO  (TEST-CloudSolrClientTest.testWrongZkChrootTest-seed#[977F0DC3DF3AE3F7]) [n:127.0.0.1:36676_kj_st    ] o.a.s.c.CoreContainer No authentication plugin used.
   [junit4]   2> 57856 INFO  (TEST-CloudSolrClientTest.testWrongZkChrootTest-seed#[977F0DC3DF3AE3F7]) [n:127.0.0.1:36676_kj_st    ] o.a.s.c.CoreContainer Security conf doesn't exist. Skipping setup for authorization module.
   [junit4]   2> 57857 INFO  (TEST-CloudSolrClientTest.testWrongZkChrootTest-seed#[977F0DC3DF3AE3F7]) [n:127.0.0.1:36676_kj_st    ] o.a.s.c.CoresLocator Looking for core definitions underneath /home/jenkins/workspace/Lucene-Solr-trunk-Linux/solr/build/solr-solrj/test/J2/temp/solr.client.solrj.impl.CloudSolrClientTest_977F0DC3DF3AE3F7-001/control-001/cores
   [junit4]   2> 57858 INFO  (TEST-CloudSolrClientTest.testWrongZkChrootTest-seed#[977F0DC3DF3AE3F7]) [n:127.0.0.1:36676_kj_st    ] o.a.s.c.SolrCore Created CoreDescriptor: {name=collection1, config=solrconfig.xml, transient=false, schema=schema.xml, loadOnStartup=true, instanceDir=/home/jenkins/workspace/Lucene-Solr-trunk-Linux/solr/build/solr-solrj/test/J2/temp/solr.client.solrj.impl.CloudSolrClientTest_977F0DC3DF3AE3F7-001/control-001/cores/collection1, collection=control_collection, absoluteInstDir=/home/jenkins/workspace/Lucene-Solr-trunk-Linux/solr/build/solr-solrj/test/J2/temp/solr.client.solrj.impl.CloudSolrClientTest_977F0DC3DF3AE3F7-001/control-001/cores/collection1/, coreNodeName=, dataDir=data/, shard=}
   [junit4]   2> 57858 INFO  (TEST-CloudSolrClientTest.testWrongZkChrootTest-seed#[977F0DC3DF3AE3F7]) [n:127.0.0.1:36676_kj_st    ] o.a.s.c.CoresLocator Found core collection1 in /home/jenkins/workspace/Lucene-Solr-trunk-Linux/solr/build/solr-solrj/test/J2/temp/solr.client.solrj.impl.CloudSolrClientTest_977F0DC3DF3AE3F7-001/control-001/cores/collection1/
   [junit4]   2> 57858 INFO  (TEST-CloudSolrClientTest.testWrongZkChrootTest-seed#[977F0DC3DF3AE3F7]) [n:127.0.0.1:36676_kj_st    ] o.a.s.c.CoresLocator Found 1 core definitions
   [junit4]   2> 57859 INFO  (coreLoadExecutor-206-thread-1-processing-n:127.0.0.1:36676_kj_st) [n:127.0.0.1:36676_kj_st c:control_collection   x:collection1] o.a.s.c.ZkController publishing state=down
   [junit4]   2> 57859 INFO  (TEST-CloudSolrClientTest.testWrongZkChrootTest-seed#[977F0DC3DF3AE3F7]) [n:127.0.0.1:36676_kj_st    ] o.a.s.s.SolrDispatchFilter user.dir=/home/jenkins/workspace/Lucene-Solr-trunk-Linux/solr/build/solr-solrj/test/J2
   [junit4]   2> 57859 INFO  (TEST-CloudSolrClientTest.testWrongZkChrootTest-seed#[977F0DC3DF3AE3F7]) [n:127.0.0.1:36676_kj_st    ] o.a.s.s.SolrDispatchFilter SolrDispatchFilter.init() done
   [junit4]   2> 57859 INFO  (coreLoadExecutor-206-thread-1-processing-n:127.0.0.1:36676_kj_st) [n:127.0.0.1:36676_kj_st c:control_collection   x:collection1] o.a.s.c.ZkController numShards not found on descriptor - reading it from system property
   [junit4]   2> 57859 INFO  (zkCallback-152-thread-1-processing-n:127.0.0.1:36676_kj_st) [n:127.0.0.1:36676_kj_st    ] o.a.s.c.DistributedQueue NodeChildrenChanged fired on path /overseer/queue state SyncConnected
   [junit4]   2> 57859 INFO  (coreLoadExecutor-206-thread-1-processing-n:127.0.0.1:36676_kj_st) [n:127.0.0.1:36676_kj_st c:control_collection   x:collection1] o.a.s.c.ZkController look for our core node name
   [junit4]   2> 57860 INFO  (OverseerStateUpdate-94095630014283779-127.0.0.1:36676_kj_st-n_0000000000) [n:127.0.0.1:36676_kj_st    ] o.a.s.c.Overseer processMessage: queueSize: 1, message = {
   [junit4]   2>   "core":"collection1",
   [junit4]   2>   "roles":null,
   [junit4]   2>   "base_url":"http://127.0.0.1:36676/kj_st",
   [junit4]   2>   "node_name":"127.0.0.1:36676_kj_st",
   [junit4]   2>   "numShards":"1",
   [junit4]   2>   "state":"down",
   [junit4]   2>   "shard":null,
   [junit4]   2>   "collection":"control_collection",
   [junit4]   2>   "operation":"state"} current state version: 0
   [junit4]   2> 57860 INFO  (OverseerStateUpdate-94095630014283779-127.0.0.1:36676_kj_st-n_0000000000) [n:127.0.0.1:36676_kj_st    ] o.a.s.c.o.ReplicaMutator Update state numShards=1 message={
   [junit4]   2>   "core":"collection1",
   [junit4]   2>   "roles":null,
   [junit4]   2>   "base_url":"http://127.0.0.1:36676/kj_st",
   [junit4]   2>   "node_name":"127.0.0.1:36676_kj_st",
   [junit4]   2>   "numShards":"1",
   [junit4]   2>   "state":"down",
   [junit4]   2>   "shard":null,
   [junit4]   2>   "collection":"control_collection",
   [junit4]   2>   "operation":"state"}
   [junit4]   2> 57860 INFO  (OverseerStateUpdate-94095630014283779-127.0.0.1:36676_kj_st-n_0000000000) [n:127.0.0.1:36676_kj_st    ] o.a.s.c.o.ClusterStateMutator building a new cName: control_collection
   [junit4]   2> 57861 INFO  (OverseerStateUpdate-94095630014283779-127.0.0.1:36676_kj_st-n_0000000000) [n:127.0.0.1:36676_kj_st    ] o.a.s.c.o.ReplicaMutator Assigning new node to shard shard=shard1
   [junit4]   2> 57861 INFO  (zkCallback-152-thread-1-processing-n:127.0.0.1:36676_kj_st) [n:127.0.0.1:36676_kj_st    ] o.a.s.c.c.ZkStateReader A cluster state change: WatchedEvent state:SyncConnected type:NodeDataChanged path:/clusterstate.json, has occurred - updating... (live nodes size: 1)
   [junit4]   2> 57862 INFO  (zkCallback-152-thread-1-processing-n:127.0.0.1:36676_kj_st) [n:127.0.0.1:36676_kj_st    ] o.a.s.c.c.ZkStateReader Updated cluster state version to 1
   [junit4]   2> 58860 INFO  (coreLoadExecutor-206-thread-1-processing-n:127.0.0.1:36676_kj_st) [n:127.0.0.1:36676_kj_st c:control_collection   x:collection1] o.a.s.c.ZkController waiting to find shard id in clusterstate for collection1
   [junit4]   2> 58860 INFO  (coreLoadExecutor-206-thread-1-processing-n:127.0.0.1:36676_kj_st) [n:127.0.0.1:36676_kj_st c:control_collection   x:collection1] o.a.s.c.ZkController Check for collection zkNode:control_collection
   [junit4]   2> 58860 INFO  (coreLoadExecutor-206-thread-1-processing-n:127.0.0.1:36676_kj_st) [n:127.0.0.1:36676_kj_st c:control_collection   x:collection1] o.a.s.c.ZkController Collection zkNode exists
   [junit4]   2> 58860 INFO  (coreLoadExecutor-206-thread-1-processing-n:127.0.0.1:36676_kj_st) [n:127.0.0.1:36676_kj_st c:control_collection   x:collection1] o.a.s.c.c.ZkStateReader Load collection config from:/collections/control_collection
   [junit4]   2> 58861 INFO  (coreLoadExecutor-206-thread-1-processing-n:127.0.0.1:36676_kj_st) [n:127.0.0.1:36676_kj_st c:control_collection   x:collection1] o.a.s.c.c.ZkStateReader path=/collections/control_collection configName=conf1 specified config exists in ZooKeeper
   [junit4]   2> 58861 INFO  (coreLoadExecutor-206-thread-1-processing-n:127.0.0.1:36676_kj_st) [n:127.0.0.1:36676_kj_st c:control_collection   x:collection1] o.a.s.c.SolrResourceLoader new SolrResourceLoader for directory: '/home/jenkins/workspace/Lucene-Solr-trunk-Linux/solr/build/solr-solrj/test/J2/temp/solr.client.solrj.impl.CloudSolrClientTest_977F0DC3DF3AE3F7-001/control-001/cores/collection1/'
   [junit4]   2> 58871 INFO  (coreLoadExecutor-206-thread-1-processing-n:127.0.0.1:36676_kj_st) [n:127.0.0.1:36676_kj_st c:control_collection   x:collection1] o.a.s.c.Config loaded config solrconfig.xml with version 0 
   [junit4]   2> 58874 INFO  (coreLoadExecutor-206-thread-1-processing-n:127.0.0.1:36676_kj_st) [n:127.0.0.1:36676_kj_st c:control_collection   x:collection1] o.a.s.c.SolrConfig current version of requestparams : -1
   [junit4]   2> 58877 INFO  (coreLoadExecutor-206-thread-1-processing-n:127.0.0.1:36676_kj_st) [n:127.0.0.1:36676_kj_st c:control_collection   x:collection1] o.a.s.c.SolrConfig Using Lucene MatchVersion: 6.0.0
   [junit4]   2> 58882 INFO  (coreLoadExecutor-206-thread-1-processing-n:127.0.0.1:36676_kj_st) [n:127.0.0.1:36676_kj_st c:control_collection   x:collection1] o.a.s.c.Config Loaded SolrConfig: solrconfig.xml
   [junit4]   2> 58883 INFO  (coreLoadExecutor-206-thread-1-processing-n:127.0.0.1:36676_kj_st) [n:127.0.0.1:36676_kj_st c:control_collection   x:collection1] o.a.s.s.IndexSchema Reading Solr Schema from /configs/conf1/schema.xml
   [junit4]   2> 58888 INFO  (coreLoadExecutor-206-thread-1-processing-n:127.0.0.1:36676_kj_st) [n:127.0.0.1:36676_kj_st c:control_collection   x:collection1] o.a.s.s.IndexSchema [collection1] Schema name=test
   [junit4]   2> 58948 INFO  (coreLoadExecutor-206-thread-1-processing-n:127.0.0.1:36676_kj_st) [n:127.0.0.1:36676_kj_st c:control_collection   x:collection1] o.a.s.s.IndexSchema default search field in schema is text
   [junit4]   2> 58949 INFO  (coreLoadExecutor-206-thread-1-processing-n:127.0.0.1:36676_kj_st) [n:127.0.0.1:36676_kj_st c:control_collection   x:collection1] o.a.s.s.IndexSchema unique key field: id
   [junit4]   2> 58949 WARN  (coreLoadExecutor-206-thread-1-processing-n:127.0.0.1:36676_kj_st) [n:127.0.0.1:36676_kj_st c:control_collection   x:collection1] o.a.s.s.IndexSchema Field lowerfilt1and2 is not multivalued and destination for multiple copyFields (2)
   [junit4]   2> 58950 WARN  (coreLoadExecutor-206-thread-1-processing-n:127.0.0.1:36676_kj_st) [n:127.0.0.1:36676_kj_st c:control_collection   x:collection1] o.a.s.s.IndexSchema Field text is not multivalued and destination for multiple copyFields (3)
   [junit4]   2> 58950 INFO  (coreLoadExecutor-206-thread-1-processing-n:127.0.0.1:36676_kj_st) [n:127.0.0.1:36676_kj_st c:control_collection   x:collection1] o.a.s.c.CoreContainer Creating SolrCore 'collection1' using configuration from collection control_collection
   [junit4]   2> 58950 INFO  (coreLoadExecutor-206-thread-1-processing-n:127.0.0.1:36676_kj_st) [n:127.0.0.1:36676_kj_st c:control_collection s:shard1 r:core_node1 x:collection1] o.a.s.c.SolrCore org.apache.solr.core.MockDirectoryFactory
   [junit4]   2> 58950 INFO  (coreLoadExecutor-206-thread-1-processing-n:127.0.0.1:36676_kj_st) [n:127.0.0.1:36676_kj_st c:control_collection s:shard1 r:core_node1 x:collection1] o.a.s.c.SolrCore [[collection1] ] Opening new SolrCore at [/home/jenkins/workspace/Lucene-Solr-trunk-Linux/solr/build/solr-solrj/test/J2/temp/solr.client.solrj.impl.CloudSolrClientTest_977F0DC3DF3AE3F7-001/control-001/cores/collection1/], dataDir=[null]
   [junit4]   2> 58950 INFO  (coreLoadExecutor-206-thread-1-processing-n:127.0.0.1:36676_kj_st) [n:127.0.0.1:36676_kj_st c:control_collection s:shard1 r:core_node1 x:collection1] o.a.s.c.SolrCore JMX monitoring not detected for core: collection1
   [junit4]   2> 58951 INFO  (coreLoadExecutor-206-thread-1-processing-n:127.0.0.1:36676_kj_st) [n:127.0.0.1:36676_kj_st c:control_collection s:shard1 r:core_node1 x:collection1] o.a.s.c.CachingDirectoryFactory return new directory for /home/jenkins/workspace/Lucene-Solr-trunk-Linux/solr/build/solr-solrj/test/J2/temp/solr.client.solrj.impl.CloudSolrClientTest_977F0DC3DF3AE3F7-001/control-001/cores/collection1/data
   [junit4]   2> 58951 INFO  (coreLoadExecutor-206-thread-1-processing-n:127.0.0.1:36676_kj_st) [n:127.0.0.1:36676_kj_st c:control_collection s:shard1 r:core_node1 x:collection1] o.a.s.c.SolrCore New index directory detected: old=null new=/home/jenkins/workspace/Lucene-Solr-trunk-Linux/solr/build/solr-solrj/test/J2/temp/solr.client.solrj.impl.CloudSolrClientTest_977F0DC3DF3AE3F7-001/control-001/cores/collection1/data/index/
   [junit4]   2> 58951 WARN  (coreLoadExecutor-206-thread-1-processing-n:127.0.0.1:36676_kj_st) [n:127.0.0.1:36676_kj_st c:control_collection s:shard1 r:core_node1 x:collection1] o.a.s.c.SolrCore [collection1] Solr index directory '/home/jenkins/workspace/Lucene-Solr-trunk-Linux/solr/build/solr-solrj/test/J2/temp/solr.client.solrj.impl.CloudSolrClientTest_977F0DC3DF3AE3F7-001/control-001/cores/collection1/data/index' doesn't exist. Creating new index...
   [junit4]   2> 58951 INFO  (coreLoadExecutor-206-thread-1-processing-n:127.0.0.1:36676_kj_st) [n:127.0.0.1:36676_kj_st c:control_collection s:shard1 r:core_node1 x:collection1] o.a.s.c.CachingDirectoryFactory return new directory for /home/jenkins/workspace/Lucene-Solr-trunk-Linux/solr/build/solr-solrj/test/J2/temp/solr.client.solrj.impl.CloudSolrClientTest_977F0DC3DF3AE3F7-001/control-001/cores/collection1/data/index
   [junit4]   2> 58952 INFO  (coreLoadExecutor-206-thread-1-processing-n:127.0.0.1:36676_kj_st) [n:127.0.0.1:36676_kj_st c:control_collection s:shard1 r:core_node1 x:collection1] o.a.s.c.SolrCore SolrDeletionPolicy.onCommit: commits: num=1
   [junit4]   2> 	commit{dir=MockDirectoryWrapper(RAMDirectory@77b69025 lockFactory=org.apache.lucene.store.SingleInstanceLockFactory@311c9c69),segFN=segments_1,generation=1}
   [junit4]   2> 58952 INFO  (coreLoadExecutor-206-thread-1-processing-n:127.0.0.1:36676_kj_st) [n:127.0.0.1:36676_kj_st c:control_collection s:shard1 r:core_node1 x:collection1] o.a.s.c.SolrCore newest commit generation = 1
   [junit4]   2> 58952 INFO  (OldIndexDirectoryCleanupThreadForCore-collection1) [n:127.0.0.1:36676_kj_st c:control_collection s:shard1 r:core_node1 x:collection1] o.a.s.c.SolrCore Looking for old index directories to cleanup for core collection1 in /home/jenkins/workspace/Lucene-Solr-trunk-Linux/solr/build/solr-solrj/test/J2/temp/solr.client.solrj.impl.CloudSolrClientTest_977F0DC3DF3AE3F7-001/control-001/cores/collection1/data/
   [junit4]   2> 58952 WARN  (OldIndexDirectoryCleanupThreadForCore-collection1) [n:127.0.0.1:36676_kj_st c:control_collection s:shard1 r:core_node1 x:collection1] o.a.s.c.DirectoryFactory /home/jenkins/workspace/Lucene-Solr-trunk-Linux/solr/build/solr-solrj/test/J2/temp/solr.client.solrj.impl.CloudSolrClientTest_977F0DC3DF3AE3F7-001/control-001/cores/collection1/data/ does not point to a valid data directory; skipping clean-up of old index directories.
   [junit4]   2> 58953 INFO  (coreLoadExecutor-206-thread-1-processing-n:127.0.0.1:36676_kj_st) [n:127.0.0.1:36676_kj_st c:control_collection s:shard1 r:core_node1 x:collection1] o.a.s.c.SolrCore no updateRequestProcessorChain defined as default, creating implicit default
   [junit4]   2> 58955 INFO  (coreLoadExecutor-206-thread-1-processing-n:127.0.0.1:36676_kj_st) [n:127.0.0.1:36676_kj_st c:control_collection s:shard1 r:core_node1 x:collection1] o.a.s.h.l.XMLLoader xsltCacheLifetimeSeconds=60
   [junit4]   2> 58956 INFO  (coreLoadExecutor-206-thread-1-processing-n:127.0.0.1:36676_kj_st) [n:127.0.0.1:36676_kj_st c:control_collection s:shard1 r:core_node1 x:collection1] o.a.s.h.l.XMLLoader xsltCacheLifetimeSeconds=60
   [junit4]   2> 58956 INFO  (coreLoadExecutor-206-thread-1-processing-n:127.0.0.1:36676_kj_st) [n:127.0.0.1:36676_kj_st c:control_collection s:shard1 r:core_node1 x:collection1] o.a.s.h.l.XMLLoader xsltCacheLifetimeSeconds=60
   [junit4]   2> 58956 INFO  (coreLoadExecutor-206-thread-1-processing-n:127.0.0.1:36676_kj_st) [n:127.0.0.1:36676_kj_st c:control_collection s:shard1 r:core_node1 x:collection1] o.a.s.h.l.XMLLoader xsltCacheLifetimeSeconds=60
   [junit4]   2> 58957 INFO  (coreLoadExecutor-206-thread-1-processing-n:127.0.0.1:36676_kj_st) [n:127.0.0.1:36676_kj_st c:control_collection s:shard1 r:core_node1 x:collection1] o.a.s.c.RequestHandlers Registered paths: /admin/mbeans,standard,,/update/csv,/update/json/docs,/admin/luke,/admin/segments,/get,/admin/system,/replication,/admin/properties,/config,/schema,/admin/plugins,/admin/logging,/update/json,/admin/threads,/admin/ping,/update,/admin/file
   [junit4]   2> 58958 WARN  (coreLoadExecutor-206-thread-1-processing-n:127.0.0.1:36676_kj_st) [n:127.0.0.1:36676_kj_st c:control_collection s:shard1 r:core_node1 x:collection1] o.a.s.c.RequestHandlers no default request handler is registered (either '/select' or 'standard')
   [junit4]   2> 58958 INFO  (coreLoadExecutor-206-thread-1-processing-n:127.0.0.1:36676_kj_st) [n:127.0.0.1:36676_kj_st c:control_collection s:shard1 r:core_node1 x:collection1] o.a.s.c.SolrCore Using default statsCache cache: org.apache.solr.search.stats.LocalStatsCache
   [junit4]   2> 58959 INFO  (coreLoadExecutor-206-thread-1-processing-n:127.0.0.1:36676_kj_st) [n:127.0.0.1:36676_kj_st c:control_collection s:shard1 r:core_node1 x:collection1] o.a.s.u.UpdateHandler Using UpdateLog implementation: org.apache.solr.update.UpdateLog
   [junit4]   2> 58959 INFO  (coreLoadExecutor-206-thread-1-processing-n:127.0.0.1:36676_kj_st) [n:127.0.0.1:36676_kj_st c:control_collection s:shard1 r:core_node1 x:collection1] o.a.s.u.UpdateLog Initializing UpdateLog: dataDir= defaultSyncLevel=FLUSH numRecordsToKeep=100 maxNumLogsToKeep=10 numVersionBuckets=65536
   [junit4]   2> 58959 INFO  (coreLoadExecutor-206-thread-1-processing-n:127.0.0.1:36676_kj_st) [n:127.0.0.1:36676_kj_st c:control_collection s:shard1 r:core_node1 x:collection1] o.a.s.c.SolrCore Hard AutoCommit: disabled
   [junit4]   2> 58960 INFO  (coreLoadExecutor-206-thread-1-processing-n:127.0.0.1:36676_kj_st) [n:127.0.0.1:36676_kj_st c:control_collection s:shard1 r:core_node1 x:collection1] o.a.s.c.SolrCore Soft AutoCommit: disabled
   [junit4]   2> 58960 INFO  (coreLoadExecutor-206-thread-1-processing-n:127.0.0.1:36676_kj_st) [n:127.0.0.1:36676_kj_st c:control_collection s:shard1 r:core_node1 x:collection1] o.a.s.c.SolrCore SolrDeletionPolicy.onInit: commits: num=1
   [junit4]   2> 	commit{dir=MockDirectoryWrapper(RAMDirectory@77b69025 lockFactory=org.apache.lucene.store.SingleInstanceLockFactory@311c9c69),segFN=segments_1,generation=1}
   [junit4]   2> 58960 INFO  (coreLoadExecutor-206-thread-1-processing-n:127.0.0.1:36676_kj_st) [n:127.0.0.1:36676_kj_st c:control_collection s:shard1 r:core_node1 x:collection1] o.a.s.c.SolrCore newest commit generation = 1
   [junit4]   2> 58961 INFO  (coreLoadExecutor-206-thread-1-processing-n:127.0.0.1:36676_kj_st) [n:127.0.0.1:36676_kj_st c:control_collection s:shard1 r:core_node1 x:collection1] o.a.s.s.SolrIndexSearcher Opening Searcher@31d421f7[collection1] main
   [junit4]   2> 58961 INFO  (coreLoadExecutor-206-thread-1-processing-n:127.0.0.1:36676_kj_st) [n:127.0.0.1:36676_kj_st c:control_collection s:shard1 r:core_node1 x:collection1] o.a.s.c.c.ZkStateReader Load collection config from:/collections/control_collection
   [junit4]   2> 58962 INFO  (coreLoadExecutor-206-thread-1-processing-n:127.0.0.1:36676_kj_st) [n:127.0.0.1:36676_kj_st c:control_collection s:shard1 r:core_node1 x:collection1] o.a.s.c.c.ZkStateReader path=/collections/control_collection configName=conf1 specified config exists in ZooKeeper
   [junit4]   2> 58962 INFO  (coreLoadExecutor-206-thread-1-processing-n:127.0.0.1:36676_kj_st) [n:127.0.0.1:36676_kj_st c:control_collection s:shard1 r:core_node1 x:collection1] o.a.s.r.ManagedResourceStorage Setting up ZooKeeper-based storage for the RestManager with znodeBase: /configs/conf1
   [junit4]   2> 58962 INFO  (coreLoadExecutor-206-thread-1-processing-n:127.0.0.1:36676_kj_st) [n:127.0.0.1:36676_kj_st c:control_collection s:shard1 r:core_node1 x:collection1] o.a.s.r.ManagedResourceStorage Configured ZooKeeperStorageIO with znodeBase: /configs/conf1
   [junit4]   2> 58962 INFO  (coreLoadExecutor-206-thread-1-processing-n:127.0.0.1:36676_kj_st) [n:127.0.0.1:36676_kj_st c:control_collection s:shard1 r:core_node1 x:collection1] o.a.s.r.RestManager Initializing RestManager with initArgs: {}
   [junit4]   2> 58962 INFO  (coreLoadExecutor-206-thread-1-processing-n:127.0.0.1:36676_kj_st) [n:127.0.0.1:36676_kj_st c:control_collection s:shard1 r:core_node1 x:collection1] o.a.s.r.ManagedResourceStorage Reading _rest_managed.json using ZooKeeperStorageIO:path=/configs/conf1
   [junit4]   2> 58963 INFO  (coreLoadExecutor-206-thread-1-processing-n:127.0.0.1:36676_kj_st) [n:127.0.0.1:36676_kj_st c:control_collection s:shard1 r:core_node1 x:collection1] o.a.s.r.ManagedResourceStorage No data found for znode /configs/conf1/_rest_managed.json
   [junit4]   2> 58963 INFO  (coreLoadExecutor-206-thread-1-processing-n:127.0.0.1:36676_kj_st) [n:127.0.0.1:36676_kj_st c:control_collection s:shard1 r:core_node1 x:collection1] o.a.s.r.ManagedResourceStorage Loaded null at path _rest_managed.json using ZooKeeperStorageIO:path=/configs/conf1
   [junit4]   2> 58963 INFO  (coreLoadExecutor-206-thread-1-processing-n:127.0.0.1:36676_kj_st) [n:127.0.0.1:36676_kj_st c:control_collection s:shard1 r:core_node1 x:collection1] o.a.s.r.RestManager Initializing 0 registered ManagedResources
   [junit4]   2> 58963 INFO  (coreLoadExecutor-206-thread-1-processing-n:127.0.0.1:36676_kj_st) [n:127.0.0.1:36676_kj_st c:control_collection s:shard1 r:core_node1 x:collection1] o.a.s.h.ReplicationHandler Commits will be reserved for  10000
   [junit4]   2> 58964 INFO  (searcherExecutor-207-thread-1-processing-n:127.0.0.1:36676_kj_st x:collection1 s:shard1 c:control_collection r:core_node1) [n:127.0.0.1:36676_kj_st c:control_collection s:shard1 r:core_node1 x:collection1] o.a.s.c.SolrCore [collection1] Registered new searcher Searcher@31d421f7[collection1] main{ExitableDirectoryReader(UninvertingDirectoryReader())}
   [junit4]   2> 58964 INFO  (coreLoadExecutor-206-thread-1-processing-n:127.0.0.1:36676_kj_st) [n:127.0.0.1:36676_kj_st c:control_collection s:shard1 r:core_node1 x:collection1] o.a.s.u.UpdateLog Looking up max value of version field to seed version buckets
   [junit4]   2> 58964 INFO  (coreLoadExecutor-206-thread-1-processing-n:127.0.0.1:36676_kj_st) [n:127.0.0.1:36676_kj_st c:control_collection s:shard1 r:core_node1 x:collection1] o.a.s.u.VersionInfo Refreshing highest value of _version_ for 65536 version buckets from index
   [junit4]   2> 58964 INFO  (coreLoadExecutor-206-thread-1-processing-n:127.0.0.1:36676_kj_st) [n:127.0.0.1:36676_kj_st c:control_collection s:shard1 r:core_node1 x:collection1] o.a.s.u.VersionInfo No terms found for _version_, cannot seed version bucket highest value from index
   [junit4]   2> 58964 INFO  (coreLoadExecutor-206-thread-1-processing-n:127.0.0.1:36676_kj_st) [n:127.0.0.1:36676_kj_st c:control_collection s:shard1 r:core_node1 x:collection1] o.a.s.u.UpdateLog Could not find max version in index or recent updates, using new clock 1505530081571766272
   [junit4]   2> 58966 INFO  (coreLoadExecutor-206-thread-1-processing-n:127.0.0.1:36676_kj_st) [n:127.0.0.1:36676_kj_st c:control_collection s:shard1 r:core_node1 x:collection1] o.a.s.u.UpdateLog Took 2 ms to seed version buckets with highest version 1505530081571766272
   [junit4]   2> 58966 INFO  (coreLoadExecutor-206-thread-1-processing-n:127.0.0.1:36676_kj_st) [n:127.0.0.1:36676_kj_st c:control_collection s:shard1 r:core_node1 x:collection1] o.a.s.c.ZkController watch zkdir /configs/conf1
   [junit4]   2> 58966 INFO  (coreLoadExecutor-206-thread-1-processing-n:127.0.0.1:36676_kj_st) [n:127.0.0.1:36676_kj_st c:control_collection s:shard1 r:core_node1 x:collection1] o.a.s.c.CoreContainer registering core: collection1
   [junit4]   2> 58967 INFO  (coreZkRegister-200-thread-1-processing-n:127.0.0.1:36676_kj_st x:collection1 s:shard1 c:control_collection r:core_node1) [n:127.0.0.1:36676_kj_st c:control_collection s:shard1 r:core_node1 x:collection1] o.a.s.c.ZkController Register replica - core:collection1 address:http://127.0.0.1:36676/kj_st collection:control_collection shard:shard1
   [junit4]   2> 58967 INFO  (coreZkRegister-200-thread-1-processing-n:127.0.0.1:36676_kj_st x:collection1 s:shard1 c:control_collection r:core_node1) [n:127.0.0.1:36676_kj_st c:control_collection s:shard1 r:core_node1 x:collection1] o.a.s.c.c.SolrZkClient makePath: /collections/control_collection/leader_elect/shard1/election
   [junit4]   2> 58971 INFO  (coreZkRegister-200-thread-1-processing-n:127.0.0.1:36676_kj_st x:collection1 s:shard1 c:control_collection r:core_node1) [n:127.0.0.1:36676_kj_st c:control_collection s:shard1 r:core_node1 x:collection1] o.a.s.c.LeaderElector Joined leadership election with path: /collections/control_collection/leader_elect/shard1/election/94095630014283779-core_node1-n_0000000000
   [junit4]   2> 58972 INFO  (coreZkRegister-200-thread-1-processing-n:127.0.0.1:36676_kj_st x:collection1 s:shard1 c:control_collection r:core_node1) [n:127.0.0.1:36676_kj_st c:control_collection s:shard1 r:core_node1 x:collection1] o.a.s.c.ShardLeaderElectionContext Running the leader process for shard shard1
   [junit4]   2> 58974 INFO  (zkCallback-152-thread-1-processing-n:127.0.0.1:36676_kj_st) [n:127.0.0.1:36676_kj_st    ] o.a.s.c.DistributedQueue NodeChildrenChanged fired on path /overseer/queue state SyncConnected
   [junit4]   2> 58974 INFO  (coreZkRegister-200-thread-1-processing-n:127.0.0.1:36676_kj_st x:collection1 s:shard1 c:control_collection r:core_node1) [n:127.0.0.1:36676_kj_st c:control_collection s:shard1 r:core_node1 x:collection1] o.a.s.c.ShardLeaderElectionContext Enough replicas found to continue.
   [junit4]   2> 58974 INFO  (coreZkRegister-200-thread-1-processing-n:127.0.0.1:36676_kj_st x:collection1 s:shard1 c:control_collection r:core_node1) [n:127.0.0.1:36676_kj_st c:control_collection s:shard1 r:core_node1 x:collection1] o.a.s.c.ShardLeaderElectionContext I may be the new leader - try and sync
   [junit4]   2> 58974 INFO  (coreZkRegister-200-thread-1-processing-n:127.0.0.1:36676_kj_st x:collection1 s:shard1 c:control_collection r:core_node1) [n:127.0.0.1:36676_kj_st c:control_collection s:shard1 r:core_node1 x:collection1] o.a.s.c.SyncStrategy Sync replicas to http://127.0.0.1:36676/kj_st/collection1/
   [junit4]   2> 58974 INFO  (OverseerStateUpdate-94095630014283779-127.0.0.1:36676_kj_st-n_0000000000) [n:127.0.0.1:36676_kj_st    ] o.a.s.c.Overseer processMessage: queueSize: 1, message = {
   [junit4]   2>   "operation":"leader",
   [junit4]   2>   "shard":"shard1",
   [junit4]   2>   "collection":"control_collection"} current state version: 1
   [junit4]   2> 58974 INFO  (coreZkRegister-200-thread-1-processing-n:127.0.0.1:36676_kj_st x:collection1 s:shard1 c:control_collection r:core_node1) [n:127.0.0.1:36676_kj_st c:control_collection s:shard1 r:core_node1 x:collection1] o.a.s.c.SyncStrategy Sync Success - now sync replicas to me
   [junit4]   2> 58975 INFO  (coreZkRegister-200-thread-1-processing-n:127.0.0.1:36676_kj_st x:collection1 s:shard1 c:control_collection r:core_node1) [n:127.0.0.1:36676_kj_st c:control_collection s:shard1 r:core_node1 x:collection1] o.a.s.c.SyncStrategy http://127.0.0.1:36676/kj_st/collection1/ has no replicas
   [junit4]   2> 58975 INFO  (coreZkRegister-200-thread-1-processing-n:127.0.0.1:36676_kj_st x:collection1 s:shard1 c:control_collection r:core_node1) [n:127.0.0.1:36676_kj_st c:control_collection s:shard1 r:core_node1 x:collection1] o.a.s.c.ShardLeaderElectionContext I am the new leader: http://127.0.0.1:36676/kj_st/collection1/ shard1
   [junit4]   2> 58975 INFO  (coreZkRegister-200-thread-1-processing-n:127.0.0.1:36676_kj_st x:collection1 s:shard1 c:control_collection r:core_node1) [n:127.0.0.1:36676_kj_st c:control_collection s:shard1 r:core_node1 x:collection1] o.a.s.c.c.SolrZkClient makePath: /collections/control_collection/leaders/shard1
   [junit4]   2> 58978 INFO  (zkCallback-152-thread-1-processing-n:127.0.0.1:36676_kj_st) [n:127.0.0.1:36676_kj_st    ] o.a.s.c.DistributedQueue NodeChildrenChanged fired on path /overseer/queue state SyncConnected
   [junit4]   2> 58979 INFO  (OverseerStateUpdate-94095630014283779-127.0.0.1:36676_kj_st-n_0000000000) [n:127.0.0.1:36676_kj_st    ] o.a.s.c.Overseer processMessage: queueSize: 1, message = {
   [junit4]   2>   "operation":"leader",
   [junit4]   2>   "shard":"shard1",
   [junit4]   2>   "collection":"control_collection",
   [junit4]   2>   "base_url":"http://127.0.0.1:36676/kj_st",
   [junit4]   2>   "core":"collection1",
   [junit4]   2>   "state":"active"} current state version: 1
   [junit4]   2> 59090 INFO  (zkCallback-152-thread-1-processing-n:127.0.0.1:36676_kj_st) [n:127.0.0.1:36676_kj_st    ] o.a.s.c.c.ZkStateReader A cluster state change: WatchedEvent state:SyncConnected type:NodeDataChanged path:/clusterstate.json, has occurred - updating... (live nodes size: 1)
   [junit4]   2> 59091 INFO  (zkCallback-152-thread-1-processing-n:127.0.0.1:36676_kj_st) [n:127.0.0.1:36676_kj_st    ] o.a.s.c.c.ZkStateReader Updated cluster state version to 2
   [junit4]   2> 59129 INFO  (coreZkRegister-200-thread-1-processing-n:127.0.0.1:36676_kj_st x:collection1 s:shard1 c:control_collection r:core_node1) [n:127.0.0.1:36676_kj_st c:control_collection s:shard1 r:core_node1 x:collection1] o.a.s.c.ZkController We are http://127.0.0.1:36676/kj_st/collection1/ and leader is http://127.0.0.1:36676/kj_st/collection1/
   [junit4]   2> 59129 INFO  (coreZkRegister-200-thread-1-processing-n:127.0.0.1:36676_kj_st x:collection1 s:shard1 c:control_collection r:core_node1) [n:127.0.0.1:36676_kj_st c:control_collection s:shard1 r:core_node1 x:collection1] o.a.s.c.ZkController No LogReplay needed for core=collection1 baseURL=http://127.0.0.1:36676/kj_st
   [junit4]   2> 59129 INFO  (coreZkRegister-200-thread-1-processing-n:127.0.0.1:36676_kj_st x:collection1 s:shard1 c:control_collection r:core_node1) [n:127.0.0.1:36676_kj_st c:control_collection s:shard1 r:core_node1 x:collection1] o.a.s.c.ZkController I am the leader, no recovery necessary
   [junit4]   2> 59129 INFO  (coreZkRegister-200-thread-1-processing-n:127.0.0.1:36676_kj_st x:collection1 s:shard1 c:control_collection r:core_node1) [n:127.0.0.1:36676_kj_st c:control_collection s:shard1 r:core_node1 x:collection1] o.a.s.c.ZkController publishing state=active
   [junit4]   2> 59130 INFO  (coreZkRegister-200-thread-1-processing-n:127.0.0.1:36676_kj_st x:collection1 s:shard1 c:control_collection r:core_node1) [n:127.0.0.1:36676_kj_st c:control_collection s:shard1 r:core_node1 x:collection1] o.a.s.c.ZkController numShards not found on descriptor - reading it from system property
   [junit4]   2> 59130 INFO  (zkCallback-152-thread-1-processing-n:127.0.0.1:36676_kj_st) [n:127.0.0.1:36676_kj_st    ] o.a.s.c.DistributedQueue NodeChildrenChanged fired on path /overseer/queue state SyncConnected
   [junit4]   2> 59131 INFO  (OverseerStateUpdate-94095630014283779-127.0.0.1:36676_kj_st-n_0000000000) [n:127.0.0.1:36676_kj_st    ] o.a.s.c.Overseer processMessage: queueSize: 1, message = {
   [junit4]   2>   "core":"collection1",
   [junit4]   2>   "core_node_name":"core_node1",
   [junit4]   2>   "roles":null,
   [junit4]   2>   "base_url":"http://127.0.0.1:36676/kj_st",
   [junit4]   2>   "node_name":"127.0.0.1:36676_kj_st",
   [junit4]   2>   "numShards":"1",
   [junit4]   2>   "state":"active",
   [junit4]   2>   "shard":"shard1",
   [junit4]   2>   "collection":"control_collection",
   [junit4]   2>   "operation":"state"} current state version: 2
   [junit4]   2> 59131 INFO  (OverseerStateUpdate-94095630014283779-127.0.0.1:36676_kj_st-n_0000000000) [n:127.0.0.1:36676_kj_st    ] o.a.s.c.o.ReplicaMutator Update state numShards=1 message={
   [junit4]   2>   "core":"collection1",
   [junit4]   2>   "core_node_name":"core_node1",
   [junit4]   2>   "roles":null,
   [junit4]   2>   "base_url":"http://127.0.0.1:36676/kj_st",
   [junit4]   2>   "node_name":"127.0.0.1:36676_kj_st",
   [junit4]   2>   "numShards":"1",
   [junit4]   2>   "state":"active",
   [junit4]   2>   "shard":"shard1",
   [junit4]   2>   "collection":"control_collection",
   [junit4]   2>   "operation":"state"}
   [junit4]   2> 59232 INFO  (zkCallback-152-thread-1-processing-n:127.0.0.1:36676_kj_st) [n:127.0.0.1:36676_kj_st    ] o.a.s.c.c.ZkStateReader A cluster state change: WatchedEvent state:SyncConnected type:NodeDataChanged path:/clusterstate.json, has occurred - updating... (live nodes size: 1)
   [junit4]   2> 59233 INFO  (zkCallback-152-thread-1-processing-n:127.0.0.1:36676_kj_st) [n:127.0.0.1:36676_kj_st    ] o.a.s.c.c.ZkStateReader Updated cluster state version to 3
   [junit4]   2> 59360 INFO  (TEST-CloudSolrClientTest.testWrongZkChrootTest-seed#[977F0DC3DF3AE3F7]) [    ] o.a.s.c.c.SolrZkClient Using default ZkCredentialsProvider
   [junit4]   2> 59361 INFO  (TEST-CloudSolrClientTest.testWrongZkChrootTest-seed#[977F0DC3DF3AE3F7]) [    ] o.a.s.c.c.ConnectionManager Waiting for client to connect to ZooKeeper
   [junit4]   2> 59362 INFO  (zkCallback-154-thread-1) [    ] o.a.s.c.c.ConnectionManager Watcher org.apache.solr.common.cloud.ConnectionManager@7875fdaf name:ZooKeeperConnection Watcher:127.0.0.1:44469/solr got event WatchedEvent state:SyncConnected type:None path:null path:null type:None
   [junit4]   2> 59362 INFO  (TEST-CloudSolrClientTest.testWrongZkChrootTest-seed#[977F0DC3DF3AE3F7]) [    ] o.a.s.c.c.ConnectionManager Client is connected to ZooKeeper
   [junit4]   2> 59362 INFO  (TEST-CloudSolrClientTest.testWrongZkChrootTest-seed#[977F0DC3DF3AE3F7]) [    ] o.a.s.c.c.SolrZkClient Using default ZkACLProvider
   [junit4]   2> 59362 INFO  (TEST-CloudSolrClientTest.testWrongZkChrootTest-seed#[977F0DC3DF3AE3F7]) [    ] o.a.s.c.c.ZkStateReader Updating cluster state from ZooKeeper... 
   [junit4]   2> 59363 INFO  (TEST-CloudSolrClientTest.testWrongZkChrootTest-seed#[977F0DC3DF3AE3F7]) [    ] o.a.s.c.ChaosMonkey monkey: init - expire sessions:false cause connection loss:false
   [junit4]   2> 59363 INFO  (TEST-CloudSolrClientTest.testWrongZkChrootTest-seed#[977F0DC3DF3AE3F7]) [    ] o.a.s.c.AbstractFullDistribZkTestBase Creating collection1 with stateFormat=2
   [junit4]   2> 59363 INFO  (TEST-CloudSolrClientTest.testWrongZkChrootTest-seed#[977F0DC3DF3AE3F7]) [    ] o.a.s.c.c.SolrZkClient Using default ZkCredentialsProvider
   [junit4]   2> 59364 INFO  (TEST-CloudSolrClientTest.testWrongZkChrootTest-seed#[977F0DC3DF3AE3F7]) [    ] o.a.s.c.c.ConnectionManager Waiting for client to connect to ZooKeeper
   [junit4]   2> 59365 INFO  (zkCallback-155-thread-1) [    ] o.a.s.c.c.ConnectionManager Watcher org.apache.solr.common.cloud.ConnectionManager@66e83742 name:ZooKeeperConnection Watcher:127.0.0.1:44469/solr got event WatchedEvent state:SyncConnected type:None path:null path:null type:None
   [junit4]   2> 59365 INFO  (TEST-CloudSolrClientTest.testWrongZkChrootTest-seed#[977F0DC3DF3AE3F7]) [    ] o.a.s.c.c.ConnectionManager Client is connected to ZooKeeper
   [junit4]   2> 59365 INFO  (TEST-CloudSolrClientTest.testWrongZkChrootTest-seed#[977F0DC3DF3AE3F7]) [    ] o.a.s.c.c.SolrZkClient Using default ZkACLProvider
   [junit4]   2> 59366 INFO  (zkCallback-152-thread-1-processing-n:127.0.0.1:36676_kj_st) [n:127.0.0.1:36676_kj_st    ] o.a.s.c.DistributedQueue NodeChildrenChanged fired on path /overseer/queue state SyncConnected
   [junit4]   2> 59367 WARN  (NIOServerCxn.Factory:0.0.0.0/0.0.0.0:0) [    ] o.a.z.s.NIOServerCnxn caught end of stream exception
   [junit4]   2> EndOfStreamException: Unable to read additional data from client sessionid 0x14e4b7a19eb0005, likely client has closed socket
   [junit4]   2> 	at org.apache.zookeeper.server.NIOServerCnxn.doIO(NIOServerCnxn.java:228)
   [junit4]   2> 	at org.apache.zookeeper.server.NIOServerCnxnFactory.run(NIOServerCnxnFactory.java:208)
   [junit4]   2> 	at java.lang.Thread.run(Thread.java:745)
   [junit4]   2> 59373 INFO  (OverseerStateUpdate-94095630014283779-127.0.0.1:36676_kj_st-n_0000000000) [n:127.0.0.1:36676_kj_st    ] o.a.s.c.Overseer processMessage: queueSize: 1, message = {
   [junit4]   2>   "operation":"create",
   [junit4]   2>   "name":"collection1",
   [junit4]   2>   "numShards":"2",
   [junit4]   2>   "stateFormat":"2"} current state version: 3
   [junit4]   2> 59373 INFO  (OverseerStateUpdate-94095630014283779-127.0.0.1:36676_kj_st-n_0000000000) [n:127.0.0.1:36676_kj_st    ] o.a.s.c.o.ClusterStateMutator building a new cName: collection1
   [junit4]   2> 59382 INFO  (TEST-CloudSolrClientTest.testWrongZkChrootTest-seed#[977F0DC3DF3AE3F7]) [    ] o.a.s.SolrTestCaseJ4 Writing core.properties file to /home/jenkins/workspace/Lucene-Solr-trunk-Linux/solr/build/solr-solrj/test/J2/temp/solr.client.solrj.impl.CloudSolrClientTest_977F0DC3DF3AE3F7-001/shard-1-001/cores/collection1
   [junit4]   2> 59382 INFO  (TEST-CloudSolrClientTest.testWrongZkChrootTest-seed#[977F0DC3DF3AE3F7]) [    ] o.a.s.c.AbstractFullDistribZkTestBase create jetty 1 in directory /home/jenkins/workspace/Lucene-Solr-trunk-Linux/solr/build/solr-solrj/test/J2/temp/solr.client.solrj.impl.CloudSolrClientTest_977F0DC3DF3AE3F7-001/shard-1-001
   [junit4]   2> 59383 INFO  (TEST-CloudSolrClientTest.testWrongZkChrootTest-seed#[977F0DC3DF3AE3F7]) [    ] o.e.j.s.Server jetty-9.2.11.v20150529
   [junit4]   2> 59385 INFO  (TEST-CloudSolrClientTest.testWrongZkChrootTest-seed#[977F0DC3DF3AE3F7]) [    ] o.e.j.s.h.ContextHandler Started o.e.j.s.ServletContextHandler@6796a0ca{/kj_st,null,AVAILABLE}
   [junit4]   2> 59386 INFO  (TEST-CloudSolrClientTest.testWrongZkChrootTest-seed#[977F0DC3DF3AE3F7]) [    ] o.e.j.s.ServerConnector Started ServerConnector@527f5341{HTTP/1.1}{127.0.0.1:35105}
   [junit4]   2> 59386 INFO  (TEST-CloudSolrClientTest.testWrongZkChrootTest-seed#[977F0DC3DF3AE3F7]) [    ] o.e.j.s.Server Started @61002ms
   [junit4]   2> 59386 INFO  (TEST-CloudSolrClientTest.testWrongZkChrootTest-seed#[977F0DC3DF3AE3F7]) [    ] o.a.s.c.s.e.JettySolrRunner Jetty properties: {solr.data.dir=/home/jenkins/workspace/Lucene-Solr-trunk-Linux/solr/build/solr-solrj/test/J2/temp/solr.client.solrj.impl.CloudSolrClientTest_977F0DC3DF3AE3F7-001/tempDir-001/jetty1, solrconfig=solrconfig.xml, hostContext=/kj_st, hostPort=35105, coreRootDirectory=/home/jenkins/workspace/Lucene-Solr-trunk-Linux/solr/build/solr-solrj/test/J2/temp/solr.client.solrj.impl.CloudSolrClientTest_977F0DC3DF3AE3F7-001/shard-1-001/cores}
   [junit4]   2> 59387 INFO  (TEST-CloudSolrClientTest.testWrongZkChrootTest-seed#[977F0DC3DF3AE3F7]) [    ] o.a.s.s.SolrDispatchFilter SolrDispatchFilter.init(): sun.misc.Launcher$AppClassLoader@659e0bfd
   [junit4]   2> 59387 INFO  (TEST-CloudSolrClientTest.testWrongZkChrootTest-seed#[977F0DC3DF3AE3F7]) [    ] o.a.s.c.SolrResourceLoader new SolrResourceLoader for directory: '/home/jenkins/workspace/Lucene-Solr-trunk-Linux/solr/build/solr-solrj/test/J2/temp/solr.client.solrj.impl.CloudSolrClientTest_977F0DC3DF3AE3F7-001/shard-1-001/'
   [junit4]   2> 59398 INFO  (TEST-CloudSolrClientTest.testWrongZkChrootTest-seed#[977F0DC3DF3AE3F7]) [    ] o.a.s.c.SolrXmlConfig Loading container configuration from /home/jenkins/workspace/Lucene-Solr-trunk-Linux/solr/build/solr-solrj/test/J2/temp/solr.client.solrj.impl.CloudSolrClientTest_977F0DC3DF3AE3F7-001/shard-1-001/solr.xml
   [junit4]   2> 59402 INFO  (TEST-CloudSolrClientTest.testWrongZkChrootTest-seed#[977F0DC3DF3AE3F7]) [    ] o.a.s.c.CoresLocator Config-defined core root directory: /home/jenkins/workspace/Lucene-Solr-trunk-Linux/solr/build/solr-solrj/test/J2/temp/solr.client.solrj.impl.CloudSolrClientTest_977F0DC3DF3AE3F7-001/shard-1-001/cores
   [junit4]   2> 59402 INFO  (TEST-CloudSolrClientTest.testWrongZkChrootTest-seed#[977F0DC3DF3AE3F7]) [    ] o.a.s.c.CoreContainer New CoreContainer 1395057797
   [junit4]   2> 59402 INFO  (TEST-CloudSolrClientTest.testWrongZkChrootTest-seed#[977F0DC3DF3AE3F7]) [    ] o.a.s.c.CoreContainer Loading cores into CoreContainer [instanceDir=/home/jenkins/workspace/Lucene-Solr-trunk-Linux/solr/build/solr-solrj/test/J2/temp/solr.client.solrj.impl.CloudSolrClientTest_977F0DC3DF3AE3F7-001/shard-1-001/]
   [junit4]   2> 59402 INFO  (TEST-CloudSolrClientTest.testWrongZkChrootTest-seed#[977F0DC3DF3AE3F7]) [    ] o.a.s.c.CoreContainer loading shared library: /home/jenkins/workspace/Lucene-Solr-trunk-Linux/solr/build/solr-solrj/test/J2/temp/solr.client.solrj.impl.CloudSolrClientTest_977F0DC3DF3AE3F7-001/shard-1-001/lib
   [junit4]   2> 59402 WARN  (TEST-CloudSolrClientTest.testWrongZkChrootTest-seed#[977F0DC3DF3AE3F7]) [    ] o.a.s.c.SolrResourceLoader Can't find (or read) directory to add to classloader: lib (resolved as: /home/jenkins/workspace/Lucene-Solr-trunk-Linux/solr/build/solr-solrj/test/J2/temp/solr.client.solrj.impl.CloudSolrClientTest_977F0DC3DF3AE3F7-001/shard-1-001/lib).
   [junit4]   2> 59406 INFO  (TEST-CloudSolrClientTest.testWrongZkChrootTest-seed#[977F0DC3DF3AE3F7]) [    ] o.a.s.h.c.HttpShardHandlerFactory created with socketTimeout : 90000,urlScheme : ,connTimeout : 15000,maxConnectionsPerHost : 20,maxConnections : 10000,corePoolSize : 0,maximumPoolSize : 2147483647,maxThreadIdleTime : 5,sizeOfQueue : -1,fairnessPolicy : false,useRetries : false,
   [junit4]   2> 59407 INFO  (TEST-CloudSolrClientTest.testWrongZkChrootTest-seed#[977F0DC3DF3AE3F7]) [    ] o.a.s.u.UpdateShardHandler Creating UpdateShardHandler HTTP client with params: socketTimeout=340000&connTimeout=45000&retry=true
   [junit4]   2> 59407 INFO  (TEST-CloudSolrClientTest.testWrongZkChrootTest-seed#[977F0DC3DF3AE3F7]) [    ] o.a.s.l.LogWatcher SLF4J impl is org.slf4j.impl.Log4jLoggerFactory
   [junit4]   2> 59409 INFO  (TEST-CloudSolrClientTest.testWrongZkChrootTest-seed#[977F0DC3DF3AE3F7]) [    ] o.a.s.l.LogWatcher Registering Log Listener [Log4j (org.slf4j.impl.Log4jLoggerFactory)]
   [junit4]   2> 59409 INFO  (TEST-CloudSolrClientTest.testWrongZkChrootTest-seed#[977F0DC3DF3AE3F7]) [    ] o.a.s.c.ZkContainer Zookeeper client=127.0.0.1:44469/solr
   [junit4]   2> 59409 INFO  (TEST-CloudSolrClientTest.testWrongZkChrootTest-seed#[977F0DC3DF3AE3F7]) [    ] o.a.s.c.ZkController zkHost includes chroot
   [junit4]   2> 59409 INFO  (TEST-CloudSolrClientTest.testWrongZkChrootTest-seed#[977F0DC3DF3AE3F7]) [    ] o.a.s.c.c.SolrZkClient Using default ZkCredentialsProvider
   [junit4]   2> 59410 INFO  (TEST-CloudSolrClientTest.testWrongZkChrootTest-seed#[977F0DC3DF3AE3F7]) [    ] o.a.s.c.c.ConnectionManager Waiting for client to connect to ZooKeeper
   [junit4]   2> 59411 INFO  (zkCallback-157-thread-1) [    ] o.a.s.c.c.ConnectionManager Watcher org.apache.solr.common.cloud.ConnectionManager@41c2acca name:ZooKeeperConnection Watcher:127.0.0.1:44469 got event WatchedEvent state:SyncConnected type:None path:null path:null type:None
   [junit4]   2> 59411 INFO  (TEST-CloudSolrClientTest.testWrongZkChrootTest-seed#[977F0DC3DF3AE3F7]) [    ] o.a.s.c.c.ConnectionManager Client is connected to ZooKeeper
   [junit4]   2> 59412 INFO  (TEST-CloudSolrClientTest.testWrongZkChrootTest-seed#[977F0DC3DF3AE3F7]) [    ] o.a.s.c.c.SolrZkClient Using default ZkACLProvider
   [junit4]   2> 59412 INFO  (TEST-CloudSolrClientTest.testWrongZkChrootTest-seed#[977F0DC3DF3AE3F7]) [n:127.0.0.1:35105_kj_st    ] o.a.s.c.c.ConnectionManager Waiting for client to connect to ZooKeeper
   [junit4]   2> 59419 INFO  (zkCallback-158-thread-1-processing-n:127.0.0.1:35105_kj_st) [n:127.0.0.1:35105_kj_st    ] o.a.s.c.c.ConnectionManager Watcher org.apache.solr.common.cloud.ConnectionManager@6a5fc0ae name:ZooKeeperConnection Watcher:127.0.0.1:44469/solr got event WatchedEvent state:SyncConnected type:None path:null path:null type:None
   [junit4]   2> 59419 INFO  (TEST-CloudSolrClientTest.testWrongZkChrootTest-seed#[977F0DC3DF3AE3F7]) [n:127.0.0.1:35105_kj_st    ] o.a.s.c.c.ConnectionManager Client is connected to ZooKeeper
   [junit4]   2> 59422 INFO  (TEST-CloudSolrClientTest.testWrongZkChrootTest-seed#[977F0DC3DF3AE3F7]) [n:127.0.0.1:35105_kj_st    ] o.a.s.c.c.ZkStateReader Updating cluster state from ZooKeeper... 
   [junit4]   2> 59482 INFO  (OverseerStateUpdate-94095630014283779-127.0.0.1:36676_kj_st-n_0000000000) [n:127.0.0.1:36676_kj_st    ] o.a.s.c.o.ZkStateWriter going to create_collection /collections/collection1/state.json
   [junit4]   2> 59483 INFO  (zkCallback-158-thread-1-processing-n:127.0.0.1:35105_kj_st) [n:127.0.0.1:35105_kj_st    ] o.a.s.c.c.ZkStateReader A cluster state change: WatchedEvent state:SyncConnected type:NodeDataChanged path:/clusterstate.json, has occurred - updating... (live nodes size: 1)
   [junit4]   2> 59483 INFO  (zkCallback-152-thread-1-processing-n:127.0.0.1:36676_kj_st) [n:127.0.0.1:36676_kj_st    ] o.a.s.c.c.ZkStateReader A cluster state change: WatchedEvent state:SyncConnected type:NodeDataChanged path:/clusterstate.json, has occurred - updating... (live nodes size: 1)
   [junit4]   2> 59483 INFO  (zkCallback-154-thread-1) [    ] o.a.s.c.c.ZkStateReader A cluster state change: WatchedEvent state:SyncConnected type:NodeDataChanged path:/clusterstate.json, has occurred - updating... (live nodes size: 1)
   [junit4]   2> 59486 INFO  (zkCallback-158-thread-1-processing-n:127.0.0.1:35105_kj_st) [n:127.0.0.1:35105_kj_st    ] o.a.s.c.c.ZkStateReader Updated cluster state version to 4
   [junit4]   2> 59486 INFO  (zkCallback-152-thread-1-processing-n:127.0.0.1:36676_kj_st) [n:127.0.0.1:36676_kj_st    ] o.a.s.c.c.ZkStateReader Updated cluster state version to 4
   [junit4]   2> 59486 INFO  (zkCallback-154-thread-1) [    ] o.a.s.c.c.ZkStateReader Updated cluster state version to 4
   [junit4]   2> 60424 INFO  (TEST-CloudSolrClientTest.testWrongZkChrootTest-seed#[977F0DC3DF3AE3F7]) [n:127.0.0.1:35105_kj_st    ] o.a.s.c.ZkController Register node as live in ZooKeeper:/live_nodes/127.0.0.1:35105_kj_st
   [junit4]   2> 60424 INFO  (TEST-CloudSolrClientTest.testWrongZkChrootTest-seed#[977F0DC3DF3AE3F7]) [n:127.0.0.1:35105_kj_st    ] o.a.s.c.c.SolrZkClient makePath: /live_nodes/127.0.0.1:35105_kj_st
   [junit4]   2> 60425 INFO  (TEST-CloudSolrClientTest.testWrongZkChrootTest-seed#[977F0DC3DF3AE3F7]) [n:127.0.0.1:35105_kj_st    ] o.a.s.c.Overseer Overseer (id=null) closing
   [junit4]   2> 60426 INFO  (TEST-CloudSolrClientTest.testWrongZkChrootTest-seed#[977F0DC3DF3AE3F7]) [n:127.0.0.1:35105_kj_st    ] o.a.s.c.LeaderElector Joined leadership election with path: /overseer_elect/election/94095630014283783-127.0.0.1:35105_kj_st-n_0000000001
   [junit4]   2> 60426 INFO  (TEST-CloudSolrClientTest.testWrongZkChrootTest-seed#[977F0DC3DF3AE3F7]) [n:127.0.0.1:35105_kj_st    ] o.a.s.c.LeaderElector Watching path /overseer_elect/election/94095630014283779-127.0.0.1:36676_kj_st-n_0000000000 to know if I could be the leader
   [junit4]   2> 60426 INFO  (TEST-CloudSolrClientTest.testWrongZkChrootTest-seed#[977F0DC3DF3AE3F7]) [n:127.0.0.1:35105_kj_st    ] o.a.s.c.CoreContainer No authentication plugin used.
   [junit4]   2> 60426 INFO  (TEST-CloudSolrClientTest.testWrongZkChrootTest-seed#[977F0DC3DF3AE3F7]) [n:127.0.0.1:35105_kj_st    ] o.a.s.c.CoreContainer Security conf doesn't exist. Skipping setup for authorization module.
   [junit4]   2> 60427 INFO  (TEST-CloudSolrClientTest.testWrongZkChrootTest-seed#[977F0DC3DF3AE3F7]) [n:127.0.0.1:35105_kj_st    ] o.a.s.c.CoresLocator Looking for core definitions underneath /home/jenkins/workspace/Lucene-Solr-trunk-Linux/solr/build/solr-solrj/test/J2/temp/solr.client.solrj.impl.CloudSolrClientTest_977F0DC3DF3AE3F7-001/shard-1-001/cores
   [junit4]   2> 60428 INFO  (TEST-CloudSolrClientTest.testWrongZkChrootTest-seed#[977F0DC3DF3AE3F7]) [n:127.0.0.1:35105_kj_st    ] o.a.s.c.SolrCore Created CoreDescriptor: {name=collection1, config=solrconfig.xml, transient=false, schema=schema.xml, loadOnStartup=true, instanceDir=/home/jenkins/workspace/Lucene-Solr-trunk-Linux/solr/build/solr-solrj/test/J2/temp/solr.client.solrj.impl.CloudSolrClientTest_977F0DC3DF3AE3F7-001/shard-1-001/cores/collection1, collection=collection1, absoluteInstDir=/home/jenkins/workspace/Lucene-Solr-trunk-Linux/solr/build/solr-solrj/test/J2/temp/solr.client.solrj.impl.CloudSolrClientTest_977F0DC3DF3AE3F7-001/shard-1-001/cores/collection1/, coreNodeName=, dataDir=data/, shard=}
   [junit4]   2> 60428 INFO  (TEST-CloudSolrClientTest.testWrongZkChrootTest-seed#[977F0DC3DF3AE3F7]) [n:127.0.0.1:35105_kj_st    ] o.a.s.c.CoresLocator Found core collection1 in /home/jenkins/workspace/Lucene-Solr-trunk-Linux/solr/build/solr-solrj/test/J2/temp/solr.client.solrj.impl.CloudSolrClientTest_977F0DC3DF3AE3F7-001/shard-1-001/cores/collection1/
   [junit4]   2> 60428 INFO  (TEST-CloudSolrClientTest.testWrongZkChrootTest-seed#[977F0DC3DF3AE3F7]) [n:127.0.0.1:35105_kj_st    ] o.a.s.c.CoresLocator Found 1 core definitions
   [junit4]   2> 60429 INFO  (TEST-CloudSolrClientTest.testWrongZkChrootTest-seed#[977F0DC3DF3AE3F7]) [n:127.0.0.1:35105_kj_st    ] o.a.s.s.SolrDispatchFilter user.dir=/home/jenkins/workspace/Lucene-Solr-trunk-Linux/solr/build/solr-solrj/test/J2
   [junit4]   2> 60429 INFO  (TEST-CloudSolrClientTest.testWrongZkChrootTest-seed#[977F0DC3DF3AE3F7]) [n:127.0.0.1:35105_kj_st    ] o.a.s.s.SolrDispatchFilter SolrDispatchFilter.init() done
   [junit4]   2> 60429 INFO  (coreLoadExecutor-217-thread-1-processing-n:127.0.0.1:35105_kj_st) [n:127.0.0.1:35105_kj_st c:collection1   x:collection1] o.a.s.c.ZkController publishing state=down
   [junit4]   2> 60429 INFO  (coreLoadExecutor-217-thread-1-processing-n:127.0.0.1:35105_kj_st) [n:127.0.0.1:35105_kj_st c:collection1   x:collection1] o.a.s.c.ZkController numShards not found on descriptor - reading it from system property
   [junit4]   2> 60430 INFO  (zkCallback-152-thread-1-processing-n:127.0.0.1:36676_kj_st) [n:127.0.0.1:36676_kj_st    ] o.a.s.c.DistributedQueue NodeChildrenChanged fired on path /overseer/queue state SyncConnected
   [junit4]   2> 60430 INFO  (coreLoadExecutor-217-thread-1-processing-n:127.0.0.1:35105_kj_st) [n:127.0.0.1:35105_kj_st c:collection1   x:collection1] o.a.s.c.ZkController Registering watch for external collection collection1
   [junit4]   2> 60430 INFO  (coreLoadExecutor-217-thread-1-processing-n:127.0.0.1:35105_kj_st) [n:127.0.0.1:35105_kj_st c:collection1   x:collection1] o.a.s.c.c.ZkStateReader addZkWatch collection1
   [junit4]   2> 60430 INFO  (OverseerStateUpdate-94095630014283779-127.0.0.1:36676_kj_st-n_0000000000) [n:127.0.0.1:36676_kj_st    ] o.a.s.c.Overseer processMessage: queueSize: 1, message = {
   [junit4]   2>   "core":"collection1",
   [junit4]   2>   "roles":null,
   [junit4]   2>   "base_url":"http://127.0.0.1:35105/kj_st",
   [junit4]   2>   "node_name":"127.0.0.1:35105_kj_st",
   [junit4]   2>   "numShards":"2",
   [junit4]   2>   "state":"down",
   [junit4]   2>   "shard":null,
   [junit4]   2>   "collection":"collection1",
   [junit4]   2>   "operation":"state"} current state version: 4
   [junit4]   2> 60430 INFO  (coreLoadExecutor-217-thread-1-processing-n:127.0.0.1:35105_kj_st) [n:127.0.0.1:35105_kj_st c:collection1   x:collection1] o.a.s.c.c.ZkStateReader Updating collection state at /collections/collection1/state.json from ZooKeeper... 
   [junit4]   2> 60430 INFO  (OverseerStateUpdate-94095630014283779-127.0.0.1:36676_kj_st-n_0000000000) [n:127.0.0.1:36676_kj_st    ] o.a.s.c.o.ReplicaMutator Update state numShards=2 message={
   [junit4]   2>   "core":"collection1",
   [junit4]   2>   "roles":null,
   [junit4]   2>   "base_url":"http://127.0.0.1:35105/kj_st",
   [junit4]   2>   "node_name":"127.0.0.1:35105_kj_st",
   [junit4]   2>   "numShards":"2",
   [junit4]   2>   "state":"down",
   [junit4]   2>   "shard":null,
   [junit4]   2>   "collection":"collection1",
   [junit4]   2>   "operation":"state"}
   [junit4]   2> 60430 INFO  (OverseerStateUpdate-94095630014283779-127.0.0.1:36676_kj_st-n_0000000000) [n:127.0.0.1:36676_kj_st    ] o.a.s.c.o.ReplicaMutator Collection already exists with numShards=2
   [junit4]   2> 60430 INFO  (OverseerStateUpdate-94095630014283779-127.0.0.1:36676_kj_st-n_0000000000) [n:127.0.0.1:36676_kj_st    ] o.a.s.c.o.ReplicaMutator Assigning new node to shard shard=shard2
   [junit4]   2> 60431 INFO  (coreLoadExecutor-217-thread-1-processing-n:127.0.0.1:35105_kj_st) [n:127.0.0.1:35105_kj_st c:collection1   x:collection1] o.a.s.c.c.ZkStateReader Updating data for collection1 to ver 0 
   [junit4]   2> 60431 INFO  (coreLoadExecutor-217-thread-1-processing-n:127.0.0.1:35105_kj_st) [n:127.0.0.1:35105_kj_st c:collection1   x:collection1] o.a.s.c.ZkController look for our core node name
   [junit4]   2> 60532 INFO  (OverseerStateUpdate-94095630014283779-127.0.0.1:36676_kj_st-n_0000000000) [n:127.0.0.1:36676_kj_st    ] o.a.s.c.o.ZkStateWriter going to update_collection /collections/collection1/state.json version: 0
   [junit4]   2> 60532 INFO  (zkCallback-158-thread-1-processing-n:127.0.0.1:35105_kj_st) [n:127.0.0.1:35105_kj_st    ] o.a.s.c.c.ZkStateReader A cluster state change: WatchedEvent state:SyncConnected type:NodeDataChanged path:/collections/collection1/state.json for collection collection1 has occurred - updating... (live nodes size: 2)
   [junit4]   2> 60533 INFO  (zkCallback-158-thread-1-processing-n:127.0.0.1:35105_kj_st) [n:127.0.0.1:35105_kj_st    ] o.a.s.c.c.ZkStateReader Updating data for collection1 to ver 1 
   [junit4]   2> 61431 INFO  (coreLoadExecutor-217-thread-1-processing-n:127.0.0.1:35105_kj_st) [n:127.0.0.1:35105_kj_st c:collection1   x:collection1] o.a.s.c.ZkController waiting to find shard id in clusterstate for collection1
   [junit4]   2> 61432 INFO  (coreLoadExecutor-217-thread-1-processing-n:127.0.0.1:35105_kj_st) [n:127.0.0.1:35105_kj_st c:collection1   x:collection1] o.a.s.c.ZkController Check for collection zkNode:collection1
   [junit4]   2> 61432 INFO  (coreLoadExecutor-217-thread-1-processing-n:127.0.0.1:35105_kj_st) [n:127.0.0.1:35105_kj_st c:collection1   x:collection1] o.a.s.c.ZkController Collection zkNode exists
   [junit4]   2> 61432 INFO  (coreLoadExecutor-217-thread-1-processing-n:127.0.0.1:35105_kj_st) [n:127.0.0.1:35105_kj_st c:collection1   x:collection1] o.a.s.c.c.ZkStateReader Load collection config from:/collections/collection1
   [junit4]   2> 61433 INFO  (coreLoadExecutor-217-thread-1-processing-n:127.0.0.1:35105_kj_st) [n:127.0.0.1:35105_kj_st c:collection1   x:collection1] o.a.s.c.c.ZkStateReader path=/collections/collection1 configName=conf1 specified config exists in ZooKeeper
   [junit4]   2> 61433 INFO  (coreLoadExecutor-217-thread-1-processing-n:127.0.0.1:35105_kj_st) [n:127.0.0.1:35105_kj_st c:collection1   x:collection1] o.a.s.c.SolrResourceLoader new SolrResourceLoader for directory: '/home/jenkins/workspace/Lucene-Solr-trunk-Linux/solr/build/solr-solrj/test/J2/temp/solr.client.solrj.impl.CloudSolrClientTest_977F0DC3DF3AE3F7-001/shard-1-001/cores/collection1/'
   [junit4]   2> 61442 INFO  (coreLoadExecutor-217-thread-1-processing-n:127.0.0.1:35105_kj_st) [n:127.0.0.1:35105_kj_st c:collection1   x:collection1] o.a.s.c.Config loaded config solrconfig.xml with version 0 
   [junit4]   2> 61446 INFO  (coreLoadExecutor-217-thread-1-processing-n:127.0.0.1:35105_kj_st) [n:127.0.0.1:35105_kj_st c:collection1   x:collection1] o.a.s.c.SolrConfig current version of requestparams : -1
   [junit4]   2> 61449 INFO  (coreLoadExecutor-217-thread-1-processing-n:127.0.0.1:35105_kj_st) [n:127.0.0.1:35105_kj_st c:collection1   x:collection1] o.a.s.c.SolrConfig Using Lucene MatchVersion: 6.0.0
   [junit4]   2> 61462 INFO  (coreLoadExecutor-217-thread-1-processing-n:127.0.0.1:35105_kj_st) [n:127.0.0.1:35105_kj_st c:collection1   x:collection1] o.a.s.c.Config Loaded SolrConfig: solrconfig.xml
   [junit4]   2> 61464 INFO  (coreLoadExecutor-217-thread-1-processing-n:127.0.0.1:35105_kj_st) [n:127.0.0.1:35105_kj_st c:collection1   x:collection1] o.a.s.s.IndexSchema Reading Solr Schema from /configs/conf1/schema.xml
   [junit4]   2> 61469 INFO  (coreLoadExecutor-217-thread-1-processing-n:127.0.0.1:35105_kj_st) [n:127.0.0.1:35105_kj_st c:collection1   x:collection1] o.a.s.s.IndexSchema [collection1] Schema name=test
   [junit4]   2> 61595 INFO  (coreLoadExecutor-217-thread-1-processing-n:127.0.0.1:35105_kj_st) [n:127.0.0.1:35105_kj_st c:collection1   x:collection1] o.a.s.s.IndexSchema default search field in schema is text
   [junit4]   2> 61596 INFO  (coreLoadExecutor-217-thread-1-processing-n:127.0.0.1:35105_kj_st) [n:127.0.0.1:35105_kj_st c:collection1   x:collection1] o.a.s.s.IndexSchema unique key field: id
   [junit4]   2> 61597 WARN  (coreLoadExecutor-217-thread-1-processing-n:127.0.0.1:35105_kj_st) [n:127.0.0.1:35105_kj_st c:collection1   x:collection1] o.a.s.s.IndexSchema Field lowerfilt1and2 is not multivalued and destination for multiple copyFields (2)
   [junit4]   2> 61598 WARN  (coreLoadExecutor-217-thread-1-processing-n:127.0.0.1:35105_kj_st) [n:127.0.0.1:35105_kj_st c:collection1   x:collection1] o.a.s.s.IndexSchema Field text is not multivalued and destination for multiple copyFields (3)
   [junit4]   2> 61598 INFO  (coreLoadExecutor-217-thread-1-processing-n:127.0.0.1:35105_kj_st) [n:127.0.0.1:35105_kj_st c:collection1   x:collection1] o.a.s.c.CoreContainer Creating SolrCore 'collection1' using configuration from collection collection1
   [junit4]   2> 61598 INFO  (coreLoadExecutor-217-thread-1-processing-n:127.0.0.1:35105_kj_st) [n:127.0.0.1:35105_kj_st c:collection1 s:shard2 r:core_node1 x:collection1] o.a.s.c.SolrCore org.apache.solr.core.MockDirectoryFactory
   [junit4]   2> 61599 INFO  (coreLoadExecutor-217-thread-1-processing-n:127.0.0.1:35105_kj_st) [n:127.0.0.1:35105_kj_st c:collection1 s:shard2 r:core_node1 x:collection1] o.a.s.c.SolrCore [[collection1] ] Opening new SolrCore at [/home/jenkins/workspace/Lucene-Solr-trunk-Linux/solr/build/solr-solrj/test/J2/temp/solr.client.solrj.impl.CloudSolrClientTest_977F0DC3DF3AE3F7-001/shard-1-001/cores/collection1/], dataDir=[null]
   [junit4]   2> 61599 INFO  (coreLoadExecutor-217-thread-1-processing-n:127.0.0.1:35105_kj_st) [n:127.0.0.1:35105_kj_st c:collection1 s:shard2 r:core_node1 x:collection1] o.a.s.c.SolrCore JMX monitoring not detected for core: collection1
   [junit4]   2> 61599 INFO  (coreLoadExecutor-217-thread-1-processing-n:127.0.0.1:35105_kj_st) [n:127.0.0.1:35105_kj_st c:collection1 s:shard2 r:core_node1 x:collection1] o.a.s.c.CachingDirectoryFactory return new directory for /home/jenkins/workspace/Lucene-Solr-trunk-Linux/solr/build/solr-solrj/test/J2/temp/solr.client.solrj.impl.CloudSolrClientTest_977F0DC3DF3AE3F7-001/shard-1-001/cores/collection1/data
   [junit4]   2> 61599 INFO  (coreLoadExecutor-217-thread-1-processing-n:127.0.0.1:35105_kj_st) [n:127.0.0.1:35105_kj_st c:collection1 s:shard2 r:core_node1 x:collection1] o.a.s.c.SolrCore New index directory detected: old=null new=/home/jenkins/workspace/Lucene-Solr-trunk-Linux/solr/build/solr-solrj/test/J2/temp/solr.client.solrj.impl.CloudSolrClientTest_977F0DC3DF3AE3F7-001/shard-1-001/cores/collection1/data/index/
   [junit4]   2> 61599 WARN  (coreLoadExecutor-217-thread-1-processing-n:127.0.0.1:35105_kj_st) [n:127.0.0.1:35105_kj_st c:collection1 s:shard2 r:core_node1 x:collection1] o.a.s.c.SolrCore [collection1] Solr index directory '/home/jenkins/workspace/Lucene-Solr-trunk-Linux/solr/build/solr-solrj/test/J2/temp/solr.client.solrj.impl.CloudSolrClientTest_977F0DC3DF3AE3F7-001/shard-1-001/cores/collection1/data/index' doesn't exist. Creating new index...
   [junit4]   2> 61600 INFO  (coreLoadExecutor-217-thread-1-processing-n:127.0.0.1:35105_kj_st) [n:127.0.0.1:35105_kj_st c:collection1 s:shard2 r:core_node1 x:collection1] o.a.s.c.CachingDirectoryFactory return new directory for /home/jenkins/workspace/Lucene-Solr-trunk-Linux/solr/build/solr-solrj/test/J2/temp/solr.client.solrj.impl.CloudSolrClientTest_977F0DC3DF3AE3F7-001/shard-1-001/cores/collection1/data/index
   [junit4]   2> 61601 INFO  (coreLoadExecutor-217-thread-1-processing-n:127.0.0.1:35105_kj_st) [n:127.0.0.1:35105_kj_st c:collection1 s:shard2 r:core_node1 x:collection1] o.a.s.c.SolrCore SolrDeletionPolicy.onCommit: commits: num=1
   [junit4]   2> 	commit{dir=MockDirectoryWrapper(RAMDirectory@3bd4e3b8 lockFactory=org.apache.lucene.store.SingleInstanceLockFactory@3c02ed8a),segFN=segments_1,generation=1}
   [junit4]   2> 61601 INFO  (coreLoadExecutor-217-thread-1-processing-n:127.0.0.1:35105_kj_st) [n:127.0.0.1:35105_kj_st c:collection1 s:shard2 r:core_node1 x:collection1] o.a.s.c.SolrCore newest commit generation = 1
   [junit4]   2> 61601 INFO  (OldIndexDirectoryCleanupThreadForCore-collection1) [n:127.0.0.1:35105_kj_st c:collection1 s:shard2 r:core_node1 x:collection1] o.a.s.c.SolrCore Looking for old index directories to cleanup for core collection1 in /home/jenkins/workspace/Lucene-Solr-trunk-Linux/solr/build/solr-solrj/test/J2/temp/solr.client.solrj.impl.CloudSolrClientTest_977F0DC3DF3AE3F7-001/shard-1-001/cores/collection1/data/
   [junit4]   2> 61602 WARN  (OldIndexDirectoryCleanupThreadForCore-collection1) [n:127.0.0.1:35105_kj_st c:collection1 s:shard2 r:core_node1 x:collection1] o.a.s.c.DirectoryFactory /home/jenkins/workspace/Lucene-Solr-trunk-Linux/solr/build/solr-solrj/test/J2/temp/solr.client.solrj.impl.CloudSolrClientTest_977F0DC3DF3AE3F7-001/shard-1-001/cores/collection1/data/ does not point to a valid data directory; skipping clean-up of old index directories.
   [junit4]   2> 61609 INFO  (coreLoadExecutor-217-thread-1-processing-n:127.0.0.1:35105_kj_st) [n:127.0.0.1:35105_kj_st c:collection1 s:shard2 r:core_node1 x:collection1] o.a.s.c.SolrCore no updateRequestProcessorChain defined as default, creating implicit default
   [junit4]   2> 61611 INFO  (coreLoadExecutor-217-thread-1-processing-n:127.0.0.1:35105_kj_st) [n:127.0.0.1:35105_kj_st c:collection1 s:shard2 r:core_node1 x:collection1] o.a.s.h.l.XMLLoader xsltCacheLifetimeSeconds=60
   [junit4]   2> 61613 INFO  (coreLoadExecutor-217-thread-1-processing-n:127.0.0.1:35105_kj_st) [n:127.0.0.1:35105_kj_st c:collection1 s:shard2 r:core_node1 x:collection1] o.a.s.h.l.XMLLoader xsltCacheLifetimeSeconds=60
   [junit4]   2> 61614 INFO  (coreLoadExecutor-217-thread-1-processing-n:127.0.0.1:35105_kj_st) [n:127.0.0.1:35105_kj_st c:collection1 s:shard2 r:core_node1 x:collection1] o.a.s.h.l.XMLLoader xsltCacheLifetimeSeconds=60
   [junit4]   2> 61615 INFO  (coreLoadExecutor-217-thread-1-processing-n:127.0.0.1:35105_kj_st) [n:127.0.0.1:35105_kj_st c:collection1 s:shard2 r:core_node1 x:collection1] o.a.s.h.l.XMLLoader xsltCacheLifetimeSeconds=60
   [junit4]   2> 61616 INFO  (coreLoadExecutor-217-thread-1-processing-n:127.0.0.1:35105_kj_st) [n:127.0.0.1:35105_kj_st c:collection1 s:shard2 r:core_node1 x:collection1] o.a.s.c.RequestHandlers Registered paths: /admin/mbeans,standard,,/update/csv,/update/json/docs,/admin/luke,/admin/segments,/get,/admin/system,/replication,/admin/properties,/config,/schema,/admin/plugins,/admin/logging,/update/json,/admin/threads,/admin/ping,/update,/admin/file
   [junit4]   2> 61616 WARN  (coreLoadExecutor-217-thread-1-processing-n:127.0.0.1:35105_kj_st) [n:127.0.0.1:35105_kj_st c:collection1 s:shard2 r:core_node1 x:collection1] o.a.s.c.RequestHandlers no default request handler is registered (either '/select' or 'standard')
   [junit4]   2> 61616 INFO  (coreLoadExecutor-217-thread-1-processing-n:127.0.0.1:35105_kj_st) [n:127.0.0.1:35105_kj_st c:collection1 s:shard2 r:core_node1 x:collection1] o.a.s.c.SolrCore Using default statsCache cache: org.apache.solr.search.stats.LocalStatsCache
   [junit4]   2> 61617 INFO  (coreLoadExecutor-217-thread-1-processing-n:127.0.0.1:35105_kj_st) [n:127.0.0.1:35105_kj_st c:collection1 s:shard2 r:core_node1 x:collection1] o.a.s.u.UpdateHandler Using UpdateLog implementation: org.apache.solr.update.UpdateLog
   [junit4]   2> 61617 INFO  (coreLoadExecutor-217-thread-1-processing-n:127.0.0.1:35105_kj_st) [n:127.0.0.1:35105_kj_st c:collection1 s:shard2 r:core_node1 x:collection1] o.a.s.u.UpdateLog Initializing UpdateLog: dataDir= defaultSyncLevel=FLUSH numRecordsToKeep=100 maxNumLogsToKeep=10 numVersionBuckets=65536
   [junit4]   2> 61618 INFO  (coreLoadExecutor-217-thread-1-processing-n:127.0.0.1:35105_kj_st) [n:127.0.0.1:35105_kj_st c:collection1 s:shard2 r:core_node1 x:collection1] o.a.s.c.SolrCore Hard AutoCommit: disabled
   [junit4]   2> 61618 INFO  (coreLoadExecutor-217-thread-1-processing-n:127.0.0.1:35105_kj_st) [n:127.0.0.1:35105_kj_st c:collection1 s:shard2 r:core_node1 x:collection1] o.a.s.c.SolrCore Soft AutoCommit: disabled
   [junit4]   2> 61618 INFO  (coreLoadExecutor-217-thread-1-processing-n:127.0.0.1:35105_kj_st) [n:127.0.0.1:35105_kj_st c:collection1 s:shard2 r:core_node1 x:collection1] o.a.s.c.SolrCore SolrDeletionPolicy.onInit: commits: num=1
   [junit4]   2> 	commit{dir=MockDirectoryWrapper(RAMDirectory@3bd4e3b8 lockFactory=org.apache.lucene.store.SingleInstanceLockFactory@3c02ed8a),segFN=segments_1,generation=1}
   [junit4]   2> 61618 INFO  (coreLoadExecutor-217-thread-1-processing-n:127.0.0.1:35105_kj_st) [n:127.0.0.1:35105_kj_st c:collection1 s:shard2 r:core_node1 x:collection1] o.a.s.c.SolrCore newest commit generation = 1
   [junit4]   2> 61619 INFO  (coreLoadExecutor-217-thread-1-processing-n:127.0.0.1:35105_kj_st) [n:127.0.0.1:35105_kj_st c:collection1 s:shard2 r:core_node1 x:collection1] o.a.s.s.SolrIndexSearcher Opening Searcher@54de6cfa[collection1] main
   [junit4]   2> 61619 INFO  (coreLoadExecutor-217-thread-1-processing-n:127.0.0.1:35105_kj_st) [n:127.0.0.1:35105_kj_st c:collection1 s:shard2 r:core_node1 x:collection1] o.a.s.c.c.ZkStateReader Load collection config from:/collections/collection1
   [junit4]   2> 61621 INFO  (coreLoadExecutor-217-thread-1-processing-n:127.0.0.1:35105_kj_st) [n:127.0.0.1:35105_kj_st c:collection1 s:shard2 r:core_node1 x:collection1] o.a.s.c.c.ZkStateReader path=/collections/collection1 configName=conf1 specified config exists in ZooKeeper
   [junit4]   2> 61622 INFO  (coreLoadExecutor-217-thread-1-processing-n:127.0.0.1:35105_kj_st) [n:127.0.0.1:35105_kj_st c:collection1 s:shard2 r:core_node1 x:collection1] o.a.s.r.ManagedResourceStorage Setting up ZooKeeper-based storage for the RestManager with znodeBase: /configs/conf1
   [junit4]   2> 61622 INFO  (coreLoadExecutor-217-thread-1-processing-n:127.0.0.1:35105_kj_st) [n:127.0.0.1:35105_kj_st c:collection1 s:shard2 r:core_node1 x:collection1] o.a.s.r.ManagedResourceStorage Configured ZooKeeperStorageIO with znodeBase: /configs/conf1
   [junit4]   2> 61622 INFO  (coreLoadExecutor-217-thread-1-processing-n:127.0.0.1:35105_kj_st) [n:127.0.0.1:35105_kj_st c:collection1 s:shard2 r:core_node1 x:collection1] o.a.s.r.RestManager Initializing RestManager with initArgs: {}
  

[...truncated too long message...]

lrj.impl.CloudSolrClientTest_977F0DC3DF3AE3F7-001/shard-3-003/cores/collection1/data [CachedDir<<refCount=0;path=/home/jenkins/workspace/Lucene-Solr-trunk-Linux/solr/build/solr-solrj/test/J2/../../../../../../../../../home/jenkins/workspace/Lucene-Solr-trunk-Linux/solr/build/solr-solrj/test/J2/temp/solr.client.solrj.impl.CloudSolrClientTest_977F0DC3DF3AE3F7-001/shard-3-003/cores/collection1/data;done=false>>]
   [junit4]   2> 139255 INFO  (zkCallback-202-thread-1-processing-n:127.0.0.1:35006_kj_st) [n:127.0.0.1:35006_kj_st c:collection1 s:shard2 r:core_node3 x:collection1] o.a.s.c.CachingDirectoryFactory Closing directory: /home/jenkins/workspace/Lucene-Solr-trunk-Linux/solr/build/solr-solrj/test/J2/../../../../../../../../../home/jenkins/workspace/Lucene-Solr-trunk-Linux/solr/build/solr-solrj/test/J2/temp/solr.client.solrj.impl.CloudSolrClientTest_977F0DC3DF3AE3F7-001/shard-3-003/cores/collection1/data
   [junit4]   2> 139255 INFO  (zkCallback-202-thread-1-processing-n:127.0.0.1:35006_kj_st) [n:127.0.0.1:35006_kj_st c:collection1 s:shard2 r:core_node3 x:collection1] o.a.s.c.c.SolrZkClient makePath: /collections/collection1/leaders/shard2
   [junit4]   2> 139255 ERROR (zkCallback-202-thread-1-processing-n:127.0.0.1:35006_kj_st) [n:127.0.0.1:35006_kj_st c:collection1 s:shard2 r:core_node3 x:collection1] o.a.s.c.ShardLeaderElectionContext There was a problem trying to register as the leader:org.apache.solr.common.SolrException: Could not register as the leader because creating the ephemeral registration node in ZooKeeper failed
   [junit4]   2> 	at org.apache.solr.cloud.ShardLeaderElectionContextBase.runLeaderProcess(ElectionContext.java:148)
   [junit4]   2> 	at org.apache.solr.cloud.ShardLeaderElectionContext.runLeaderProcess(ElectionContext.java:315)
   [junit4]   2> 	at org.apache.solr.cloud.LeaderElector.runIamLeaderProcess(LeaderElector.java:199)
   [junit4]   2> 	at org.apache.solr.cloud.LeaderElector.checkIfIamLeader(LeaderElector.java:159)
   [junit4]   2> 	at org.apache.solr.cloud.LeaderElector.access$200(LeaderElector.java:56)
   [junit4]   2> 	at org.apache.solr.cloud.LeaderElector$ElectionWatcher.process(LeaderElector.java:390)
   [junit4]   2> 	at org.apache.solr.common.cloud.SolrZkClient$3$1.run(SolrZkClient.java:269)
   [junit4]   2> 	at java.util.concurrent.Executors$RunnableAdapter.call(Executors.java:511)
   [junit4]   2> 	at java.util.concurrent.FutureTask.run(FutureTask.java:266)
   [junit4]   2> 	at org.apache.solr.common.util.ExecutorUtil$MDCAwareThreadPoolExecutor$1.run(ExecutorUtil.java:156)
   [junit4]   2> 	at java.util.concurrent.ThreadPoolExecutor.runWorker(ThreadPoolExecutor.java:1142)
   [junit4]   2> 	at java.util.concurrent.ThreadPoolExecutor$Worker.run(ThreadPoolExecutor.java:617)
   [junit4]   2> 	at java.lang.Thread.run(Thread.java:745)
   [junit4]   2> Caused by: org.apache.zookeeper.KeeperException$SessionExpiredException: KeeperErrorCode = Session expired for /collections
   [junit4]   2> 	at org.apache.zookeeper.KeeperException.create(KeeperException.java:127)
   [junit4]   2> 	at org.apache.zookeeper.KeeperException.create(KeeperException.java:51)
   [junit4]   2> 	at org.apache.zookeeper.ZooKeeper.exists(ZooKeeper.java:1045)
   [junit4]   2> 	at org.apache.solr.common.cloud.SolrZkClient$4.execute(SolrZkClient.java:302)
   [junit4]   2> 	at org.apache.solr.common.cloud.SolrZkClient$4.execute(SolrZkClient.java:299)
   [junit4]   2> 	at org.apache.solr.common.cloud.ZkCmdExecutor.retryOperation(ZkCmdExecutor.java:61)
   [junit4]   2> 	at org.apache.solr.common.cloud.SolrZkClient.exists(SolrZkClient.java:299)
   [junit4]   2> 	at org.apache.solr.common.cloud.SolrZkClient.makePath(SolrZkClient.java:493)
   [junit4]   2> 	at org.apache.solr.common.cloud.SolrZkClient.makePath(SolrZkClient.java:463)
   [junit4]   2> 	at org.apache.solr.common.cloud.SolrZkClient.makePath(SolrZkClient.java:450)
   [junit4]   2> 	at org.apache.solr.cloud.ShardLeaderElectionContextBase$1.execute(ElectionContext.java:140)
   [junit4]   2> 	at org.apache.solr.common.util.RetryUtil.retryOnThrowable(RetryUtil.java:31)
   [junit4]   2> 	at org.apache.solr.cloud.ShardLeaderElectionContextBase.runLeaderProcess(ElectionContext.java:136)
   [junit4]   2> 	... 12 more
   [junit4]   2> 
   [junit4]   2> 139257 INFO  (TEST-CloudSolrClientTest.test-seed#[977F0DC3DF3AE3F7]) [    ] o.e.j.s.ServerConnector Stopped ServerConnector@13fadb94{HTTP/1.1}{127.0.0.1:0}
   [junit4]   2> 139257 INFO  (TEST-CloudSolrClientTest.test-seed#[977F0DC3DF3AE3F7]) [    ] o.e.j.s.h.ContextHandler Stopped o.e.j.s.ServletContextHandler@1de8006a{/kj_st,null,UNAVAILABLE}
   [junit4]   2> 139258 INFO  (TEST-CloudSolrClientTest.test-seed#[977F0DC3DF3AE3F7]) [n:127.0.0.1:35006_kj_st c:checkStateVerCol s:shard3 r:core_node2 x:checkStateVerCol_shard3_replica1] o.a.s.c.ZkTestServer connecting to 127.0.0.1:57821 57821
   [junit4]   2> 139263 INFO  (Thread-284) [n:127.0.0.1:33211_kj_st c:collection1 s:shard2 r:core_node3 x:collection1] o.a.s.c.ZkTestServer connecting to 127.0.0.1:57821 57821
   [junit4]   2> 139264 WARN  (Thread-284) [n:127.0.0.1:33211_kj_st c:collection1 s:shard2 r:core_node3 x:collection1] o.a.s.c.ZkTestServer Watch limit violations: 
   [junit4]   2> Maximum concurrent create/delete watches above limit:
   [junit4]   2> 
   [junit4]   2> 	10	/solr/aliases.json
   [junit4]   2> 	10	/solr/clusterstate.json
   [junit4]   2> 	4	/solr/configs/conf1
   [junit4]   2> 
   [junit4]   2> Maximum concurrent children watches above limit:
   [junit4]   2> 
   [junit4]   2> 	10	/solr/live_nodes
   [junit4]   2> 	4	/solr/overseer/collection-queue-work
   [junit4]   2> 	3	/solr/overseer/queue
   [junit4]   2> 
   [junit4]   2> NOTE: reproduce with: ant test  -Dtestcase=CloudSolrClientTest -Dtests.method=test -Dtests.seed=977F0DC3DF3AE3F7 -Dtests.multiplier=3 -Dtests.slow=true -Dtests.locale=de_LU -Dtests.timezone=Pacific/Fiji -Dtests.asserts=true -Dtests.file.encoding=ISO-8859-1
   [junit4] ERROR   40.7s J2 | CloudSolrClientTest.test <<<
   [junit4]    > Throwable #1: org.apache.solr.client.solrj.impl.HttpSolrClient$RemoteSolrException: Error from server at http://127.0.0.1:43958/kj_st/checkStateVerCol: no servers hosting shard: shard2
   [junit4]    > 	at __randomizedtesting.SeedInfo.seed([977F0DC3DF3AE3F7:1F2B321971C68E0F]:0)
   [junit4]    > 	at org.apache.solr.client.solrj.impl.HttpSolrClient.executeMethod(HttpSolrClient.java:560)
   [junit4]    > 	at org.apache.solr.client.solrj.impl.HttpSolrClient.request(HttpSolrClient.java:234)
   [junit4]    > 	at org.apache.solr.client.solrj.impl.HttpSolrClient.request(HttpSolrClient.java:226)
   [junit4]    > 	at org.apache.solr.client.solrj.SolrRequest.process(SolrRequest.java:135)
   [junit4]    > 	at org.apache.solr.client.solrj.SolrClient.query(SolrClient.java:943)
   [junit4]    > 	at org.apache.solr.client.solrj.SolrClient.query(SolrClient.java:958)
   [junit4]    > 	at org.apache.solr.client.solrj.impl.CloudSolrClientTest.stateVersionParamTest(CloudSolrClientTest.java:543)
   [junit4]    > 	at org.apache.solr.client.solrj.impl.CloudSolrClientTest.test(CloudSolrClientTest.java:116)
   [junit4]    > 	at org.apache.solr.BaseDistributedSearchTestCase$ShardsRepeatRule$ShardsFixedStatement.callStatement(BaseDistributedSearchTestCase.java:960)
   [junit4]    > 	at org.apache.solr.BaseDistributedSearchTestCase$ShardsRepeatRule$ShardsStatement.evaluate(BaseDistributedSearchTestCase.java:935)
   [junit4]    > 	at java.lang.Thread.run(Thread.java:745)
   [junit4]   2> 139284 INFO  (SUITE-CloudSolrClientTest-seed#[977F0DC3DF3AE3F7]-worker) [n:127.0.0.1:35006_kj_st c:checkStateVerCol s:shard3 r:core_node2 x:checkStateVerCol_shard3_replica1] o.a.s.SolrTestCaseJ4 ###deleteCore
   [junit4]   2> NOTE: leaving temporary files on disk at: /home/jenkins/workspace/Lucene-Solr-trunk-Linux/solr/build/solr-solrj/test/J2/temp/solr.client.solrj.impl.CloudSolrClientTest_977F0DC3DF3AE3F7-001
   [junit4]   2> Jul 01, 2015 9:17:31 PM com.carrotsearch.randomizedtesting.ThreadLeakControl checkThreadLeaks
   [junit4]   2> WARNING: Will linger awaiting termination of 1 leaked thread(s).
   [junit4]   2> NOTE: test params are: codec=CheapBastard, sim=DefaultSimilarity, locale=de_LU, timezone=Pacific/Fiji
   [junit4]   2> NOTE: Linux 3.13.0-54-generic amd64/Oracle Corporation 1.8.0_60-ea (64-bit)/cpus=12,threads=1,free=330631640,total=508887040
   [junit4]   2> NOTE: All tests run in this JVM: [ConcurrentUpdateSolrClientTest, SolrExampleXMLTest, ModifiableSolrParamsTest, SolrParamTest, TestCoreAdmin, StreamingTest, SolrPingTest, GetByIdTest, TestBatchUpdate, SolrExampleJettyTest, TestJsonRecordReader, CloudSolrClientTest]
   [junit4] Completed [64/64] on J2 in 82.13s, 3 tests, 1 error <<< FAILURES!

[...truncated 11 lines...]
BUILD FAILED
/home/jenkins/workspace/Lucene-Solr-trunk-Linux/build.xml:526: The following error occurred while executing this line:
/home/jenkins/workspace/Lucene-Solr-trunk-Linux/build.xml:474: The following error occurred while executing this line:
/home/jenkins/workspace/Lucene-Solr-trunk-Linux/build.xml:61: The following error occurred while executing this line:
/home/jenkins/workspace/Lucene-Solr-trunk-Linux/extra-targets.xml:39: The following error occurred while executing this line:
/home/jenkins/workspace/Lucene-Solr-trunk-Linux/solr/build.xml:243: The following error occurred while executing this line:
/home/jenkins/workspace/Lucene-Solr-trunk-Linux/solr/common-build.xml:513: The following error occurred while executing this line:
/home/jenkins/workspace/Lucene-Solr-trunk-Linux/lucene/common-build.xml:1426: The following error occurred while executing this line:
/home/jenkins/workspace/Lucene-Solr-trunk-Linux/lucene/common-build.xml:981: There were test failures: 64 suites, 441 tests, 1 error

Total time: 45 minutes 50 seconds
Build step 'Invoke Ant' marked build as failure
Archiving artifacts
Recording test results
Email was triggered for: Failure - Any
Sending email for trigger: Failure - Any



Mime
View raw message