lucene-dev mailing list archives

Site index · List index
Message view « Date » · « Thread »
Top « Date » · « Thread »
From Erick Erickson <erickerick...@gmail.com>
Subject Re: Any clue why I'm being asked to moderate these messages from the build system?
Date Fri, 19 Jun 2015 17:41:11 GMT
Right, but I keep getting them even after approving some of them. It's
like the from address keeps changing.

Or I'm just confused. I'll "reply-all" for a while and we'll see.

On Fri, Jun 19, 2015 at 9:55 AM, Chris Hostetter
<hossman_lucene@fucit.org> wrote:
>
> : Clearly they're coming from Elastic......
>
> pretty sure it's just standard moderatation queue stuff...
>
> the first time a (non-subscribed) addr sends an email to the list, it gets
> held in the queue -- if the moderator just hits "reply" tothe "accept"
> address, then that one message will make it through -- but future messages
> will not.
>
> Which is why moderators are encouraged to "reply-all" so that the "allow"
> address is also hit -- this ensures that future messages from the same
> sender won't get stuck in the moderation queue in the future.
>
> at some point recently elastic changed the email addr used by their CI
> system, so it needed to be re-allowed to send mail, and they started
> popping back up in the moderation queue.
>
> (As a reminder: questions like this are why we have the moderator list, so
> we don't have to distract the entire dev community with meta-discussions
> about dealing with moderation)
>
>
> :
> : From: build@elastic.co
> : To: dev@elastic.co, dev@lucene.apache.org, simonw@apache.org
> : Cc:
> : Date: Fri, 19 Jun 2015 10:56:46 +0000
> : Subject: [CI] Lucene 5x Linux 64 Test Only - Build # 51986 - Failure!
> :  BUILD FAILURE
> :
> : Build URLhttp://build-eu-00.elastic.co/job/lucene_linux_java8_64_test_only/51986/
> : Project:lucene_linux_java8_64_test_only
> : Randomization:JDKEA9,local,heap[1024m],-server +UseConcMarkSweepGC
> : +UseCompressedOops +AggressiveOpts,sec manager on
> : Date of build:Fri, 19 Jun 2015 12:54:09 +0200
> : Build duration:2 min 35 sec
> :
> : CHANGES
> : No Changes
> :
> : BUILD ARTIFACTS
> : checkout/lucene/build/core/test/temp/junit4-J0-20150619_125429_116.events
> : checkout/lucene/build/core/test/temp/junit4-J1-20150619_125429_116.events
> : checkout/lucene/build/core/test/temp/junit4-J2-20150619_125429_112.events
> : checkout/lucene/build/core/test/temp/junit4-J3-20150619_125429_116.events
> : checkout/lucene/build/core/test/temp/junit4-J4-20150619_125429_112.events
> : checkout/lucene/build/core/test/temp/junit4-J5-20150619_125429_116.events
> : checkout/lucene/build/core/test/temp/junit4-J6-20150619_125429_118.events
> : checkout/lucene/build/core/test/temp/junit4-J7-20150619_125429_119.events
> :
> : FAILED JUNIT TESTS
> : Name: junit.framework Failed: 2 test(s), Passed: 0 test(s), Skipped: 0
> : test(s), Total: 2 test(s)
> : Failed: junit.framework.TestSuite.org.apache.lucene.search.TestNumericRangeQuery32
> : Failed: junit.framework.TestSuite.org.apache.lucene.search.TestNumericRangeQuery32
> : Name: org.apache.lucene.index Failed: 2 test(s), Passed: 774 test(s),
> : Skipped: 23 test(s), Total: 799 test(s)
> : Failed: org.apache.lucene.index.TestIndexWriterExceptions.testAddDocsNonAbortingException
> : Failed: org.apache.lucene.index.TestIndexWriterExceptions.testExceptionFromTokenStream
> :
> : CONSOLE OUTPUT
> : [...truncated 1849 lines...]
> : [junit4] - org.apache.lucene.index.TestIndexWriterExceptions.testExceptionFromTokenStream
> : [junit4] - org.apache.lucene.index.TestIndexWriterExceptions.testAddDocsNonAbortingException
> : [junit4]
> : [junit4]
> : [junit4] JVM J0: 1.02 .. 125.17 = 124.15s
> : [junit4] JVM J1: 1.01 .. 124.41 = 123.39s
> : [junit4] JVM J2: 1.33 .. 124.50 = 123.17s
> : [junit4] JVM J3: 1.11 .. 122.66 = 121.55s
> : [junit4] JVM J4: 1.24 .. 124.04 = 122.80s
> : [junit4] JVM J5: 1.01 .. 127.16 = 126.15s
> : [junit4] JVM J6: 1.00 .. 133.45 = 132.45s
> : [junit4] JVM J7: 1.03 .. 125.12 = 124.08s
> : [junit4] Execution time total: 2 minutes 13 seconds
> : [junit4] Tests summary: 401 suites, 3227 tests, 2 suite-level errors,
> : 2 errors, 48 ignored (44 assumptions)
> : BUILD FAILED
> : /home/jenkins/workspace/lucene_linux_java8_64_test_only/checkout/lucene/build.xml:50:
> : The following error occurred while executing this line:
> : /home/jenkins/workspace/lucene_linux_java8_64_test_only/checkout/lucene/common-build.xml:1444:
> : The following error occurred while executing this line:
> : /home/jenkins/workspace/lucene_linux_java8_64_test_only/checkout/lucene/common-build.xml:999:
> : There were test failures: 401 suites, 3227 tests, 2 suite-level
> : errors, 2 errors, 48 ignored (44 assumptions)
> : Total time: 2 minutes 21 seconds
> :
> : ---------------------------------------------------------------------
> : To unsubscribe, e-mail: dev-unsubscribe@lucene.apache.org
> : For additional commands, e-mail: dev-help@lucene.apache.org
> :
> :
>
> -Hoss
> http://www.lucidworks.com/
>
> ---------------------------------------------------------------------
> To unsubscribe, e-mail: dev-unsubscribe@lucene.apache.org
> For additional commands, e-mail: dev-help@lucene.apache.org
>

---------------------------------------------------------------------
To unsubscribe, e-mail: dev-unsubscribe@lucene.apache.org
For additional commands, e-mail: dev-help@lucene.apache.org


Mime
View raw message